##TITLE=1H_DE-3_reagent
 CDCl3
 8 sc, 
 8.8.2023
##JCAMPDX= 6.0         $$ Bruker NMR JCAMP-DX V2.0
##DATA TYPE= NMR FID
##DATA CLASS= NTUPLES
##ORIGIN= UXNMR, Bruker Analytische Messtechnik GmbH
##OWNER= root
$$ XWIN-NMR		Version 3.5
$$ Tue Aug  8 13:49:27 2023 Russian Standard Time (UT+4h)  she@DPX200
##.OBSERVE FREQUENCY= 200.13135
##.OBSERVE NUCLEUS= ^1H
##.DELAY= (6, 6)
##.ACQUISITION MODE= SIMULTANEOUS
##.ACQUISITION SCHEME= undefined
##.AVERAGES= 8
##.DIGITISER RES= 18
##SPECTROMETER/DATA SYSTEM= spect
##.PULSE SEQUENCE= zg30
##.SOLVENT NAME= CDCl3
##.SHIFT REFERENCE= (INTERNAL, CDCl3, 0, 15.7039)
##AUDIT TRAIL= $$ (NUMBER, WHEN, WHO, WHERE, WHAT)
$$ ##TITLE= Audit trail, XWIN-NMR		Version 3.5
$$ ##JCAMPDX= 5.01
$$ ##ORIGIN= Bruker BioSpin GmbH
$$ ##OWNER= she
$$ F:/spectra/data/she/nmr/H-F/1/audita.txt
$$ ##AUDIT TRAIL=  $$ (NUMBER, WHEN, WHO, WHERE, WHAT)
(   1,<2023-08-08 13:48:32.73 +0400>,<she>,<DPX200>,
      <created by zg, POWCHK disabled, PULCHK disabled
       configuration hash MD5:
       00 E9 B6 7A A2 85 ED C7 34 08 36 98 17 FE 4E 26
       data hash MD5: 16K
       08 49 27 F4 F9 2A 4F 55 1C 91 73 BA FD 88 DA BA>)
$$ ##END=
$$ 
$$ hash MD5
$$ 02 5B AC C4 FD CC 30 12 FD 20 3F 0F A4 CF 2D 19
##$RELAX= 
##$RELAX= 
##$RELAX= 
##$RELAX= 
##$RELAX= 
##$RELAX= 
$$ Bruker specific parameters
$$ --------------------------
##$DU= <F:/spectra>
##$EXPNO= 1
##$NAME= <H-F>
##$PROCNO= 1
##$TYPE= <nmr>
##$USER= <she>
##$AMP= (0..31)
100 100 100 100 100 100 100 100 100 100 100 100 100 100 100 100 100 100 
100 100 100 100 100 100 100 100 100 100 100 100 100 100 
##$AQSEQ= 0
##$AQ_mod= 1
##$AUNM= <au_zg>
##$AUTOPOS= <>
##$BF1= 200.13
##$BF2= 200.13
##$BF3= 200.13
##$BF4= 200.13
##$BF5= 200.13
##$BF6= 200.13
##$BF7= 200.13
##$BF8= 200.13
##$BYTORDA= 1
##$CFDGTYP= 0
##$CFRGTYP= 5
##$CHEMSTR= <none>
##$CNST= (0..31)
1 1 145 1 1 1 1 1 1 1 1 1 1 1 1 1 1 1 1 1 1 1 1 1 1 1 1 1 1 1 1 1 
##$CPDPRG= <>
##$CPDPRG1= <>
##$CPDPRG2= <>
##$CPDPRG3= <>
##$CPDPRG4= <mlev>
##$CPDPRG5= <mlev>
##$CPDPRG6= <mlev>
##$CPDPRG7= <mlev>
##$CPDPRG8= <mlev>
##$CPDPRGB= <>
##$CPDPRGT= <>
##$D= (0..31)
0 1.2 0 0 0 0 0 0 0 0.06 0 0.03 0 0 0 0 0.0002 0 0 0 0 0 0 0 0 0 0 0 0 
0 0 0 
##$DATE= 1691488112
##$DBL= (0..7)
120 120 120 120 120 120 120 120 
##$DBP= (0..7)
150 150 150 150 150 150 150 150 
##$DBP07= 0
##$DBPNAM0= <>
##$DBPNAM1= <>
##$DBPNAM2= <>
##$DBPNAM3= <>
##$DBPNAM4= <>
##$DBPNAM5= <>
##$DBPNAM6= <>
##$DBPNAM7= <>
##$DBPOAL= (0..7)
0.5 0.5 0.5 0.5 0.5 0.5 0.5 0.5 
##$DBPOFFS= (0..7)
0 0 0 0 0 0 0 0 
##$DE= 6
##$DECBNUC= <off>
##$DECIM= 32
##$DECNUC= <off>
##$DECSTAT= 4
##$DIGMOD= 1
##$DIGTYP= 9
##$DL= (0..7)
0 120 120 120 120 120 120 120 
##$DP= (0..7)
150 150 150 150 150 150 150 150 
##$DP07= 0
##$DPNAME0= <>
##$DPNAME1= <>
##$DPNAME2= <>
##$DPNAME3= <>
##$DPNAME4= <>
##$DPNAME5= <>
##$DPNAME6= <>
##$DPNAME7= <>
##$DPOAL= (0..7)
0.5 0.5 0.5 0.5 0.5 0.5 0.5 0.5 
##$DPOFFS= (0..7)
0 0 0 0 0 0 0 0 
##$DQDMODE= 0
##$DR= 18
##$DS= 0
##$DSLIST= <SSSSSSSSSSSSSSS>
$$ [...]
##$SUBNAM2= <"">
##$SUBNAM3= <"">
##$SUBNAM4= <"">
##$SUBNAM5= <"">
##$SUBNAM6= <"">
##$SUBNAM7= <"">
##$SUBNAM8= <"">
##$SUBNAM9= <"">
##$SW= 18.05172834244
##$SWIBOX= (0..15)
0 0 2 0 0 0 0 0 0 0 0 0 0 0 0 0 
##$SW_h= 3612.71676300578
##$TD= 16384
##$TD0= 1
##$TE= 0
##$TE2= 300
##$TE3= 300
##$TEG= 300
##$TL= (0..7)
0 120 120 120 120 120 120 120 
##$TP= (0..7)
150 150 150 150 150 150 150 150 
##$TP07= 0
##$TPNAME0= <>
##$TPNAME1= <>
##$TPNAME2= <>
##$TPNAME3= <>
##$TPNAME4= <>
##$TPNAME5= <>
##$TPNAME6= <>
##$TPNAME7= <>
##$TPOAL= (0..7)
0.5 0.5 0.5 0.5 0.5 0.5 0.5 0.5 
##$TPOFFS= (0..7)
0 0 0 0 0 0 0 0 
##$TUNHIN= 0
##$TUNHOUT= 0
##$TUNXOUT= 0
##$USERA1= <user>
##$USERA2= <user>
##$USERA3= <user>
##$USERA4= <user>
##$USERA5= <user>
##$V9= 5
##$VALIST= <valist>
##$VCLIST= <CCCCCCCCCCCCCCC>
##$VD= 0
##$VDLIST= <DDDDDDDDDDDDDDD>
##$VPLIST= <PPPPPPPPPPPPPPP>
##$VTLIST= <TTTTTTTTTTTTTTT>
##$WBST= 1024
##$WBSW= 4
##$XGAIN= (0..3)
0 0 0 0 
##$XL= 0
##$YL= 0
##$YMAX_a= 391116
##$YMIN_a= -416794
##$ZGOPTNS= <>
##$ZL1= 120
##$ZL2= 120
##$ZL3= 120
##$ZL4= 120
##$ABSF1= 10
##$ABSF2= 0
##$ABSG= 5
##$ABSL= 3
##$ALPHA= 0
##$AQORDER= 0
##$ASSFAC= 0
##$ASSFACI= 0
##$ASSFACX= 0
##$ASSWID= 0
##$AUNMP= <proc_1d>
##$AZFE= 0.1
##$AZFW= 0.1
##$BCFW= 1
##$BC_mod= 2
##$BYTORDP= 1
##$COROFFS= 0
##$CY= 11.3945322036743
##$DATMOD= 1
##$DC= 2
##$DFILT= <>
##$DTYPP= 0
##$F1P= 15.7292609196834
##$F2P= 12.9074282941183
##$FCOR= 0.5
##$FTSIZE= 0
##$FT_mod= 4
##$GAMMA= 1
##$GB= 0.15
##$INTBC= 1
##$INTSCL= 1
##$ISEN= 128
##$LB= 0.24
##$LEV0= 0
##$LPBIN= 0
##$MAXI= 10000
##$MC2= 0
##$MEAN= 0
##$ME_mod= 0
##$MI= 1.114404
##$NCOEF= 0
##$NC_proc= 0
##$NLEV= 6
##$NOISF1= 3.799351
##$NOISF2= 2.8
##$NSP= 1
##$NTH_PI= 0
##$NZP= 0
##$OFFSET= 15.70392
##$PC= 1
##$PHC0= -21041.36
##$PHC1= 8.85272
##$PH_mod= 1
##$PKNL= yes
##$PPARMOD= 0
##$PSCAL= 0
##$PSIGN= 0
##$REVERSE= no
##$SF= 200.130013532006
##$SI= 16384
##$SIGF1= 3
##$SIGF2= 2
##$SINO= 400
##$SIOLD= 16384
##$SREGLST= <1H.CDCl3>
##$SSB= 0
##$STSI= 0
##$STSR= 0
##$SW_p= 3612.71676300578
##$SYMM= 0
##$S_DEV= 0
##$TDeff= 0
##$TDoff= 0
##$TI= <>
##$TILT= no
##$TM1= 0
##$TM2= 0
##$TOPLEV= 0
##$USERP1= <user>
##$USERP2= <user>
##$USERP3= <user>
##$USERP4= <user>
##$USERP5= <user>
##$WDW= 1
##$XDIM= 8192
##$YMAX_p= 0
##$YMIN_p= 0
$$ End of Bruker specific parameters
$$ ---------------------------------
##NTUPLES= NMR FID
##VAR_NAME=  TIME,          FID/REAL,        FID/IMAG
##SYMBOL=    X,             R,               I
##VAR_TYPE=  INDEPENDENT,   DEPENDENT,       DEPENDENT
##VAR_FORM=  AFFN,          ASDF,            ASDF
##VAR_DIM=   8192,          8192,            8192
##UNITS=     SECONDS,       ARBITRARY UNITS, ARBITRARY UNITS
##FACTOR=    0.0002768,     1,               1
##FIRST=     0,             0,               0
##LAST=      2.2672688,     0,               0
##MIN=       0,             -416794,         0
##MAX=       2.2672688,     391116,          0
$$ Real data points
##PAGE= N=1
##DATA TABLE= (X++(R..R)), XYDATA
0@%%%%%%%%%%Qj6J6j6J6k4L2m0M9n7P2q8J04j21J45j71J97k28K65l05L48l96M52
$$ 0 0 0 0 0 0 0 0 0 0 0 8 -8 8 -8 8 -16 16 -24 25 -32 40 -48 56 -65 80 -91 106 -122 143 -162 186 -210 242
33B42n13N78o53P32q20R20j027J142j270J411j565J731j912K112k330K567k825
$$ 242 -271 307 -346 386 -434 486 -541 601 -669 742 -823 908 -1004 1108 -1222 1345 -1480
50a480L112l431L781m171M608n097N654o292P031p897Q932j0194J1772j3814J6569
$$ -1480 1632 -1799 1982 -2189 2419 -2678 2976 -3316 3715 -4182 4750 -5444 6328 -7486 9083
65I083k0518K6697l7816O4096k44506k13830L59757K12639J4862j98193q7538
$$ 9083 -11435 15262 -22554 41542 -202964 -416794 -57037 155602 170464 -27729 -115267
76a15267Q7074K07649M7388j44569j61847Q3589K43204J43895j41575k79887j71540
$$ -115267 -28193 179456 226844 82275 -79572 4017 247221 391116 249541 -30346 -201886
87b01886Q6503K05272Q4201j45994j91002k8577J26984O9830r6371j64806l2614
$$ -201886 -115383 89889 174090 28096 -162906 -191483 -64499 5331 -91040 -255846 -288460
98b88460J65158K27032N9572j57225j82275J0741J82293J56196j050r5353m3377
$$ -288460 -123302 103730 163302 6077 -176198 -165457 16836 173032 171982 76629 33252
109C3252P6876J01285k5860j63173j26728N4115J64004Q0354r4864j81305j06415
$$ 33252 110128 211413 185553 22380 -104348 -50233 113771 194125 99261 -82044 -188459
120a88459L8571R9233K1618p5332n1505O2484J06054J7009r4747r6338K1042J40285
$$ -188459 -149888 -50655 -29037 -104369 -155874 -93390 12664 29673 -65074 -161412 -140370 -85
132h5J43204K2595r0204p3658K7408P0650R885n7735m0467L7374P7877J7635r8866
$$ -85 143119 165714 75510 1852 29260 99910 109795 52060 11593 48967 126844 144479 45613
145D5613j43672n5688P0643R5306Q960p2752o0626J3293N5079J1316n9263m9556
$$ 45613 -98059 -153747 -83104 12202 21162 -51590 -112216 -98923 -43844 -32528 -91791 -141347
157a41347N6098J37939Q7757m4852j15170n3284O5055J11755M2537n7569o9307
$$ -141347 -85249 52690 140447 95595 -19575 -72859 -7804 103951 146488 88919 19612
168A9612J5425P4274J1683j02923j22904j5009J06805J09361j3997j33497j18646
$$ 19612 35037 109311 120994 18071 -104833 -119842 -13037 96324 82327 -51170 -169816
179a69816J5313J10383O3795m9037p7771J3220J09564R0280l5007j26916o8993
$$ -169816 -154503 -44120 19675 -29362 -107133 -93913 15651 105931 70924 -55992 -124985
190a24985Q7319J65487P4633q2396j33170l7823Q0860Q3996k6484j14076o5192
$$ -124985 -37666 127821 202454 120058 -13112 -50935 29925 113921 87437 -26639 -91831
201i1831O6164J16648J1384j32046j47415j1309J29791J28140o436j18354q1508
$$ -91831 -25667 90981 102365 -29681 -177096 -188405 -58614 69526 63090 -55264 -136772
212a36772N3914J19225L9050q0191q5957L3739J39734J03451m7878j50418q9045
$$ -136772 -82858 36367 75417 -4774 -90731 -56992 82742 186193 138315 -12103 -101148
223a01148O6303J36665M8574q6303j12976j5906P9911N6730n7397j22143m8439
$$ -101148 -34845 101820 150394 64091 -48885 -64791 15120 71850 14453 -107690 -156129
234a56129Q8181J28230K3391j07065j15882k12J08963R6679r684p9617l1240O9598
$$ -156129 -67948 60282 83673 -23392 -139274 -139486 -30523 66156 56472 -23145 -54385 15213
246A5213R0754M06r3901p8777L2144J13614P1693m9470j18243o2359M4068P4048
$$ 15213 105967 106373 12472 -66305 -34161 79453 151146 101676 -16567 -78926 -34858 39190
258C9190K482p2996n7469K8337P7819K6973o8575r4862j3206R0304R9026J0341
$$ 39190 41672 -31324 -88793 -60456 17363 44336 -24239 -119101 -132307 -42003 57023 67364
270F7364o9028n3888K6673P1408K8695m4043n1988J8253Q0217N1490m4093r9092
$$ 67364 -1664 -55552 -28879 42529 71224 27181 -24807 -6554 73663 125153 81060 -18032
282a8032n2074L9900P5532J9472n6685o4470j57N0874K2600m8979o6633j021P7388
$$ -18032 -70106 -30206 45326 64798 8113 -56357 -56514 -5640 16960 -32019 -98652 -99673 -22285
295b2285P7646k615p5626n9674K6337Q1525M6233k9997n1520M569O2105M3311
$$ -22285 55361 52746 -22880 -82554 -56217 25308 71541 41544 -9976 -5407 56698 100009
307A00009l8158q7317m0387N4673Q8893K0680p3858q9352j4943N9577M7448k7312
$$ 100009 61851 -25466 -65853 -11180 77713 98393 24535 -64817 -79760 -20183 27265 -47
319d7o8191j9864O2774P6042m730q6585p0440L0870J04741P1788k7505q1198l3690
$$ -47 -68238 -88102 -25328 50714 45984 -40601 -111041 -80171 24570 96358 68853 -12345 -46035
332d6035N1589O9284k176p1518n0198L9028Q7833L1643p2394j07063l2896O8835
$$ -46035 5554 74838 72662 1144 -49054 -10026 77807 109450 37056 -70007 -102903 -34068
344c4068Q3979L928p4995o1581K2000P0560K6081n5947p1341R063R3836Q3727
$$ -34068 49911 53839 -21156 -82737 -60737 9823 35904 -20043 -91384 -82321 11515 95242
356I5242j5982r4381o3329L5833R1526M4650m3784o8830n609O3151M6259m0786
$$ 95242 79260 -15121 -78450 -42617 48909 93559 49775 -19055 -24664 38487 84746 43960
368D3960r2700m1679N8495R3178K2827p5221r2051j3349O7351O0977j5818o2626
$$ 43960 -48740 -90419 -31924 61254 84081 8860 -83191 -96540 -29189 31788 15970 -46656
380d6656k0813N6346P0906j144p6374o4541K6216R5822O5897k8933q1542l9578
$$ -46656 -67469 -11123 59783 58639 -17735 -82276 -56060 39762 105659 76726 -4816 -44394
392d4394L8812N8604p4n9677m3830L0484P1054K2190o4150q9452k1198O5711P7450
$$ -44394 -5582 53022 52948 -6729 -50559 -20075 50979 73169 9019 -80433 -101631 -35920 41530
405D1530N634o2823n0882K1121O1505K0865m6876n1870J7862Q1480O1137k6544
$$ 41530 47164 -15659 -66541 -45420 16085 36950 -9926 -61796 -43934 37546 98683 72139
417G2139q7162n2146L7768P9703L0722m7437o0947j47N3684K9728m4333p6726
$$ 72139 -15023 -67169 -29401 50302 81024 33587 -27360 -27507 26177 55905 11572 -65154
429f5154k2017O2449Q0011Q348p4050p4976M067P0492N2532k0516n5668j0343
$$ -65154 -87171 -24722 55289 63637 -10413 -85389 -81322 -10830 41702 21186 -34482 -44825
441d4825N5871N8162j2500p4105n1131L5433Q8214M7622m2341q2009l1715M3773
$$ -44825 11046 69208 56708 -17397 -68528 -33095 55119 102741 60400 -21609 -53324 -9551
453i551N4537o654o0315l8201L3695O7011J5292o4261p9415p142P3490P4162j338
$$ -9551 44986 38332 -21983 -60184 -26489 40522 55814 -8447 -87862 -95004 -21514 52648 51310
466E1310o5000m6073K5989O1669K0677m3881m8566J5166P3380N0646l2182q3605
$$ 51310 -13690 -59763 -33774 27895 48572 4691 -43875 -28709 44671 95317 63135 -20470
478b0470m5104L8180P2264K4095m6266n8344l757M5562K8162l4207o1951j5159
$$ -20470 -65574 -27394 44870 68965 22699 -35645 -39402 6160 34322 115 -61836 -76995
490g6995N5898O8096M504o2723n9397P518O2053M5273j4772m3514r260M1742M1595
$$ -76995 -21097 46999 51503 -11220 -70617 -63099 -1046 44227 29455 -14059 -23319 18423 60018
503F0018j4160n9070l5664L2612O8412K8513m2334o6153k0900L5383L8059r661
$$ 60018 45858 -13212 -48876 -16264 52148 80661 38327 -27826 -48726 -13343 24716 15055
515A5055m3978k0039L2952M7419j043n7020n2392J2872O7222N0919j3374n2445
$$ 15055 -28923 -48962 -16010 31409 30366 -26654 -79046 -66174 1048 51967 38593 -13852
527a3852k4018L0429M4083P35m2043k6665L0939O1028K0354n0154p0771j8680
$$ -13852 -37870 -7441 36642 37377 -4666 -31331 -392 60636 80990 30836 -39935 -58615
539e8615M8721N5873q95n1836l9327J7140M4509O744m8775m9354J3293P0823N4613
$$ -58615 -9894 45979 45084 -6752 -46079 -28939 15570 22314 -26461 -75815 -62522 8301 62914
552F2914k0787p2171m1792L3582O8780K7301l6386m5020R301N6192L2145l9708
$$ 62914 42127 -30044 -71836 -38254 30526 57827 21441 -23579 -14278 41914 74059 34351
564C4351p3806k4273N6324P6761J1833o7607p4071m912N7866M3512k4997n9695
$$ 34351 -39455 -63728 -7404 69357 81190 13583 -60488 -65400 -7534 35978 10981 -48714
576d8714j5156N3555O1031q061p5007n9211K6612Q8759O0139k6537p3610l2868
$$ -48714 -63870 -10315 50716 42655 -32352 -91563 -64951 23808 83947 57410 -16200 -49068
588d9068M0798N9860L035n5352m2178K9050P1361K8237n5780q6884k8458N5561
$$ -49068 -8270 51590 54625 -727 -42905 -13855 57506 85743 29963 -56921 -85379 -29818
600b9818P4316J1058n8603n7017Q055N3714K7343l6391n4569J373O7238O4986
$$ -29818 44498 55556 -3047 -60064 -52009 1705 29048 -7343 -61912 -60539 6699 71685
612G1685q427p2268n6601K0309P1973M5270k3611n3734j5512L6964L5407k0209
$$ 71685 63258 -9010 -65611 -45302 26671 71941 48330 -5404 -20916 16048 51455 31246
624C1246n9660l1734L6365O5955K1622m9680o9254j9860M1444M9003K062l5159
$$ 31246 -28414 -60148 -23783 42172 63794 14114 -55140 -75000 -33556 15447 17509 -17650
636a7650j9301K5412L9564J781m3843l8025J6884O1348M5113j4184n1605l1977
$$ -17650 -36951 -11539 28025 29806 -14037 -52062 -35178 26170 71283 57099 5494 -26483
648b6483J5575L3851O721k4985j9884J5762L2747L132m3006n0473o498M3174M6327
$$ -26483 -10908 22943 29664 4679 -15205 557 33304 36436 -6570 -57043 -63541 -20367 25960
661B5960J614l6506k9045R354K7500N714k1972j5243K4599M9065K2022l1840n4559
$$ 25960 27574 -8932 -37977 -28623 -1123 4591 -17381 -32624 -8025 41040 63062 31222 -23337
674b3337j8762L5823M9185J0543l2041l1081N975K6191M52l9217l8643R682N4390
$$ -23337 -42099 -6276 42909 53452 21411 -9670 -3695 22496 22948 -16269 -54912 -45230 9160
687I160M1124j9769o3612m0837K1366N4611K6631k3600l2335Q099M4042K5037
$$ 9160 50284 30515 -33097 -73934 -52568 2043 28674 5074 -27261 -19162 24880 49917
699D9917l0077n5603j4495N2124O9015J4148n5609o4918q068M7384L8457j8131
$$ 49917 19840 -35763 -50258 1866 70881 85029 29420 -35498 -43566 3818 42275 24144
711B4144m9811j6944L9146M6424j0573o8497n5150K0717P8809N4658k3601o8719
$$ 24144 -25667 -42611 -3465 42959 32386 -36111 -91261 -70544 8265 62923 39322 -29397
723b9397l3568L5812N7762J1498m3399l5382K6156O6300K9520m7647p8467k5873
$$ -29397 -62965 -27153 30609 42107 -1292 -36674 -10518 55782 85302 37655 -40812 -66685
735f6685N4106P3669J3113n7808o1642j173M7284K8359l0800n3719p619N5012
$$ -66685 -12579 61090 74203 16395 -45247 -46420 864 29223 -1577 -55296 -62915 -7903
747g903N8110o204o7940n5939J6693P1674N1789j5906n2459k1519L3008M2590
$$ -7903 50207 44003 -23937 -79876 -63183 8491 60280 44374 -8085 -29604 3404 45994
759D5994l937m8306l2286K7701O1297K5057m3376o9063k6436L6616N1531P927
$$ 45994 42057 -6249 -38535 -10834 50463 75520 32144 -36919 -63355 -26739 24792 32719
771C2719l8762l4829R893L6999J1517l4096l9819O268N3306M7661n593m8393l6192
$$ 32719 -6043 -40872 -30979 6020 17537 -16559 -56378 -50110 3196 50857 45264 -3129 -39321
784c9321J3958M3359K4055j6767k6736J523K8435J4992k5168m3815j5943K9547
$$ -39321 -25363 17996 42051 25284 -1452 71 28506 43498 18330 -25485 -41428 -11881
796a1881M0861P490l3549l7818m939K4173J6816j0849j9879M503L0591K4012j3113
$$ -11881 28980 36470 2921 -34897 -39836 -15663 1153 -9696 -29575 -25072 5519 29531 16418
809A6418l7505j8596K3632M2938J9623j8734k8805l055K1536J2404j8501k9217
$$ 16418 -21087 -39683 -16051 26887 46510 27776 -1029 -4084 17452 29856 11355 -17862
821a7862k970L1706L0457j0330m6199l6855Q984M0254K2821j7508l1786l959L0225
$$ -17862 -20832 10874 41331 31001 -15198 -52053 -43069 -2815 20006 2498 -29288 -33247 -3022
834c022K4806j4068l8251j4038L5195N2697J5991l6595m7172n123L9913L5552
$$ -3022 21784 7716 -30535 -44573 -9378 43319 59310 22715 -24457 -29580 10333 45885
846D5885r391m0458j9864K5131L7197k300m8242m5424Q005N3117L8812j8318n5588
$$ 45885 36494 -3964 -23828 1303 38500 36200 -12042 -57466 -49461 3656 42468 24150 -31438
859c1438k9238K7233M8710J1426l4451l3446J5277N2958L1125k7810n6637j9976
$$ -31438 -60676 -33443 15267 26693 -7758 -41204 -25927 27031 58156 30346 -26291 -46267
871d6267M1464N9277J1512m6042m9088J512M3417K7352k6401n1552j5098L9906
$$ -46267 -4803 54474 65986 19944 -29144 -27632 15785 43137 16736 -34816 -49914 -10008
883a0008M8493k942n5254m8626J0765N6870L9560j7883m6998j7099L4714M4676
$$ -10008 38485 35543 -19711 -68337 -57572 -702 38858 20975 -26023 -43122 -8408 36268
895C6268J459m1994l2652K0594N5528K8926l0224n5635k1026L2059M3554L368
$$ 36268 37727 -4267 -36919 -16325 39203 68129 37905 -17730 -38756 -6697 36857 40225
907D0225m0170l5124R382L7922J5298l1889m5099o073M1274M3451o76m1660l1902
$$ 40225 55 -35069 -25687 12235 27533 -4356 -49455 -55528 -14254 29197 28521 -13139 -45041
920d5041J3328M1797K2659j8406k9792J395L4898K8426j3862m2116k2853K1811
$$ -45041 -31713 10084 32743 14337 -15455 -14060 20838 49264 35402 -6714 -29567 -7756
932g756M0729J2435k8659l7218o767K4220J8290j3708l1480r479K6046L1289j103
$$ -7756 32973 45408 16749 -20469 -27236 -3016 15274 1566 -29914 -39393 -13347 17942 16839
945A6839l4483k7520J0287L7752K4326j0562k5841m909K3849K3130o899k9645
$$ 16839 -17644 -45164 -34877 2875 27201 16639 -9202 -14111 9738 32868 25969 -3676
957c676j4633K1252L5217P912l0224l7180n823K5808K2309j0185l0060j2964J9653
$$ -3676 -18309 2943 38160 46072 15848 -21332 -27155 -1347 20962 10777 -19283 -32247 -12594
970a2594K5878k752l4021k6219J4343M2934K6135j6286l5924j1932K6023L2901
$$ -12594 13284 10532 -23489 -49708 -35365 7569 33704 17418 -18506 -30438 -4415 28486
982B8486J805k7749j8627J7851L6121J0359l1974m2270o941L4489L5405n340l9216
$$ 28486 30291 2542 -16085 1766 37887 48246 16272 -25998 -32939 1550 36955 31615 -7601
995g601k9823J0313L2387J0067k6719l1220M993L9903L1211j3386m2987k3539
$$ -7601 -37424 -27111 5276 15343 -11376 -42596 -37603 2300 33511 20125 -22862 -46401
1007d6401K4107M6421J9771k4348l3460o52L2109K4208j6342l9556j5524K8699
$$ -46401 -22294 24127 43898 19550 -13910 -14562 17547 41755 25413 -14143 -29667 -968
1019i68M0829M224m0555m3749k467L6855L0259j1924l6041j5884K4424L3637l84
$$ -968 39861 44085 3530 -40219 -42686 -5831 24428 12504 -23537 -39421 -14997 18640 18256
1032A8256l5604k8483J6349M7349K9829j8308m2396j7796K5527L6840N297k8989
$$ 18256 -17348 -45831 -29482 17867 47696 29388 -13008 -30804 -5277 31563 36860 7871
1044G871k4671J1195L3200J1564l0011m1853q297L3289L6157r30l7057l0391P357
$$ 7871 -16800 -5605 27595 39159 9148 -32705 -41002 -7713 28444 27514 -9543 -39934 -32577
1057c2577L2064J4862j8208k6104L946L4363K7073j1966l7891k0400K1814M1211
$$ -32577 -513 14349 -3859 -29963 -26017 8346 35419 23453 -14438 -34838 -13024 28187
1069B8187J6613k2617l1571l363K4106J7877j5141l2143j0175K5536L2110j719
$$ 28187 44800 22183 -9388 -12751 11355 29232 14091 -18052 -28227 -2691 29419 27700
1081B7700l7048l4491L755L5044K4714j0869k8864q354K2756K5882m053k9878
$$ 27700 -9348 -43839 -40084 -5040 19674 8805 -20059 -28413 -5657 20225 16172 -13706
1093a3706j7984K0237M1057J8308k3187l8349j1080K5459K8960k007k8157j8883
$$ -13706 -31690 -11453 29604 47912 24725 -13624 -24704 755 29715 27708 -449 -19332
1105a9332J3321K7154L134l0862l3795P77L5637L0875p413l6148k2657J4837L2644
$$ -19332 -6011 21143 24277 -6585 -40380 -39603 -3966 26909 19496 -16652 -39309 -24472 8172
1118H172J0694j9684k2018Q728L4044K0796j7853l7796j4910K6306L8247Q071
$$ 8172 18866 -818 -22836 -14108 19936 40732 22879 -14917 -29827 -3521 34726 42797
1130D2797k8933l1735k6K5552J5200j7917l0640o606K7100K9468m135l6907k9148
$$ 42797 13864 -17871 -17897 7655 22855 4938 -25702 -32308 -5208 24260 20125 -16782 -45930
1143d5930R960L7567K3529j2196k8105o751K2743K4511m284k7497j5624J9023
$$ -45930 -35970 1597 25126 12930 -15175 -21926 817 25328 21044 -6453 -22077 -3054
1155c054L5717J2630k5326l6327q881K3586K5374l082k7073j6662J1712K3102
$$ -3054 32663 45293 19967 -16360 -25241 -1655 23719 20637 -6436 -23098 -11386 11716
1167A1716J440k6994k6068N876L3975K5408r227l1141j6074J6266K8471Q257j7985
$$ 11716 13156 -13838 -39906 -34030 -55 25353 16126 -15015 -31089 -14823 13648 21905 3920
1180C920j6234J0402K7642J1572k1483l2264p154K6093K9233k79k8788k5095L942
$$ 3920 -12314 -1912 25730 37302 15819 -16445 -23599 2494 31727 31448 2660 -22435 -18493
1193a8493K1438Q684j8770k2787K846K8306K1596j1958l3861j7929J8835L5194
$$ -18493 2945 11629 -7141 -29928 -27082 1224 22820 10862 -22999 -40928 -22093 13101
1205A3101J5321j6766k3982P34K4302J6892j3002k8205p941K6132L1880K46l4123
$$ 13101 28422 11656 -12326 -11592 12710 29602 16600 -11605 -19546 6586 38466 38712 4589
1218D589l3683P64K9737K1631j2266k9613j0458K0799K4320n495l2866k1747J7823
$$ 4589 -29094 -28330 1407 23038 10772 -18841 -29299 -8500 15820 10325 -22541 -44288 -26465
1231b6465M1816K2087j9544l7149j1928K5991L2270K223k6317j9011J4878L2040
$$ -26465 15351 37438 17894 -19255 -31183 -5192 27078 29301 2984 -16027 -1149 30891
1243C0891Q286k9941l8007m774L3881L4228l363l7376l0210Q283L0382J3491j9993
$$ 30891 39177 9236 -28771 -33545 336 34564 31201 -6175 -36385 -28102 2280 15771 -4222
1256d222k6972J920L3255K6789j1174l8061k2415K0331M2800K0369k0193l2851
$$ -4222 -31194 -29274 3981 30770 19596 -18465 -40880 -20549 22251 42620 22427 -10424
1268a0424o854K4362K2080q698k9989j4168K1050L2908M713l2709l7862l898L0995
$$ -10424 -17278 7084 29164 20466 -9523 -23691 -2641 30267 34980 2271 -35591 -39489 -8494
1281h494K9356l977k8742j6803J3212K4581L829k2619k0035J0878L4667K2648
$$ -8494 20862 16885 -11857 -28660 -15448 9133 12962 -9657 -29692 -18814 15853 38501
1293C8501j3372l3697j7084J6767K9334Q829j7420j9001K199J8033P236j7968
$$ 38501 25129 -8568 -25652 -8885 20449 29278 11858 -7143 -4944 13089 20325 2357
1305B357k6118m620K3233K5573q20k5448k3413K513K1362J3169o853j3225K364
$$ 2357 -23761 -28381 -5148 20425 19605 -5843 -29256 -26743 -5381 7788 935 -12290 -9926
1318i926J8513J3063j0279k3145r552J7605K7157Q973j6935k1637l230J3417Q580
$$ -9926 8587 21650 11371 -11774 -21326 -3721 23436 32409 15474 -6163 -9393 4024 12604
1331A2604r324j6069l05J8088J4831r112k7726j8271J0468K7224J4300j0636j8807
$$ 12604 3280 -12789 -13094 4994 19825 10713 -17013 -35284 -24816 2408 16708 6072 -12735
1344a2735k889J5674J3041p804j8789l273K2302K6460J670k6754k7069Q54K4803
$$ -12735 -15624 50 13091 5287 -13502 -16775 5527 31987 33657 6903 -20166 -19312 5491
1357E491J9803p404k3368j0248J3541J7340n514k7688j8440J3975L4299J7280
$$ 5491 25294 17890 -5478 -15726 -2185 15155 9641 -18047 -36487 -22512 11787 29067
1369B9067j8699l4069j2007K1799K9931M705k0725j6652J2005K8286R211k4018
$$ 29067 10368 -23701 -35708 -13909 16022 20727 2 -16650 -4645 23641 32852 8834
1381H834l2288k565L2440L2516l249l5617k9091O506K8960J4490j8176k7236k268
$$ 8834 -23454 -26019 6421 38937 35688 71 -29020 -22514 6446 20936 2760 -24476 -26744
1394b6744K7018K4299j0580l6130k1794J9056M0804J9773j8760l3449q485K4187
$$ -26744 274 24573 13993 -22137 -43931 -24875 15929 35702 16942 -16507 -24992 -805
1406h05K6582k795k6428j5774J6866L1715P912k7976l5877n753K9051K9539j915
$$ -805 25777 22982 -3446 -19220 -2354 29361 37273 9297 -26580 -32333 -3282 26257 24342
1419B4342l0454k2526P964K4777Q869j8751k3007L448K9765K3358q864l1197j8075
$$ 24342 -6112 -28638 -20674 4103 12972 -5779 -28786 -25338 4427 27785 18921 -12276 -30351
1432c0351J5100L1681J4155j4828k2704j791J8720J3600j0374k3779r299J7646
$$ -30351 -15251 16430 30585 15757 -6947 -8738 9982 23582 13208 -10571 -19870 -2224
1444b224K4003K273k3892k5403r52K0046J6553n741j7110o183J3030J5531k455
$$ -2224 21779 24052 160 -25243 -26195 -6149 10404 4663 -12447 -18630 -5600 9931 7476
1457G476j7556j0971J0871K4109J1999j1018j9840n856J3293J4166k461j4034
$$ 7476 -10080 -21051 -10180 13929 25928 14910 -4930 -10786 2507 16673 14212 178
1469A78p008R632J3426k349j8887j6569L133J9200J1959p835j8402o366J1665
$$ 178 -6830 2802 16228 13879 -5008 -21577 -18444 756 12715 4880 -13522 -19888 -8223
1482h223J3367j547j4437o700J3526K0517N188j6221j9161K71K0287J7175m752
$$ -8223 5144 3597 -10840 -17540 -4014 16503 21691 5470 -13691 -13420 6867 24042 19290
1495A9290j9660j0232J0893J6269r53k0375j7761O760K3121J3227j3715k6678
$$ 19290 -370 -10602 291 16560 15607 -4768 -22529 -15769 7352 20579 6864 -19814
1507a9814j0316J6590K4112L022j9318j6446Q681K4955J2483j5475k5169m370
$$ -19814 -30130 -13540 10572 13594 -5724 -22170 -13489 11466 23949 8474 -16695 -21065
1519b1065K4823K6539k94k6973k2148O555K6028J2696j6712k6321n568K2079K2173
$$ -21065 3758 30297 30003 3030 -19118 -12563 13465 26161 9449 -16872 -22440 -361 21812
1532B1812n882l0543k1401J2640L1727J5337j7509k8047n636K3792K5270k889
$$ 21812 15930 -14613 -36014 -23374 8353 23690 6181 -21866 -27502 -3710 21560 18671
1544A8671k5162j6222J4814L0806J1818k1308k9949n253K4916K5215l714k7462
$$ 18671 -6491 -22713 -7899 22907 34725 13417 -16532 -21785 3131 28346 24632 -2830
1556b830k0204R376K5019Q374k0055k6480j948K5497K3496n045k7614j8053J2037
$$ -2830 -23034 -13658 11361 19735 -320 -26800 -28748 -3251 20245 15200 -12414 -30467 -18430
1569a8430K7924J2613j5047k1456nK2094J8827p038k4810j3269J4030K5350P584
$$ -18430 9494 22107 7060 -14396 -14401 7693 26520 19482 -5328 -18597 -4567 20783 28367
1582B8367j9346k4115k847J7996J4618p058k0837r094J3003J9744J384j9122j8133
$$ 28367 9021 -15094 -17941 55 14673 7615 -13222 -22316 -9313 10431 11815 -7307 -25440
1595b5440M409K2490J5936o608j7968o487J2454J6456Q96j5020j1024Q433J8475
$$ -25440 -21031 1459 17395 10787 -7181 -13668 -1214 15242 16138 1118 -9906 -1473 17002
1608A7002O736j3624k0215m894J3916J4259k377j6272j0414O472J3572J376j4087
$$ 17002 23738 10114 -10101 -14995 -1079 13180 10803 -5469 -15883 -9411 4161 5537 -8550
1621h550j3245M757J9086J2598p031j7994o632J2571J6892K986j2773j0112P056
$$ -8550 -21795 -17038 2048 14646 7615 -10379 -17011 -4440 12452 15438 2665 -7447 -391
1634c91J6565N015j4527j8117j689J7191J6192m609j9847j4463O225J6559M637
$$ -391 16174 21189 6662 -11455 -13144 4047 20239 15630 -4217 -18680 -12455 4104 8741
1647H741j3896j4656K720J9177J3271r472k1349q563J5018K3346P199j5072j7108
$$ 8741 -5155 -19811 -17091 2086 15357 5885 -15464 -24027 -9009 14337 21536 6464 -10644
1660a0644J588J8227J1826r031j9666n442J6258J9768j372k3081k1085K953K2217
$$ -10644 -9056 9171 20997 11966 -7700 -13142 3116 22884 21512 -1569 -22654 -19701 2516
1673B516J4436r598k1169q155J4510J7758j584j9522j3708J0791K5634J2505j3989
$$ 2516 16952 7354 -13815 -21970 -7460 10298 8714 -10808 -24516 -13725 11909 24414 10425
1686A0425k3453o478J8177K1537Q90j8176j4140P066J9237N914j6836k1908k220
$$ 10425 -13028 -19506 -1329 20208 21098 2922 -11218 -4152 15085 20999 4163 -17745 -19965
1699a9965K0538J9522m157k3890j7216P121K0968R365j1872j6868P09J8430J4961
$$ -19965 573 20095 15938 -7952 -25168 -18047 2921 12286 414 -16454 -15745 2685 17646
1712A7646o627k1351j0488J3753K4318Q380j4609k0366k173J6036J2619o183j7426
$$ 17646 11019 -10332 -20820 -7067 17251 25631 11022 -9344 -11517 4519 17138 10955 -6471
1725f471p382J2476J6866l43k0124j8577L007K0733J4384o873j8501p312J1754
$$ -6471 -13853 -1377 15489 15146 -4978 -23555 -20548 185 14569 7696 -10805 -18117 -6363
1738f363J5111M28j4608j0101R940K0444Q548j3553k0084m995J5695J7308k23
$$ -6363 8748 9176 -5432 -15533 -5593 14851 23399 9846 -10238 -15233 462 17770 17547
1751A7547j6406j1792N752J3998K699j4394j6295J465J8190J4670n623k0365j1998
$$ 17547 1141 -10651 -4899 9099 11798 -2596 -18891 -17426 764 15434 9811 -10554 -22552
1764b2552R225J8462O828j0907j2664L163J6754J0033r143j8685n499J5230J9596
$$ -22552 -13327 5135 11963 1056 -11608 -8445 8309 18342 9199 -9486 -14985 245 19841
1777A9841K797j7351j7149N82J5448R555q890j6410l608J3779J4575m057j9710
$$ 19841 22638 5287 -11862 -11280 4168 13723 4833 -11577 -15185 -1406 13169 9112 -10598
1790a0598j3989Q168K1110J1357r611j7516l811J3921J4352k032j5143q402J0769
$$ -10598 -24587 -16419 4691 16048 6437 -11079 -14890 -969 13383 11351 -3792 -12194 -1425
1803a425J9068N101j5955j9618k094J6579J5653l570j7263j1256O966J4026K942
$$ -1425 17643 22744 6789 -12829 -14923 1656 17309 13739 -3524 -14780 -7814 6212 9154
1816I154j4585j4466L499J8565J3687p517j9084r741J1238J8242O110j1598j1745
$$ 9154 -5431 -19897 -16398 2167 15854 8337 -10747 -20488 -9250 8992 15102 3504 -8241
1829h241K880J5204P934r662j6831l713J3868J6877p4j7464j5595K498J4358P779
$$ -8241 -5361 9843 17777 8115 -8716 -12429 1439 18316 18242 778 -14817 -12319 2039 9818
1843I818q161j4049j474J3156J1199n024j6764r530J0418J9080Q149j0450j4809
$$ 9818 1657 -12392 -13866 -710 10489 5465 -11299 -20829 -10411 8669 16818 6368 -8441
1856h441j980J3178J1093m177j3375n116J1305J4506L23j6547j5917J339J6443
$$ -8441 -10421 2757 13850 9673 -3702 -8818 2487 16993 17316 769 -15148 -13809 2634
1869B634J2056o433j6106p341R085J2778r55j4295j0199Q371J9038Q813j1362
$$ 2634 14690 8257 -7849 -15190 -6105 6673 5718 -8577 -18776 -10405 8633 17446 6084
1882F084j8625m815J4921J7388Q89j4504j0606O812J5015L978j3765j6630L59
$$ 6084 -12541 -17356 -2435 14953 15842 1338 -9268 -2456 12559 16537 2772 -13858 -13499
1895a3499J7738J5499n515k0872j3830P528J7682O776j1711j4688J334J6302J1649
$$ -13499 4239 19738 14223 -6649 -20479 -12951 4731 11507 -204 -14892 -13558 2744 14393
1908A4393p640j9504p716J3929K1792O567j4827j8247j263J5891J3305n465j6628
$$ 14393 6753 -12751 -20467 -6538 15254 21821 6994 -11253 -12516 3375 16680 11215 -5413
1921e413o755J1701J6645R9j8878j7567K610J9349J4697o384j8826r781R824J5844
$$ -5413 -12168 -467 16178 16277 -2601 -20168 -17558 1791 16488 10104 -8722 -18503 -8679 7165
1935G165K445j3614j1288O078J8595J0423j0420j9693o926J3882J8538L360j4040
$$ 7165 9610 -4004 -15292 -9214 9381 19804 9384 -10309 -17235 -3353 15185 18545 4505
1948D505j3778J836J3535O468r610j5134k169J4055J4524k561j6976j3724M148
$$ 4505 -9273 -7437 6098 12566 2956 -12178 -14347 -292 14232 11671 -5305 -19029 -14881
1961a4881J6324R462o015j2115k558J0299R738l168j2744o525R286J5782M798
$$ -14881 1443 10905 4890 -7225 -9783 516 10254 7086 -5658 -12183 -2897 12885 17683
1974A7683j0828j4258k550J0243R222j903j0542m587O302Q578j511j2155r571
$$ 17683 6855 -7403 -9953 290 9512 7609 -2933 -7520 -1218 7360 5849 -6306 -15877
1987a5877M756J3863Q121o268j1850m116P952R219m85p912l967P262J1147J189
$$ -15877 -11121 2742 10863 4595 -7255 -11371 -3419 5800 5315 -2597 -6564 698 11845 13034
2001A3034j1500j1427J503J2380R980m036j2251o598N525R040n29j0871p697N828
$$ 13034 1534 -9893 -8390 3990 13970 9934 -2317 -8915 -3390 5650 5121 -5750 -13447 -7619
2015g619J3414O318r979j5153l395J1720J4401Q09j1124r002N413J3062M408j0526
$$ -7619 5795 12113 2134 -13019 -16414 -4694 9707 10516 -608 -9610 -4197 8865 13273 2747
2029B747j3010P63J5427J3280m841j8044j2006O590J6099O345j1028j4470m79
$$ 2747 -10263 -9500 5927 19207 14366 -3678 -15684 -9094 7005 13350 2322 -12148 -12627
2042a2627J3779J0618o858j7316p607J2040J9615N700j4689j7059k63J6313J3903
$$ -12627 1152 11770 4912 -12404 -20011 -7971 11644 17344 2655 -14404 -14667 1646 15549
2055A5549m034j5512p383J0515J6287K145j6512j6417J563J8492J3976o023j9712
$$ 15549 11515 -3997 -11380 -865 15422 17567 1055 -15362 -13799 4693 18669 12646 -7066
2068g066j1273Q425J7378L606j2715j4296K685J6674J1374p389j8309p658J2330
$$ -7066 -18339 -9914 7464 11070 -1645 -15941 -13256 3418 14792 7403 -10906 -18564 -6234
2081f234J8761N386j3182j5151N66J4869J0560n895j5623n758J1017J4535M02
$$ -6234 12527 17913 4731 -10420 -9854 5015 15575 9680 -5943 -11701 -684 13851 14253
2094A4253j5032j4459J407J5597J0132n551j4410o066Q726J2213M49j1084r267
$$ 14253 -779 -15238 -13831 1766 11898 6347 -8063 -14129 -5403 6810 7259 -3825 -13092
2107a3092M829J4250P705p197j3138l688R441J1684Q72j0207p729L278R883L158
$$ -13092 -8263 5987 13692 6495 -6643 -10331 -890 10794 11666 1459 -6270 -2992 6891 10049
2121A0049q173j0230q40R860Q173l026j0997o163M600R600K110o660o683K307
$$ 10049 1876 -8354 -9194 666 8839 5813 -5184 -11347 -6747 2853 4963 -1697 -8380 -6073
2135f073Q971N090m962r185j491Q436R053q71q779o288L994Q520K384p574q177
$$ -6073 2898 7988 3026 -6159 -7650 786 9839 8968 189 -6099 -2105 6415 8799 1225 -6952
2150f952J381R036N610n271j0858m424P293R970M82r057p768L423J0628N526o685
$$ -6952 -5571 3465 9075 3804 -7054 -11478 -4185 5785 6267 -2790 -10558 -7135 3493 9019 2334
2165B334j0402j617J0632J0840j103j1960q468N188J2461M801q654j2372j029
$$ 2334 -8068 -9685 947 11787 10684 -1276 -9744 -4556 7905 12706 4052 -8320 -9349
2178i349J0987J0507m023j4559q584P056J4801M978j0377j3805o39J3253J1400
$$ -9349 1638 12145 8122 -6437 -15021 -7965 6836 11814 1437 -12368 -13007 246 11646
2191A1646l846j3802p680R150J5561M374j2335j4321M18J4312J1823m188j5511
$$ 11646 7800 -6002 -13682 -4532 11029 15403 3068 -11253 -10835 3477 15300 11112 -4399
2204d399q471Q106J4480L170j2903j4136J004J4969J1574n303j6278q363R007
$$ -4399 -12870 -4764 9716 12886 -17 -14153 -13149 1820 13394 8091 -8187 -16550 -7543
2217g543J5595M486j1139j2786J103J4250J0581n503j5092o919R657J5364L659
$$ -7543 8052 12538 1399 -11387 -10284 3966 14547 9044 -6048 -12967 -3310 12054 15713
2230A5713j2513j3619N7J2569R575m943j3772n867Q544J2791J222j2042j1677
$$ 15713 3200 -10419 -10362 2207 11782 6839 -6933 -12800 -4256 8535 9757 -2285 -13962
2243a3962K388J3452R328m659j2450m748P671J1194J172r466q121L643J1954N529
$$ -13962 -11574 1878 11206 6547 -5903 -10651 -2980 8214 9386 -80 -8201 -4558 7396 12925
2257A2925p495j1567l821Q569J0119l05r527p390L057Q218L237o914q749N66R610
$$ 12925 5430 -6137 -9958 -1389 8730 8425 -1102 -8492 -5435 2783 6020 -894 -9643 -9077 533
2272E33P706k824r712n787N346R641K810n667o867J727Q011M145n473q759j700
$$ 533 8239 5415 -4297 -10084 -4738 4903 7713 2046 -4821 -3094 4917 9062 3589 -5170 -6870
2287f870P608Q654r14r649p055K348Q446L264n765p539N35Q194O001m312j0021
$$ -6870 738 9392 8478 -1171 -8226 -5878 2568 5832 67 -7472 -6937 1257 7258 2946 -7075
2302g075m069P055J0604K912p782q597J153R047N949m676q989k160Q248R128o35
$$ -7075 -11144 -4089 6515 9427 1645 -6952 -5799 3248 9197 4521 -4468 -6628 1620 10748 10113
2317A0113j1736r059L138J1389O616o013j1265l143P533R125j540j0460o582O058
$$ 10113 -1623 -10682 -7544 3845 10461 4448 -6817 -9960 -2427 6698 5158 -5302 -11884 -5826
2331e826J2527N146q625j2258k508J0780J1331n64j0969p402M848J1143L276r389
$$ -5826 6701 11847 3222 -9036 -11544 -764 10567 10003 -966 -8368 -3520 7623 10899 1510
2345A510j0960J45J1838R962l563j3528q739N562J2511M740q286j0536J15J0526
$$ 1510 -9450 -9305 2533 12495 8932 -4596 -13335 -7773 4738 9478 1192 -9344 -9229 1297
2359A297Q237m237j2339n476Q185J3718L691r674j2201o28J0705Q864l078j0858
$$ 1297 9534 5297 -7042 -12518 -4333 9385 13076 3402 -8799 -9427 1278 10142 7064 -3794
2373c794m740P114J0413P73j0915j0404K041J1852Q623m318j2045n602O713R939
$$ -3794 -8534 -1420 8993 9766 -1149 -11553 -9512 2340 10963 6645 -5400 -11002 -4289 5650
2387E650J386q728o986L177J1130N380o654j1416l132Q824J0251R13r503p788
$$ 5650 7036 -1692 -8678 -5501 5629 11009 4355 -7061 -10193 -1369 8882 9795 292 -7496
2401g496K652Q723L846o617q699j94R132Q014k705j1002o600M713J0364L824o032
$$ -7496 -4844 3879 7725 1108 -7591 -7785 1347 9361 6656 -4346 -10946 -6233 4131 7955 1923
2416A923q091m6Q045N921l721r421l347P238J0084J216q633r073N17R098O528
$$ 1923 -6168 -6214 1831 7752 4031 -5390 -8737 -1499 8585 9801 1168 -7905 -7388 1710 8238
2431H238l837q786k962O849P468j019r766o816M323J0498N685o139r760k445P268
$$ 8238 4401 -4385 -7347 -498 6970 5951 -3815 -10631 -6308 4190 9875 3736 -6024 -8469 -1201
2446a201P851n03q627m845M963R525K513q125r659l59R701Q370k517r697n794
$$ -1201 6650 6147 -2480 -7325 -2362 7163 9676 1551 -8108 -8467 1234 9604 7087 -2610 -8404
2461h404M395Q452K115p271p738J381R710O764m250j0989m478O453J0003K564
$$ -8404 -4009 4443 6558 -713 -8451 -7070 2640 9404 5154 -5835 -10313 -3860 6143 8707
2475H707p395p986Q57Q918N620n127q882k851P649R357L49r630q879J778R498
$$ 8707 1312 -6674 -5817 3101 8721 3594 -5288 -8139 -490 8867 9216 -414 -9293 -7515 1983
2490A983N789m492q668k327O948P312j580q614n862M478J0097M476o095r308j770
$$ 1983 7772 3280 -5388 -7715 -767 6545 4965 -3649 -9511 -5033 5064 9540 3445 -5863 -7633
2505g633P402P520j340p629m512M788P962J782p730q728R89Q463P159k862r039
$$ -7633 -231 7289 5949 -1680 -6192 -1404 6558 8340 610 -8118 -7129 1334 8493 5631 -3408
2520c408m952M576P880J112o830n981K372R051M746n455r497k326O813Q977R62
$$ -3408 -8360 -3784 4096 5208 -1622 -7603 -5231 3820 8566 3111 -6386 -8712 -1899 7078 8040
2535H040p483o633K398P803L456n786p913j49P810P715k889r609o753M326R305
$$ 8040 557 -6076 -3678 4125 7581 1795 -6118 -6267 1543 9258 6369 -3240 -9993 -5667 3638
2550C638L640n826p860l16P821N961l356r190l715O781R788K319q417q577K99
$$ 3638 7278 1452 -6408 -6724 1097 7058 3702 -5488 -9203 -2422 7366 9685 1268 -7309 -7010
2565g010Q758O645l096q737l678O175Q854m53r123q187K722J0304O657m757j0462
$$ -7010 1748 8393 5297 -3440 -7118 -943 7911 7458 -1665 -9852 -7130 3174 9831 5074 -5388
2580e388m551O794Q759Q51p822p077L679R327M909n762j0700k335Q423R820L34
$$ -5388 -9939 -3145 5614 6465 -1357 -8434 -4755 4572 9481 3719 -6981 -9316 -893 8927 9261
2595I261r239p323K096Q884M580n751q512j440P808Q256k130r810p005L543J0119
$$ 9261 22 -7301 -5205 3679 8259 2508 -6004 -7444 364 8620 6490 -3320 -10325 -6782 3337
2610C337M952n328q847j166P027O380j624p824m373M691R320K579o845q435p38
$$ 3337 8289 2961 -5886 -7052 -25 6355 4731 -3093 -7466 -2775 6545 9124 2279 -6156 -6894
2625f894P448O727j463p282m555L976O377R90o600o146J665P514N466l581q049
$$ -6894 554 7281 5818 -1464 -6019 -2043 4334 5324 -1276 -7422 -5757 1757 7223 3642 -4407
2640d407l169M758O521J205n407m219K029O502K399m411o329p16O252O233j146
$$ -4407 -7576 -2818 3703 4908 -499 -4718 -2689 3813 6212 1801 -4528 -5244 1008 7241 6095
2655F095p110m622K783N857J659m547n195P13O149L841l948o810k579N386P166
$$ 6095 -1015 -5637 -2854 3003 4662 115 -5080 -4367 1782 5623 1675 -5135 -7714 -2328 4838
2670D838O67n738n351J545O819L297l839o647j53O429N742j674p888n042L498
$$ 4838 5505 -233 -5584 -4039 2780 6077 2238 -4409 -4562 1867 7609 5935 -1953 -6995 -3497
2685c497P733L400n648p764p60O851N788k799q443l725N685Q525J792p443p997
$$ -3497 4236 7636 1988 -5776 -6536 315 6103 3304 -5139 -8864 -3179 5346 7138 -305 -8302
2700h302Q30Q987O734k964q320l602N824Q359P23q021p785K113R282O239m608
$$ -8302 -7472 1515 8249 5285 -3035 -6637 -813 7546 8269 248 -7537 -5424 3858 10097 5489
2715E489j0259m684O209R155J111q588p682J949R715N458n027r792l146P613R778
$$ 5489 -4770 -9454 -3245 5910 7021 -1567 -9249 -7300 2415 7873 2846 -6946 -10092 -2479 7299
2730G299J581q839p812J771R632O432m536r562l382P050Q862J79r239p980K282
$$ 7299 8880 41 -7771 -6000 3632 10064 5528 -4034 -7416 -366 8496 8675 -564 -8544 -6262
2745f262R229N411m766r755l107O551Q109L79q100o622L229Q606M729m244q522
$$ -6262 2967 8378 3612 -6143 -9250 -2699 5410 5789 -2311 -8933 -5704 2902 7631 3387 -5135
2760e135j740O572P703j8p501n655K724P560L717n033p699j233N882N931j611
$$ -5135 -6875 -303 7400 7382 -119 -5774 -3050 4510 8227 3194 -4505 -5738 144 6075 4464
2775D464o561n139K916O777K242m548o086k25O050M904j499o219k726L680O040
$$ 4464 -2097 -7236 -4320 2457 4699 151 -5935 -6160 -110 4794 3295 -2924 -5650 -1970 4070
2790D070J528m742m409J150N126L060k696n738j275L932M540p91n238l673K224
$$ 4070 5598 856 -3553 -2403 2723 5783 3087 -2651 -3926 6 4546 3755 -1483 -5156 -2932
2805b932M755J455l857m260K28M911L350j876n366j860M323N593M71n071l835
$$ -2932 1823 3278 -579 -4839 -4611 300 3650 1774 -3592 -5452 -1129 4464 4935 -136 -3971
2820c971J930N565K411l692n557n08M837N029j403o715m419L096O464J969m638
$$ -3971 -2041 3524 5935 2243 -3314 -3822 1015 6044 4641 -2074 -6493 -3397 3067 5036 398
2835C98o316j54O362N059k575p119k946M722Q081J735o335o768P92P439N536k652
$$ 398 -5918 -6072 290 5349 2774 -4345 -7291 -2569 5512 7247 912 -5856 -5064 2375 7911 5259
2851E259p791l235M809P062P96p443p108J535Q492N398l775r241l529N308P985
$$ 5259 -2532 -5767 -958 6104 6900 -543 -7651 -6116 2376 7774 3999 -5242 -8771 -3463 4522
2866D522J225o606o419J918Q149N226m259q785k885O833Q710J017p899p406J602
$$ 4522 5747 -859 -7278 -5360 2789 8015 3756 -5029 -7914 -1081 7629 8646 747 -6659 -5057
2881e057P790M813l818q012k969O046P246k40p626o814J768Q812N145l830q061
$$ -5057 2733 7546 3728 -4284 -7253 -1207 6039 5799 -1827 -8641 -6873 1939 7084 3254 -4807
2896d807k874N434P504L66o412n232K660P941L423m460p750k096N941O827q1o441
$$ -4807 -7681 -2247 5257 5623 -789 -6021 -3361 4580 8003 3543 -4207 -6303 -362 6465 6384 -57
2912e7n266J385O201K505m225o223k27N668N086j390o243m018K731O409K702l321
$$ -57 -5323 -3938 2263 4768 543 -5680 -5907 -239 4847 3457 -2786 -6804 -4073 2336 5038 1717
2928A717n073J90M723L716k151n193j893L816N400Q99n509m907L06M705L111k390
$$ 1717 -3356 -3166 1557 5273 3122 -2071 -3964 -148 5252 6151 642 -4265 -3959 746 3857 1467
2944A467m189j386L508L729j207n220k568K749N569K344l717m875Q9M263L597
$$ 1467 -2722 -4108 -600 3129 1922 -3298 -5866 -3117 2452 4796 1079 -3796 -3707 556 4153
2959D153j224m415j425L665M671n98n075m848J694N739L402l126o004j656L527
$$ 4153 2929 -1486 -2911 754 5425 4827 -248 -5096 -3402 2337 5739 2613 -3391 -5047 -1520
2974a520M710p96n357l052L135O183K021m616o189m80O106N827j018n711l955
$$ -1520 3190 2394 -2963 -6015 -2880 3303 5324 708 -5481 -5961 145 5972 4954 -757 -4712
2989d712L079N985J661m913n808K65O510N172k305p792m378L596O961K338n368
$$ -4712 -1633 4352 6013 1100 -4708 -4443 2067 7239 4934 -2858 -7236 -3640 3321 5659 291
3004B91o015L93O159M475k687p084k886N335P349J866o358o551L59O895N248k559
$$ 291 -5724 -5331 828 5303 2616 -4468 -7354 -2019 5330 7196 838 -5713 -5354 1541 6789 4230
3020D230o506k934M487O590j22o286n891J118P612M786l633p344l246M206O945
$$ 4230 -2276 -5210 -723 5867 5745 -541 -6432 -5314 2298 7084 3451 -3893 -7139 -2933 4012
3035D012M98n212n126J892O671L659l760p222j829N592O777K72n901n444J663
$$ 4012 4510 -702 -5828 -3936 2735 6394 2634 -4588 -6417 -825 5952 6224 323 -5121 -3458
3050c458N932L169l806n527j095N284M796r01o485m684L073O138K919l547n789
$$ -3458 2474 5643 1837 -3690 -4785 499 5295 4394 -2091 -6775 -3702 2436 5355 1808 -3981
3065c981o49M907L873r88n295k548L264N817J074m816n371L59N200L971j353n394
$$ -3981 -4630 277 4150 3162 -2133 -4681 -1417 4400 5474 658 -4713 -4354 846 4817 3464 -1930
3081a930k143K805M615J59m737m313J924N580K937l028n219j624L603N030K83
$$ -1930 -4073 -1268 3347 3506 -1231 -5544 -3620 1960 4897 1869 -3350 -4974 -1371 3659 3942
3096C942m675k888J655N023J975m044n046k24M988M548j398n051l380K415M648
$$ 3942 -733 -3621 -1966 3057 5032 988 -4058 -4282 706 5254 3856 -1195 -4575 -2160 2488
3111B488J319m129m166O36N113L429k380n673k232L699N685J030m242m475Q71
$$ 2488 3807 -322 -4488 -3852 1261 4690 2310 -3363 -5595 -1896 3789 4819 577 -3898 -3027
3126c027M812L046k368n406j277M396M825k98n446m696J844N362L225l045n403
$$ -3027 1785 4831 2463 -2943 -4220 176 5001 4703 -743 -5439 -3595 1767 4992 1947 -3456
3141c456j410M240M540j031m819l475K257O000K401l531n446q27M761M325n27
$$ -3456 -4866 -626 3914 2883 -1936 -5411 -3154 2846 5247 1716 -3730 -4557 204 4529 4002
3156D002n173k806K680N114R82m283n007L76N228L877j841n439l005K959M901
$$ 4002 -1171 -3977 -1297 3817 4799 516 -4491 -4115 1113 4990 3149 -2290 -5295 -2336 2565
3171B565J067l981m264R41M645L255k224n147j650L731N361M60m545m002J258
$$ 2565 3632 -349 -4613 -3672 973 4228 2004 -3143 -4793 -1062 4299 4759 214 -3788 -2530
3186b530M562K810k604n063p64M122L779p87m983l827K270M941K518l375m834
$$ -2530 2032 4842 2238 -2825 -3589 533 4312 3525 -1458 -5285 -3015 1926 4444 1069 -3765
3201c765n59M026L813j025m702k780L325N232J558m355m719K60N021L751j848
$$ -3765 -4324 -298 3515 2490 -2212 -4992 -1667 3565 5123 768 -3951 -3691 1330 5081 3233
3216C233n028k159L403M570J87m684m360J383N309L130k560n712k027L456N377
$$ 3233 -1795 -3954 -551 4019 4206 -478 -4838 -3455 1854 4984 2424 -3288 -5315 -1859 3518
3231C518n5m208l950J983N093K429l002n633r28M931M951k51n302m157J694N323
$$ 3518 3463 -745 -4695 -2712 2381 4810 1808 -3825 -4753 178 5129 4878 -424 -4581 -2887 2436
3247B436K489l454n062n54M439M453j381n649l475K550N700K402l620n172p41
$$ 2436 4925 1471 -3591 -4145 294 4747 3366 -2283 -5758 -3208 2492 4894 1274 -3898 -4639
3262d639M800M147j334m979k828L363N470J245m163n244J42M843M074j607m815
$$ -4639 161 4308 2974 -2005 -4833 -1470 4000 5245 1082 -4162 -4020 823 4897 3290 -1525
3277a525k640K473M979L98l884m257O82M833L400k155n076k052L087M636Q98l883
$$ -1525 -4165 -1692 3287 3685 -199 -4456 -3774 1059 4459 2304 -2772 -4824 -1737 2899 3797 -86
3293h6l736J053M575K382k401m301j456L755M111j06m141l356J679L621J758k358
$$ -86 -3822 -2769 1806 4188 1787 -2514 -3970 -215 3896 3790 -351 -3707 -2028 1593 3351 993
3309I93l897k46L326L160j405l673k345K335M056J073l344k943K72L513K591j856
$$ 993 -2904 -3150 176 3336 1931 -1742 -4087 -1752 2304 3377 33 -2910 -2638 875 3466 1610
3325A610l403j361K825L525N1l653k828J031L762K082k682l777q68L607L017q36
$$ 1610 -1793 -3154 -329 3196 3247 -406 -3234 -2203 1559 3641 959 -2818 -3686 -79 2938 2102
3341B102l899k392K563M084J043l336l919M49M137L309j566m521j772L055M218
$$ 2102 -1797 -4189 -1626 2458 3501 165 -3754 -3305 832 4141 2575 -1946 -3718 -663 3555
3356C555P96m261l767P92M586K841k170n308j593L710M182J75m437m008J388N030
$$ 3555 4351 90 -3677 -2885 1701 4542 2372 -2936 -4529 -819 3363 3538 -899 -4907 -3519 1511
3372A511K804k655n238r58L804N043j22m571m037J751N252K704l123n282j225
$$ 1511 4315 1660 -3578 -4536 -732 4311 4189 -382 -4419 -2668 2584 5288 2165 -3117 -4342
3387d342M190M995o16n228m262J915N316K841l207n502j238M271M948o57m786
$$ -4342 -152 4843 4227 -1001 -5263 -3348 1968 4809 1602 -3900 -5138 -867 4081 3424 -1362
3402a362l872K227N351K655k977n458o54M177M325o93m789k982K008M979J857
$$ -1362 -5234 -3007 2344 4999 2022 -3436 -4090 87 4412 3719 -1070 -4052 -2044 2935 4792
3417D792l291n019p02M230M199r58m831k629J662M679J224l126l737o5M086L434
$$ 4792 1501 -3518 -4220 10 4209 3251 -1580 -4209 -2547 2132 3356 230 -3507 -3572 514 3948
3433C948j186m271k243K018M270J361k926l502N0L758K188j556l452j695K384
$$ 3948 2762 -1509 -3752 -1734 2536 3897 971 -2531 -2481 1277 3465 1909 -1543 -3238 -854
3448h54L503N68l506k912N35L106K131j375l491n98K624K685r26k508j954J690
$$ -854 2649 3217 -289 -3201 -2666 440 2571 1196 -2295 -2893 -269 2416 1490 -1018 -2972 -1282
3464a282L105J255k339k392k33K507K004r22k802j124K392K106O1l186k076P61
$$ -1282 1823 3078 739 -1653 -1886 621 2625 1703 -1099 -2223 169 2275 2336 -850 -2926 -2165
3480b165K984K147k194k993n46K572K547p22k970j896K074L948M73k752l353J21
$$ -2165 819 2966 772 -2221 -2767 -195 2352 1630 -1340 -3236 -1162 2786 3259 507 -2846 -2725
3496b725L620K742j210l608j907K465L283L46l521l172J040M082K757k439m394
$$ -2725 895 3637 2427 -1181 -3088 -623 2660 3006 -515 -3687 -2647 1435 4192 1753 -2641
3511b641j705L013M016O81l501l414J140M128K061k289m551j067L967M327L5m471
$$ -2641 -4346 -1333 2683 3364 -137 -3551 -2411 1717 3778 1489 -3062 -4129 -162 4165 4200 -271
3527b71l768J049M665K440k436m211j445L457M340n77m659l557J949N036K843
$$ -271 -4039 -2990 1675 4115 1679 -2532 -3977 -520 3820 3243 -1416 -4973 -3024 2012 4855
3542D855l098m744j388L420M488J15m452l071J654M720K118l107m780j172M218
$$ 4855 1757 -2987 -4375 -955 3533 3648 -804 -3875 -2221 2499 4617 1510 -3270 -4442 -224
3557b24M316L8m581l607J242M385J804k418l897q95L884L737j128m223k944K076
$$ -224 4092 4130 -451 -4058 -2816 1569 3373 955 -2942 -3837 47 3784 2656 -1567 -4511 -2435
3573b435M217K267k487l536j233L131L185p38l468j838J865L627J301l188l793
$$ -2435 1782 4049 1562 -1974 -3207 -76 3109 2371 -1097 -2935 -1070 2557 3858 670 -3123
3588c123q0L233K858r17l128j600J516K982P9k497k307J094K949J984j421l358
$$ -3123 -3203 30 2888 1971 -1157 -2757 -1241 1741 1820 -677 -2984 -1890 1059 3043 1622 -1736
3604a736p15J794K688L98k154k173J264K406N76k225k093k32K613K256r64k779
$$ -1736 -2451 -657 2031 2429 275 -1898 -634 1772 2348 123 -1970 -2202 411 2667 1703 -1076
3620a076j542J480K519K41j966j741N41K759J142j616l009m16K644K793j77k505
$$ -1076 -2618 -1138 1381 1622 -344 -2085 -1544 1215 2357 741 -2268 -2684 -40 2753 2576 71
3636G1k067P52K949R88k066k744L5K958K173j111l634j805K050L254J171k483
$$ 71 -1996 -1244 1705 2693 627 -2117 -2082 876 3049 1938 -1696 -3501 -1451 1803 2974 491
3652D91l114r8L118K294j108l669j290K787L755L30l298l332O37L515K466j290
$$ 491 -2623 -2721 397 2691 1583 -2086 -3376 -589 3166 3496 198 -3134 -2497 1018 3484 2194
3668B194l652j504K528L083J54l329l175J107M136K310k040m215j577K845L693
$$ 2194 -1458 -2962 -434 2649 2803 -526 -3701 -2594 1542 3852 1812 -2403 -3980 -1135 2558
3683B558M82l557k781J397L618J635k136l703j049L333L685P3l989k799J024L464
$$ 2558 3040 -517 -3298 -1901 1717 3352 1216 -2487 -3536 -203 3482 3555 -434 -3233 -2209 1255
3699A255J797j684l711o40K908K906l73l562k541J332L691J863j976l646q99K803
$$ 1255 3052 1368 -2343 -2983 -75 2831 2458 -1104 -3645 -2313 1378 3241 1265 -2381 -3280 -477
3715d77L026m16k846k207J652L334R17k169l198l99L085K432l84l269j766J404
$$ -477 2549 2133 -713 -2920 -1268 2066 2983 814 -2384 -2783 302 2734 2350 -919 -2685 -1281
3731a281K966P47k380k365O9K845K151j420k988j368K059K914M26k464k402Q15
$$ -1281 1685 2432 52 -2313 -2244 601 2752 1332 -1656 -3024 -965 1949 2375 -89 -2491 -1676
3747a676K709J496j536k669o91K355K337q7k876j956Q13L082O77j503k450k15
$$ -1676 1033 2529 993 -1676 -2367 -12 2325 2238 -638 -2594 -1781 1301 1978 475 -1975 -2190
3763b190K598J838j093k480j481J819K503R18k084k615L81K302J849j263k296
$$ -2190 408 2246 1153 -1327 -2808 -989 1514 2432 348 -2267 -1886 416 2265 1002 -1294
3778a294r11K030K575k62k417k483J047K564J985j805k407j051K248K354n02k437
$$ -1294 -2205 -175 2400 2138 -279 -2762 -1715 849 2834 1029 -1378 -2429 -181 2173 1671 -766
3794g66j979J228L030J284j982k890n84K618K560l85l009j635J521K741R47k160
$$ -766 -2745 -1517 1513 2797 815 -2075 -2659 -41 2519 2134 -875 -2510 -989 1752 2699 539
3810E39k782l89K952K707j212k711k264J932K921P83k408k425J86K511K040r38
$$ 539 -2243 -2632 320 3027 1815 -896 -3160 -1228 1693 2476 68 -2357 -2171 340 2380 1442
3826A442l020j220J964K995K83k268k521L34K680J952j417k756q11K222K586q7
$$ 1442 -1578 -2798 -834 2161 2444 176 -2345 -2011 669 2621 1204 -1552 -2363 -141 2445 2358
3842B358k560k427N41L040J774j639k621j144K385K091n5k916j479J275L059R75
$$ 2358 -202 -2629 -2088 952 2726 1087 -1534 -2678 -293 1798 1743 -1173 -2652 -1377 1682 2657
3858B657j778l014l67K626K135o98k196j575J463K448P88k308k163m7K672K018
$$ 2657 879 -2135 -2502 124 2259 1561 -635 -2210 -747 1701 2489 181 -1982 -2029 643 2661
3874B661j056l031j023J551K539M88k202k232N52K717J541j403l017n58K178K667
$$ 2661 1605 -1426 -2449 -898 1641 2129 -73 -2305 -1753 964 2505 1102 -1915 -2473 -295 2372
3890B372Q8k661k205Q59K760J165j270k978l22K370K205k20k874k169J261L011
$$ 2372 2460 -201 -2406 -1547 1213 2378 1108 -1870 -2192 178 2383 2163 -711 -2880 -1619 1392
3906A392Q14j624k359m95K269K140m15k657j752J353K920J187k094l067j12K780
$$ 1392 2206 582 -1777 -2272 -3 2137 1722 -935 -2687 -1334 1586 2773 679 -2388 -2500 280
3922B80K198o61k601j334J161K704N57k172k159o0K661J871j062k549j635J712
$$ 280 2478 1817 -784 -2118 -957 1747 2304 132 -2027 -2087 574 2445 1383 -1166 -2801 -1089
3938a089K713L29j945k198K73K699J642j479k591o75J657K776K46k530j842M83
$$ -1089 1624 1953 8 -2190 -1917 782 2424 945 -1646 -2321 -664 2112 2358 -172 -2014 -1531
3954a531K394J383j090k542n33J839K067k23k433j554R01K221J322j501k467j49
$$ -1531 863 2246 1156 -1386 -1919 -80 1987 1764 -669 -2223 -1322 899 2221 720 -1747 -1896
3970a896J674J966l34k389q83R17K249R59k023j838OK050J424o63j950q38J023
$$ -1896 -222 1744 1410 -979 -1862 -945 1304 2263 240 -1598 -1592 458 1882 1219 -731 -1569 -546
3987e46J711N13j866j270J26K261R61j084k116o13J708J594j53j619j448Q52J974
$$ -546 1165 1678 -188 -1458 -1332 929 1890 806 -1310 -1923 -215 1379 1226 -393 -1841 -989 985
4004I85Q61j728j813l3J919J827o59k499p01J014K310M15j973j990P91K070J256
$$ 985 1846 118 -1695 -1728 191 2018 1359 -1140 -1841 -827 1483 1898 -75 -2065 -1274 796 2052
4021B052q71k683n37J549K219Q6k148j491M29K412Q60j135k423n19K337J819k6
$$ 2052 1181 -1502 -2039 -490 1729 1815 -333 -1824 -1395 1017 1877 742 -1681 -2200 137 1956 1930
4038A930k611j905J021K822Q95j221k564m50J925K517m58k802j349P27K746J237
$$ 1930 -681 -2586 -1565 1257 2152 931 -1633 -2083 -158 2359 1901 -901 -2250 -1523 1223 2460
4054B460j859k437m53K248K363k77k803j422J381K580O46j899k489o75L058K184
$$ 2460 601 -1836 -2289 -41 2322 2045 -758 -2180 -799 1781 2427 528 -1961 -2636 422 2606
4070B606p64k447j694R28K478J146j785k333j81K518J852j007k330j558J445K517
$$ 2606 1842 -605 -2299 -1371 1107 2253 468 -1865 -2046 472 2324 1317 -1013 -2571 -1126 1391
4086A391Q02j399k141m97K044J672q12j696j502J712J965M90j778k416N1K401
$$ 1391 2193 794 -1347 -1844 200 1872 1060 -636 -2138 -426 1539 2029 251 -2165 -2114 287
4102B87J700o28k279p17Q86J913Q7j400j723O38K020J002p54j988q25J479K024
$$ 287 1987 1359 -920 -1637 -751 1162 1249 -151 -1874 -1236 784 1786 1032 -956 -1781 -302 1722
4119A722m12j104j357P45J048N15q36j618K82J208J351m83j423j215P57J412K48
$$ 1722 1310 206 -1151 -406 642 1157 321 -1297 -1015 193 1544 1061 -362 -1577 -820 592 840
4136H40j125p51O7J634J071j350j437l50J473J289J2j627j112O92J263P91j220
$$ 840 -285 -1036 -969 665 1736 386 -1051 -1401 72 1361 1373 -254 -1366 -674 589 1380 160
4153A60j437J91J612J283p38k046j129J368J817P62j803j412L27J567J189j067
$$ 160 -1277 -1086 526 1809 1071 -975 -2104 -736 1081 1843 40 -1372 -1045 522 1711 644
4169F44k022n92J859J642K81k275j690N76K110J478q28k310o94J680J940m26j902
$$ 644 -1378 -1970 -111 1531 1812 -463 -2153 -1577 533 2011 1183 -1127 -1821 -141 1799 1373 -529
4186e29j863J079K448J459j466k633o26J525K407J80k359j852Q84K586R04j403
$$ -529 -2392 -1313 1135 2594 1128 -1505 -2131 -606 1801 1981 -378 -2230 -1346 1240 2144 741
4202G41k160r61K299K122l2k409j839O86K493J213j325k330j15J672J803K43l014
$$ 741 -1419 -2380 -81 2041 2009 -400 -2239 -1553 940 2153 828 -1502 -1617 55 1858 2101 -913
4219i13j422J124K307J265j183k873k67J638K041j61k034j580Q85K577Q46j716
$$ -913 -2335 -1211 1096 2361 1178 -1695 -1962 -324 1717 1556 -478 -2058 -1173 1404 2250 534
4235E34j953p23J903K167j06k089j441N56K019O05j166j694J23J593J439n46j932
$$ 534 -1419 -2142 -239 1928 1822 -267 -1708 -1152 867 1472 306 -1388 -1265 328 1767 1221 -711
4252g11j197J197J774N91j313j330k83J491J247q69j465p56J294J707n1j399j385
$$ -711 -1908 -711 1063 1654 341 -989 -1272 219 1466 597 -868 -1624 -330 1377 1326 -73 -1458
4269a458J75J774P66m87j233p16J032J161m09j251o46Q43J492L02j179j188j82
$$ -1458 -1283 491 1257 770 -463 -1179 -147 1014 605 -646 -1292 -449 1043 1345 166 -1022 -1204
4286a204J305Q99l95j123n90J012J309p1j571j203Q94J264J029j034j475l73J191
$$ -1204 101 1000 605 -518 -1108 -96 1213 1142 -429 -1632 -738 526 1555 521 -954 -1327 -136
4303a36J320l37j289q64J035J436Q6j047j475q6J578J398m78j574j011J052J513
$$ -136 1184 847 -442 -1306 -271 1165 1251 204 -1271 -1357 221 1619 1141 -433 -1444 -392 1121
4320A121M2j036j605K30J830J087o64j885p90J073J808N34j826j586L32K083R17
$$ 1121 1163 127 -1478 -1248 582 1669 1005 -880 -1670 -597 1211 1745 -81 -1667 -1335 748 1665
4337A665q65k229l48J572J853p0j937j344N08J613J459j104j963n47J690J589
$$ 1665 800 -1429 -1777 -205 1648 1578 -359 -1703 -1195 418 1877 773 -1190 -1737 -47 1542
4353A542j71j705j568P27J933J368j290k261n27J756J818k70k048j001P42J776
$$ 1542 1371 -334 -1902 -1175 758 2126 836 -1425 -1952 -196 1622 1352 -696 -1697 -955 821
4369H21J019j136j976n18J606J653J75k045j006O22J190J134j019j692l14J561
$$ 821 1840 704 -1272 -1790 -184 1469 1644 -401 -1407 -785 405 1539 520 -1172 -1486 75
4385G5J606q35j398j174P08J829N06q17j641q4J400J288p73j691n06J026J466
$$ 75 1681 846 -552 -1726 -1018 811 1317 500 -1141 -1225 175 1463 690 -1001 -1507 -481 985
4402I85P69j759j101p6J562R92o09j615l18Q34J389k5j346r50L16J639O52q65
$$ 985 1754 -5 -1106 -1182 380 1372 763 -852 -1170 -336 1053 1028 -318 -1268 -952 687 1339 474
4420D74j330n94J406J350l55j280q17Q43R80L55r76j193M00R78P89Lj570o18O77
$$ 474 -856 -1450 -44 1306 951 -329 -1146 -303 677 1032 56 -1137 -737 241 1030 1033 -537 -1155 -478
4439d78J146L85j241j181P88Q74R69p56j369o39J428J128L5j296q58L25J361P45
$$ -478 668 1053 -188 -1369 -581 293 1262 506 -863 -1502 -74 1054 1089 -207 -1065 -740 621 1366
4457A366r60j544r5J220J621m73j642q25M46J834N06j111j159q70J667J364k54
$$ 1366 406 -1138 -1233 -13 1608 1135 -507 -1332 -886 948 1454 343 -816 -1686 -19 1345 1091
4474A091j814p09N90K066K46j148j684N6J637J017o05j236j011J173J469L07j286
$$ 1091 -723 -1432 -842 1224 1470 322 -1362 -1306 331 1348 743 -493 -1504 -331 1138 1445 159
4491A59j462L94J127J121k90j923n57J208J243R6j159j272J31J675R35n56j879
$$ 159 -1303 -909 218 1339 1049 -874 -1431 -223 1020 1116 -43 -1315 -1184 491 1426 870 -1009
4508a009n50J189J455Q3j131j177K99J324J027r77j332l13Q19J530r9j353q70
$$ -1009 -1559 -370 1085 1168 37 -1140 -841 483 1510 533 -799 -1112 -293 1237 1138 -215 -1085
4525a085J93J517Q37j087j123n53J370J246m73j339p01O96J415L89r97j233r0
$$ -1085 -892 625 1462 375 -748 -1301 69 1315 842 -497 -1198 -502 913 1302 305 -928 -1018
4542a018J030J389o79j257m19P40J266L6j182j045J51J448P31m49j288n13M06
$$ -1018 12 1401 722 -535 -954 -214 1052 1088 -94 -1139 -988 460 1191 742 -546 -1059 -653
4559f53J687Mj217q77L40J545N44r66j154n68J140J271j65r13j210O79J105P08
$$ -653 1034 1038 -179 -1056 -716 829 1373 407 -747 -1315 -175 1096 931 18 -1192 -513 592 1300
4577A300j080j348pJ413J090l38j596r21P11J505M44j015j343J63R46J137n12
$$ 1300 220 -1128 -1135 278 1368 1030 -566 -1487 -776 729 1173 158 -1185 -1022 -76 1061 549
4594E49j204q08R05J387N34j091j231l48J132J409m62j023j086J089J034N05j338
$$ 549 -655 -1463 -558 829 1363 272 -959 -1307 -175 1234 772 -251 -1337 -248 786 1291 -47
4611d7r84J13J284R91m70j375o12O85J243J52j069j133P47J068P20m35j470p39
$$ -47 -1031 -918 366 1357 887 -488 -1100 -415 828 980 -89 -1222 -475 593 1313 878 -592 -1331
4629a331J024J312k61q68q51L18J172O97q77r81k98R41J068k71r39r65N37J149
$$ -1331 -307 1005 744 -124 -975 -657 515 1212 335 -646 -944 -3 1065 794 -145 -1110 -573 576
4647E76L49q55q98P5P87J063m64j373l81Q67J034J16j051q18J81R96P10l35j407
$$ 576 925 70 -828 -753 34 1097 633 -740 -1121 -254 780 896 -155 -973 -792 204 914 579 -828
4666h28n9R34P66M8j279p02M32J385N14q90j246K9J165N64kj406o26R58J113J22
$$ -828 -887 47 813 861 -418 -1120 -688 697 1211 321 -925 -896 269 833 831 -575 -1201 -243 870 992
4686I92r35j025P1J159P87k48j326o85J000J022K54j021j335K05J404R78l76j758
$$ 992 57 -968 -897 262 1049 801 -525 -1210 -210 812 1066 45 -1290 -1085 319 1297 921 -837
4704h37m96J052J584j34j273r79N12J195O86q08j551k14J212J118L10j646r59
$$ -837 -1333 -281 1303 1169 -104 -1083 -571 624 1310 502 -1049 -1263 -51 1067 1377 -269 -1228
4721a228M07J309J047j120j262k79R58J297j90j139j088M82J470Q71j002j275
$$ -1228 -821 488 1535 415 -847 -1126 -168 1129 939 -200 -1288 -806 664 1535 533 -742
4737g42m88J327J256l32j214j003P21J082P30j121j456r5J269J188n9j322r72
$$ -742 -1230 97 1353 1021 -193 -1196 -475 607 1337 216 -1240 -1335 -66 1122 1063 -259 -1231
4754a231O64J134M92q75j080r6J161R44l75j057q39M19J347N78r24r71O9P24J047
$$ -1231 -567 567 1059 184 -896 -992 169 1113 738 -319 -1158 -739 608 1186 262 -709 -640 84 1131
4773A131n56r54q49R06J241k30n56j143P1J098P38o36p64j95L42Q15j1r39j10
$$ 1131 575 -379 -1228 -322 919 689 133 -1010 -939 159 897 261 -503 -698 -356 459 448 -491 -601
4792f01K81Q58M18n42r56m1M70Q13k50q43m76N92J081m3q65p08J16J104N41p08
$$ -601 -320 538 956 414 -542 -583 -113 700 450 -393 -869 -277 804 761 -104 -812 -696 408 949 241
4812B41n56m92M41J079J02r66q60O19J076N63j197q47j28R43Q17j52r80q06Q60
$$ 241 -315 -807 -366 713 815 -151 -1011 -392 684 1247 50 -797 -925 18 835 683 -297 -1103 -243
4831b43Q83K22j135o73j9J209P01k33j273o28Q42J145L44r09j073J55J026Q40
$$ -243 640 862 -273 -946 -965 244 945 712 -561 -1189 -347 798 1142 233 -840 -685 341 1181
4849A181o80j004n18Q33J030M50j347j095K12J403P43o50j422m50J009J351Nj224
$$ 1181 501 -503 -1021 -188 842 1292 -55 -1150 -938 465 1208 558 -864 -1314 -305 1046 1051 -173
4867a73j145M24J287J035p85j511m38P00J474J88r82j213K92J356Q49p27j551
$$ -173 -1318 -894 393 1428 643 -868 -1306 -606 868 1056 74 -1139 -847 509 1358 631 -920
4884i20l70J194J142o0j118j031J62J183P69j89j279o92R68J362n4j163j087L35
$$ -920 -1290 -96 1046 986 -132 -1163 -1001 182 951 762 -517 -1209 -241 1121 1067 -96 -1183 -848
4902h48J355R50r39r82k50M41P81J49r56o83N33Q74O68p39j063j65Q92P25j78
$$ -848 507 1457 518 -464 -714 -273 508 657 -299 -982 -449 425 1093 354 -709 -874 18 743 565
4921E65r77m71K97R43K14p26l41k01J048M67j44q07o42K37J137mn08n17n6Q27
$$ 565 -412 -883 -586 357 571 -155 -496 -697 351 818 674 -133 -775 -538 599 595 87 -430 -486 341
4941C41L47m92o93l36P26O21q1p99k44J83O96J61L4q98m06Q98N75k16p50k97M35
$$ 341 688 196 -497 -833 -107 514 433 -366 -610 -427 269 430 464 -434 -840 58 633 417 -333 -630 -195
4962a95P23Q4o00o39L47P79L42o76p31k16Q99O85j25q94n62M98Q01J83n19j016
$$ -195 528 612 12 -627 -280 499 841 165 -566 -782 117 802 677 -217 -779 -281 520 703 184 -832
4982h32q3R17O86l4j065l38O72P78K58m72j165j64J032Q71n56j164m67O55J244
$$ -832 -915 2 688 654 -411 -749 -77 701 959 487 -678 -842 190 1061 505 -659 -1126 -471 773
5001G73J01r12r51J34R48Q30p2j240q65O96J046M70j034j046P3J323J049q87r55
$$ 773 874 -38 -989 -855 93 923 851 -389 -1254 -558 488 958 -76 -1122 -1049 274 1323 436 -519
5020e19o44P49J217J91j029r74K97R29Q77m31j265q00R81J120L87j024r99PJ099
$$ -519 -1163 -414 803 994 -35 -1009 -712 217 1094 663 -602 -1402 -421 699 1086 62 -937 -930 169
5039A69R08o30j154k89O24J053J04r77p39N10Q47O51o10j019j81O32R55K9j144
$$ 169 1077 447 -707 -996 -372 681 785 -192 -931 -421 426 1077 467 -552 -733 -101 854 883 -261
5058b61n84L98P54M14l81p88n79Q93P19N8j053l13L23J077K14q73o69p0P99P97
$$ -261 -845 -447 307 721 340 -448 -1027 -134 585 643 -410 -723 -400 677 891 18 -651 -721 78 875
5078H75k36j093qM20M88J57m40q37K5P64N05k71q09l42Q41N99q5p75l13J64P71
$$ 875 639 -454 -462 -42 446 603 163 -674 -649 115 620 349 -460 -802 39 638 553 -222 -535 -371 400
5099D00R3k97o62j39O55M88r5p21m77L18J443k39o42q02k40R58O51k28j076J8
$$ 400 493 196 -466 -605 50 538 443 -278 -755 -437 1006 767 125 -677 -917 41 692 464 -612 -594
5119e94L31O93M35p91p93M26O24K56k1j206l11R17P38j35p48o11J62J086M09m31
$$ -594 -263 430 865 74 -719 -293 331 587 566 -640 -951 -34 704 569 -179 -790 -628 458 867 436
5139D36q83o54J066R89l60r16m11L95R36L46q69m26m73Q00J076j67j299l11L93
$$ 436 -447 -1101 -35 954 594 -322 -733 -338 598 944 75 -351 -824 -24 1052 885 -414 -725 -332
5158c32Q52M92n33j051L8P00M56j39o86n84M24J045r6l20j077N5J104M97m26n61
$$ -332 520 1012 479 -572 -534 166 622 483 -203 -787 -363 682 586 266 -811 -756 348 845 419 -142
5178a42o95N26J042j09m40r96L62R46L68p8j093n25M45Q46L27o60p28NR04L26
$$ -142 -837 -311 731 622 182 -814 -452 494 862 784 -309 -834 -389 457 784 124 -604 -599 305 631
5198F31n94n54j74N26P59k8o36r23N65R87K03m88q27o8P43N48k23o27m47K35J152
$$ 631 37 -517 -691 -165 594 566 -70 -993 -428 559 762 274 -553 -621 122 670 447 -180 -627 -392 760
5219G60R4p99m59k65Q07O14m22o37m35L39P24M10o09r17K09O01Q76o78o35k34
$$ 760 854 55 -404 -669 138 752 330 -307 -742 -403 321 731 122 -795 -586 15 891 213 -422 -656
5239f56O18P47l83m98o57L35O82N35n59q16j19L79J046J87j041m88K19O21P44
$$ -656 -38 709 326 -172 -829 -494 188 723 164 -652 -771 -392 654 841 -200 -688 -469 152 896
5258H96p93o84j50O39O75J24j015l66N8R46L65o95n14k10P10O77k05n91r30P97
$$ 896 103 -581 -731 -92 583 707 -308 -674 -616 330 695 0 -514 -724 -14 663 458 -133 -1063 -266
5278b66P23M00o58r86J39P73O22l30p66k85N06P53P9q34l03k1O92N44l31q33j28
$$ -266 457 857 199 -787 -648 125 747 417 -349 -634 -128 625 704 -130 -433 -454 238 782 451 -382 -510
5299e10M24N16K09m61p50K75M82M88l77p95k96O11P73j84p93k58L96Q26K45r35
$$ -510 -86 430 639 178 -572 -297 185 673 296 -499 -795 -184 589 405 -388 -646 -250 576 821 -114
5319a14l99rP16N10j42o04n88M32O11L18q71m16R9O69M39m71n27l47L01O83L37
$$ -114 -513 -522 194 704 562 -42 -630 -198 413 731 -140 -556 -457 212 651 180 -347 -694 -393 290 627
5340F27p14l34l91J022M78k21q85l57Q42N35p5n71n03J61Q62M02o78o46r6O01
$$ 627 -87 -421 -812 210 688 467 -418 -775 67 602 527 -44 -547 -386 476 878 200 -446 -542 59
5360E9O95m51q21l44M47J079Kp30p51nQ54P46l40p28m61N55R32J05n25j160K67
$$ 59 754 303 -518 -862 -415 664 666 -64 -815 -820 34 780 440 -288 -749 -194 738 843 318 -842 -575
5381e75R01Q36n06r81m24M82R36M13q96r28J24Q90M45l28q58m08Q43P30J09q79
$$ -575 326 1162 656 -325 -749 -267 669 1082 186 -742 -618 272 717 389 -469 -877 -34 696 805 -74
5401g4p15J45J012L13m54n58l33M43Q91M5m87p98j71R73P42o27o20n33M57Q01
$$ -74 -789 -644 368 681 227 -331 -664 -221 670 715 228 -570 -741 232 974 347 -273 -806 -349 452
5421D52J02p77p15M21Q13M06l15j046J32M61N11P3n23m77K30P19m8l01p01J74
$$ 452 554 -223 -938 -517 296 702 387 -659 -527 -66 445 518 -5 -482 -252 467 419 118 -583 -409
5441d09M76N52l24l65n96K09O34K78n49l99J85L62M61j24n35m49K78O57L60p53
$$ -409 67 619 295 -70 -666 -457 177 455 -94 -493 -308 54 515 391 -144 -593 -315 342 702 -51
5461e1n65K68L88K52Pm27j62K41N72o8o22l37K76M09K77m93m96J19M76M73k02
$$ -51 -616 -348 40 292 299 -128 -290 -49 523 455 -167 -504 -228 181 458 -35 -531 -412 64 537 335
5482C35p20j7K36O33j07m89m06J10Q79J42L9j070j49O08N66j54m87o99P53R1O95
$$ 335 -385 -402 -166 467 360 -129 -535 -425 454 596 635 -435 -584 24 590 436 -51 -750 3 94 789
5503G89m43r85J42N30N73N9o89q56P68O42O2l76o99J1L71P47J09r18n57K11R23
$$ 789 346 -639 -497 33 606 665 -24 -880 -112 530 592 216 -483 -472 -101 646 755 -163 -720 -509 414
5524D14O1k84q10J06P70N70j67r55j39L51O29J83q02o80K74O61N04l17q33n30
$$ 414 475 191 -619 -513 257 827 660 -295 -434 -83 546 729 -73 -753 -479 182 686 369 -464 -994
5544i94O82P35N04q67q37J01O85N54o4p81l24O7R00O22r88n30k70J042N43k14
$$ -994 -312 423 927 60 -777 -676 9 563 499 -282 -606 -539 361 983 -5 -535 -805 237 780 566
5564E66j061m50O77Q98L08q72o81k0R57L00m12n29k91M32P16J20p06m83K01L71
$$ 566 -495 -945 -268 630 938 66 -615 -635 322 622 210 -319 -610 -178 538 658 -48 -531 -330 41
5584D1N96m27m29j6O1L13L13o49m75L03O99L57n48n53r1O95K91l76k56j98R9P26
$$ 41 637 210 -219 -235 -174 139 452 -197 -672 -369 330 687 139 -414 -505 190 481 105 -151 -349 -250 476
5606D76k46k93k41k15O41M29n35l05N3L96M54o25ok08k88R63K2n31l25m4N70M71
$$ 476 230 -63 -304 -519 122 551 16 -289 -236 160 614 -11 -17 -225 -513 450 472 -59 -384 -428 142 613
5628F13k14o02m76N98N82k26m91l69K56K92O21l86p28Q0K41O77K8p87o01L31J057
$$ 613 399 -203 -679 -81 501 275 -216 -585 -329 -37 584 198 -530 -450 -209 468 496 -291 -892 -561 496
5649D96n4k68p13M4L73M24Q5n02o96K83P89L46l45p98k60O98Q53l23o76m74N55
$$ 496 442 174 -539 -495 -122 302 387 -115 -811 -528 261 607 262 -536 -796 -98 755 432 -244 -718 -163
5670a63N75L75o34o88L33L97L76l28l27n60J82Q29M37n53r51J49N72N35r5o92
$$ -163 412 787 153 -535 -202 195 571 243 -84 -644 -462 367 804 251 -700 -551 21 556 461 -231
5690b31n47K59R19L92p38p22K99N85O31k26q25p77P76Q61P1m77r82K70O02M01
$$ -231 -778 -519 400 792 54 -668 -369 216 847 621 -204 -981 -205 656 727 250 -732 -462 140 541
5710E41l3n87l86L56N09J48p97k43N8P19L90k79p75j47N47M23K0n46n34L25O85
$$ 541 508 -79 -465 -109 400 548 -249 -492 -434 285 675 396 -379 -526 21 444 464 -82 -616 -291 394
5731C94L57j73q91r4O32L02Km70m77M27K54K13l97l47O9K58K77j89n20j41K78
$$ 394 751 578 -313 -407 225 527 529 59 -418 9 263 476 79 -268 -199 59 336 147 -373 -514 -236
5752b36M59J68m91l11L58L28K07m62k12n56Q08L35j39m92j69k6O14M99o04o03
$$ -236 223 391 -100 -411 -53 275 482 20 -192 -748 60 395 256 -236 -405 -431 183 682 78 -525
5772e25J74N31K11J38n52o31M85L00K86k27m99K10L17L11l32n19r5K02M84M68
$$ -525 -351 180 391 529 -23 -654 -169 131 417 190 -309 -99 218 529 197 -322 -417 -215 269 737
5792G37n96p25Q1P42L88m10m57p50R03N49j04n08m66K03Q16K21m08o89l2K86O58
$$ 737 141 -584 -503 239 627 217 -240 -990 -87 462 358 -150 -616 -413 403 624 216 -473 -505 -219 439
5813D39L09p59m98J54P76J31l07q78J26M26P85k92j98o54j17R44K52m57o45j43
$$ 439 748 -11 -509 -355 421 552 245 -633 -507 -81 704 412 214 -440 -557 387 639 182 -463 -606
5833f06N97O25j5q00l55L76N92L63n60n65L8N52K78j13q49l77M37P95O7l31q33
$$ -606 -9 616 601 -199 -554 -178 414 777 217 -348 -310 242 520 407 -442 -819 -382 413 480 149 -684
5854f84RM87Q14l50n20k69L10O82J66m72o68n8P68N87l97m37m72J65N96K76l73
$$ -684 -675 -188 626 276 -244 -513 -203 479 645 173 -495 -553 215 802 405 -32 -504 -339 257 533 160
5875A60o15M09M44J48n54n23j17L94Q23k30k13q66L30P06K75j90o47J5K50N88
$$ 160 -455 -46 398 546 -8 -531 -648 -254 569 339 126 -740 -410 296 571 381 -266 -251 -1 587
5895E87j00o91k09L55M92K85o46o52J08P59K76k20n51n81P70K10J20j74o79j54
$$ 587 487 -204 -413 -58 434 719 73 -579 -471 288 564 344 -207 -788 -18 192 312 138 -541 -695
5915f95O29N43l58k67m84M89M41J09m94m57L03P10L0j74r48L5P25L72J20j001
$$ -695 -66 477 119 -148 -632 -143 298 407 -87 -544 -241 469 499 325 -623 -588 137 509 629 -372
5935c72l9N5O48J97m21r92K64O87M12j25p58r4K53P44j35l22r5j67N21N66k93
$$ -372 -411 -356 292 489 68 -924 -660 27 439 314 -444 -538 -285 459 324 2 -93 -260 261 827 534
5956E34q18j11R7O35j03k36k57l17O92K36J1q27j70M31N68J00n44l11k9Q53K13
$$ 534 -284 -395 -298 337 234 -2 -259 -576 116 352 363 -464 -634 -203 365 465 -79 -390 -419 434 647
5977F47m86l91k44O33K30m14p1n26P01L28ll44l95j23O08R0Q5m96l45K23M50L47
$$ 647 161 -230 -474 159 389 -25 -96 -622 79 407 404 60 -335 -458 150 240 325 -171 -516 -293 157 504
5999E04n63j77m61J092j63q5k42l85N21L84l39j31m05L48O97J29n17n61o4M04
$$ 504 -59 -236 -697 395 232 147 -95 -480 41 425 86 -45 -450 -102 595 724 207 -354 -418 -14
6019a4K81J40n72m21K51N77J53m36n84K43M12O28k11p64l38N24K11K43j51o44
$$ -14 267 407 -165 -586 -335 242 395 -41 -625 -382 30 658 447 -317 -655 -131 80 323 172 -472
6039d72J92N02M0j0n77k30J47O11K12m45m69j31O72M34j03o70l46L14P02K59o24
$$ -472 -280 222 262 252 -325 -555 -408 203 415 -30 -499 -630 42 476 373 -297 -643 -329 373 632 8
6060Ho63N3P06N85n9p66l35L88N39Q5n94l60N7M52K60o9r50k8N73N11K48p23n21
$$ 8 -655 -602 104 689 630 -136 -471 -83 456 541 -53 -413 -356 96 356 287 -663 -691 -118 393 641 -82 -603
6083f03J82N38K60p0o82j35N78P31j85p91j48m9O40L90q5r64k13P69L12l53m70
$$ -603 -421 117 377 307 -375 -510 68 799 614 -177 -325 -374 266 656 571 -393 -606 163 475 122 -348
6104c48J70J38L11K44m34l49j32K78M49m8k22n66J75Q10J1n65l96R7L21M47l39
$$ -348 -178 -40 271 515 81 -268 -400 -122 327 279 57 -509 -334 476 487 -78 -474 -377 -56 391 52
6125E2j89m24K74N50O7n65q7P0L74K2Nm19j37L89K24m2m33k0J86L16J76o14J37
$$ 52 -137 -561 -287 263 330 -235 -322 -252 122 144 149 -270 -407 -18 206 164 -269 -289 -103 213 389 -225 -88
6148h8k54M61P8j64l31j22J78O76p9l91j38j52P08K06m40m27M0j3M48Rm97l68
$$ -88 -342 119 197 33 -298 -420 -242 434 355 -36 -174 -326 382 588 148 -279 -239 -252 196 205 -292 -660
6170f60L44L75N91o32n11J11M32K04Rk40n49M29N52J90q12l25L23J84M59O1q60
$$ -660 -316 59 650 18 -493 -382 50 254 263 23 -526 -97 455 645 -167 -492 -169 15 474 535 -325
6191c25j22J83P71qm45m06q8K92N38r2p27j8K44Q38N9o67l51k68P51M93k54q09
$$ -325 -447 -264 507 499 54 -352 -440 -148 390 298 -429 -447 -203 635 694 27 -324 -592 159 652 398 -411
6213d11k11O42M39r5k78n67J55M53K25p5o93j86M78N15O8n84l05j19P63L78m28
$$ -411 -622 20 459 364 86 -481 -326 127 352 277 -416 -602 -124 391 459 -125 -430 -549 214 592 164
6234A64l08j85k9O65J48o43l34J16M95L26j38o14l6L47N06k63k51j41%K75K15
$$ 164 -144 -329 -358 307 455 -188 -522 -406 89 415 277 -337 -373 -26 480 217 -34 -175 -175 100 315
6255C15k63k29j49M17L51j11j96o27M39L13L03l47n38rM59k6k03r8k02L02J60
$$ 315 52 -177 -326 91 442 331 135 -492 -53 260 563 216 -322 -331 128 102 -101 -199 -401 -99 61
6276F1L4j81k13K21K04qj05m37k51P04L95j81o92J7L17M11K1l27k43R5M24O2j90
$$ 61 95 -86 -299 -78 126 118 13 -424 -675 29 424 243 -449 -432 -115 296 317 -10 -253 -158 266 328 138
6299A38n09p9N30L65k10k49l28Q1P69o4l54n50o8M95N28k22m19j77J25P03m4l97
$$ 138 -371 -450 80 445 235 -14 -342 -261 508 444 90 -460 -528 -33 495 273 -146 -323 -198 505 461 64
6321F4m59K25J94J03K14m23l23J92K51L90m03m79k97R55K46j88o24j12K90M36
$$ 64 -395 -170 24 127 341 -82 -405 -213 38 428 25 -454 -751 204 450 262 -362 -474 -184 252
6341B52J51m02l28n5M08P73n51m11j86K39O43j14m96m22L10J89M32l76m70L9K51
$$ 252 403 1 -327 -382 26 799 248 -163 -349 -110 533 419 -77 -499 -189 0 432 56 -414 -375 -124
6362a24O47O5m15p79k5Q17R6m6n53j29Q6P58J70m56n31l2M06M61l82j84r7O2O06
$$ -124 523 588 173 -606 -631 186 282 236 -317 -446 -360 398 568 112 -419 -451 -45 416 34 -150 -247 -185 421
6385D21K62p77m02M62j28M31n0l38k39L10K12L11m66m32L4N84k6M5n49nN06j12
$$ 421 683 -94 -496 -34 -162 269 219 -119 -358 -48 164 475 9 -423 -389 195 169 214 -335 -340 166 54
6407E4K38n76j35K75N17k46J0k99k25J98N14j43n60J42Q2M09j34P2l88K72K48
$$ 54 292 -284 -419 -144 373 127 137 -162 -387 -189 325 182 -378 -236 -154 255 121 193 -195 77 325
6428C25j04n9l09PJ49O6J38k73l29M48L56j36j62l95O8K79J79k64j27j36K34K12
$$ 325 221 162 -147 -140 9 75 213 -60 -389 59 415 279 117 -278 -210 69 248 -16 -143 -279 -45 167
6450A67j51J63m47j84N38J67j97j93l95O39M25j51l68j38o3K22M32m25l64l1M15
$$ 167 16 179 -268 -452 86 253 56 -137 -532 107 532 381 13 -125 -188 34 466 41 -323 -354 61
6471F1O00m47l33k08J71M85q4l11k29n3M05J34J13l20l07M31R7M24n22r32N21
$$ 61 661 214 -119 -327 -156 329 245 -66 -295 -348 57 191 304 -16 -323 108 205 629 107 -825 -304
6492c04N49M16l52n23Q1p5M30K04m67m74K59K61K03O9m27q7l2M13K1j44k89k1
$$ -304 245 661 309 -214 -133 -208 222 426 -41 -515 -256 5 208 277 -150 -237 -269 144 165 21 -268 -289
6514b89N98jk29J0k76o3O83k2l29o02L46L51L67n89j69r4k8O14o6k13l49K25K33
$$ -289 309 308 79 89 -187 -250 433 411 82 -520 -174 177 544 -45 -214 -308 -336 278 212 -1 -350 -125 108
6537A08L64l95k71L0J25N91k80m71o9J89J40J61k19k47k43M22O52k25m54k08N13
$$ 108 472 77 -194 -164 -39 552 272 -199 -268 -79 61 222 3 -244 -487 -65 587 362 -92 -300 213
6558B13K54k25k66k38o2K83L97J04m89k50K30M53o2m10l08L16L71J56l09k84k26
$$ 213 467 242 -24 -262 -324 -41 356 460 -29 -279 -49 404 342 -68 -376 -60 311 467 158 -126 -352
6579c52Q1P52l74l28q4o7O90Q2l79o5l10O24j0j43k19m07L47K61L79l72l01p7
$$ -352 -271 481 107 -221 -305 -372 318 400 21 -44 -354 270 260 117 -102 -509 -162 99 478 106 -195 -272
6601b72K38M24k32k80j74L02K40K9l91k73K40K32L73l34j88j17P0L89l6k23k50
$$ -272 -34 390 158 -122 -296 6 246 275 -116 -389 -149 83 456 122 -66 -183 -113 276 240 17 -233
6622b33j95N93K32k6l97n07N69L41k17k49k70K38M29M5n29j8k34M76L08j30l33
$$ -233 -428 165 397 371 -26 -533 36 377 160 -89 -359 -121 308 353 -176 -194 -428 48 356 226 -107
6643a07j38J11K49J75j84m08J73L79K90m23j09q2oN45p6l14k56kL67K09l46k19
$$ -107 -245 -134 115 290 106 -302 -129 250 540 117 8 -74 -80 465 389 75 -181 -183 184 393 47 -172
6665a72j03L73l4M74l56l24M3M38r3j64j76j09K44J65k39n2l95N88Q7K36k09m66
$$ -172 -275 98 64 538 182 -142 -99 339 246 82 -94 -203 41 206 -33 -85 -480 108 195 431 222 -244
6687b44j33M81J61K7l10k91L23K99j16l04Q9l57K79K30J82o64j12L18M52m74Q9
$$ -244 -377 104 265 292 -18 -309 14 313 197 -107 -18 -375 -96 134 316 -348 -460 -142 310 -164 -75
6708g5n4k30L23L44j92k21k17j24Q82J6m55l12J26M07L0k0k96j56k2N90m26Nj75
$$ -75 -129 -359 -36 308 116 -105 -322 -446 436 452 -3 -315 -189 218 248 228 -68 -224 -246 344 -82 -77 -252
6731b52p7K61N35q3n58j16J85K38j52r0j87M09J44j9l33k73J83L79Q6j27j83j92
$$ -252 -329 -68 467 384 -174 -290 -105 133 -19 -109 -296 113 257 238 -95 -368 -185 194 280 153 -30 -222
6753b22O5K75O3J17p92K38L56j6N9l15m27M35L92o6j73M4l69L00L45q3j97k43
$$ -222 -157 118 181 298 -494 -256 100 84 143 -172 -599 -164 228 162 -11 33 -336 -36 309 226 29 -214
6775b14J98L30n4k93n1j0L46n3M6m21K4j17L71k5k48p2K11L97j41j80m52L23J42
$$ -214 -16 314 260 -33 -84 -94 252 199 245 -176 -152 -269 102 77 -171 -243 -32 365 224 44 -408 -85 57
6798E7J67J45k91k98j42K54L57l41J49K6r3L41n4o43K68L27k80L69m42k11L02
$$ 57 224 369 78 -220 -362 -108 249 -92 57 83 -10 331 277 -366 -98 229 -51 318 -124 -335 -33
6819c3K06L24l07m07L01q0J72L59n81j47K37K02P6l10l72J97K22K50j57j97j93
$$ -33 173 497 190 -217 84 4 176 535 -46 -193 44 246 322 12 -360 -163 59 309 152 -45 -238
6840b38J43L42nk33j20j52M35L02l03l73j31J78L88M6q4o74K70L39J69j15l12
$$ -238 -95 247 242 9 -111 -263 172 474 171 -202 -333 -155 233 279 195 -479 -209 130 299 184 -128
6861a28j23J37L09J63l5o34J03L72K98k94k06l26P24k69J10j50j57k65M02M06
$$ -128 -251 -114 195 358 323 -311 -208 164 462 168 -38 -364 360 91 201 51 -106 -371 31 437
6881D37k83n02k13N74K99J22n15O8k75J15M91k1k28j47J50K01o9l19p1O5O2L54
$$ 437 154 -348 -561 13 312 434 -81 -13 -288 -173 318 297 69 -78 72 273 204 -115 -186 -121 -59 295
6903B95p4l32j23L42L5Ql1j83j6J78q9k8J05n16N30j08r9k19J26J64K13l47r1
$$ 295 221 -111 -234 108 143 151 120 -63 -79 99 10 -18 87 -429 101 -7 -106 -325 -199 -35 178 -169 -260
6926b60L2lJ56N4J99l41j53K16L77l64J72R4k31M24l23q9O9K9j07L08K3l01k79
$$ -260 -228 -231 -75 -21 178 -163 -316 -100 277 -87 85 179 -52 372 49 -40 29 58 -49 259 282 -19 -298
6949b98J35N88m45Q0j91q9M13q3qj75o2M62j77j10rJ01k15N9K63r0j14m12M50
$$ -298 -163 425 -20 60 -131 -220 193 110 102 -73 -135 327 150 40 31 132 -83 -24 239 149 35 -377 73
6972G3J76n9l26k31M18K01K3k34j51j82M15J54L3m28k17M21L80j78m32k45p1M79
$$ 73 249 190 -136 -367 51 252 275 41 -110 -292 123 277 310 -118 -335 86 466 288 -144 -389 -460 19
6994A9K12j94n1k27R0M70l7m30j67J79K01K53l41K6l40J95K36J49j43l01jL43
$$ 19 231 37 -14 -241 -151 319 282 -148 -315 -136 65 318 -23 3 -337 -142 94 243 100 -201 -202 141
7016A41J88j66m00n2P6L73K35n68Nk25L00M38j28m42j00J89O75k01l68j43J44
$$ 141 329 163 -237 -289 -213 160 395 -173 -168 -393 -93 345 217 -225 -325 -136 539 338 -30 -173 -29
7037b9PK60N8l12l89J99M62j35l35J57j48L07J22k41j71O7J90K27j70l45q0K45
$$ -29 -22 238 296 -16 -405 -206 256 121 -214 -57 -205 102 224 -17 -188 -121 69 296 126 -219 -299 -54
7059e4J71K17j82m73K3J97L94l55n5k53J87P6M29m64l7q0M61J71l87Pk78K84L70
$$ -54 117 334 152 -321 -298 -101 293 -62 -117 -370 -183 -107 322 -142 -179 -259 202 373 -14 -7 -285 -1 369
7082C69j96l52J77K3k0J7L1q9r0J80J57j71q6k42M97k41L58l37p0q4K1K21l1j60
$$ 369 173 -179 -2 21 1 18 49 -40 -130 50 207 36 -50 -292 205 -36 322 -15 -85 -169 -148 73 42 -118
7106a18j25O5L29Q1m86J09K0J90j28J59k00m1K46L36j19l89J66k92K56J86k73
$$ -118 -243 -178 151 232 -254 -145 -125 65 -63 96 -104 -145 101 437 318 -71 95 -197 59 245 -28
7127b8j12j82L12J29Q6l16n4K19K07q4k43j0k91K39J43Q3k20K18nK99j38l09m2
$$ -28 -140 -322 -10 119 205 -111 -165 54 261 177 -66 -76 -367 -128 15 98 -122 96 91 390 252 -57 -99
7150i9j55M09J72k17j83J8K9j34L27j60k90jO9N27p8m83j29L49J20J27n12J50
$$ -99 -254 155 327 110 -73 -55 -26 -160 167 7 -283 -284 -215 312 234 -249 -378 -29 91 218 -294 -144
7172a44m0K11Q5k19r0J08K09q7K97j98k69J08PL80n34J61n0P3J20J13l11j62K67
$$ -144 -184 27 112 -107 -197 -89 120 33 330 132 -137 -29 -22 358 -176 -15 -65 8 128 241 -70 -232 35
7195C5J85q9k15j8PJ67M42m07o2k38K42M9Q4m24K81l31L84o1j87M7J02k84M33
$$ 35 220 131 -84 -102 -95 72 514 107 45 -193 49 98 182 -242 39 -292 92 31 -156 -109 -7 -291 142
7218A42k2j25k12k2M43J05o6l01n8K1Q4J57J20l48j06L03J45L5p39L53J13J86
$$ 142 120 -5 -217 -239 204 309 243 -58 -116 -95 -11 146 266 -82 -188 115 260 295 -444 -91 22 208
7240B08Jl31m1j47K61J89j84K07p0P5J03j63j76k33N46j51j79J22j84K5K48K74
$$ 208 209 -122 -163 -310 -49 140 -44 163 93 168 271 108 -68 -301 245 94 -85 37 -147 -122 126 400
7262D00o88K37P2j08L02j02q1Q0p8j59J36O1l03j25M7N35k16J26k92J13K41J83
$$ 400 -288 -51 21 -87 215 113 32 112 34 -125 11 72 -231 -356 -309 226 10 136 -156 -43 198 381
7284C81l21m95L29J07J29k10L0L8k4Qk1Qk67K93L5J94J27o07J48mO2P9L8k98L97
$$ 381 60 -435 -106 1 130 -80 -50 -12 -36 -28 -49 -41 -308 -15 20 214 341 -266 -118 -122 -60 19 57 -241 156
7309A56l0l0j26k48K28m4l5K39k05K39K4J29n7jo22M27J17M8k18K8m7J46K9n8
$$ 156 126 96 -30 -278 -50 -94 -129 110 -95 144 168 297 240 239 -383 44 161 209 -9 19 -28 118 147 89
7333H9O3l08j38M88o3P9k46j17J86J54r0l3k13k5K88Q5p3j69j22J7M08%l95R8
$$ 89 152 -156 -294 194 131 210 -36 -153 33 187 97 64 -149 -174 114 199 126 -43 -165 -148 260 260 -135 -37
7357c7L29n5r7qn02K41J05M81k56j10k24L14nj07J93k76j61L21Qk63J20k45K02
$$ -37 292 237 140 132 -370 -129 -24 457 201 91 -133 181 176 69 262 -14 -175 146 154 -109 11 -234 -32
7380c2p5K01J43k43l03M72P5l07J03m7K1P9j30j07K06q1L5R2n8N5k66L7nL74k59
$$ -32 -107 94 237 -6 -309 163 238 -69 34 -13 8 87 -43 -150 56 -25 10 102 44 99 -167 -130 -135 239 -20
7405b0K2r7K20k7mm8j80J94J49j96j85J66k46K36K81j19k71l4O9ML46m63J9P5
$$ -20 2 -95 125 98 94 46 -134 60 209 13 -172 -6 -252 -16 265 146 -125 -159 -90 -86 260 -203 -184 -109
7429a09J15K94o1l66J33k64M20M6m36J44M2m2K84o4k91J33J17j10j6R2l91N36
$$ -109 6 300 239 -127 6 -258 162 208 -228 -84 -42 -84 200 136 -155 -22 95 -15 -31 61 -330 206
7451B06k88K67j91k57L31k7J13j15l23L61k02M06qk19j6J40j28l37J86n7J66Q4
$$ 206 -82 185 -6 -263 68 41 154 39 -284 77 -125 281 273 54 38 178 50 -287 -101 -158 8 92
7473I2r6m7pL4r1J65K3P5n35M05J29j52J26k21J25j28N10l59j88P8O0L22k82k19
$$ 92 -4 -51 -58 -24 -115 50 73 148 -387 18 147 -5 121 -100 25 -103 407 48 -140 -62 -2 320 38 -181
7497a81R4J03Q5J23j2k38M4Kj9K69k5k62O8k9j76L93r2k73L11k20P4j40q3qK09
$$ -181 -87 16 101 224 212 -26 18 20 1 270 245 -17 51 22 -154 239 147 -126 185 -35 39 -101 -184 -192 17
7522A7L22j23j18j57j82K63L82k93j70K00j12q9L46n46L69J3j4M4j31k45J25J63
$$ 17 339 216 98 -59 -241 22 404 111 -59 141 29 -60 286 -260 109 122 108 152 21 -224 -99 64
7544F4J01k76Q7K9j58K46l6nk40J36L10r6j80Lo8j75L12J10j2j37j66K00L1J10
$$ 64 165 -111 -24 5 -153 93 57 52 -188 -52 258 162 -18 -15 -83 -258 54 164 152 15 -151 49 80 190
7568A90k27p9P3K56k06J07l04q9K35N2N7j55k52M24J61o4k18k62K72J23l16K79
$$ 190 -37 -116 -43 213 7 114 -190 -279 -44 8 65 -90 -342 82 243 179 -39 -301 -29 94 -222 57
7590E7k63K10j00J75n8j88k2L59k15j22J42j87L6J33O3J31l27Q1K84j77j82J73
$$ 57 -206 4 -96 79 21 -167 -189 170 -45 -167 -25 -212 -176 -43 20 151 -176 -95 189 12 -170 3
7612Cj34j35M73p5k08j4J13RK1K04m20p6K17K55j74k39K7J01NJ6n8j14J17O9J50
$$ 3 -131 -266 207 132 -76 -90 23 32 53 257 -163 -239 -22 233 59 -180 -153 -52 -47 -31 -89 -203 -86 -17 133
7637A33j31o9n9J59j2K35m20m2k6K70J37j24j74j0Q9J40j67k00K98j91K64r4Q2
$$ 133 2 -67 -126 33 21 256 -164 -206 -232 38 175 51 -123 -133 -44 96 -71 -271 27 -164 100 6 88
7660H8l01M6M94k57K18m93R9J28k24M31j22j04J3K9J24j87K4l07K59N3j53J02
$$ 88 -213 -167 327 70 288 -205 -106 22 -202 229 107 3 16 45 169 -18 6 -301 -42 11 -142 -40
7682d0k26J42J74j63K26j98l36N12m6j02k35L00L5J04l7K5k75k28M98m30L02r7
$$ -40 -266 -124 50 -113 113 -85 -421 91 45 -57 -292 8 43 147 110 135 -140 -368 130 -300 2 -95
7704i5R8l58L95l7L06m60J39j48J50L77n09K49j62K82l7K24m94j52O3L56j8j66
$$ -95 3 -355 40 3 309 -151 -12 -160 -10 367 -142 107 -55 227 190 414 -80 -232 -169 187 169 3
7726Cj76m3M64o9k84j0K43k03J17J9L8l10J92L21k31j65J04R9P6j27J74l47J51
$$ 3 -173 -216 248 179 -105 -115 128 -75 42 61 99 -211 -19 302 71 -94 10 109 185 58 232 -115 36
7749C6l42K04J76j37J41l73L65J49l00O7o7J12j06m0J96k08Q1N5J03l46K86K43
$$ 36 -306 -102 74 -63 78 -295 70 219 -81 -14 -81 31 -75 -115 81 -127 -46 9 112 -234 52 295
7771B95m21M9J13K2J38j09K1J89l14J94n10L33n5r3J13N0R8j44J10p8j58Q7J2
$$ 295 -126 -77 36 58 196 87 108 297 -17 177 -333 0 -55 -148 -35 15 113 -31 79 1 -157 -70 -58
7794e8K6J27j03j40L94j31j87K15j23J68P9j76j77q1J16J22k5J72m88K72m8nO0
$$ -58 -32 95 -8 -148 246 115 -72 143 20 188 267 91 -86 -167 -51 71 46 218 -270 2 -46 -51 9
7817IJ96k55K01o5k00J44j42O9r1K48K05k47k88J43K32O3j59j21j47K27N4j08
$$ 9 205 -50 151 86 -114 30 -112 -43 -134 114 319 72 -216 -73 159 222 63 -58 -205 22 76 -32
7839c2o4K4j4K21J60l27r5j60K63n5K76M1m21L13j39J7k1j07J11O4J62j36k26
$$ -32 -96 -72 -86 135 295 -32 -127 -287 -24 -79 197 238 -183 130 -9 8 -13 -120 -9 55 217 81 -145
7862a45L3J38J02k0k18P7N3k31K61K2j52No0r7L84p8j00m7R2L5L6r2j06J32o8
$$ -145 -112 26 128 108 -110 -33 20 -211 50 72 -80 -75 -135 -232 152 74 -26 -73 19 54 90 -2 -108 24 -44
7887d4K21j23n6M54m09m9j55K05K0p0p4J33O1j34n4J22J35r9L8ok11K89j32k29
$$ -44 177 54 -2 452 43 -6 -161 44 64 -6 -80 53 114 -20 -74 48 183 84 122 116 -95 194 62 -167
7911a67J88j96J97K24j63j39k6k4J89P6k35q3J24K16k50L53k96k8J26K06n14K22
$$ -167 21 -175 22 246 83 -56 -82 -106 83 159 -76 -159 -35 181 -69 284 -12 -40 86 292 -222 0
7933@p6mK26l65L55l68J70p6K88j49j4j34J58J49m55K79j20J68O4j88J27j31k70
$$ 0 -76 -80 146 -219 136 -232 -62 -138 150 1 -13 -147 11 160 -295 -16 -136 32 96 -92 35 -96 -366
7956c66K97J99Mj37r1LJ90k34L2J24j14L20k44J2N3K2J84k60J12n9q2n2J53j43
$$ -366 -69 130 134 -3 -94 -91 99 -135 -103 21 -93 227 -17 -5 48 70 254 -6 106 47 -35 -87 66 -77
7980g7KJ17k43j03M41l43J57j71J80J14l34L70p1k63K03q0J22k4r7k3J29M1j06
$$ -77 -75 42 -201 -304 137 -206 -49 -220 -40 74 -260 110 39 -224 -21 -101 21 -3 -100 -123 6 47 -59
8003e9k59M98l87mK88j44K8R4r1J39j26k78K80kK32l06l01K27L08M9k13J07j47
$$ -59 -318 180 -207 -211 77 -67 -39 55 -36 103 -23 -301 -21 -23 209 -97 -398 -171 137 186 -27 80 -67
8026f7k04L20P9l2Q2m13J19K36j24r2K35p3J31j36J5k08K50k8J79R8k85l7l01
$$ -67 -271 49 128 96 178 -235 -116 120 -4 -96 139 66 197 61 76 -132 118 90 269 367 82 45 -256
8049b56K60p9K36k23O4M6K5J37j55Ok63J56J51Q1j97O9JJ00k5o0k7J74j25Q1N0
$$ -256 4 -75 161 -62 2 48 73 210 55 61 -202 -46 105 186 -11 58 59 159 134 74 47 221 96 177 227
8074B27l96j25K63J98q4j55J49j1k9l4k5k46N9O15j98L2m45K13j7N4N7r8J85j06
$$ 227 -169 -294 -31 167 83 -72 77 66 37 3 -22 -268 -209 406 208 240 -205 8 -9 45 102 4 189 83
8098H3N0J1r8Lj53J54Q4k97lJ05J31l34K70n5PK70j49j45K79j91j23K47j44K08
$$ 83 133 144 46 49 -104 50 134 -163 -166 -61 70 -264 6 -49 -42 228 79 -66 213 22 -101 146 2 210
8122B10l35J00J1j11J95O9j72K16L4j89K59n83K30j99qO32k25j64Q0j0K69R0p19
$$ 210 -125 -25 -14 -125 70 139 -33 183 217 28 287 -296 -66 -265 -273 359 134 -30 50 40 309 399 -320
8145c20K76k0J16j07j6j46J47N0j59J62Jk4K73j35j02O5j49M0J3K82m10K02j44
$$ -320 -44 -64 52 -55 -71 -217 -70 -20 -179 -17 -16 -40 233 98 -4 61 -88 -48 -35 247 -163 39 -105
8168a05K02m5L9j95r6L05m0J40j04l52K01J74jkp7k20J81J72k15j2k27L82j78
$$ -105 97 52 91 -104 -200 105 65 205 101 -251 -50 124 123 121 44 -176 5 177 -38 -50 -277 105 -73
8191g3
$$ Imaginary data points
##PAGE= N=2
##DATA TABLE= (X++(I..I)), XYDATA
0@%%%%%%%%%%%%%qJ6j6J6j6K2l0L3m1M9n7P0q2R4j08J25j46J69j93K19k48K80
$$ 0 0 0 0 0 0 0 0 0 0 0 0 0 0 -8 8 -8 8 -8 14 -16 17 -24 25 -32 38 -44 50 -58 67 -79 90 -103 116 -132 148
35A48l17L59m01M49n04N59o20O92p67Q48r40J039j146J264j394J534j691J864
$$ 148 -169 190 -211 238 -266 293 -327 365 -402 446 -494 545 -601 663 -731 803 -888 976
53I76k053K267k506K774l083L440l854M346m940N677o613P851r582J2191j6624
$$ 976 -1077 1190 -1316 1458 -1625 1815 -2039 2307 -2633 3044 -3569 4282 -5300 6891 -9733
68i733K6112q3730J20330J41638k06393k40657q2212J53400J66673Q748j56883
$$ -9733 16379 -67351 52979 194617 -11776 -252433 -334645 -181245 -14572 -5824 -162707
79a62707o4960J64529K58840N6764j88827k16750P906K27798K35507J3511j91956
$$ -162707 -227667 -63138 195702 252466 63639 -153111 -145205 82593 318100 331611 139655
90A39655j70903L2710J36759K3181j49366j50233J2803J57622J12560r0385k41531
$$ 139655 -31248 1462 138221 161402 12036 -138197 -125394 32228 144788 54403 -187128
101a87128j53324Q5812K11319J03510p3124j15419n894J09741R7825l0321j10980
$$ -187128 -340452 -254640 -43321 60189 -12935 -128354 -134248 -24507 73318 42997 -67983
112f7983j9014J50687J83058K5954j44871j57660k3644J06346J02796j9165j11088
$$ -67983 -86997 63690 246748 272702 127831 -29829 -53473 52873 155669 136504 25416
123B5416o5112M0649M9336n6632j32820p3909O1379J34756P3543n9539j24450
$$ 25416 -39696 953 50289 -6343 -139163 -213072 -151693 -16937 56606 -2933 -127383
134a27383m8328P5403J00464K2347l4578L564P4179P7819o088r5064q5652K6836
$$ -127383 -175711 -100308 156 22503 -12075 -8511 65668 143487 137399 42335 -43317 -16481
146a6481J19840Q1915m2416j11063o5973J5775L5060k1910p4503l9722N7162R3692
$$ -16481 103359 185274 142858 31795 -34178 -18403 16657 -5253 -79756 -119478 -62316 31376
158C1376O748j09176j13614J441J14603J13646J3704o8876m2507N1976Q7020O909
$$ 31376 38124 -71052 -184666 -183225 -68622 45024 58728 -10148 -52655 -679 86341 93250
170I3250q3497n8971O0214J32276O4305p9164j52730p7959O3161J11272J6828
$$ 93250 9753 -49218 10996 143272 207577 128413 -24317 -102276 -39115 72157 88985
181H8985r6750q8946J8735Q5797K7199q8270j19334r353J31660J44487O510j25640
$$ 88985 -7765 -96711 -77976 7821 35020 -53250 -172584 -181937 -50277 94210 100720 -24920
193b4920j05469L4425J31151Q4285l9993r2051j1025J00470R3776m0633j47249
$$ -24920 -130389 -95964 35187 119472 79479 -12572 -23597 76873 170649 130016 -17233
204a7233r6755N9146J45895O7444q8281j53444o0729P7284R8728j1450j06380
$$ -17233 -113988 -54842 91053 158497 70216 -83228 -143957 -66673 32055 20605 -85775
215h5775o2738O9006J29351M2042r8362j30956r473J36266J43098P943j10133
$$ -85775 -148513 -79507 49844 91886 -6476 -137432 -146905 -10639 132459 140402 30269
226C0269q4324L7716J03126L7582p6058r8917K478J08245Q4803n2008j46890r3643
$$ 30269 -54055 -16339 86787 124369 48311 -50606 -48128 60117 144920 92912 -53978 -147621
238a47621M5654J17447N2044o5225r8132j4552P9073O7759l1874r0011k8383Q5874
$$ -147621 -101967 15480 67524 2299 -95833 -110385 -31312 36447 4573 -85438 -113821 -27947
250b7947J20694L3390q2270j00299m680R2416Q0488j7129p8820l6231M5768O0711
$$ -27947 92747 126137 43867 -56432 -61112 31304 111792 94663 15843 -20388 25380 86091
262H6091j5297r3781p7303K2993R6195N6395m9756r9846m3347M7776P0096Q739
$$ 86091 70794 -22987 -100290 -77297 18898 75293 25537 -74309 -117656 -69880 216 8955
274H955n1259l1327M5249Q1032K4478o2591p5319L963Q5314P9222m487p1294n1098
$$ 8955 -42304 -73631 -28382 52650 77128 14537 -60782 -56819 28495 107717 103230 31936 -19162
287a9162K1801N2817L785o1094n4103K0508P0922L3358n5221r4760l8384N3403
$$ -19162 2639 55456 59241 -1853 -55956 -35448 35474 68832 13611 -81149 -119533 -66130
299f6130P9725J7241n3670m7106K2982O5902K6275m7552o0328J0965Q9613P8609
$$ -66130 13595 30836 -22834 -69940 -46958 18944 45219 -2333 -62661 -51696 37917 116526
311A16526j5107r0252o3804K8387P7865L1958m8950o7362k958O1108L9651m8394
$$ 116526 101419 11167 -52637 -24250 53615 85573 36623 -30739 -33697 27411 67062 18668
323A8668r7662m0452O3885R8209K3911p2295q5007k852P5315O2477j9141o4802
$$ 18668 -78994 -119446 -55561 42648 66559 -5736 -90743 -93595 -18280 44197 25056 -39746
335c9746j5341O8790Q0235k455q8141p5250K3756R9420O6326l7036r2676m5298
$$ -39746 -55087 13703 93938 91483 3342 -71908 -48152 51268 117594 80558 -12118 -57416
347e7416M2085O2080m864p3583n5256L4165Q7599L7098o5898j00494k6213P5705
$$ -57416 -15331 46749 41885 -31698 -86954 -52789 34810 71908 6010 -94484 -120697 -44992
359d4992R3924J4465o5122n6293K3889P3899L1089n2398o9681O127Q7510P4831
$$ -44992 48932 63397 -1725 -58018 -34129 39770 70859 18461 -51220 -45093 42417 117248
371A17248k2907r9193p1670K6694Q3119L8293m7153p0579r343N7371M2566l7373
$$ 117248 94341 -4852 -76522 -49828 33291 71584 24431 -46148 -55491 1880 44446 7073
383G073q2155l2275O1945R4393K7378o4993p9728m719O9382O0438j2560n6209
$$ 7073 -75082 -107357 -45412 48981 76359 11366 -68362 -73081 -3699 56739 44179 -12030
395a2030j7712N1463O1030q322p8568o4230K2713Q4594N3229l6953q4046m0159
$$ -12030 -29742 21721 82751 74429 -4139 -68369 -45656 38938 92167 55214 -28832 -68991
407f8991L7004N4793k936n8244l7179L7931P4303K3118o0372q0639r730P4916
$$ -68991 -31987 22806 19870 -38374 -75553 -37622 36681 59799 -573 -81212 -90942 -16026
419a6026Q1056N725o3342m6846K5123O1190J6058n2769n5458J4362P6317N2483
$$ -16026 65030 70755 7413 -39433 -14310 46880 62938 10169 -45289 -30927 45390 97873
431I7873l6594r3479n4210L7110P6782K6198m9667o0123J898N7305L4633l8250
$$ 97873 61279 -32200 -86410 -49300 27482 53680 4013 -56110 -54212 3093 37726 -524
443e24o9782j4822O8013Q3790J1959o8911p0283O730P1202N2014k1786n8598j6185
$$ -524 -70306 -85128 -17115 66675 78634 9723 -60560 -53830 17372 69386 47600 -10998 -27183
456b7183M8978N2493j6892p8198n5818K9305Q2218M3282m4410q2657l1136M4423
$$ -27183 21795 74288 57396 -20802 -76620 -47315 34903 78185 33775 -48882 -80018 -35595
468c5595N7304r01n3810l2872L6692O9566K0449n6764p1214k344P3349P2542j486
$$ -35595 21709 20808 -33002 -65874 -29182 40384 60833 4069 -67145 -69489 3860 76402 74916
481G4916o2086m6379J9920N2968J4706m4522m9647R879O1694M0352l4942p9254
$$ 74916 12830 -33549 -13629 39339 54045 9523 -40124 -30245 31449 71801 36859 -42395
493d2395m1606L5279O6403K2620l9790m8215K025M5338K7703k8141m9001m480
$$ -42395 -84001 -48722 17681 40301 511 -47704 -45679 -341 27362 -779 -49780 -54260
505e4260N7899O3110J794n9967n2201J1314N6150L4697k1572m3674p598L6587
$$ -54260 3639 66749 68543 8576 -43625 -32311 23839 58536 36964 -6710 -14308 22279
517B2279K9247k6110o2980l1253L7288O4728J9629m6984o0548j0257M3190L8790
$$ 22279 51526 25416 -37564 -68817 -31529 33199 52828 5844 -54704 -64961 -21771 17019
529A7019j1774l9899q108M4981N0633m617n9845m7540K1784P1095M5861k4145
$$ 17019 5245 -34654 -42762 2219 52852 48235 -11610 -59150 -37366 33729 79590 55445
541E5445n9715k4595L2473M0080j0019n2808l1436L2577O2494J6791n7209p5448
$$ 55445 -4270 -28865 3608 43688 33669 -19139 -50575 -17998 44496 61287 4078 -71370
553g1370j5171N7740O3291J029n3279l6948K5827N6110J3535m9049n1749J5930
$$ -71370 -86541 -28801 34490 35519 -17760 -54708 -28881 27229 40764 -8285 -60034 -44104
565d4104P8767N9516k3843q1261n0332L2102P1648K7516m4831n7961J115N5366
$$ -44104 34663 94179 70336 -10925 -61257 -29155 42493 70009 25178 -32783 -31668 23698
577B3698L3983m1064p9414k9459N6996Q3540J9088o4451p5167n537O3975N5126
$$ 23698 57681 16617 -62797 -92256 -35260 48280 67368 2917 -72250 -77787 -13812 41314
589D1314j3626n5099j8148N0464O3806q28p0344o2467J7689Q1753N9105k4732
$$ 41314 27688 -27411 -45559 4905 68711 67883 -2461 -64928 -47239 34514 93619 68887
601F8887p6967m4384K8306N4785O383n0932m4788K0087O4114L1107m6071p8770
$$ 68887 -8080 -52464 -24158 30627 37010 -13922 -58710 -38623 25491 56598 10527 -68243
613f8243k6552N4731P6980K1201m6975n1446N179M9987K9561k7100m6484p80N6108
$$ -68243 -94795 -40064 36916 58117 11142 -40304 -35125 14862 44423 17323 -29161 -29941 26167
626B6167N4305j0992o9304n5820J1565N9374L7037k1750m8551j7670K6368K5829
$$ 26167 80472 69480 176 -55644 -44079 15295 52332 30582 -17969 -35639 -9271 16558
638A6558j6912m6108j9000L7445N8664J8342m0135n3664r321M0262M2420L370
$$ 16558 -354 -46462 -65462 -28017 30647 48989 8854 -44810 -54131 -13869 28551 31921
650C1921k4902j0339K2795K6402j0767m3765l0013K0626N1797K7679k6142n2067
$$ 31921 7019 -3320 19475 45877 35110 -8655 -38668 -18042 33755 61434 35292 -16775
662a6775k5115J7698K6436k456k5234r168K6574L3862m228m5633m0820J1923N6561
$$ -16775 -41890 -24192 2244 -212 -25446 -34614 -8040 25822 21594 -24039 -64859 -52936 3625
675C625M5269o878m0604k1662K0000K9872k043l2795j7872K9285M9721J2381m8155
$$ 3625 48894 42016 1412 -20250 -250 29622 27579 -5216 -23088 6197 55918 68299 20144
688B0144o4991j7521M3228N1909K757m3461l4793J2827L7355O553l9965l9797
$$ 20144 -44847 -62368 -19140 32769 35526 -7935 -42728 -29901 7454 14007 -25958 -65755
700f5755J5561O6355N1122j8791o7855m3181K8764O5750L0882l0293m5322k93
$$ -65755 -50194 16161 67283 48492 -19363 -62544 -33780 31970 62852 32559 -12763 -13056
712a3056M4872K9137l3317o6797k5766M8843P2503J5029o1620p4768j1950N4368
$$ -13056 31816 60953 27636 -39161 -64927 -16084 56419 71448 9828 -64940 -76890 -22522
724b2522N0636r915n1183k1811M1078N6574J645o1078n5433J8230Q0820O1196
$$ -22522 28114 18199 -32984 -54795 -13717 42857 44502 -16576 -72009 -53779 27041 88237
736H8237j9166p1825m3903K7497N7565J5969m2163m4880J0482N5024K9442m1761
$$ 88237 69071 -2754 -46657 -19160 38405 54374 12211 -32669 -22187 32837 62279 20518
748B0518p5577l1167M6342P1788K1078m7275n8448n424M6440L7486j5342m2483
$$ 20518 -55059 -86226 -39884 31904 52982 5707 -52741 -58165 -11725 25761 10419 -32064
760c2064q221M7225N4713k22n7630n2812J0261O0881M5631j4316n1350k8852K0239
$$ -32064 -40285 6940 61653 61431 3801 -49011 -38750 22131 67762 53446 2096 -26756 -6517
773f517L2305m465m1498k8971K1396M9949K0146l6184n6465j7973L5659M7984
$$ -6517 25788 21323 -20175 -49146 -27750 22199 42345 6161 -50304 -68277 -32618 15366
785A5366J1864k6778k3134J1438L1226Q388k6392k8408J0011M3633L3271j2978
$$ 15366 27230 452 -22682 -11244 19982 28370 1978 -26430 -16419 27214 60485 47507
797D7507m4797k9929J0884L0293J0511k0131k1692M701K2878N183k8508l4776
$$ 47507 2710 -27219 -16335 13958 24469 4338 -17354 -12653 10225 15408 -13100 -47876
809d7876k364L5871L7488J292l1575k5016R448K9632J2075j6050j6893J3720L5511
$$ -47876 -50240 -14369 23119 24411 -7164 -32180 -22732 6900 18975 2925 -13968 -248 35263
822C5263J7156k5111m4543j6469K9283M1803O367l4042l4322K065K7776J0853
$$ 35263 52419 27308 -17235 -33704 -4421 37382 43749 9707 -24615 -22550 5226 16079
834A6079k6612l4922J679M1604L7012j0742m9347l3739K0325N2220K7997k1128
$$ 16079 -10533 -45455 -43776 -2172 34840 24098 -25249 -58988 -38663 13557 41554 20426
846B0426l7202k789L6523L1084j5417m6320k2572L1802N3857J4567m4324n7497
$$ 20426 -16776 -19565 16958 48042 32625 -13695 -36267 -4465 49392 63959 19635 -37862
858c7862j0917M1060L9722r760m6302k5891K5714M5523P135m4252m6160Q166N9309
$$ -37862 -48779 -7719 32003 22243 -24059 -49950 -24236 21287 28422 -15830 -61990 -53824 5485
871E485M8580j2516n5139l1804K7715N3157J6847l5683m0925O749M8696L1428
$$ 5485 54065 41549 -13590 -45394 -17679 35478 52325 16642 -24283 -17534 31162 62590
883F2590k7793o1483k9012L3764N6177J3859m3962n1224l321M1984L2364j7270
$$ 62590 34797 -26686 -55698 -21934 34243 48102 4140 -47084 -50405 -8421 23943 6673
895F673m5309j4706L8159N1597O912m4844m4415Q071N2348M0102j2323m3611k1036
$$ 6673 -38636 -53342 -15183 36414 43326 -1518 -45933 -37862 14486 54588 42265 -1346 -22382
908b2382K4964L7430O74m0423l4748J1876M4617K3923k7944n1403k1261K7295
$$ -22382 2582 40012 40686 263 -34485 -22609 22008 45931 17987 -33416 -54677 -27382
920b7382L9619N667l0566k7254J1970L6846J6020k4193l4678r1L9761L9499j942
$$ -27382 12237 17904 -12662 -39916 -27946 8900 24920 727 -33951 -34042 5719 45218 43276
933D3276l5950k7319J1140L2924J3500k1174k8118Q98K7541J7475j9901m0291
$$ 43276 7326 -19993 -8853 24071 37571 16397 -11721 -10823 16718 34193 14292 -25999
945b5999j8116K2078L4283P494k6503k8314K252K6927J6670j3751k3991P84L2470
$$ -25999 -44115 -22037 12246 19740 -6763 -35077 -32825 -5898 10772 -2979 -26970 -26186 6284
958F284L0437m744l4065k3579J5097L6324J7276j8879k9119l873K3000J6910j6842
$$ 6284 36721 31977 -2088 -25667 -10570 25754 43030 24151 -4968 -8841 14159 31069 14227
971A4227l6159j4639K4501L5206M133l4872l7185O24L4249K6079j0309k9189p848
$$ 14227 -21932 -36571 -12070 23136 27269 -7603 -44788 -44164 -9915 16164 5855 -23334 -31182
984c1182K7744L2168k247l5059k5651J7973M5723K5999k1326m2142j5851K4617
$$ -31182 -3438 28730 26483 -8576 -34227 -16254 29469 55468 34142 -8000 -23851 766
996G66L1010k033l3722k4381J4613L5455R987l3520m3488p205L7242M0283o90
$$ 766 31776 29743 -3979 -28360 -13747 21708 31695 -1825 -45313 -52518 -15276 25007 24317
1009B4317l7312k8318J3820L7811J6080k2560l0461N011M0767L2466j3525m5531
$$ 24317 -12995 -41313 -27493 10318 26398 3838 -26623 -21612 19155 51621 38096 -7435
1021g435k7537K1155M4300J7242k7380l8834o215K8673K2566j6832l9671j5898
$$ -7435 -34972 -13817 30483 47725 20345 -18489 -24704 3969 26535 9703 -29968 -45866
1033d5866K8479M1464O873l7244m0366R69L9293L3857o581l1686j3393K3787L2358
$$ -45866 -17387 24077 30950 -6294 -46660 -45691 -6398 27459 20878 -10808 -24201 -414 31944
1046C1944N86l3536k7183J3459M2395K4784k1037m3249k0335K0402L1473K772
$$ 31944 32530 -1006 -28189 -14730 27665 52449 31412 -11837 -32172 -11770 19703 22475
1058B2475k8460k3577J0427L0238R979k7175l5905l134L5604L7198M5l2242k5188
$$ 22475 -5985 -29562 -19135 11103 21082 -6093 -41998 -45132 -9528 27670 27715 -4527 -29715
$$ [...]
8191C59
##END NTUPLES=NMR FID
##END=
