##TITLE=1H_DE-36_oil_D2O
 D2O
 8 sc, 
 4.3.2024
##JCAMPDX= 6.0         $$ Bruker NMR JCAMP-DX V2.0
##DATA TYPE= NMR FID
##DATA CLASS= NTUPLES
##ORIGIN= UXNMR, Bruker Analytische Messtechnik GmbH
##OWNER= root
$$ XWIN-NMR		Version 3.5
$$ Mon Mar  4 16:15:36 2024 Russian Standard Time (UT+4h)  she@DPX200
##.OBSERVE FREQUENCY= 200.1313
##.OBSERVE NUCLEUS= ^1H
##.DELAY= (6, 6)
##.ACQUISITION MODE= SIMULTANEOUS
##.ACQUISITION SCHEME= undefined
##.AVERAGES= 8
##.DIGITISER RES= 18
##SPECTROMETER/DATA SYSTEM= spect
##.PULSE SEQUENCE= zg30
##.SOLVENT NAME= CDCl3
##.SHIFT REFERENCE= (INTERNAL, CDCl3, 0, 15.7039)
##AUDIT TRAIL= $$ (NUMBER, WHEN, WHO, WHERE, WHAT)
$$ ##TITLE= Audit trail, XWIN-NMR		Version 3.5
$$ ##JCAMPDX= 5.01
$$ ##ORIGIN= Bruker BioSpin GmbH
$$ ##OWNER= she
$$ F:/spectra/data/she/nmr/H-F/1/audita.txt
$$ ##AUDIT TRAIL=  $$ (NUMBER, WHEN, WHO, WHERE, WHAT)
(   1,<2024-03-04 16:14:23.53 +0400>,<she>,<DPX200>,
      <created by zg, POWCHK disabled, PULCHK disabled
       configuration hash MD5:
       00 E9 B6 7A A2 85 ED C7 34 08 36 98 17 FE 4E 26
       data hash MD5: 16K
       C1 D4 F7 63 5E A1 EA 37 76 F6 DB 6F DB 0E D2 0E>)
$$ ##END=
$$ 
$$ hash MD5
$$ 31 45 09 52 61 2E 12 DF 3A 20 F8 BE D2 29 51 AA
##$RELAX= 
##$RELAX= 
##$RELAX= 
##$RELAX= 
##$RELAX= 
##$RELAX= 
$$ Bruker specific parameters
$$ --------------------------
##$DU= <F:/spectra>
##$EXPNO= 1
##$NAME= <H-F>
##$PROCNO= 1
##$TYPE= <nmr>
##$USER= <she>
##$AMP= (0..31)
100 100 100 100 100 100 100 100 100 100 100 100 100 100 100 100 100 100 
100 100 100 100 100 100 100 100 100 100 100 100 100 100 
##$AQSEQ= 0
##$AQ_mod= 1
##$AUNM= <au_zg>
##$AUTOPOS= <>
##$BF1= 200.13
##$BF2= 200.13
##$BF3= 200.13
##$BF4= 200.13
##$BF5= 200.13
##$BF6= 200.13
##$BF7= 200.13
##$BF8= 200.13
##$BYTORDA= 1
##$CFDGTYP= 0
##$CFRGTYP= 5
##$CHEMSTR= <none>
##$CNST= (0..31)
1 1 145 1 1 1 1 1 1 1 1 1 1 1 1 1 1 1 1 1 1 1 1 1 1 1 1 1 1 1 1 1 
##$CPDPRG= <>
##$CPDPRG1= <>
##$CPDPRG2= <>
##$CPDPRG3= <>
##$CPDPRG4= <mlev>
##$CPDPRG5= <mlev>
##$CPDPRG6= <mlev>
##$CPDPRG7= <mlev>
##$CPDPRG8= <mlev>
##$CPDPRGB= <>
##$CPDPRGT= <>
##$D= (0..31)
0 1.2 0 0 0 0 0 0 0 0.06 0 0.03 0 0 0 0 0.0002 0 0 0 0 0 0 0 0 0 0 0 0 
0 0 0 
##$DATE= 1709554462
##$DBL= (0..7)
120 120 120 120 120 120 120 120 
##$DBP= (0..7)
150 150 150 150 150 150 150 150 
##$DBP07= 0
##$DBPNAM0= <>
##$DBPNAM1= <>
##$DBPNAM2= <>
##$DBPNAM3= <>
##$DBPNAM4= <>
##$DBPNAM5= <>
##$DBPNAM6= <>
##$DBPNAM7= <>
##$DBPOAL= (0..7)
0.5 0.5 0.5 0.5 0.5 0.5 0.5 0.5 
##$DBPOFFS= (0..7)
0 0 0 0 0 0 0 0 
##$DE= 6
##$DECBNUC= <off>
##$DECIM= 32
##$DECNUC= <off>
##$DECSTAT= 4
##$DIGMOD= 1
##$DIGTYP= 9
##$DL= (0..7)
0 120 120 120 120 120 120 120 
##$DP= (0..7)
150 150 150 150 150 150 150 150 
##$DP07= 0
##$DPNAME0= <>
##$DPNAME1= <>
##$DPNAME2= <>
##$DPNAME3= <>
##$DPNAME4= <>
##$DPNAME5= <>
##$DPNAME6= <>
##$DPNAME7= <>
##$DPOAL= (0..7)
0.5 0.5 0.5 0.5 0.5 0.5 0.5 0.5 
##$DPOFFS= (0..7)
0 0 0 0 0 0 0 0 
##$DQDMODE= 0
##$DR= 18
##$DS= 0
##$DSLIST= <SSSSSSSSSSSSSSS>
$$ [...]
##$SUBNAM2= <"">
##$SUBNAM3= <"">
##$SUBNAM4= <"">
##$SUBNAM5= <"">
##$SUBNAM6= <"">
##$SUBNAM7= <"">
##$SUBNAM8= <"">
##$SUBNAM9= <"">
##$SW= 18.0517328524113
##$SWIBOX= (0..15)
0 0 2 0 0 0 0 0 0 0 0 0 0 0 0 0 
##$SW_h= 3612.71676300578
##$TD= 16384
##$TD0= 1
##$TE= 0
##$TE2= 300
##$TE3= 300
##$TEG= 300
##$TL= (0..7)
0 120 120 120 120 120 120 120 
##$TP= (0..7)
150 150 150 150 150 150 150 150 
##$TP07= 0
##$TPNAME0= <>
##$TPNAME1= <>
##$TPNAME2= <>
##$TPNAME3= <>
##$TPNAME4= <>
##$TPNAME5= <>
##$TPNAME6= <>
##$TPNAME7= <>
##$TPOAL= (0..7)
0.5 0.5 0.5 0.5 0.5 0.5 0.5 0.5 
##$TPOFFS= (0..7)
0 0 0 0 0 0 0 0 
##$TUNHIN= 0
##$TUNHOUT= 0
##$TUNXOUT= 0
##$USERA1= <user>
##$USERA2= <user>
##$USERA3= <user>
##$USERA4= <user>
##$USERA5= <user>
##$V9= 5
##$VALIST= <valist>
##$VCLIST= <CCCCCCCCCCCCCCC>
##$VD= 0
##$VDLIST= <DDDDDDDDDDDDDDD>
##$VPLIST= <PPPPPPPPPPPPPPP>
##$VTLIST= <TTTTTTTTTTTTTTT>
##$WBST= 1024
##$WBSW= 4
##$XGAIN= (0..3)
0 0 0 0 
##$XL= 0
##$YL= 0
##$YMAX_a= 76141
##$YMIN_a= -79901
##$ZGOPTNS= <>
##$ZL1= 120
##$ZL2= 120
##$ZL3= 120
##$ZL4= 120
##$ABSF1= 10
##$ABSF2= 0
##$ABSG= 5
##$ABSL= 3
##$ALPHA= 0
##$AQORDER= 0
##$ASSFAC= 0
##$ASSFACI= 0
##$ASSFACX= 0
##$ASSWID= 0
##$AUNMP= <proc_1d>
##$AZFE= 0.1
##$AZFW= 0.1
##$BCFW= 1
##$BC_mod= 2
##$BYTORDP= 1
##$COROFFS= 0
##$CY= 11.3945322036743
##$DATMOD= 1
##$DC= 2
##$DFILT= <>
##$DTYPP= 0
##$F1P= 15.7292609196834
##$F2P= 12.9074282941183
##$FCOR= 0.5
##$FTSIZE= 0
##$FT_mod= 4
##$GAMMA= 1
##$GB= 0.15
##$INTBC= 1
##$INTSCL= 1
##$ISEN= 128
##$LB= 0.24
##$LEV0= 0
##$LPBIN= 0
##$MAXI= 10000
##$MC2= 0
##$MEAN= 0
##$ME_mod= 0
##$MI= 1.114404
##$NCOEF= 0
##$NC_proc= 0
##$NLEV= 6
##$NOISF1= 3.799351
##$NOISF2= 2.8
##$NSP= 1
##$NTH_PI= 0
##$NZP= 0
##$OFFSET= 15.70392
##$PC= 1
##$PHC0= -24954.29
##$PHC1= 21.65264
##$PH_mod= 1
##$PKNL= yes
##$PPARMOD= 0
##$PSCAL= 0
##$PSIGN= 0
##$REVERSE= no
##$SF= 200.130013532006
##$SI= 16384
##$SIGF1= 3
##$SIGF2= 2
##$SINO= 400
##$SIOLD= 16384
##$SREGLST= <1H.CDCl3>
##$SSB= 0
##$STSI= 0
##$STSR= 0
##$SW_p= 3612.71676300578
##$SYMM= 0
##$S_DEV= 0
##$TDeff= 0
##$TDoff= 0
##$TI= <>
##$TILT= no
##$TM1= 0
##$TM2= 0
##$TOPLEV= 0
##$USERP1= <user>
##$USERP2= <user>
##$USERP3= <user>
##$USERP4= <user>
##$USERP5= <user>
##$WDW= 1
##$XDIM= 8192
##$YMAX_p= 0
##$YMIN_p= 0
$$ End of Bruker specific parameters
$$ ---------------------------------
##NTUPLES= NMR FID
##VAR_NAME=  TIME,          FID/REAL,        FID/IMAG
##SYMBOL=    X,             R,               I
##VAR_TYPE=  INDEPENDENT,   DEPENDENT,       DEPENDENT
##VAR_FORM=  AFFN,          ASDF,            ASDF
##VAR_DIM=   8192,          8192,            8192
##UNITS=     SECONDS,       ARBITRARY UNITS, ARBITRARY UNITS
##FACTOR=    0.0002768,     1,               1
##FIRST=     0,             0,               0
##LAST=      2.2672688,     0,               0
##MIN=       0,             -79901,          0
##MAX=       2.2672688,     76141,           0
$$ Real data points
##PAGE= N=1
##DATA TABLE= (X++(R..R)), XYDATA
$$ [...]
1785A21n9p0J83k12j9l5L7R8r7K48p5m6r2J50j43K73k14j75j18K82j4j66l0L8
$$ 121 62 -8 175 -37 -56 -91 -54 44 -53 195 120 74 -18 132 -11 262 48 -127 -245 37 23 -143 -173 -135
1809a35P0K02l47J73J14k35J86rk44M1K29j38O5P9k5N3J67k77M8J48l21J84l6
$$ -135 -65 137 -210 -37 77 -158 28 19 -225 -184 45 -93 -28 51 26 79 246 -31 17 165 -156 28 -8
1832hj93L14j23R1j59J2j5K3J14R9j75l0k5R0r9J24j13j35K22m8j43K34k30L5
$$ -8 -201 113 -10 81 -78 -66 -81 -58 56 155 -20 -50 -75 15 -84 40 -73 -208 14 -34 -177 57 -173 -138
1856a38j8J56J45r4j57P1j17J48jL2n6J02j71J74oj18m9k09J63J54o1J70JL5m55
$$ -138 -156 0 145 51 -106 -35 -152 -4 -5 27 -29 73 -98 76 70 -48 -97 -306 -143 11 -50 120 121 156 -299
1881b99K29P7j35p4K21L5l2J7j67k9n6K86P9j21p7M5J00k25J91j54J07M4j26n4
$$ -299 -70 7 -128 -202 19 54 22 39 -128 -157 -213 73 152 31 -46 -1 99 -126 65 -89 18 62 -64 -118
1905a18L76j62l0Qk49J74p0N7l7J14j44MK12k45j92K52J25k5J49k79rO3K33l59
$$ -118 258 96 66 74 -175 -1 -71 -14 -51 63 -81 -77 135 -110 -302 -50 75 50 199 -80 -89 -26 207 -152
1929a52J26Q3l42L46k01%J1L45k16nL50k66q5J72j72m1J69m4q6q7J67j47J48J57
$$ -152 -26 57 -285 61 -140 -140 -129 216 0 -5 345 79 -6 166 -6 -47 122 78 -8 -95 72 -75 73 230
1953B30m07K77j64J80j3j2O8j27k04J6J02j76J46j8k6M21k56j57O4N0n4K8j0J12
$$ 230 -177 100 -64 116 103 91 159 32 -172 -156 -54 -230 -84 -102 -128 293 37 -120 -56 -6 -60 -32 -42 70
1977G0L8j75J08m3L3j12o3lJ0L7P2M0j27K39no0p8N0k33L25n3k45N27o16K65l40
$$ 70 108 -67 41 -2 31 -81 -144 -147 -137 -100 -28 12 -115 124 119 59 -19 31 -202 123 70 -175 352 -264 1 -339
2003c39N29n33J56r4o6K08J77L00k58J72k40J29p3Ok77P2M9N3k4n1J96M8j93J37
$$ -339 190 -343 -187 -281 -347 -139 38 338 80 252 12 141 68 74 -203 -131 -82 -29 -53 -104 92 140 -53 84
2027H4j68K14m2ok5P0k0J12K4k1j84R8k46m6L45j42k97K05Q6l31K04J78j73J75
$$ 84 -84 130 88 82 57 127 107 219 243 222 38 136 -110 -156 189 47 -250 -45 41 -290 -86 92 -81 94
2051I4j88N1j23q4M32l44L69j52O6k64L9J97k70J34k9N9j11J18LL6p1n9K79j64
$$ 94 -94 -43 -166 -250 182 -162 207 55 121 -143 -104 93 -177 -43 -72 -13 -124 -6 -3 33 -38 -97 182 18
2075A8k88N27l66NQ6m6J83o5j88k26L40o3K27k47j51K32j41J43M5P1k80K41l2
$$ 18 -270 257 -109 -104 -18 -64 119 54 -134 -360 -20 -83 144 -103 -254 -22 -163 -20 25 96 -184 57 25
2098B5J9o0j10K88J77m72J66k34L63r2P4l9k5J68k12J83r3l77J23Q0J96j92NL9
$$ 25 44 -16 -126 162 339 -133 33 -201 162 70 144 105 80 248 36 219 126 -251 -128 -48 148 -44 -39 0
2122@J6k2O0k68P9k4N0P1K5J35j11J87m88K28q0J41r8J11k60L30m1rm3p1J16k0
$$ 0 16 -6 54 -214 -135 -159 -109 -38 -13 122 11 198 -290 -62 -142 -1 -99 12 -248 82 41 32 -11 -82 34 14
2148A4%j69J82K6K2Q1Q2l28J31J15j24J32r3R1j20j08m0K99k37M6j7M1K9K18l64
$$ 14 14 -155 27 53 75 156 238 -90 41 156 32 164 71 162 42 -66 -106 193 -44 2 -15 26 55 273 -91
2173i1Q4o4lJ64j5pp7O2Q7k11k9J69k00J73P4j70K22k45r9J43M9j94P0L07k38
$$ -91 -7 -71 -74 90 75 68 -9 53 140 -71 -100 69 -131 42 116 -54 168 -77 -176 -33 16 -178 -108 199 -39
2198c9m8O3L3K9nJ68k18j16L17q2j74J79j55K02j04q0k4J9j10K1l1J73Q2k81R6
$$ -39 -87 -24 9 38 33 201 -17 -133 184 102 -72 107 -48 154 50 -30 -54 -35 -145 -124 -155 18 100 -181 -85
2223h5J8J28j05m9J61j76L3j0J65j1K00k43j61R5K32k47J69oK25k49J6j55j00
$$ -85 -67 61 -44 -93 68 -108 -75 -85 80 69 269 26 -135 -40 192 -55 114 108 333 84 100 -55 -155
2246a55K01j54K32P9j74k4J73l35K27K3j41m3K2m9K22j5l2k92J79J22O3p5l34
$$ -155 46 -108 124 203 29 5 178 -157 70 93 -48 -91 -69 -118 104 89 57 -235 -56 66 129 54 -280
2269b80L06K9j86L11j48nl05J23J16J59m9k28J14m2R7R2k05J90k42J47K97l99
$$ -280 26 55 -131 180 32 27 -278 -155 -39 120 71 -157 -43 -85 12 104 -101 89 -153 -6 291 -108
2291a08J27j04J65j46O9J66j99M3j44l18M71j38L04j00l01K66q3P1l4N9j56r2
$$ -108 19 -85 80 -66 3 169 -30 13 -131 -449 22 -116 188 88 -213 53 -30 41 7 66 -90 -182
2313a82K44J0O9j96M7R5k0j03R5P9j60K48l72K45k45J22L27m67l9J84j28J44J69
$$ -182 62 72 141 -55 -8 87 67 -36 59 138 -22 226 -146 99 -146 -24 303 -164 -203 -19 -147 -3 166
2336A66q4J1m4k13M0N1o2O9J24J79k37P8k74L24l8j38j62K73L7p2K62l34j65L37
$$ 166 82 93 49 -164 -124 -73 -135 -66 58 237 0 78 -196 128 90 -48 -210 63 100 28 290 -44 -209 128
2360A28j02j67JKL21J19k56p7J85q4o6j7P5j39o6p6L6K80j22J03j1k13J56K18
$$ 128 26 -141 -140 -138 183 302 46 -31 154 70 4 -13 62 -77 -143 -219 -183 97 -25 78 67 -146 10 228
2384B28l77J75j2O2j08J63l8l07K70J13k7j31R4o2O5O9j27j74K28m9J9N0l1o8
$$ 228 -149 26 14 76 -32 131 93 -214 56 169 142 11 105 43 108 177 50 -124 104 55 74 124 93 25
2408B5K35k12n2P6O7k33j05J02j2J77k31l8k5Q0K73j30J63k46J74P0j47J3j02
$$ 25 260 48 -4 72 139 -94 -199 -97 -109 68 -163 -201 -226 -146 127 -3 160 -86 88 158 11 24 -78
2431g8J49J6j76K9K01k21J54P8J72l48K33j5j39j47L76k02q2P6p6J7k7J18k5l80
$$ -78 71 87 -89 -60 141 -80 74 152 324 -24 209 194 55 -92 284 82 0 76 0 17 -10 108 83 -297
2455b97K30j74J32K67k53K30P7l19L9J07l6o1j9J41j71N9J23j58K37k68J09j5
$$ -297 -67 -241 -109 158 -95 135 212 -107 -68 39 3 -58 -77 64 -107 -48 75 -83 154 -114 -5 -20
2477b0K5J64j14k15J62R6k24K38pJ96n28L33j24L3k0k96K50m8K70j27j09j1M6
$$ -20 5 169 55 -160 2 98 -126 112 105 301 -227 106 -18 15 -5 -301 -51 -99 171 44 -65 -76 -30
2500c0MN8L7J29j23k51M8J29Q5j49Q7J18n9j71J4J63n4j0l83J59J69j33J44J97
$$ -30 -26 32 69 198 75 -176 -128 1 86 -63 24 142 83 -88 -74 89 35 25 -358 -199 -30 -163 -19 178
2524A78k09M6Q0k19L31l73K88r4o4O0q0J14k33K57j47j72K22N9j23J14O7j14J23
$$ 178 -31 15 95 -124 207 -166 122 28 -36 24 -56 58 -175 82 -65 -237 -15 44 -79 35 102 -12 111
2547A11p2j06J79k14J3o3K93k69J83k8Q1k7n1r3j81J19O2N8R8L3O0m9k53j03N58
$$ 111 39 -67 112 -102 -89 -152 141 -128 55 27 108 81 30 -63 -244 -125 -63 -5 93 126 186 137 -116 -219 339
2572C39j29q2l7p0L15m10P9l7J12r1P1j05o5l1Q6R8M3j39m6J37j73L13m73M18
$$ 339 210 128 91 21 336 -74 5 -32 80 -11 60 -45 -110 -141 -55 43 86 -53 -99 38 -135 178 -295 123
2596A23j62k5j06j05J29l1J84k19L87p3j70p4J48k26M34k28j2j62J6L39j75K53
$$ 123 -39 -64 -170 -275 -146 -177 7 -212 175 102 -68 -142 6 -220 214 -14 -26 -188 -172 167 -8 245
2618B45l34j92M34k7j47j52L9J78J40m9l54J27p7J16L6oj96L54J0j20L9kL1j12
$$ 245 -89 -281 153 126 -21 -173 -134 44 184 135 -219 -92 -169 -53 -17 -23 -219 135 145 25 64 62 93 -19
2642a9k5j45r0K40K92j83K74j55l12K63j88K67j75j59R0OQ3j42K01j66n0q0R7
$$ -19 -44 -189 -279 -39 253 70 344 189 -123 140 -48 219 44 -115 -25 -19 64 -78 123 -43 -93 -173 -76
2665g6R2J20o8O1p9j00J78l4j67j04Q3p6M04M7l49J81q3L3j12R1J5jJ43l2j75
$$ -76 16 136 68 129 50 -50 128 94 -73 -177 -94 -170 234 281 -68 113 30 63 -49 42 57 56 199 167 -8
2690hJ9J35k60L17j92J71j94J05k32j13M05J1l94J84P8P4j47J02l8K4M0n3o6o3
$$ -8 11 146 -114 203 11 182 -12 93 -139 -252 153 164 -230 -46 32 106 -41 61 23 47 87 34 -32 -95
2714i5k3O9J4O3M2n5l9o9K35j47K15m14J7K36l27O3L48P2r0ol87P57n35J50j68
$$ -95 -118 -49 -35 28 70 15 -24 -93 142 -5 210 -204 -187 49 -278 -215 133 205 115 109 -278 479 -56 94 -74
2739g4mj9K44j51j49J01j74J53j14K87j32Q4L3L3j46J14k43M28l21J26j18j10
$$ -74 -78 -97 147 -4 -153 -52 -226 -73 -187 100 -32 52 85 118 -28 86 -157 271 -50 76 -42 -152
2761a52P8M1j80K98k35L17j99k05K26k36M18j20PL4J3k44q7M68k72L4j1K3L01
$$ -152 -74 -33 -213 85 -150 167 -32 -237 -11 -247 171 51 58 92 105 -139 -226 242 -30 4 -7 16 317
2784C17l65J6l41N07O8k29K11k21J86p5k71J00P9J4j12K20k71K03K20j61j03N3
$$ 317 -48 -32 -373 134 202 -27 184 -37 149 74 -197 -97 -18 -4 -116 104 -167 36 256 95 -8 45
2806D5j79J92m2j84M48j03j52jn6l0k5P7k03L0m8K52r7N7j5J42l07M00k72N0J66
$$ 45 -134 58 16 -168 280 177 25 24 -32 -62 -87 -10 -213 -183 -231 21 -76 -19 -34 108 -199 201 -71 -21 145
2831A45o2J27j71K3j17L7m4O3J32l14R4K38M9l8n0J47m03K36j2nk73N7rK41R7
$$ 145 83 210 39 62 -55 -18 -62 1 133 -181 -87 151 200 162 112 259 -144 92 80 75 -198 -141 -150 91 188
2856A88m05L23n1n0m8J86j34K%j69l1R5k5K50l3l55J72j3K34j00l26L11j01l0
$$ 188 -217 106 55 5 -43 143 9 11 11 -158 -189 -94 -119 131 98 -257 -85 -98 136 36 -290 21 -80 -110
2880a10P2L3j84J34K77L8k61o9K13k26K30j53l9K13J27q41N75P7R8k03J47k33
$$ -110 -38 -5 -189 -55 222 260 -1 -70 143 -83 147 -6 -45 168 295 -546 29 106 204 1 148 -85
2902h5Q9k7l1J34N5p1j77N9J7k8K06J18k23n2J85k06l4K0K36j05O5k47j12J20
$$ -85 4 -23 -54 80 135 64 -113 -54 -37 -65 141 259 36 -16 169 -37 -71 -51 185 80 145 -102 -214 -94
2926i4J35K62p1k94R0Q1j01m3l9O5K07k73P2j42J39j00J38J2k34J95k3K13o2l63
$$ -94 41 303 232 -62 28 109 8 -35 -74 -9 198 -75 -3 -145 -6 -106 32 44 -190 5 -18 195 133 -230
2950b30K64J31j50j32J41r8K2o7l8l3n1L90n18L64l2k55N33l80j26K59K54l84
$$ -230 34 165 15 -117 24 -74 -52 -119 -157 -190 -241 149 -369 -5 -37 -292 241 -139 -265 -6 248 -136
2972a36K10K01k14j83K53o5k15M66k91j16P4j73K21n0j6j25N01n35Q0K10l8M7
$$ -136 74 275 61 -122 131 66 -149 317 26 -90 -16 -189 32 -18 -34 -159 342 -193 -113 97 59 106
2994A06j68j0K26j97J35R6o4j4L5j91j10J04l1M4P7l11L81j35j8j39P1J50J24
$$ 106 -62 -72 154 -43 92 188 124 110 145 -46 -156 -52 -83 -39 38 -273 108 -27 -45 -184 -113 37 161
3017A61l13K4LL18k49J44PR2M6j3m76L02j2q1J86Q5p0n6k14j94L15l7K55j88K2
$$ 161 -152 -128 -125 193 -56 88 95 187 233 220 -256 46 34 -47 139 224 154 98 -116 -310 5 -32 223 35 57
3042E7j13j84J47K95R2q7l41q1L1Q5J34k68J28K71j21j15o6J24o2J0k2L91k76
$$ 57 -56 -240 -93 202 294 207 -134 -215 -184 -99 35 -233 -105 166 45 -70 -136 -12 -74 -64 -86 305 29
3065B9N9j26j9J70k88O24o60K14J4j77m2K03k41J91K64l29K53j71o2Q7J79j33
$$ 29 88 -38 -57 113 -175 449 -211 3 17 -160 -202 1 -240 -49 215 -114 139 -32 -94 -7 172 39
3087C9L4j31q2R6j14L72J11l43J2n9j43K23%j49m5QJ92J95j17k48N8P0K04k41
$$ 39 73 -58 -140 -44 -158 214 325 -18 -6 -65 -208 15 15 -134 -179 -171 21 216 99 -149 -91 -21 183 -58
3111e8R2j32Q0P0J29l11J08k89J92J35l19J17J65J46m9O9k73R4q7o2K75j24j76
$$ -58 34 -98 -18 52 181 -130 -22 -311 -119 16 -303 -186 -21 125 76 145 -128 -34 -121 -183 92 -32 -208
3134b08J97K91k73mo3J29k38L04r6k31P9J37J85l21j03L42j15k6J19N3k10j15
$$ -208 -11 280 7 3 -60 69 -169 135 39 -192 -113 24 209 -112 -215 127 12 -14 105 158 -52 -167
3156a67M78m54J83r3J09j7R1l35L03j32kmm3r6J45L8l5j13p0K46l43J92J77O1
$$ -167 311 -143 40 -53 56 39 130 -205 98 -34 -36 -40 -83 -179 -34 4 -31 -144 -214 32 -311 -119 58 119
3180A19l10K56k94L92j88M0j8p3Q5Q5l08L28r0M4M9n8j53J75l7j41l9J46J03K8
$$ 119 -191 65 -229 163 -25 15 -3 -76 9 94 -214 114 24 68 117 59 -94 81 44 -97 -136 10 113 141
3204A41k19J43J27l22M49m52p1L77m42M5M8K5K52k56J44r0J2Q7p5M5j63J97oK37
$$ 141 -78 65 192 -130 319 -133 -204 173 -269 -224 -176 -151 101 -155 -11 -101 -89 -2 -77 -32 -195 2 -4 233
3228B33k03l4j57J76J12j05K3k37J48K36l88J25M0j24M0K84j90J53M4j64r0J60
$$ 233 30 -4 -161 15 127 22 45 -192 -44 192 -196 -71 -31 -155 -115 169 -21 132 176 12 -78 82
3250H2k7j49J2K10j65K7M0l54N88k39O1l60J98lK23k65P4Q7J11k03k0k00L77j50
$$ 82 55 -94 -82 128 -37 -10 30 -324 264 25 86 -274 -76 -79 144 -121 -47 40 151 -52 -72 -272 105 -45
3274d5j24l6L34k37MK36O3k11k1N8q4j50j7J59QK4k66K90P1k4k7l9O0j46J42N3
$$ -45 -169 -205 129 -108 -104 132 195 -16 -37 21 -63 -213 -230 -71 -63 -39 -305 -15 56 32 5 -34 26 -120 22 75
3300G5k53K72j85j8J24k5K3p7J35l82K88j2rJ67J19m23N0K3K92k80lL8J30j47
$$ 75 -178 94 -91 -109 15 -10 13 -64 71 -311 -23 -35 -44 123 242 -181 -131 -108 184 -96 -99 -61 69 -78
3324g8N7K37l27J16L4M0k08K02n1l28K84N3m3L9J02r6M2K7k85L66k72J01j19P3
$$ -78 -21 216 -111 5 39 79 -129 73 22 -306 -22 31 -12 27 129 33 75 102 -183 183 -89 12 -107 -34
3348c4j3J33j06L2j5J7j04J70k83K61q4J39l31J92N0mJ78k27j10O2O7J23l67L65
$$ -34 -47 86 -20 12 -3 14 -90 80 -203 58 -26 113 -218 -26 24 20 198 -29 -139 -77 -10 113 -254 111
3372A11k22Q3k03J69J04j19O3P2j0k11K02R5j86k9m4Q2k00P0N8K10q9j39J02j42
$$ 111 -111 -28 -231 -62 42 -77 -14 58 48 -163 39 134 -52 -81 -125 -43 -243 -173 -115 95 6 -133 -31 -173
3396a73j5J04lJ28K36j87k07P6n3N5r7L58k84l9J94J01k0l15L29j38j33K92rq9
$$ -173 -188 -84 -87 41 277 90 -117 -41 -94 -39 -136 222 -62 -101 93 194 174 -141 188 50 -83 209 200 111
3420A11k66J86Q1j50K19m1j53R0J58k19k81M10k22Q8J26p2k0R4k47j01K92j92
$$ 111 -155 31 112 -38 181 140 -13 77 235 16 -265 145 -77 11 137 65 45 139 -108 -209 83 -109
3442a09o9P5J14j78K10J16l6j45J58j90J41j17m2J16K00k15m8j6n7J73Rj14R6
$$ -109 -178 -103 11 -167 43 159 123 -22 136 -54 87 -30 -72 44 244 29 -19 -35 -92 81 90 -24 72
3465G2p8l0L3Q7j96Q7j9k7l2QM5n7J17J18j66J89p0j02j83K82Q4j22K62l04n1
$$ 72 -6 -36 -3 84 -112 -25 -44 -71 -103 -95 -50 -107 10 128 -38 151 81 -21 -204 78 162 40 302 -2 -53
3490e3J10J18j98j89J66Q7J09n1J31j28j28j43M25r5o2M7j79J75p5j26j8rk93
$$ -53 57 175 -23 -212 -46 41 150 99 230 102 -26 -169 256 161 99 146 -33 142 67 -59 -77 -86 -379
3513c79L22K43l68L02m7jM1k06m6L19j16n4K42Q5m34NQ0o4K07p5j49j0k44L60
$$ -379 -57 186 -182 120 73 72 113 -93 -139 180 64 10 252 337 -97 -92 -12 -76 131 56 -93 -103 -347 13
3537A3J24j57L72k55j03L8l3J59m0o5J7J60q0qQ6j87j08m6K17j32l9j19L3n6K23
$$ 13 137 -20 352 97 -6 32 -1 158 118 53 70 230 150 142 228 41 -67 -113 104 -28 -67 -186 -153 -209 14
3562A4J00k61L70q5k17r1K84p2n5J6N6l1k70K33p2k07L29L1k40K65j89K27j3l2
$$ 14 114 -147 223 138 -79 -170 114 42 -13 3 59 28 -242 -9 -81 -288 41 72 -168 97 -92 135 122 90
3586I0j92L01j12R0j0l00K73j81P8j0p7Q3M7j17k1k01J93Mk8Q4P7mR6j49N0l4
$$ 90 -102 199 87 177 167 -133 140 -41 37 27 -50 33 80 -37 -58 -259 -66 -62 -90 -6 71 67 163 14 64 30
3612C0J48j11j62o3J38l4O7l9j41J62j04J34m8j33J3LJ87K62n16J38J49pq2m8
$$ 30 178 67 -95 -158 -20 -54 13 -26 -167 -5 -109 25 -23 -156 -143 -140 47 309 -207 -69 80 73 -9 -57
3636e7q6K88n5p1o3K9n1J04K10k53N3K9q4R7k20Q7J49j31O5m9j16L0K83l6m2J
$$ -57 -143 145 90 19 -44 -15 -66 38 248 -5 48 77 -7 90 -130 -43 106 -25 40 -9 -125 -95 188 152 110 111
3662A11L34n06K36k57n2L58k84J02l49Q9L63N2l69L7J46kR2j29k9j54N2N5M20
$$ 111 445 -61 175 -82 -134 224 -60 42 -307 -218 145 197 -172 -135 11 9 101 -28 -57 -211 -159 -104 316
3685C16l98K8R0J08k05j6J07k56L13j44Q8Q5j04J43k85J43J0J12m1n7j95K59j10
$$ 316 -82 -54 36 144 -61 -77 30 -226 87 -57 31 116 12 155 -130 13 23 135 94 37 -158 101 -9
3708iJ31k7k46J20k01M9K06j50J84k27J8L73l39M8M4p7M2j41R0K12j25J68J40
$$ -9 122 95 -151 -31 -232 -183 23 -127 57 -170 -152 221 -118 -70 -26 -103 -61 -202 -112 100 -25 143 283
3731B83m34N00j93l35J15J31Q2j08k68J10J8J49L6n7J6k53K33j97J70q0J0M2k5
$$ 283 -151 349 156 -179 -64 67 149 41 -227 -117 -99 50 86 29 45 -208 25 -172 -2 -82 -72 -30 -55
3754e5p5J97J6Q5j71J06j31j13J52k17J51q1n4J19j54K27j50K5Q6J26j54j21J15
$$ -55 -130 67 83 168 -3 103 -28 -141 11 -206 -55 -136 -190 -71 -225 2 -148 -123 -37 89 -65 -186 -71
3777g1j79N3J33k1m2O7L03K9Ql17K99p5J34k87J97l01J51j52J29j01J34m1K30
$$ -71 -250 -197 -64 -85 -127 -60 243 272 280 -37 262 187 321 34 231 -70 81 -71 58 -43 91 50 280
3800B80l88j5M2jN8k41J54J37j34J57j67J24mj20J85l10L88j8q8J60J54l08j55
$$ 280 -108 -123 -81 -82 -24 -265 -111 26 -108 49 -118 6 2 -118 67 -243 145 127 39 199 353 45 -110
3823a10M1K57q5J80q2l93J27o4J83q6M5J45j79j45L05j16j03lJ87j29K3l4O8J36
$$ -110 -69 188 103 283 201 -192 -65 -129 54 -32 13 158 -21 -166 139 23 -80 -83 104 -25 -2 -36 32 168
3847A68k14J25n3q7J38j6l17J67J42j45P8l31L31ok4q2K16j16q5M82j26l94j1
$$ 168 -46 79 26 -61 77 61 -256 -89 53 -92 -14 -345 -14 -20 -44 -126 90 -26 -111 371 245 -149 -160
3870a60J44Q9RJ13R9l36O6J36k46J46k19J14J11n6K00k49k9J36m13M78p4q0P0
$$ -160 -16 73 82 195 294 -42 24 160 -86 60 -159 -45 66 10 210 -39 -68 68 -345 133 59 -21 49
3893D9n5O2R9j08k11K47%J23o43J99J44J54J36L1O9j31j33n3K92j99j40lJ09q3
$$ 49 -6 56 155 47 -164 83 83 206 -437 -238 -94 60 196 227 296 165 32 -21 271 72 -68 -71 38 -45
3917d5m9p6P7J22j76P5J58r8q2K74k95K36j32k49L54Q8N4k82L05k59PP8q5k9m
$$ -45 -94 -170 -93 29 -147 -72 86 -12 -94 180 -115 121 -11 -260 94 182 236 -46 259 0 7 85 0 -29 -33
3942c3K23j61q2K90j56r1M9j86K2L28l51K41j43J93m32O5J84L66k77J66k25K15
$$ -33 190 29 -53 237 81 -10 39 -147 -125 203 -148 93 -50 143 -289 -224 -40 326 49 215 -10 205
3964B05j87K3j85J55L28n92L6K44J19l48L35j57O2j68R9o4L85r7k80L39k82r8
$$ 205 18 41 -144 11 339 -253 -217 27 146 -202 133 -24 38 -130 -31 -95 290 193 -87 252 -30 -128
3986a28L34k91L5K63k13J61O2O9m18J48lj98J27R3j68J71j89L68k28OP4j05R8
$$ -128 206 -85 -50 213 0 161 223 292 -126 22 19 -179 -52 41 -127 44 -145 223 -5 1 75 -30 68
4009F8kr2n6j8J29n0K06k45J54Mq1l1j27K7J62K22l15J84j67j36J84l5J9k2Po0
$$ 68 66 -26 -82 -100 29 -21 185 -60 94 98 17 -14 -141 -114 48 270 -45 139 -28 -164 20 -15 4 -18 -11 -71
4035g1J0k2j7j0j13K66j64J79j54K3K25Qj55J06k69J25R6L9J77k88O4j85N2J49
$$ -71 -61 -83 -100 -110 -223 43 -121 58 -96 -73 152 160 5 111 -158 -33 63 102 279 -9 55 -130 -78 71
4059G1J98m71J54J59l3Q8k09j59K43q3J41k43J62o9J43M5j70K01n3j70J22q3K5
$$ 71 269 -202 -48 111 78 166 -43 -202 41 -42 99 -144 18 -51 92 137 -33 168 115 -55 67 -16 9
4082Inj40K18j56L45j39o3j42K15M1q1k59L7rJ02K76r3j33RJ8J70l12P9j02J28
$$ 9 4 -136 82 -74 271 132 69 -73 142 183 102 -157 -120 -129 -27 249 156 23 32 50 220 -92 -13 -115 13
4107A3L2jj70J09N3J61O1q0m69L54J57j45L0k17M2J59j94j09M62j58P4j45j02
$$ 13 45 44 -126 -17 36 197 258 178 -291 63 220 75 105 -112 -70 89 -105 -214 248 90 164 19 -83
4130h3K43k11K97k27n8J1R6J2j78J11q4K35j77pJ28kj76J59k10J21Q6j25K84k44
$$ -83 160 -51 246 19 -39 -28 68 80 -98 13 -71 164 -13 -20 108 106 -70 89 -121 0 86 -39 245 1
4154An9p5K05%q2JJ02j15l04J93q0K30O6j86K65p4QP6l1k01j49K86j49J62j18
$$ 1 -58 -133 72 72 -10 -9 93 -22 -326 -133 -213 17 83 -103 162 88 96 172 141 -60 -209 77 -72 90 -28
4179b8J83l58J07n8J74o1l9n1p0J14o5J50J96r9j51J60k20j15K63p1k54R3J69
$$ -28 155 -203 -96 -154 20 -41 -80 -131 -201 -87 -152 -2 194 95 -56 104 -116 -231 32 -39 -293 -200 -31
4202c1N9J64q7o4j75K48j20j15J62j77J52j27K42j66j91K09J60l3k90L20j28J24
$$ -31 28 192 105 41 -134 114 -6 -121 41 -136 16 -111 131 -35 -226 -17 143 110 -180 140 12 136
4224A36j67K52j16p0J23k68J90Jk37J07m2k48L73P6rk97J88K5k01m3N19l55Lp7
$$ 136 -31 221 105 35 158 -110 80 81 -156 -49 -91 -339 34 110 101 -196 -8 17 -184 -227 292 -63 -60 -137
4248a37M65k16p2l6K02l40J41Q9Q7l34K33j84J17J6n4O6M4j15O8j85J14l2K47
$$ -137 328 112 40 4 206 -134 7 96 183 -151 82 -102 15 31 -23 43 87 -28 40 -145 -31 -63 184
4271A84k53Q9MJ3L4l06M05k09J65k09K37k36j90J43K78J0J8k80m1L42j24r5J03
$$ 184 -69 20 24 37 71 -235 170 -39 126 -83 154 -82 -272 -129 149 159 177 -103 -144 198 74 -21 82
4294H2k20K36l37J04R4q8Q3m9N3J79%k04L49j63M2j39K42Pl26q9L37m33J15J64
$$ 82 -138 98 -239 -135 -41 -129 -46 -95 -42 137 137 -67 282 119 161 22 264 271 -55 -144 193 -240 -125 39
4318C9P2J15l07RL8K20l33K06J44n9k05O5O5j33n2R0J10p8j64J33j35K74n3k29
$$ 39 111 226 -81 -72 -34 186 -147 59 203 144 -61 4 69 -64 -116 -26 84 6 -158 -25 -160 114 61 -168
4342a68L21J34j58k39K24k56L06j4k50j0q2J26j2j12P0L43n84K70J40l03J26m2
$$ -168 153 287 129 -110 114 -142 164 150 -100 -110 -192 -66 -78 -190 -120 223 -361 -91 49 -254 -128 -170
4364a70J04o3J04pJ2J11J08o6j18j07K31n5K06n23J97kQ7k47J15j25J02J20j10
$$ -170 -66 -129 -25 -32 -20 91 199 133 15 -92 139 84 290 -233 -36 -38 49 -198 -83 -208 -106 14 -96
4387i6K47l71R7J1J02J0j0j43J70J07n57P02k05j37J9J1k0M93m14Kj11j77N84
$$ -96 151 -220 -123 -112 -10 0 -10 -153 17 124 -433 269 64 -73 -54 -43 -63 430 16 18 -93 -270 314
4410C14k44J59m39M26k33J4J44r3p0j63j5L12K3j2j40jJ33j76j23k1j6J92J22
$$ 314 70 229 -210 216 -17 -3 141 48 -22 -185 -200 112 135 123 -17 -18 115 -61 -184 -205 -221 -29 93
4433I3p8J54l09R0J90j05k10K28q0Q6J94m96K17J44k2k15J56JM7j3J51j89l20
$$ 93 15 169 -140 -50 140 35 -175 53 -27 59 253 -243 -26 118 96 -119 37 38 85 72 223 34 -286
4456b86J51J21J84l31O7K22l13K12j38K09k17J95l8l6RL7k16N6K66j7l94L27m7
$$ -286 -135 -14 170 -161 -94 128 -185 27 -111 98 -119 76 38 2 11 48 -168 -112 154 137 -257 70 23
4479B3J69l25J03J23j28N7j90L23n1r6k32K06k1Q4k22K3J14j01Q9O7j29K12o7
$$ 23 192 -133 -30 93 -35 22 -168 155 104 8 -224 -18 -39 45 -177 -154 -40 -141 -52 15 -114 98 31
4502C1R2l27K31LM3m8M9P9j06q0jj37L17k22q6R5Kl4KK4J6j02K56j6j13M4q0j22
$$ 31 123 -204 27 30 73 25 74 153 47 -33 -34 -171 146 -76 -162 -67 -65 -99 -97 -73 -57 -159 97 81 -32 12 -68 -190
4530a90P8J00J32n9j45J29k64J27J38O8l45Q9K89k85J95p2J71K3j76j71L30k12
$$ -190 -112 -12 120 61 -84 45 -219 -92 46 114 -231 -142 147 -138 57 -15 156 179 3 -168 162 -50
4552e0j99o4K64K60l41P6o4K5j81N54k25r4k01K96O5j24P6k1M4j42o2L26j99p6
$$ -50 -249 -313 -49 211 -130 -54 -118 -93 -274 280 55 -39 -240 56 121 -3 73 52 96 -46 -108 218 19 -57
4576e7K18l00R5j3j26J85j96M7j30K36K18o8j98j17M01q9j46j60r7L40j71N02
$$ -57 161 -139 -44 -57 -183 2 -194 -147 -277 -41 177 109 -89 -206 195 106 -40 -200 -297 43 -128 374
4598C74l65L1O8k02J24q5K9l12L75J82j24N0l29L57m5j20J01l06R8L4JK86l67
$$ 374 9 40 108 -94 30 -55 -26 -338 37 219 95 145 -184 173 128 8 109 -197 -99 -65 -64 222 -145
4621a45K22m2N0j8j81P3n6K79m56K53J83j69K40m08Q0K84o9k15L0k76K98J62k77
$$ -145 77 35 85 67 -114 -41 -97 182 -274 -21 162 -7 233 -175 -95 189 120 -95 -65 -341 -43 119 -158
4644a58L35l24L60M8k14o0J03%j92N37l84O6j79J56j45j36K61j68m9q7J03j36
$$ -158 177 -147 213 261 47 -13 90 90 -102 435 51 117 -62 94 -51 -187 74 -94 -143 -230 -127 -263
4666b63K68o2O9n5k73M54j09m35K76J92k25Q7J89k69R6J32j16L4j86N7L62m76
$$ -263 5 -57 12 -43 -316 138 29 -406 -130 62 -163 -76 113 -156 -60 72 -44 -10 -196 -139 223 -253
4688b53O1K03R9k5q0K64m80K17NL1m5Q4N3k05j02R2L08k13j95L90m38M1P0J12
$$ -253 -192 11 110 85 5 269 -211 6 11 42 -3 81 134 -71 -173 -81 227 14 -181 209 -229 -188 -118 -6
4712fK28j64J3k98N9RL04j09k56J50L1K3J2O3Qj96L71k14P6J48n06K93r6J54p1
$$ -6 222 58 71 -227 -168 -159 145 36 -220 -70 -39 -16 -4 59 67 -129 242 28 104 252 -254 39 -57 97 26
4737B6R6j68r3L30l35N6l6J58KK1j7l3O8j13jJ10J72J2j51k4k09N9k9j63M92j67
$$ 26 122 -46 -139 191 -144 -88 -124 34 36 57 40 7 75 -38 -39 71 243 255 104 80 -129 -70 -99 -262 230 63
4763F3l19K19K10r6o7J43j22j17j61M95l44O4K94qk53j5J31m9k64J97J39k77K12
$$ 63 -256 -37 173 77 10 153 31 -86 -247 248 -96 -32 262 254 1 -14 117 68 -196 1 140 -137 75
4786G5j86K10q8j7j43K85j92J93j31J84Mm40L91j93J62m03L07kj24R4rj16Q1k1
$$ 75 -111 99 11 -6 -149 136 -56 137 6 190 194 -246 145 -48 114 -289 18 16 -108 -14 -23 -139 -58 -79
4810g9q2K39o2j09j88K86j09O8j18K72j38k9K12j69R6k15M06m28Q3R8j39J59Q7
$$ -79 -161 78 16 -93 -281 5 -104 -36 -154 118 -20 -49 163 -6 90 -125 281 -147 -64 34 -105 54 141
4833A41J5j43R0k4j33Q0k00N6L4K09Q1l13K14k78L37j58M5k77R0J88J61j44j07
$$ 141 156 13 103 79 -54 26 -174 -118 -84 125 206 -107 107 -171 166 8 53 -224 -134 54 215 71 -36
4856c6K09k91J81k62J27N3k5K69r9J26l47P9o9L7J43j8q8k2O8j12Q9n4R6k68K37
$$ -36 173 -118 63 -199 -72 -19 -44 225 126 252 -95 -16 -85 -48 95 77 -11 -33 35 -77 12 -42 54 -214 23
4881B3j5O8N8j52K5J20j08j27N1M6o8N0m5J26p9j27J51M0k30K06j90J31L01k07
$$ 23 8 76 134 -18 7 127 19 -108 -57 -11 -79 -29 -74 52 -27 -154 -3 37 -193 13 -177 -46 255 48
4905D8k4k65M24k57J0K79j52j69R4J01o8j29K66m18J13M0j19L48j36j14PJ15q4
$$ 48 24 -241 183 -74 -64 215 63 -106 -12 89 21 -108 158 -260 -147 -107 -226 122 -14 -128 -121 -6 -90
4928i0J8K31j13P9k6rl79L52P3k9o7l3R7k19J22r4K14k3J7l88J25K46j04O9O0
$$ -90 -72 159 46 125 99 90 -289 63 136 107 40 7 104 -115 7 -87 127 104 121 -267 -142 104 0 69 129
4953A29m6k73J90K05j34J17j27J35k3l20L28l05J64K24j3k48L6K4k46K78j24p8
$$ 129 83 -190 0 205 71 188 61 196 173 -147 181 -124 40 264 251 3 39 63 -183 95 -29 -107
4975a07PK8L81j68p6J34M2j80j44j8K98q6p6j82K53l86L10K07m3k55l41M32o8
$$ -107 -100 -72 309 141 65 199 241 61 -83 -101 197 111 35 -147 106 -280 30 237 194 -61 -402 30 -38
4998c8K61k46J43j25J08j78R1K0K26l61K05j95M22k47k2K5r6J36j92J6J92O1r3
$$ -38 223 -23 120 -5 103 -75 16 36 262 -99 106 -89 333 86 64 89 -7 129 -63 -47 145 206 113
5021A13j8k81K49k65J58N8J01m79N58k79J68J85j17o2J5Pn4J7j46L05l66N1L42
$$ 113 95 -186 63 -202 -44 14 115 -364 194 -85 83 268 151 89 104 111 57 74 -72 233 -133 -82 260
5044B60k72k76K79J98k66P8p2r4K62K7J15l38O3l9K80r6j12K8l1J00k2J2k1j90
$$ 260 -12 -288 -9 189 -77 1 -71 -165 97 124 239 -99 -36 -75 205 109 -3 25 -6 94 72 84 63 -127
5068a27K0K94k65N1J0l02L07m8J60j00J08j58J43j30J83Pj71j25mK13j25L5j75
$$ -127 -107 187 -78 -27 -17 -319 -12 -60 100 0 108 -50 93 -37 146 153 -18 -143 -147 66 -59 -24 -199
5091a99K3K12j54J73j24j8K14j71K15l20j8K06k4k64L12l58M28R4r6J5q5r0j67
$$ -199 -176 36 -118 55 -69 -87 127 -44 171 -149 -167 39 15 -249 63 -295 133 227 131 146 61 -29 -196
5114a96J6J71P0j17j99N01j00j26P5j10j41J70P2k82J85j30j13J98R7j46Q6J97
$$ -196 -180 -9 61 -56 -255 246 146 20 95 -15 -156 14 86 -196 -11 -141 -254 -56 41 -105 -19 178
5136A78O9k81M20n0k00j15J19Q9k11J51k45K17l20J05P6k3j12J12P4k23J00jJ63
$$ 178 247 -34 386 336 136 21 140 229 18 169 -76 141 -179 -74 2 -21 -133 -21 53 -170 -70 -71 92
5159I2k3r5j9N9K1k25K6l5L23m26L75m5l58K02o6L0K29J22k79j24L07o0o6P7O6
$$ 92 69 -26 -45 14 35 -190 -164 -199 124 -302 73 28 -330 -128 -194 -164 65 187 -92 -216 91 31 -35 42 108
5184A08k18K58k87J80j91Q4o8K25l98K14r2l3K92L2l25J10J42J29j72K04k93j28
$$ 108 -110 148 -139 41 -150 -66 -134 91 -307 -93 -185 -218 74 106 -219 -109 33 162 -10 194 -99 -227
5206b27K74j2O6l27K3J24O8j51j58K01Q0J85j51J02OJ52l97L69l62J5L00l07l5
$$ -227 47 35 101 -226 -203 -79 -11 -162 -320 -119 -39 146 -5 97 103 255 -142 227 -135 -120 180 -127 -162
5229a62o0N2J60j56J69p9J4N7l4J89q5J8j08n1j2m7q4K51J51l14J02j80L76k38
$$ -162 -222 -170 -10 -166 3 -76 -62 -5 -39 150 65 83 -25 -76 -88 -135 -219 32 183 -131 -29 -209 167 -71
5253g1J18k14K92m09O7K80o0%o6R2k78L17j10Q9N4k8j70j72O0J51K21j82J33j90
$$ -71 47 -167 125 -284 -217 63 3 3 -63 29 -249 68 -42 47 101 73 -97 -269 -209 -58 163 -19 114 -76
5277g6J05J83j8j72j06J1r3J68J01%j80L2J48j18J5m5Mj20L91m8l71O9K55j05
$$ -76 29 212 194 22 -84 -73 -166 2 103 103 -77 -45 103 -15 0 -45 -41 -161 230 182 -189 -120 135 30
5301C0j6j44K58p4k54O6J21q9J84k66M52m14M2L8K05j92J01j60K5J45k75K41j07
$$ 30 14 -130 128 54 -200 -134 -13 -102 82 -184 268 -146 -104 -66 139 -53 48 -112 -87 58 -217 24 -83
5324h3M1K37k76K4L78l87M6q%J10J77k32k29K20N3j98Q2l10N24j29Oj72J94l7
$$ -83 -42 195 -81 -57 321 -66 -20 -28 -28 82 259 27 -202 18 71 -127 -45 -355 169 40 46 -126 68 31
5348C1j55l6J77j43J31k41L88k42M8RJ10L0j52K26k75OJ54K1q1J91q5j50o1K72
$$ 31 -124 -160 17 -126 5 -236 152 -90 -42 -33 77 107 -45 181 -94 -88 66 87 6 197 112 -38 -99 173
5372A73j80j9j39O8j18L59k04QK10j87L24j75M7J10m02k9K50k7Nk33k06M30J05
$$ 173 -7 -26 -165 -97 -215 144 -60 -52 158 -29 295 120 167 277 -125 -154 96 69 74 -159 -365 65 170
5395A70k65J59P7p4l42M02l25K56Nj12J51j66oJ51n0P1o6rk5O8k40M3N9L10j16
$$ 170 -95 64 141 67 -275 127 -198 58 63 -49 102 -64 -70 81 31 102 36 27 2 70 -170 -127 -68 242 126
5420A26j10j3J70k74P6K34j76k72o0M59j83r4J21J21j91L64l92K79l3Nl80N19
$$ 126 16 3 173 -101 -25 209 33 -239 -299 160 -23 -117 4 125 -66 298 -94 185 152 157 -223 296
5442B96k46Q3k20L25m89J49O5L1P5j49o2K08n7j00j7k6R6p5j83J90J84q5K20l27
$$ 296 50 133 -87 238 -251 -102 -37 -6 69 -80 -142 66 9 -91 -108 -134 -38 -113 -296 -106 78 -7 213 -114
5466a14K1K29m3j77OJ44j88MJ04P7l10q7L91J5j81J9P6M5o4j4j71L69k83Q7N2
$$ -114 -93 136 93 -84 -78 66 -122 -118 -14 63 -247 -334 57 72 -109 -90 -14 31 -33 -47 -218 151 -132 -45 7
5491Gn0N8j93L13l73L26k01K25K5J8l09K56Lk83L61l04M7OK3j71J73j37J37j80
$$ 7 -43 15 -178 135 -238 88 -113 112 137 155 -154 102 105 -178 183 -121 -74 -68 -45 -216 -43 -180 -43 -223
5515b23P1J1K64k16lr7J50Q4N9L1q4L42m98L66o71K73J74J8K6J2j18O4j39L11
$$ -223 -152 -141 123 -93 -96 -193 -43 41 100 131 47 389 -109 257 -414 -141 33 51 77 89 -29 35 -104 207
5539B07j51l8j35K18j55rK00m80M79k18j22L49P8j29j66j43L45k85M20j38l00
$$ 207 56 18 -117 101 -54 -63 137 -343 136 -82 -204 145 223 94 -72 -215 130 -155 265 127 -173
5560a73q4K51o3j77K69q8K4o8k1K23L4j79o3L95j17l25J7L58r0j71J71L0p5j13
$$ -173 -257 -6 -69 -246 23 -65 -41 -109 -130 93 127 -52 -115 280 163 -162 -145 213 123 -48 123 153 78 -35
5584c5O9n3j14M21k84r9L0J24j51J28P7n34N46j19j19K66K9q1k8j14P2K75l11
$$ -35 34 -19 -133 288 4 -95 -65 59 -92 36 113 -421 125 6 -113 153 182 101 73 -41 31 306 -5
5607el2N8j09Q1j15K64l71J70K14l22n7L54k19K27l7j4j84J19l3P4M1J6j04m7
$$ -5 -37 21 -88 -7 -122 142 -229 -59 155 -167 -224 130 -89 138 101 87 -97 22 -11 63 104 120 16 -31
5631c1K2j89L26k28J02n9L13m28J19K58k96M23l90K58k86M1L6l17L64k7o8O4R2
$$ -31 -9 -198 128 -100 2 -57 256 -172 -53 205 -91 332 -58 200 -86 -45 -9 -326 38 11 -57 7 99
5654I9l35K74j54Q5Q9j17m1J35N0Q3J08k21k10L14k76J5K19j89j84o6L19J12r0
$$ 99 -236 38 -116 -31 58 -59 -100 35 85 168 276 55 -155 159 -117 -102 117 -72 -256 -322 -3 109 19
5677A9j67J39K14j90L1j95Q8k4Q4JJ09k1M1J61k65r2J72m68M33n1n9J29K60l78
$$ 19 -148 -9 205 15 46 -149 -61 -85 -1 0 109 88 129 290 25 -67 105 -363 70 19 -40 89 349 -29
5701b9j8Q7rk06K65j24O5q0J8j4R5O4j24q3J54K3j56J26O8j57j20K41k57k8K91
$$ -29 -47 40 31 -175 90 -34 31 -49 -31 -45 50 114 -10 -93 61 84 -72 54 122 -35 -155 86 -171 -199 92
5726I2R2j58J1n4Q1n4J32l21J40N3k04J54J55l8j56OJ77j88k3J45j26j4qk8J17
$$ 92 184 26 37 -17 64 10 142 -179 -39 14 -190 -36 119 81 -75 -69 108 -80 -103 42 -84 -98 -106 -134 -17
5751a7j19N6K2Q9k9J40j40J91k25qL02l29L53j48j92j35O0J44k5Jn7J79pk19M49
$$ -17 -136 -80 -58 31 2 142 2 193 -32 -40 262 -67 286 138 -54 -189 -129 15 -10 -9 -66 113 106 -113 336
5776C36l73k22K24J64k54M01n7j52j16q0j08K48J4k1J96l67J01L00j65k24L01
$$ 336 -37 -259 -35 129 -125 276 219 67 -49 -129 -237 11 25 4 200 -167 -66 234 69 -155 146
5797A46k15O8L3J9k33M1J17o4K26q7j97J18j72J96j30j50L26J03k25K28l12J68
$$ 146 -69 -1 32 51 -182 -141 -24 -88 138 51 -146 -28 -200 -4 -134 -284 42 145 -80 148 -164 4
5819DO3k86nJ67M7k64M21n4N2j84J36j01K80l41M7j29J31l8%J78k60R7M7J9m40
$$ 4 67 -219 -224 -57 -10 -274 147 93 145 -39 97 -4 276 -65 -18 -147 -16 -54 -54 124 -136 -39 8 27 -413
5844d13P02l62J31J8l12L18j59j00L40j51K6j46L05k40R8q1j45J97l44L86r9K36
$$ -413 289 -73 58 76 -236 82 -77 -177 163 12 38 -108 197 -43 55 -26 -171 26 -318 68 -31 205
5866B05j71Q8k87K3l2J32J29k52L52j14J28j64Q6j17O7j26L1m1J06p6J06j76L98
$$ 205 34 122 -165 -142 -174 -42 87 -165 187 73 201 37 123 6 73 -53 -22 -63 43 -33 73 -103 295
5889B95j62o7j66K14M7p4r0k09K11M9kj39J17k58oL66J20k38l57J69K13M3k94
$$ 295 133 66 -100 114 161 87 -3 -212 -1 48 46 -93 24 -234 -240 126 246 8 -349 -180 33 76 -218
5912b18L77j22m1k3J94j47m4R4r7j96K7J90k2k16Q2K82k04k4K1L3j99K93j84q4
$$ -218 159 37 -4 -27 167 20 -24 70 -27 -223 -196 -6 -28 -244 -162 120 -84 -108 -87 -54 -253 40 -144 -228
5936b28J31J77J90l04j16jL61l31K57k26o2P1N7j73J50j17J36J53o0R5j28k63
$$ -228 -97 80 270 -34 -150 -151 210 -121 136 -90 -152 -81 -24 -197 -47 -164 -28 125 65 160 32 -231
5958b31J31K6J40M0n6k43M61j49j30J69o2j20j66L56l20K43j01J85l08l9K32q6
$$ -231 -100 -74 66 106 50 -193 268 119 -11 158 96 -24 -190 166 -154 89 -12 173 -135 -174 58 -28
5980b8J84l22J1K22q4j71J39L7M8J31N4L0l40q8L48k80o2J74r9K37j36k09r5K10
$$ -28 156 -166 -155 67 -17 -188 -49 -12 36 167 221 251 -89 -177 171 -109 -171 3 -96 141 5 -204 -299 -89
6004h9R5K11l0k85j4J27o9Q5pk79K14L2J22L0j49j8K7L19k45o1j15j65K92K45
$$ -89 6 217 187 -98 -112 15 -54 31 24 -255 -41 -9 113 143 -6 -24 3 322 77 16 -99 -264 28 273
6028B73k88j2J35l9k15L02m1j52K08j15k26N19k61Qo3l1k5r0p8J14j59M01l06
$$ 273 -15 -27 108 69 -146 156 115 -37 171 56 -170 349 88 96 33 2 -23 -113 -191 -77 -236 165 -141
6051a41O8R7l56N25l43L44o5j04o1q5J70j03N3K16j32j05l2K49k57L67j19j36
$$ -141 -73 24 -332 193 -150 194 129 25 -36 -121 49 -54 -1 215 83 -22 -54 195 -62 305 186 50
6073E0q3L4k2J04J00l25K58j07o9k8R4j49N5J48j38n4P4M2Q9m8L12l45J38k12
$$ 50 -33 1 -21 83 183 -142 116 9 -60 -88 6 -143 -88 60 -78 -132 -58 -16 73 25 337 -8 130 -82
6097h2N1Kk36M11k69P7R6K9j83J47J58l60J03O7N7j14K07l08j0J17j21J48o1o5
$$ -82 -31 -29 -265 146 -123 -46 50 79 -104 43 201 -159 -56 11 68 -46 161 -147 -157 -40 -161 -13 -74 -139
6121a39J3J74K8nK7L7j97o4m5R5Ok5J33P7rk36Q5O8o2N4k3j90L46l76L60j17o3
$$ -139 -126 48 76 71 98 135 -62 -126 -171 -76 -70 -95 38 115 106 -130 -45 23 -39 15 -8 -198 148 -228 132 15 -48
6148d8L17k29l6K81n09L1J78o0o1J18J60j27J14L6k96K8K24j82J70O8j17N4j31
$$ -48 269 40 4 285 -224 -193 -15 -75 -136 -18 142 15 129 165 -131 -103 121 -61 109 177 60 114 -17
6171a7Q2J98k75k00J73K96l85K03K9L6k18K63j49L5k26J82l07J26j8K86q1j11
$$ -17 65 263 -12 -212 -39 257 -128 75 104 140 -78 185 36 71 -155 27 -280 -154 -172 114 33 -78
6193g8J61j29J67J35j12j64k9p2j00O3K68k64J20O1R8m94K34n0M1n2m3J62M04
$$ -78 83 -46 121 256 144 -20 -49 -121 -221 -158 110 -154 -34 27 125 -369 -135 -185 -144 -196 -239 -77 327
6216C27p9k13K98o22L35K3o3j60K59j23j34J57k42L20k00J32P0j7k05k5M15j41
$$ 327 248 35 333 -289 46 69 6 -154 105 -18 -152 5 -237 83 -117 15 85 68 -137 -162 253 112
6238A12n4J56M8l81J72j44O5j20N0J35l77N25m74J75M21l93J21K3k2j02K32j56
$$ 112 58 214 262 -119 53 -91 -26 -146 -96 39 -338 187 -287 -112 309 -84 37 60 38 -64 168 12
6260A2J81l2Jl28R6o1M8K7m5L04k60K44j04j90m9J26j28J73l5J97j03r8N9k01
$$ 12 193 161 162 -166 -70 -131 -83 -56 -101 203 -57 187 83 -107 -156 -30 -158 15 -20 177 74 -24 35 -166
6284a66K54l85J92j10M34m78L81Nj51j71K14k19K00J14r7j00K15l45K04k74L21
$$ -166 88 -297 -105 -215 219 -259 122 127 -24 -195 19 -200 0 114 17 -83 132 -213 -9 -283 38
6305C8J46k65P4j08j19L4J39l9j47K22k8J37Q9l40J06J78m8j20j05J99J78M6j92
$$ 38 184 -81 -7 -115 -234 -200 -61 -100 -247 -25 -53 84 173 -167 -61 117 69 -51 -156 43 221 267 75
6328G5l3q4n8L99n71J48K08j71J31j25K08j30j83L12k49K34J6k54OJ20L5j57m0
$$ 75 42 -42 -100 299 -272 -124 84 -87 44 -81 127 -3 -186 126 -123 111 127 -127 -121 -1 34 -123 -163
6351a63k0PJ04mR6J11l09K36Pp4k97L72m3J32K7k94L71l35J41nk78P6J09j88L07
$$ -163 -183 -176 -72 -76 20 131 -178 58 65 -9 -306 66 23 155 182 -112 259 -76 65 60 -218 -142 -33 -221 86
6376H6k17J23k23K30K66m40J41l5L3J46rj12kj52J07J31j66J88k25K43j23q7r9
$$ 86 -131 -8 -231 -1 265 -175 -34 -69 -36 110 101 -11 -13 -165 -58 73 -93 95 -130 113 -10 -97 -196
6399a96L66k83J60k63J17Q8OPJ5k99L45J33l44M0j57P0J07J01j0j21J85R4n51
$$ -196 170 -113 47 -216 -99 -11 -5 2 17 -282 63 196 -148 -108 -265 -195 -88 13 3 -118 67 161 -390
6422c90K68P3N1l1j9J06J3O4k07L5L0K11m52L45j12k07Q2J76m8Q4l1k6k12J89
$$ -390 -122 -49 2 -29 -48 58 71 135 -72 -37 -7 204 -248 97 -15 -222 -140 36 -12 72 41 15 -197 -8
6446hl14N60j65j19M5q5K67l82J95k18K88o4J45l66J80N5p1J07j93K63j63R1j70
$$ -8 -322 238 73 -46 -1 -86 181 -201 -6 -224 64 0 145 -221 -41 14 -57 50 -143 120 -43 48 -122
6469a22K21j80J11jj93J31m5p2J42j12J30k12K23nQJ17j04q1L68m71M73m07J71
$$ -122 99 -81 30 29 -164 -33 -78 -150 -8 -120 10 -202 21 16 24 141 37 -44 324 -147 326 -81 90
6492I0R2j01j54J76k24j03K92o5j31L45j78k67J63K49k89Q6j00j60L55k64K12
$$ 90 182 81 -73 103 -121 -224 68 3 -128 217 39 -228 -65 184 -105 -19 -119 -279 76 -188 24
6513B4J42j60J22j07Q8j52K65p4j24k01QP9Q3k0k08R7K01J45j83l68M61j21k15
$$ 24 166 6 128 21 109 -43 222 148 24 -177 -169 -90 -7 -27 -235 -138 63 208 25 -343 118 -3 -218
6536b18P0Ol7K22k22L76j56L4q1l9rn3j06J70L0m3J3K78j24j27k6P8l5J20j46
$$ -218 -148 -142 -179 43 -179 197 41 75 -6 -45 -54 -107 -213 -43 -13 -56 -43 235 111 -16 -42 36 1 121 -25
6561b5L16k82j33j66K73q7J78j7j80J29J88k78N3m8J65l90L75L1l70K92j89K12
$$ -25 291 9 -124 -290 -17 -104 74 57 -123 6 194 -84 -31 -79 86 -304 71 102 -268 24 -165 47
6583D7j52O6J8Qn9J21j37J31j7P7K42k31j14p4J09p3q1L34J28l41J3j30K89j47
$$ 47 -105 -39 -21 -13 -72 49 -88 43 26 103 345 114 0 -74 35 -38 -119 215 343 2 15 -115 174 27
6607B7k6k1m8L9J01r2J45o3k24j29L02kkJ42m07K35J13k50J87J26N6l13j79K64
$$ 27 1 -20 -68 -29 72 -20 125 62 -162 -291 11 9 7 149 -258 -23 90 -160 27 153 209 -104 -283 -19
6631a9J87l6j39N5j54J62j17j35P8J55K27k96n1K70p2km61M56M1r0k17L71j1k87
$$ -19 168 132 -7 48 -106 56 -61 -196 -118 37 264 -32 -83 187 115 113 -348 108 149 59 -158 213 202 -85
6655h5n5Q7lj45j13K69J42j07k76K26J86j43m1J41j17j5o4J94j74K03J16k09k20
$$ -85 -140 -53 -56 -201 -314 -45 97 -10 -286 -60 126 -17 -58 83 -34 -49 -113 81 -93 110 226 17 -203
6678b03K22J78j97k28L15q0J11M9j11K34l07J60k67P0j42J92p4J1j65K01k07J90
$$ -203 19 197 0 -228 87 7 118 167 56 290 -17 143 -124 -54 -196 -4 -78 -67 -232 -31 -238 -48
6700d8N6L8k86L80K8j78J32o0lj44K84j14M7M0j69j9O5J19o7k08Q2r7J51o4K55
$$ -48 8 46 -240 140 168 -10 122 62 59 -85 199 85 132 172 3 -16 49 168 101 -107 -25 -122 29 -35 220
6725B20j53m1l29Q9K69l36K52O4l64K42J18R4k22P9j43J92j33J34J97k48o4K56
$$ 220 67 26 -303 -214 55 -281 -29 35 -329 -87 31 125 -97 -18 -161 31 -102 32 229 -19 -83 173
6747A73k20j05J28l43L44L8K28j34k86k4K85N0j57r1J18J7J58j12m4r4K50Q2k98
$$ 173 -47 -152 -24 -367 -23 15 243 109 -177 -201 84 134 -23 -114 4 21 179 67 23 -71 179 261 -37
6770c7J21j66J12l6p3J11j31J12l9R1J03k04J07j67N0Q4K2Q6l81m0Q8J97J16j63
$$ -37 84 -82 30 -6 -79 32 -99 13 -26 65 168 -36 71 -96 -46 38 60 146 -235 -275 -187 10 126 -37
6794c7K29l9j63J13j97L50j45M8j96q1Q6J13k92M43l53O6J69k4k8O4k13M4j5j39
$$ -37 192 153 -10 103 -94 256 111 159 -37 -118 -32 81 -211 232 -121 -55 114 90 62 126 -87 -43 -58 -197
6818a97K07M6P3l01O0J4L0j27L20l33J99o1J21k96J75J93m21L12NJ10j35p1K28
$$ -197 10 56 129 -172 -112 -98 -68 -195 125 -208 -9 -70 51 -245 -70 123 -298 14 19 129 -6 -77 151
6841A51r2O7j64M9J70O4j48o0K33n18K51j0J97k70J09J50k27j99K59K11j28J9
$$ 151 59 126 -38 11 181 245 97 37 270 -248 3 -7 190 -80 29 179 -48 -247 12 223 95 114
6863A14q3K44j23j30j41P1l4k26M3L35k52K93j34Q9J1k08K1J70R0k6j94J52j92
$$ 114 31 275 152 22 -119 -48 -82 -308 -265 70 -182 111 -23 66 77 -131 -110 60 150 124 -70 82 -110
6886a10j8M22l70N3J8L19l03N8l06K34J38j99J9K43k48o6O4N6n5L09k26R5r1J07
$$ -110 -128 294 -76 -23 -5 314 11 69 -237 -3 135 -64 -45 198 -50 -116 -52 4 -51 258 32 127 36 143
6910A43j90o5K66k87K0N7L2o4J97kJ12k92j29K59j35R1J43k82L3J92m21L57k87
$$ 143 -47 -112 154 -133 -113 -56 -24 -88 109 107 219 -73 -202 57 -78 13 156 -126 -93 99 -322 35 -252
6933b52L61K23l06K29l28K02l5j42j77L05j95L48k71n8K53n1j86j92L51Q6j71
$$ -252 109 332 26 255 -73 129 94 -48 -225 80 -115 233 -38 -96 157 106 -80 -272 79 165 -6
6954fM8kM5r1J50k80J01Q6q5J50J33p2m8K37l39J14m8k21k7J94k33K55l82N05
$$ -6 42 40 85 -6 144 -136 -35 51 -34 116 249 177 129 366 27 141 93 -128 -155 39 -194 61 -321 184
6978A84J95k48j47k11J33L03j67j26J04j74K84n2j31J66J4n9J23n2M7J74n9n28
$$ 184 379 131 -16 -227 -94 209 42 -84 20 -154 130 78 -53 113 127 68 191 139 186 360 301 -227
7000b27J68j28N17l89L06k71l8j36J43J51k18K31j05J56j62M7L2j48j1L66l64
$$ -227 -59 -187 330 -59 247 -24 -62 -198 -55 96 -122 109 4 160 -2 45 77 -71 -82 284 -80
7021h0L22k35m2J22k64K02j2O7kJ18j53m7K47k05J23j42J56K34l43j4k30J88M1
$$ -80 242 7 -35 87 -177 25 13 80 78 196 43 -4 243 38 161 19 175 409 66 52 -178 10 51
7044E1j83J25P1q1K39k23J29Oj76N6O6n5Q0l25L25l30M08j11J40J9j36k75J94
$$ 51 -132 -7 64 -17 222 -1 128 134 -42 14 80 25 105 -220 105 -225 183 72 212 231 95 -180 14
7067A4n4Q2m4M6O7p2P1k11j02K68k89L63j68n1j13K49n5J27k21J12R4J16j54k28
$$ 14 -40 42 -2 44 111 39 110 -101 -203 65 -224 139 -29 -80 -193 56 1 128 -93 19 113 229 75 -153
7091a53K76r6K09j20N7k52k8J61k42J91j3j9K23l13J57j8j56K05p6r2M0J20m6
$$ -153 123 27 236 116 173 -79 -107 54 -188 3 -10 -29 194 -119 38 20 -136 69 -7 -99 -59 61 15
7114A5J49m7j84N9j40j00K09%K32l9l42K86q4K5k15J93j9l3J08N5j65Q6J38q7
$$ 15 164 117 -67 -8 -148 -248 -39 -39 193 154 -188 98 14 39 -176 17 -2 -35 73 128 -37 49 187 100
7138A00K1j12L6q2P3j57R4l41L77j5L3j28l22M15K9j38P8P4L2k4l5J89l82J92
$$ 100 121 9 45 -37 36 -121 -27 -368 9 -6 27 -101 -423 -8 21 -117 -39 35 67 43 8 197 -185 7
7162Gj09Q5J65N4k43J21j70kJ84j44L5K4p4L99n08J14J33L7j50j37L6MM65k70
$$ 7 -102 -17 148 202 -41 80 -90 -92 92 -52 -17 7 -67 332 -176 -62 71 108 -42 -179 -143 -139 326 56
7186E6j36K4J72O1j06Oj75K04J0R0k25o7K24k44p7L8K57j91J41oj30J17m6J9M4
$$ 56 -80 -56 116 177 71 77 -98 106 116 206 -19 -86 138 -106 -183 -145 112 -79 62 56 -74 43 -3 16 60
7211F0j75j74M97k12k35K12l6j3N8r1K54p4M5k00m8J16o0K5J33j01k8R9j8l1K13
$$ 60 -115 -289 208 -4 -239 -27 -63 -76 -18 -109 145 71 116 -84 -132 -16 -76 -51 82 -19 -47 52 34 3 216
7236B16k44J23L3l75L21M4m88L73J2j29J23j99L06k9N4o4j44MK43j62q5L30l12
$$ 216 -28 95 128 -247 74 118 -370 3 15 -114 9 -190 116 87 141 77 -67 -63 180 18 -67 263 -49
7259d9n6J7K19k87J38J86j06k53jJ50P0j77J60j47o4K21m1p1o5j4K96k33J2K26
$$ -49 -105 -88 131 -156 -18 168 62 -191 -192 -42 28 -149 11 -136 -200 21 -20 -91 -156 -170 126 -107 -95 131
7283A31j60n7mN6L0M1n7j53J44j87K22j67J76q0k7L20k82J55k47J99j0J60l06
$$ 131 -29 -86 -90 -34 -4 37 -20 -173 -29 -216 6 -161 15 -65 -92 228 -54 101 -146 53 43 203 -103
7306a03R9J1p2K40j41k14M9J54R6J5k64J02J2l0J69q5j17j91K15Q1P6Rk31K86
$$ -103 -4 7 -65 175 34 -180 -131 23 119 134 -130 -28 -16 -46 123 38 -79 -270 -55 26 102 111 -120 166
7330A66n0p8j10J35R7m65J83K64m5N4j17L6k00L22j6n5l4k57M88k52k90J74K5
$$ 166 116 38 -72 63 160 -305 -122 142 97 151 34 70 -130 192 176 121 87 -170 318 66 -224 -50 -25
7353b5N8K12l71K43k66K5K17o8Jl4l6j5M2j06m3J06n7j78J64K90j66R2k30O6P6
$$ -25 33 245 -126 117 -149 -124 93 25 26 -8 -44 -59 -17 -123 -166 -60 -117 -295 -131 159 -7 85 -145 -79 -3
7378ck20j09K95L34j40R7j01j60q1J07j55K81K5r7K8rQ2j19J1J3j08K30k47Q0
$$ -3 -223 -332 -37 297 157 254 153 -7 -88 19 -136 145 170 73 101 92 174 55 66 79 -29 201 -46 34
7402C4p1M1l75k7O9K32r2J93j35qJ37J48q0j68K60j5j80J03k23J47l15J02J18
$$ 34 -37 4 -371 -398 -329 -97 -189 4 -131 -139 -2 146 66 -102 158 143 -37 66 -157 -10 -325 -223 -105
7425a05P5N7k31L28l63p7L36k8rP9j46J86O2j40j7J52j15J37k80J25j78R2K37
$$ -105 -30 27 -204 124 -239 -316 20 -8 -17 62 -84 102 164 24 7 159 44 181 -99 26 -152 -60 177
7448A77j06j28M3K67l25j21J26n7K74j91L52n12L5P7Q8N3j64j09J74J48j09J96
$$ 177 71 -57 -14 253 -72 -193 -67 -124 150 -41 311 -201 -166 -89 -1 52 -112 -221 -47 101 -8 188
7470A88J17l20n5KP5L4q6oL36m46K31Q6l29J73L62k18k7Pj54M0n8K18k67j25M10
$$ 188 305 -15 -70 -68 7 41 -45 -51 285 -161 70 156 -173 0 362 144 117 124 -30 10 -48 170 -97 -222 188
7495A88j70j8Mj34K23j48j42M14k02j05L11o9m44J61K54k03L47k83J84k11P0l13
$$ 188 18 0 4 -130 93 -55 -197 217 15 -90 221 152 -292 -131 123 -80 267 -16 168 -43 27 -286
7517b86N17k29Mj96K07m2n1J82k67R2J1o1j67J08J17K2N4N8P1j6j69j35L24j69
$$ -286 231 2 6 -190 17 -25 -76 106 -161 -69 -58 -119 -286 -178 -61 -39 15 73 144 128 -41 -176 148 -21
7541b1o0P8j38R0K89k32o5K15l07K27J89l90K28j46K98k74lJ45j23k18j7Q2N8
$$ -21 -81 -3 -141 -51 238 6 -59 156 -151 76 265 -125 103 -43 255 -19 -22 123 0 -218 -235 -153 -95
7564i5J51j2P4j25j81L18k62J30J89l16K73j97J84M4k71J94j93J59L9j12J00n
$$ -95 56 44 118 -7 -188 130 -132 -2 187 -129 144 -53 131 175 -96 98 -95 64 103 -9 91 86
7586H6k03J0J79j08R5M0Mj46J57l3m21L45q9j30K56n5l2J27j6l7n2r5K10J5l11
$$ 86 -117 -107 72 -36 59 99 103 -43 114 81 -340 5 -84 -214 42 -13 -45 82 66 29 -23 -118 92 107 -204
7611b04M3K5J39j17J63j56K25j32M3l4n8j66L04J12m9k82j00K17N6P0k50J00K34
$$ -204 -161 -136 3 -114 49 -107 118 -14 29 -5 -63 -229 75 187 138 -144 -244 -27 29 99 -151 -51 183
7634A83k38J77mo1j02K22j64j77K6J16J02k21M95o3k03j34K25j36q4J40l5j4J41
$$ 183 -55 122 118 57 -45 177 13 -164 -138 -22 80 -141 354 291 88 -46 179 43 -41 99 64 50 191
7657A91j07l6j42L6k9p7P9J69j57l26M39P0j53lP0j25m8K4L32j12rj4j26J12j65
$$ 191 84 48 -94 -58 -87 -164 -85 84 -73 -399 40 110 -43 -46 24 -101 -149 -125 207 95 86 72 -54 58 -107
7682a07J85k6j81J68q1r0K13j24L54l32M7n6J4k8J34J6m9k90K19Q4j91J28P9J67
$$ -107 78 52 -129 39 -42 -132 81 -43 311 -21 26 -30 -16 -44 90 106 57 -233 -14 70 -121 7 86 253
7706B53l10J38r7n0J20j73M9J92j23Q5o4n7l6K38j20j08K38j01j7J40j88j5j84
$$ 253 -57 81 -16 -66 54 -119 -70 122 -1 84 20 -37 -73 165 45 -63 175 74 57 197 9 -6 -190
7729a90J98J51k56K84k15R7K52m86N6M7q3J79Q8k60j36J04J74kl1n6L32j59j10
$$ -190 8 159 -97 187 -28 69 321 -165 -109 -62 -145 34 122 -138 -274 -170 4 2 -29 -85 247 88 -22
7752b2K04r4p8R3N1l0j48M6p5m6R6k53P9K03L1J28M9k69P9J54n0KJ39Lm28P2K80
$$ -22 182 88 10 103 154 124 -24 22 -53 -99 -3 -256 -177 26 57 185 234 -35 44 198 148 150 289 292 -136 -64 216
7779B16%l98n3O40o59L91j74j73L07r8Q8K7j2k53K00j98P3QJ47m3j13J21r2R7
$$ 216 216 -182 -235 405 -254 137 -37 -210 97 -1 87 114 102 -151 49 -149 -76 -68 79 36 -77 44 -48 49
7803D9j76K47k76j8J10R3k14K83j25M4j7K04j90r2oJ1k5j51M08l40L08o0k18J40
$$ 49 -127 120 -156 -174 -64 29 -185 98 -27 17 0 204 14 -78 -84 -73 -98 -249 159 -181 127 67 -151 -11
7827a1M9p4j5J47j71P5K80r1k71K4J15k87J4N78m75n2L38k66n6q4L99j07j14R8
$$ -11 38 -36 -51 96 -75 0 280 189 -82 -58 57 -230 -216 362 -113 -165 173 -93 -149 -233 166 59 -55 43
7851D3L4j32J33K29k34p2q0J13k88K65j8J60j23j78P3L2j89J20J95n5q7L49k20
$$ 43 77 -55 78 307 73 1 -79 34 -254 11 -7 153 30 -148 -75 -43 -232 -112 83 28 -59 290 70
7874G0j05n4p5N0j3L26j97J54k16J1j68M94K8m12M8l5K31j15m5J3K36k24j53K70
$$ 70 -35 -89 -164 -114 -127 199 2 156 -60 -49 -217 277 305 -107 -59 -94 137 22 -23 -10 226 2 -151 119
7898A19j63j70J41o4J97Q5L0O5l39K86j33j87J07k66M90l56p8Q6K8J44J54k07
$$ 119 -44 -214 -73 -137 60 145 175 240 -99 187 54 -133 -26 -292 198 -158 -236 -150 -122 22 176 -31
7920c1J02K0k4L8O1o9k05l8K88l22K08M5l25K71J29j23J31l10J52J04j39Q3K08
$$ -31 71 91 67 105 166 97 -108 -146 142 -180 28 73 -252 19 148 25 156 -154 -2 102 -37 46 254
7943B54r4j06m9lk5j89L1l9K70j2j88M3K50j52j02J84l28J76K8lK80m31M7J54
$$ 254 160 54 5 2 -23 -212 -181 -220 50 38 -150 -107 143 -9 -111 73 -255 -79 -51 -54 226 -205 -158 -4
7967dj77L1Q0J50n4m3Om7L08n18k9N05j02J36k62J62j86l4k4L2J92k08J7L5j60
$$ -4 -181 -150 -70 80 26 -17 -11 -58 250 -268 -297 208 106 242 -20 142 -44 -78 -102 -70 122 -86 -69 -34 -194
7992a94K3K47j3k3j09R6j14J76j96k4J33l6J26Pj28j99L30j9J57l97J84n9J0o2
$$ -194 -171 76 63 40 -69 27 -87 89 -107 -131 2 -34 92 99 -29 -228 102 83 240 -157 27 -32 -22 -84
8016h4J98Q0l72K30n1k13M17o7j12M3k30J19K26k27k3j74O2J34r5j2J90n0m1o3
$$ -84 114 194 -178 52 1 -212 205 138 26 69 -161 -42 184 -43 -66 -240 -178 -44 -139 -151 39 -11 -52 -115
8040a15k8J55J17k07K85M0j54j93J31j22K0J24J34j79K43k76p1N7o9P3q0O5n9
$$ -115 -143 12 129 -78 207 247 93 -100 31 -91 -71 53 187 8 251 -25 -96 -39 -108 -35 -115 -50 -109
8063a09J66r1l91L40J1J11J98k13k1K6j66K23j59K87l9k01p7Q1r4J5M35k95J43
$$ -109 57 -34 -425 -85 -74 37 235 22 1 27 -139 84 -75 212 173 -28 -105 -24 -118 -103 332 37 180
8086A80l80J77J58k52JL0q7L82k96O0j33J55K31l73R8J25J98n52K45O0j4j87P7
$$ 180 -200 -23 135 -117 -116 -86 -173 209 -87 -27 -160 -5 226 -147 -49 76 274 -278 -33 27 13 -174 -97
8109i7l6lJ90j38K32k53K41j26L49n28L43q7k75L06q6j5J34k72M4R7j13K1J19
$$ -97 -133 -136 54 -84 148 -105 136 10 359 -169 174 87 -188 118 32 17 151 -121 -77 20 -93 -72 47
8132D7L19j94J0k08J75l26M15j58J3l63P6K32n7J33m8l9j32K7J46j98L14l54K70
$$ 47 366 172 182 -26 149 -177 238 80 93 -270 -194 38 -19 114 66 27 -105 -78 68 -130 184 -170 100
8155A00O6o8k12R4j0L4j07n4J87K5l9N0j28M0J09M6k12J1m9K24j83k6J99j0k14
$$ 100 166 98 -114 -20 -30 4 -103 -157 30 55 16 66 -62 -22 87 133 -79 -68 -117 107 -76 -102 97 87 -127
8180a27K11Pk00L37j72j1k71L75Mj14J33
$$ -127 84 91 -109 228 56 45 -226 149 153 39 172
8191A72
$$ Imaginary data points
##PAGE= N=2
##DATA TABLE= (X++(I..I)), XYDATA
0@%%%%%%%%%%%%%%%qJ6j6J6j6J8k6L2l8M6n0N8p0Q0r0J04j20J37j55J76k00K25
$$ 0 0 0 0 0 0 0 0 0 0 0 0 0 0 0 0 -8 8 -8 8 -8 10 -16 16 -22 24 -26 32 -38 42 -48 56 -64 73 -82 94 -106 119
37A19k50K78l12L49l89M31m76N26n83O46p13P86q64R51j049J157j276J409j559
$$ 119 -131 147 -165 184 -205 226 -250 276 -307 339 -374 412 -452 499 -550 607 -669 740 -819
56h19J727j920K145k406K717l095L567m176M989o139P919j1061J8255o9141o622
$$ -819 908 -1012 1133 -1273 1444 -1651 1916 -2260 2729 -3410 4509 -6552 11703 -57438 -64060
71f4060R0275r899Q000L6339J5486o5429n3285m59J5706j4527P724M9819M7395
$$ -64060 26215 16316 24316 60655 76141 10712 -42573 -43032 -27326 -41853 -34129 15690 63085
84F3085j3677k9753o341p299m3141k5610K4647L5482O072J1793K7942N084l4102
$$ 63085 49408 19655 13314 6015 -37126 -62736 -38089 -2607 3465 15258 43200 48284 14182
97A4182k8506n834o197r594J3293L1131K0146j068l677j877j7496k9366q663J0158
$$ 14182 -14324 -20158 -26355 -35949 -22656 8475 28621 27553 23876 21999 4503 -24863 -33526 -23368
111b3368O256M845K1820K2695l578j6686n052p191k0844j1508J5016J6863O584
$$ -23368 -17112 -12267 9553 32248 28670 11984 6932 -259 -21103 -32611 -17595 -732 5852
124E852P117J4224J860k1453k1687m074L91n839M704K4320J8355m042o479J951
$$ 5852 12969 27193 29053 7600 -14087 -18161 -17770 -23609 -18905 5415 23770 19728 13249 15200
138A5200q828k3182j0616J1566J1761J274J0241J7514J324j8901j2690k318o926
$$ 15200 6372 -16810 -27426 -15860 -4099 -2825 7416 24930 26254 7353 -5337 -7655 -14581
151a4581r688N820K0506J1449o3P74L772j0746k0014o361P198L621L21J2352J5112
$$ -14581 -24269 -18449 2057 13506 13443 14217 17989 7243 -12771 -19132 -11934 -8313 -7992 4360 19472
166A9472r30j1323n131k912j1011r578O663J4068O055J231P489M091j1178j4529
$$ 19472 18542 7219 2088 -824 -11835 -21413 -14750 -682 5373 6604 14093 18184 7006 -7523
180g523k412J479l602R57J3071J2385p54n760j09m729j2700q039O031P358K642
$$ -7523 -9935 -8456 -12058 -11101 1970 14355 13601 7841 7732 3003 -9697 -17736 -11705 -4347 -1705
195a705M812J0511K586r133r380k483k496m929J464J1261Q105q7K07J437n133
$$ -1705 3107 13618 16204 7071 -2309 -4792 -7288 -12217 -10753 508 8613 8526 8733 10170 5037
210E037j2756m891L559K310J265P304R790J002o159m418k555n857o475K960R051
$$ 5037 -7719 -12610 -9051 -6741 -5476 1828 11618 12620 6461 2043 -512 -6369 -12844 -9884 -833
225h33M788J508L933K140o925r579l060P58j263Q81Q694P951R0l421n95l010p824
$$ -833 3955 5463 9396 11536 4611 -4968 -8028 -7270 -8533 -7652 1042 8993 9083 5662 5067 2057 -5767
242e767n180L735N141J712L374N966J530o487o353j396j792l663J406Q020N987
$$ -5767 -10947 -7212 -2071 -359 3015 8981 10511 4024 -2329 -3725 -5517 -9180 -7774 246 6233
257F233m31k83J023l518p899l646K805K415O87M213O226J022n242l737j125l467
$$ 6233 5802 5519 6542 3024 -4875 -8521 -5716 -3301 -2614 1599 7825 8847 3605 -132 -1257 -4724
273d724l945J740O376L484N61J912J822m018o065k705J309J04L59M632M981L34
$$ -4724 -8669 -6929 -553 2931 3492 5404 7226 3208 -2857 -5562 -4253 -4149 -3790 842 5823 6157
289F157k585j210j666m514l359J656L933J984J380L377J359l565m235j188p63
$$ 6157 3572 2362 696 -3818 -7177 -5521 -1588 396 1776 5153 6512 2947 -1288 -2476 -3239
304c239k025O47N023L810n5q22O19k066n326k091J347J802N36K621M146N75k821
$$ -3239 -5264 -4617 406 4216 4161 3339 3958 1892 -3434 -5525 -4178 -2376 -1840 781 4927 5502 2681
321B681k512q86j970k390P82L999K663J25J465L26j874m488j837P43KM37L103
$$ 2681 169 -717 -2687 -5077 -4295 -296 2367 2492 3957 4283 2409 -2079 -3916 -3173 -3171 -2734 369
338C69L173Q34j924j042o46k919k505J196K705J065J023K296P67k520l352o71
$$ 369 3542 4376 2452 1410 764 -2155 -4660 -3464 -759 306 1329 3625 4392 1872 -1480 -2151
354b151j82j625P57L374K649k70l91N24j242l554j862J248J475kK106K597L76
$$ -2151 -2333 -3958 -3201 173 2822 2552 2161 2685 1443 -2111 -3973 -2725 -1250 -1252 854 3451 3827
371C827k081j696m82j639j904R08K745K127p8O65R46j801l248j090P57J96j10
$$ 3827 1746 50 -432 -2071 -3975 -3067 -322 1805 1727 2392 3338 1537 -1711 -2801 -2044 -1848 -1958
388a958K036K977J66j542r17o92j969j912R58K474Q76M84J265J219k135k468m38
$$ -1958 78 3055 3221 1679 762 70 -1899 -3811 -2853 -379 497 981 2246 3465 1330 -1138 -1576
405a576j47j084P11K534J928L39j058J36r55k830j334J027J254P08R30K175K95
$$ -1576 -1723 -2807 -2096 438 2366 2705 1647 1783 828 -2002 -3336 -2309 -1055 -347 583 2758 3053
422C053j798j463j43j155j318P45K386J100J58K89M01j416k216p74M81K15K40
$$ 3053 1255 -208 -351 -1506 -2824 -2079 307 1407 1565 1854 2255 839 -1377 -2151 -1670 -1455 -1215
439a215J438J995J80j275p96k29j607j120Q97J635O69J09J263N25j529j778o27
$$ -1215 223 2218 2398 1123 327 98 -1509 -2629 -1732 -97 572 681 1944 2469 940 -838 -1465
456a465j59q9m7K270J397n4q29r0m82j648j173J024P75L35O92J340L16j462j026
$$ -1465 -1624 -1713 -1760 510 1907 1853 1024 934 452 -1196 -2369 -1345 -570 -235 457 1797 2113 651 -375
475c75k38n37q74N19J569J093Q8k30L08q05j559n38L49N11M7J130J418q9j161
$$ -375 -613 -1150 -2024 -1505 64 1157 1245 1015 1323 518 -1041 -1579 -1230 -719 -672 458 1876 1787 626
494F26m93k70j136o72P64J137N07L50P66j27r16j414j99j23l0qJ618J193k84o81
$$ 626 133 -137 -1273 -1945 -1181 -44 463 813 1579 1452 536 -878 -1077 -1200 -1230 -1238 380 1573 1289 608
514F08L1l49j217q61R14M76K90P77R02mj256n94l05m02l02K06J285Q34l72J01
$$ 608 639 290 -927 -1788 -874 -398 -108 669 1571 1567 311 -283 -588 -990 -1292 -1086 199 1033 661 762
534G62Q4m75j247q64J055K85K8Q41J092j14r77k99k01j033k64J91J257L83K52
$$ 762 846 371 -876 -1740 -685 -400 -372 469 1561 1447 470 171 -30 -1063 -1327 -1136 121 504 756
553G56M92L0p77j121l79l7J82N7R16J000o3k84k12k89q93o93N13N99M14L49M64
$$ 756 1248 1278 501 -620 -999 -1036 -854 -797 119 1119 1056 772 560 271 -622 -1315 -802 -203 211 560 1024
574A024J14p42r08n31m0j61N70P82Q63r0j9l35m71q69k28L47N06l9O57N89O7n90
$$ 1024 1138 396 -512 -1043 -1083 -1244 -674 108 971 881 862 527 56 -813 -1041 -694 -188 -227 430 1019 1086 496
596D96l49o72n2o08L36J113M14j39J01J15m70j003k7k8O5L35Q72L75k48j15k85
$$ 496 147 -525 -577 -1185 -849 264 678 539 640 755 285 -718 -745 -773 -708 -373 499 874 626 511 226
617B26k59o57n10O80M56M26k2M52K7q43l1n33j77j20J126K52Q21k91R0r08k89
$$ 226 -33 -690 -1200 -520 -64 362 340 792 819 -24 -55 -588 -765 -885 241 493 1314 1023 1113 205 -84
638h4k26q13N91J50O41K27O03k61n85m10k00K4p04R94l8R60p06P60m41o3j180
$$ -84 -310 -1123 -532 -382 259 486 1089 828 243 -167 -367 -343 -1047 -53 -91 869 163 923 482 419 -761
659g61l35O15j14K77N14N96j62n75M10r10l27K87m76N55N52L27j34L01m02q04
$$ -761 -1096 -481 -595 -318 196 792 630 55 465 -445 -772 -485 -961 -406 146 473 339 640 238 -566
679e66J75j76J57N9N4J022m56r0n02j47m6k88O74J159r71K12Q80k87p62l89m96
$$ -566 -391 -567 -410 -351 -297 725 269 179 -323 -470 -516 -804 -130 1029 58 270 1150 863 101 -288 -784
700g84M27j96L06Q2J194l16p30N56m91j99k82M60o66L20N17P34n88k7m6n70m57
$$ -784 -357 -553 -247 -165 1029 713 -17 539 48 -151 -433 27 -639 -319 198 932 344 317 271 -299 -756
721g56P30L5n57M60Q63K82k75j215J42Q00j086K76M6N31k91J10j4k54K56p25M19
$$ -756 -26 9 -548 -88 775 1057 782 -433 -291 509 -577 -301 -255 276 -15 95 81 -173 83 -642 -223
742b23l73Q84J16Q2j7k54N7k96k38j4n88P56L36K15j9o19n95J115m47p4l04L08
$$ -223 -596 288 404 486 469 215 272 -24 -262 -276 -864 -108 228 443 424 -195 -790 325 -122 -196 -500 -192
764a92J9Q01J02l97k30k46O2q79M86l32J542j297K03K93O34L89j292l5L44q18
$$ -192 -173 628 730 333 103 -143 -81 -960 -474 -806 736 -561 -358 -65 569 958 -334 -369 -25 -843
784h43J538n24M32n65M71k9n33n17K54K39k79L80L69o3k53j40k81K24n01K93l1
$$ -843 695 171 603 38 509 480 -53 -570 -316 -77 -356 24 393 330 77 -63 -344 -120 -621 -328 -359
805c59L79L66K92j167R04r81M86n9j92O14k74O94l4n59Q61p87m54N3j25L9N43
$$ -359 20 386 678 -489 415 -566 -80 -139 -331 283 9 703 669 110 971 184 -270 -217 -342 -303 240
826B40m81P36L53j059P71q81R7M28l04K83K43L6m85Q3J80l85l06k03J061l55K8
$$ 240 -241 495 848 -211 560 -321 -224 204 -100 183 426 462 -23 60 240 -145 -451 -654 407 52 80
847H0K01L82k53o98n5j13NL78k85O74J81m46qk16J37k54L5K27p8J64J16K2n6l57
$$ 80 281 663 410 -288 -343 -456 -451 -73 -358 316 497 51 43 -173 -36 -290 -255 -28 -106 58 174 196 140 -217
871b17R8P5L8k48M48j0o4J94o4l47p0K7j97J11J32K01o3J98k71J54J21p71R4K53
$$ -217 -119 -44 -6 -254 194 184 120 314 250 -97 -167 -140 -337 -226 -94 107 44 242 -29 125 246 -525 -431 -178
895a78m5N88J67Lk32L77j97l40k75q9J83l64R69n68L72k3o52L59o47L96M29k35
$$ -178 -223 365 532 535 303 680 483 143 -132 -221 -38 -402 567 -1 371 348 -304 55 -592 -196 233 -2
917bP1L74l20j64M14k75k92j30k7P85o40Q04k93n01M26k96j2n67R32j8J55L6n43
$$ -2 69 443 123 -41 373 98 -194 -324 -351 434 -206 598 305 -196 230 -66 -78 -645 287 269 424 460 -83
940h3K66m67K24J77k7p73M97K28Q8P04k18j65l65o7K4k52L19j52K58k06Q5p0j23
$$ -83 183 -284 -60 117 90 -683 -186 42 130 834 616 451 86 19 43 -209 110 -42 216 10 95 25 -98
963i8j50P7J16J43O0l43N78o0m26J86l03J84k65J81l9M74k72J59j57P9j64k89
$$ -98 -248 -171 -55 88 148 -195 383 323 -103 83 -220 -36 -301 -120 -159 315 43 202 45 124 -40 -329
985c29J43NJ10K24j2n7r4J3Pk75j4N5L37J11m2N0k43j24L38l60P7k27J35K56j57
$$ -329 -186 -181 -71 153 141 84 -10 3 10 -265 -279 -224 113 224 182 232 -11 -135 203 -157 -80 -307 -172 84 -73
1010g3N11l74N7Qk69N3k3j9J36j04L17J34l38m4j12K35k5N4p4J30m5j5K45m79
$$ -73 438 64 121 129 -140 -87 -110 -129 7 -97 220 354 16 -28 -140 95 70 124 50 180 135 120 365 -114
1034a14P7l86L22N0K31j9j68J85k69j54K23O4n02M56p8l4M6M24N7m93q7p3P0p0
$$ -114 -37 -423 -101 -51 180 161 -7 178 -91 -245 -22 42 -460 -4 -82 -116 -70 354 411 -82 -169 -242 -172 -242
1058b42N4K35O0K04j68j93q7J56j49O3L7J5Q5K2J19q0k21kP6j70L2K01n8q1O8
$$ -242 -188 47 107 311 143 -50 -137 19 -130 -67 -30 -15 70 92 211 131 -90 -92 -16 -186 -154 47 -11 -92 -24
1083b4J73k49j68J66J10k70M6J19L16j33k20K21k43P6K8J72Q2K04l18OJ31j15
$$ -24 149 -100 -268 -102 8 -262 -216 -97 219 86 -134 87 -156 -80 -52 120 202 406 88 94 225 110
1105A10j81q5r9l1K07N9jm3J18k88L17k79rO6L01O4m26L79J16p52M69k44O9J39
$$ 110 -71 -156 -255 -286 -79 -20 -21 -64 54 -234 83 -196 -205 -139 162 226 -200 179 295 -457 12 -232 -163 -24
1129b4J34K29m29K79k64K20l26J09O6j22J22K52Pnk16J42k71J84k69J52l1J49
$$ -24 110 339 -90 189 -75 145 -181 -72 -6 -128 -6 246 253 248 32 174 -97 87 -182 -30 -61 88
1151H8J97k98J34j90r3j06Q5l06K45J91J14R9J35k43m1k80QK19n1K70N2j9k16
$$ 88 285 -13 121 -69 -162 -268 -183 -489 -244 -53 61 160 295 52 11 -269 -261 -42 -93 177 229 210 -6
1174fK62k34K86m29k24J76K07k65L14J75r2o5l09J76j35P8j5J62J13k65J90k6
$$ -6 256 22 308 -121 -345 -169 38 -227 87 262 170 105 -204 -28 -163 -85 -100 62 175 -90 100 74
1196G4KJ39j56m19J52K99n0J46n2j1j34Q3p8j02o9J42J52R5k26N5r0k1Jp7O3J88
$$ 74 76 215 59 -360 -208 91 41 187 135 124 -10 73 -5 -107 -176 -34 118 213 -13 42 -48 -69 -68 -145 -82 106
1222A06l1N3M9p1p3k34J15O3J11j24J18K7JJ14n73K58R8j14l1M1K76j83l1M7n4
$$ 106 75 128 177 106 33 -201 -86 -23 88 -36 82 109 110 224 -349 -91 7 -107 -138 -97 179 -4 -35 12 -42
1247d2k43K27L3n17N96L15m13L28l99K26j58j12j13J1J93J98j48K38J03k95j83
$$ -42 -285 -58 -25 -542 54 369 -44 284 -115 111 -47 -159 -272 -261 -68 130 -18 220 323 28 -155
1268a55J90q9l01L2K12K82l1n8m5k2j29O5j00J08j16J49M17n55J14N9j40mK0K7
$$ -155 35 -54 -355 -323 -111 171 140 82 37 15 -114 -49 -149 -41 -157 -8 409 -146 -32 27 -113 -117 -97 -70
1292g0N8Q9o0M8N5J52m67K60m16L78j31O6K00l17J88k00Q3q4j38L10q8N7J52J75
$$ -70 -12 77 17 65 120 272 -195 65 -351 27 -104 -38 162 -155 33 -167 -84 -168 -306 4 -84 -27 125 300
1316C00j96j29M4N5m31J64L60k44L7l5K23k68J54j40p7K19j57J22O0K77k60j49
$$ 300 104 -25 19 74 -357 -193 167 -77 -40 -75 148 -120 34 -106 -183 36 -121 1 61 338 78 -71
1338g1Q3k17L94k93J63Q3M0k73K33J9k40q1P4k00N54l61L67k06j22O2n3k19J05
$$ -71 12 -205 189 -104 59 142 182 -91 142 161 -79 -160 -86 -286 268 -93 274 68 -54 8 -45 -264 -159
1361a59J4L7OJ31k12J67J37J04l13k20K43K39l57J16P2J09m1J81k64l98L32J62
$$ -159 -145 -108 -102 29 -183 -16 121 225 -88 -308 -65 174 -183 -67 5 114 73 254 -10 -408 -76 86
1383H6J42M6n9KK2k09r7J12k26K42j85L28j71J41J03q5l65K32l24L78j16j97M69
$$ 86 228 274 215 217 239 30 -67 45 -181 61 -124 204 33 174 277 192 -173 59 -265 113 -3 -200 269
1406B69o3j52jk42R1q4oK84j15Q5p5L1JK3j91J61l29J02J86L69k51k8j19J35l4
$$ 269 206 54 53 -189 -98 -182 -188 96 -19 66 -9 22 23 46 -145 16 -313 -211 -25 344 93 65 -54 81 47
1431D7j01P1J37k25J68J33j50M8o5l2m66O1L08rk80L71K47k49o5O4r3J1J80q2
$$ 47 -54 17 154 -71 97 230 80 128 63 31 -435 -374 -66 -75 -355 16 263 14 -51 13 -80 -69 111 29
1455B9K0K28k19QJ7j82K04j99K11k71L51l70J84j97K33k41K61q3j61J60r9J59
$$ 29 49 277 58 66 83 -99 105 -94 117 -154 197 -173 11 -186 47 -194 67 -16 -177 -17 -116 43
1477D3J3l7J13j6k46L01l36J23K7K4L1r6k8K42j87q2j03q7M16k56K13j59J73K31
$$ 43 56 19 132 116 -130 171 -165 -42 -15 9 40 -56 -84 158 -29 -111 -214 -301 115 -141 72 -87 86 317
1501C17l35k07J42j2l6L1J57K49k09lk32o0J51l1RK48n4j28J75j7k68j01J12l0
$$ 317 -18 -225 -83 -95 -131 -100 57 306 97 94 -138 -198 -47 -78 -69 179 125 -3 172 155 -113 -214 -102 -132
1525a32j12M15m23N05l39K92n6k63m3m1K82j58J12J02j57L9p0J8No8P4J16n5l6
$$ -132 -244 171 -252 253 -86 206 150 -113 -156 -197 85 -73 39 141 -16 23 -47 -29 -24 -92 -18 98 43 7
1549GMK39r1m47J36J85J9j68m37P9P70q0m5r0k1j06j22J4K83j31K51l56J43J50
$$ 7 11 250 159 -288 -152 33 52 -116 -553 -474 296 216 171 81 60 -46 -168 -154 129 -2 249 -107 36 186
1573A86j13n4k88L64j99L20j41m7k04J88l03k9J71K59j26J21k46K47J73l73L15
$$ 186 73 19 -269 95 -104 216 75 28 -176 12 -291 -320 -149 110 -16 105 -141 106 279 -94 221
1594B21j95o7J60j49J37q0m58P47l7M9p48N61k45J03M2o3K32k89L4k10K65J1m03
$$ 221 26 -41 119 -30 107 27 -431 316 279 328 -420 141 -104 -1 41 -22 210 -79 -45 -255 10 21 -382
1617c82N09j69j13P30o05N38m50k56o9j01K63J47m20K24L54M40o22K90J98m37
$$ -382 127 -42 -155 575 -30 508 58 -198 -267 -368 -105 42 -378 -154 200 640 18 308 506 69
1637F9l90P38k56l66M42J03k56l10J83KP7L3J36j98J85m96J09K15k25J54O6J3
$$ 69 -321 417 161 -205 237 340 84 -226 -43 -41 36 69 205 7 192 -304 -195 20 -205 -51 15 28
1659B8k28K5K66l6J7l84K04J9L27n02K13J3L8P5L0j24o7K8k51L64j4K5k2j05J87
$$ 28 -200 -175 91 55 72 -312 -108 -89 238 -264 -51 -38 0 75 105 -19 -86 -58 -309 55 41 66 44 -61 126
1684A26k33j41J66J9l0K02j66M9M7J1q2k3J57m0q7K24k25M8j85M94k94j32j26
$$ 126 -107 -248 -82 -63 -93 109 -57 -8 39 50 -32 -55 102 62 -25 199 -26 22 -163 331 37 -95 -221
1707b21J06J61L23m83K06J15k67J79ql98J73Q6m2J72j45J01K79l30j86J47L08
$$ -221 -115 46 369 -114 92 207 -60 119 111 -287 -114 -28 -70 102 -43 58 337 7 -179 -32 276
1728B76k61j64J68J28o9J69l90k47K52J19R3k06K27O6k88L67k64lN2O2j4J08q7
$$ 276 15 -149 19 147 78 247 -143 -390 -138 -19 74 -132 95 161 -127 240 -24 -27 25 87 73 181 94
1751I4j17J97l60K16J8j35%R5N3J80l04J15o9J76j16j36j8K5m4K38j58J49j09
$$ 94 -23 174 -186 30 48 -87 -87 8 61 241 -63 52 -17 159 43 -93 -111 -86 -130 108 -50 99 -10
1774a0r4K4QJ32k17m1J27J62k14J76k5q7j38K76j62MO2N0R8k26K35o1qK25l61
$$ -10 -104 -80 -72 60 -157 -198 -71 91 -123 53 28 -59 -197 79 -83 -79 -17 33 131 -95 140 79 71 296 -65
1799f5N0M7l8Q0j72L69q1j62k56L52j80j59K38J10J8j11k01J10J37j24j19K19
$$ -65 -15 32 -6 74 -98 271 190 28 -228 124 -56 -215 23 133 151 40 -161 -51 86 -38 -157 62
1821F2K6jk04O0O3L24m53R7o3k7M2Q2R2J66k74j02J96k25J75N6Kq8k34J78P0J21
$$ 62 88 87 -117 -57 6 330 -123 -26 -89 -116 -74 8 100 266 -8 -110 86 -139 36 92 94 6 -228 -50 20 141
1847A41q2j57k0m2%R5K24j19M8m7L1j03K2Q6p5J34n4j40N4jj66Q1j48l5K21k36
$$ 141 59 -98 -118 -160 -160 -65 159 40 88 41 72 -31 -9 77 2 136 82 -58 -4 -5 -171 -90 -238 -273 -52 -288
1873b88K68j25L00m01M14k77KJ09q5K1J78J68l14P1m7p5r7rK53N9Qk47J25J71
$$ -288 -20 -145 155 -246 168 -109 -107 2 -83 -62 116 284 -30 41 -6 -81 -178 -187 66 125 133 -114 11 182
1897A82l80K54q5p7N8J06j68P6oR4P7j79K05j17j30K30k66J61j98Q3J19R8m5l97
$$ 182 -198 56 -29 -106 -48 58 -110 -34 -40 54 131 -48 157 40 -90 140 -126 35 -163 -80 39 137 92 -305
1921c05N54l02K80j74j2K37k29q3r7J29o9J63k55K05o5L7K8r3J7j72K49K06k67
$$ -305 249 -53 227 53 41 278 49 -34 -131 -2 -71 92 -163 42 -23 14 42 -51 -34 -206 43 249 -18
1944a8J16M5J7j21kK8l62L39K56l69L39J07j36j94q4j70O7R4m5%r5J96R5l07N59
$$ -18 98 143 160 39 37 65 -297 42 298 -71 268 375 239 45 -39 -209 -142 -48 -93 -93 -188 8 103 -204 355
1969C55m75M53l38r7k9R6j1K56M2j70k78q0L33k64J25J08k7m9k5ll3J63n5N5L6
$$ 355 -120 333 -5 -102 -131 -35 -46 210 252 82 -196 -276 57 -207 -82 26 -1 -50 -75 -78 -111 52 -3 52 88
1994H8p3J52l6k7k86K77l24J78m2l9L88O0l40L2j24J73O3r1l6j71M7l1J48Q6j24
$$ 88 15 167 131 104 -182 95 -229 -51 -93 -132 256 316 -24 8 -116 57 120 29 -7 -178 -131 -162 -14 72 -52
2019e2pJ10j0M8k99J10K23Nj08lK4L0j42p9N4j7m9J47J08J30j2o30N41j87J47
$$ -52 -59 51 41 89 -210 -100 123 128 20 17 41 71 -71 -150 -96 -113 -162 -15 93 223 211 -419 122 -65 82
2044H2J05j73L5J57j05j60N2J90k50r9L01K29l00J59k4p5K4J3k47J21r8Q5k9Q1
$$ 82 187 14 49 206 101 -59 -7 183 -67 -166 135 364 64 223 199 124 148 161 -86 35 -63 22 -7 74
2068G4k21J16Npl9L00j56J05%l45pMK90l06K03j89K01J76j62l4J00j16J80j57
$$ 74 -147 -31 -26 -33 -72 228 72 177 177 -168 -175 -171 119 -187 16 -173 28 204 42 8 108 -8 172 15
2092A5J31r1K4p6J4J04j33q4L72l01j5j15J57j39L8J48j76K20k27J73k9J75k20
$$ 15 146 55 79 3 17 121 -12 -96 276 -25 -40 -155 2 -137 -99 49 -127 93 -134 39 10 185 -35
2115c5L3p6j51O6K25j31o9K3J02P0l9j56K08k96P1K60p2j49K02oJ20j6o9k07L06
$$ -35 -2 -78 -229 -163 62 -69 -138 -115 -13 57 18 -138 70 -226 -155 105 33 -116 86 80 200 184 115 -92 214
2140B14k58P9q6m8m5J45j6M7o4j83K65N0J36j91l82K51J58O5k55R8l9NJ81j46
$$ 214 -44 35 -51 -99 -144 1 -15 32 -32 -215 50 100 236 45 -337 -86 72 137 -118 -20 -59 -54 127 -19
2164a9K57k51N2k58K20O8q3k5J64o6j28L6K45j57m4m4K55j4j68j16J71K05l14
$$ -19 238 -13 39 -219 1 69 -14 -39 125 59 -69 -33 212 55 11 -33 222 208 40 -76 95 300 -14
2187a4N0l12p0N10k19J42O5j30j71O7K97l78K69J10k78K14o8l04J54j18M43k74
$$ -14 36 -276 -346 164 -55 87 152 22 -149 -82 215 -163 106 216 -62 152 84 -220 -66 -184 259 -15
2209a5K6oM6j44K2J9PL25m04K35R0k77L82l17j27N8N0J53K9k84K70p5j48J71o2
$$ -15 11 5 51 -93 -71 -52 -45 280 -124 111 201 -76 306 -11 -138 -80 -30 123 152 -132 138 63 -85 86 24
2234B4j34K31o7P0j54R2J94j91P7L7l45K84l19L24j00R3j35j39J81j14J49j13
$$ 24 -110 121 54 124 -30 62 256 65 142 179 -166 118 -201 123 23 116 -19 -158 23 -91 58 -55
2256e5j4j17K26j23M8L68k58j78K2K2j03K21l31K62Pj2j55M26m05L08m56L29K3
$$ -55 -69 -186 40 -83 -35 333 75 -103 -81 -59 -162 59 -272 -10 -3 -15 -170 256 -149 159 -297 32 55
2279E5j8R9j34J07k18j10NL34j29L32k59l3Kj14L82j21m8l39J33J55p6L4l0p2
$$ 55 37 136 2 109 -109 -219 -214 120 -9 323 64 31 33 -81 301 180 132 -207 -74 81 5 39 9 -63
2303f3j7J21J9m4P9Pl52J27Q4L1K48l52J20L50l85n0r9J14J73M3l01N7k0L62m11
$$ -63 -80 41 60 16 95 102 -250 -123 -39 -8 240 -112 8 358 -27 -77 -176 -62 111 154 -147 -90 -110 252 -159
2328a59K25j17J15k0p3j26j57K08J72n0J44k52P7m62M30l9O5q1J25j61K54mj09
$$ -159 66 -51 64 44 -29 -155 -312 -104 68 18 162 -90 -13 -475 -45 -84 -19 -100 25 -136 118 114 5
2351Eq8ON46l57j23m8N3K9l44N81l51J95q2o0M04l68J86j46J18J92l44J03k29
$$ 5 -83 -77 469 112 -11 -59 -6 23 -321 260 -91 104 22 -38 366 -2 184 38 156 348 4 107 -122
2374a22m1K6Q1J96j65L2k2j29n7K49j15j17L31j55K99k49R1m2o2n8K18kj30j19
$$ -122 -163 -137 -56 140 -25 7 -15 -144 -201 48 -67 -184 147 -8 291 42 133 91 29 -29 189 187 57 -62
2398f2J32N1l73K1J77J50J03l39O2j26Q1K51p0k21J94o8m3P1J75k46J42l02L94
$$ -62 70 121 -252 -231 -54 96 199 -140 -78 -204 -123 128 58 -163 31 -37 -80 -9 166 -80 62 -240 154
2421A54j78J38l2j50j00R9Q2L8k35K77K35o03J29P0J77j42Q9j90J22J20o3k0J59
$$ 154 -24 114 82 -68 -168 -69 13 51 -184 93 328 -275 -146 -76 101 -41 48 -142 -20 100 37 17 176
2444A76m5k05K02p3j69J01m3N9L2O7Q9j84O0N6k87J13N2p1L22k24q3K60k16l3
$$ 176 131 -74 128 55 -114 -13 -56 3 35 102 191 7 67 123 -164 -51 1 -70 252 28 -55 205 -11 -44
2468d4NJ23lj25K08j08n5J86k60K8l68L09P7r6N5J28j13K73k02r5RJ72jn6j44
$$ -44 -39 84 81 -44 164 56 1 187 -73 -45 -413 -104 -27 -123 -68 60 -53 220 18 -77 -68 104 103 47 -97
2493i7J3J17k8l19L22LL1nk49m4J85J31j3j52o1L8J99k08J05j16P5q8L0J69j5
$$ -97 -84 33 5 -314 8 11 42 37 -212 -256 -71 60 47 -105 -166 -128 71 -137 -32 -148 -73 -161 -131 38 23
2518B3k4p9J7K9L27n32R4J99l4j80K14l2j10M17p8j79n0j82L90q8k00J96r9q6
$$ 23 -1 -80 -63 -34 293 -239 -145 54 20 -160 54 22 -88 329 251 72 22 -160 230 142 -58 138 39 -47
2542d7K3j63J46j97K76j82J02l1j3L8K11r2l8K97l9k46l43L79k34O6K55j88l1
$$ -47 -24 -187 -41 -238 38 -144 -42 -73 -86 -48 163 71 33 330 291 45 -298 81 -153 -87 168 -20 -51
2565e1J70k3j22M1P8m5p5j89L12k6j72j23L22P0k62O0P3m8j05l8J74J30k28j5
$$ -51 119 96 -26 15 93 48 -27 -216 96 70 -102 -225 97 167 -95 -35 38 -10 -115 -153 21 151 -77 -92
2589i2q9J8J80lj86J88J50j62o0k41L13J17nl14J19n2J55M66n39K30m2N6k99p
$$ -92 -181 -163 17 14 -172 16 166 4 -56 -297 16 133 128 -186 -67 -119 36 502 -37 193 151 207 -92 -99
2613i9K0J69j95J17r8LL28l93J63K5RJ36k04M7J7L2k43K44p6N8m1n4J09j26N3
$$ -99 -79 90 -105 12 -86 -83 245 -148 15 40 49 185 -19 28 45 77 -166 78 2 60 19 -35 74 -52 1
2638AJ35j02J97l53K37j21j44J09J24k00J30j80K86k97K8J28l4n0K21N6l54K73
$$ 1 136 34 231 -122 115 -6 -150 -41 83 -117 13 -167 119 -178 -150 -22 -56 -106 115 171 -183 90
2660I0k48K82p1p5j02QL0Q1j73J42k23K23QJ64k40l3J05j47K49l07J92P5k19J87
$$ 90 -158 124 53 -22 -124 -116 -86 -5 -178 -36 -259 -36 -28 136 -104 -137 -32 -179 70 -237 -45 30 -189 -2
2684br1K3J02K17m96L13O6k46o7K36M3j22l6K6K57k22j01K14k96j2J22J42r0n9
$$ -2 -93 -70 32 249 -247 66 132 -114 -181 55 98 -24 -60 -34 223 1 -100 114 -182 -194 -72 70 -20 -79
2708g9j82L70j10kj37M14n58J99K81q9Q2j64NL7k66l9L22j03k28L02l19K10M2
$$ -79 -261 109 -1 -3 -140 274 -284 -85 196 107 189 25 30 67 -199 -238 84 -19 -247 55 -264 -54 -12
2731a2P8j00K4Q6k54J20J00j47J01rJ72k79K8J81M2J01r3p7j41j3p8l9J30l7Q3
$$ -12 66 -34 -10 76 -178 -58 42 -105 -4 -13 159 -120 -92 89 131 232 139 62 -79 -92 -170 -209 -79 -116 -33
2756c3k02M39l41L16O6k99Rp6j03N6J39N4J0Pq7M8k87L74o2q7j16L23j15j63J50
$$ -33 -235 204 -137 179 245 -54 -45 -121 -224 -168 -29 25 35 42 -45 3 -284 90 28 -59 -175 148 33 -130 20
2781B0O9m5J14j74J13K30n48K92j59R4K04P1k81j15J86k28K28J40j98r0j06J04
$$ 20 89 44 158 -16 97 327 -221 71 -88 6 210 281 0 -115 71 -157 71 211 13 -77 -183 -79
2803g9Q9K7j3Q8J40q1J08k83K49k51l0O8J9l29L25n0k50K43j55K45q2j61K8m3
$$ -79 10 37 24 112 252 171 279 -4 245 -6 -36 32 51 -278 47 -3 -253 -10 -165 80 -2 -163 -135 -178
2827a78M30l85J82q0j33R2J22q2Q7l35M61l90K33J29q5j26k11J07l2l1J20J86
$$ -178 252 -133 49 -31 -164 -72 50 -32 55 -280 181 -209 24 153 68 -58 -269 -162 -194 -225 -105 81
2849H1j7j43K8j96L26l5o8RP3k66J41K26j32Q1K2j06N9l46K64j79J51R2J5k28
$$ 81 64 -79 -51 -247 79 44 -24 -15 58 -208 -67 159 27 108 130 24 83 -263 1 -178 -27 65 80 -148
2873a48o9K34j69K64Q4k80P5R2J69k86o2K16mk1j25k19R1Q9K47k35q2M3P3n4J33
$$ -148 -217 17 -152 112 196 -84 -9 83 252 -34 -96 120 116 95 -30 -249 -158 -69 178 -57 -139 -96 -23 -77 56
2898E6k5n7J8j72J83kp8K83k69R5K6j73J82k68L25l61K49M0L6n8k1J57n8N1m2
$$ 56 31 -26 -8 -180 3 1 -77 206 -63 32 58 -115 67 -201 124 -237 12 52 88 30 9 166 108 159 117
2923A17k12k22J9K05L03k18K3j13J8J26j90k4K61l1l07L05k5K4j30L15l1m09K42
$$ 117 -95 -317 -298 -93 210 -8 15 -98 -80 46 -144 -168 93 62 -245 60 35 59 -71 244 213 -196 46
2946D6J51r1k99K83k36L19j17l4J08j44k1p0n5Q5r9K93p5N0q5j31k99N05j78Q3
$$ 46 197 106 -193 90 -146 173 56 22 130 -14 -35 -105 -160 -75 -174 119 44 94 9 -122 -421 84 -94 -11
2970a1o2m7j31L09J23lk84o9J83j95M1R7j56N7J79r7J37k82K65K19j00k02N0J8
$$ -11 -73 -120 -251 58 181 178 -106 -175 8 -187 -146 -49 -205 -148 31 -66 71 -211 54 273 173 -29 21 39
2994C9k72J33K28J05l37K36j17j20J34p5J08j61l1J00J27K3J26k39J73r2j04j0
$$ 39 -233 -100 128 233 -104 132 15 -105 29 -46 62 -99 -130 -30 97 120 246 7 180 88 -16 -26
3016b6J43j52k50L19J18q6J62l25lK51n1J60j42pj89R4M8R9k67M8L07l37l4J69
$$ -26 117 -35 -285 34 152 66 228 -97 -100 151 100 260 118 111 -78 16 64 163 -104 -56 251 -86 -120 49
3040D9l4J07j1l16L13j94j37M39l85M04j99k29L45k01k33J82jJ84p4N6M1Nj07
$$ 49 15 122 111 -205 108 -86 -223 216 -169 235 36 -193 152 -49 -282 -100 -101 83 9 65 106 111 4
3063Dk38J66J54o9pk01K16L1j60l7Q8K49l56J13j98K68N9k96J69j37K30k9j70
$$ 4 -234 -68 86 17 10 -191 25 56 -104 -141 -53 196 -160 -47 -245 23 82 -214 -45 -182 48 19 -151
3086a51jK04k66J56q6j01K87j45O6L7j68L13l46J67pj27K23n8K15J9p2k27L07
$$ -151 -152 52 -214 -58 -144 -245 42 -103 -37 0 -168 145 -201 -34 -41 -168 55 -3 212 231 159 -68 239
3109B39j42k14J16J54j15rP7o0K2p1K4k29Q1J60o1L07k81J25k27N1J08K8J10k26
$$ 239 97 -117 -1 153 38 29 106 46 68 -3 21 -208 -127 33 -28 279 -2 123 -104 -53 55 83 193 -33
3133c3R9N1K9j46M1O0k15k0J35j3o4K19k93K42m1j40L74j47k71K72o1k79L15j95
$$ -33 66 117 146 0 41 101 -114 -134 1 -12 -76 143 -150 92 51 -89 285 138 -133 139 78 -201 114 -81
3157h1m5N2O9J32p5j43K3j81J31J0j02n7M93m58M78m34J75L09j73q4k1j38K47
$$ -81 -126 -74 -5 127 52 -91 -68 -249 -118 -108 -210 -267 226 -232 246 -188 -13 296 123 39 18 -120 127
3180A27n3r9J74j49j36K34l7M9j56q7O5O9J45k95K28J2r7j39K21LL3j09q0K56
$$ 127 74 -25 149 0 -136 98 61 110 -46 -133 -68 1 146 -149 79 91 -6 -145 76 79 112 3 -77 179
3204A79l86M06r4j47J71q7j62j6L17k44N8p9J00j27R4L32m05J7M2o5m1L70m05
$$ 179 -207 199 105 -42 129 42 -120 -136 181 -63 -5 -84 16 -111 -17 315 -90 -73 -31 -96 -137 233 -172
3227a72K55o7j07J07j43K21p1N0QJ1j81J36j25J23J0P3k28L74j75k4K42k80l70
$$ -172 83 16 -91 16 -127 94 23 73 81 92 -89 47 -78 45 55 128 -100 274 99 75 317 37 -333
3250c33J47K57n5J70k68L2J95j51p9Q8j02j29J77k7J09m4kK23k74m5J27n5J2k2
$$ -333 -186 71 16 186 -82 -50 145 -6 -85 3 -99 -228 -51 -78 31 -13 -15 208 -66 -111 16 -39 -27 -49
3274d9L9M6q9n3J05K06m07o4M14k80J01q6K74l63J31K50m34K89O2j5M5R5l14%
$$ -49 -10 36 -53 -106 -1 205 -202 -266 148 -132 -31 -117 157 -206 -75 175 -259 30 92 77 122 217 -97 -97
3298i7lO5kJ49Ln7K1Q8j75N7N7j75J28j35O0J84m71L10J52Q3j4k78J54Kk30J32
$$ -97 -100 -35 -37 112 115 58 79 167 -8 49 106 -69 59 -76 -16 168 -303 7 159 242 228 -50 104 106 -124 8
3324Hj0j66M07k26P7j62K16J15k06j89P3K62l00R8n4n7L22j08j03j85J43j3K77
$$ 8 -2 -168 239 13 90 -72 144 259 53 -136 -63 199 -101 -3 -57 -114 208 100 -3 -188 -45 -58 219
3347B19n2j20j12P6j17N5J49k46J51k3K58r2j28o2J36Nj7k1J2l46L12j24J38k17
$$ 219 167 47 -65 11 -106 -51 98 -148 3 -20 238 146 18 -44 92 97 80 59 71 -275 37 -87 51 -166
3371a66K1P3J19K25k06Q5j53qJ81k11J74j98QN0j57O4K38l48L59k92MM3J80j38
$$ -166 -145 -72 47 272 66 151 -2 -10 171 -40 134 -64 -56 -6 -163 -99 139 -209 150 -142 -138 -95 85 -53
3395e3N5m1Q7Lj60K15j26R7k90M6J28l7q8QN6K17K8j70j02J42k21L58q6j51M4
$$ -53 2 -39 48 51 -109 106 -20 77 -213 -167 -39 -76 -164 -156 -100 117 145 -25 -127 15 -206 152 66 -85 -41
3420d1J0K28j58J24o6q3N0J89l99J76K04k83L4k7J5K88n14L49Pk99K49k31L44
$$ -41 -31 197 39 163 97 14 64 253 -146 30 234 -49 -15 -42 -27 261 -253 96 103 -196 53 -178 166
3443A66j47j75M6L00j60JQ0K73m58pOj60K63L3j56L99l40N8p4j03J34K5l1J4J78
$$ 166 19 -156 -110 190 30 31 111 384 -74 -81 -75 -235 28 61 -95 304 -36 22 -52 -155 -21 4 -27 -13 165
3468A65n18J41J94j5M4k9l0QJ41l58K65P7j90O7p2L02l56L0R0Q7K8M0l38K20n3
$$ 165 -353 -212 -18 -33 11 -18 -48 -40 101 -257 8 85 -105 -38 -110 192 -164 -134 -44 43 71 111 -227 -7 -60
3493f0J14j42J45j33p0J53L7O7k48J29j2L16k49J7k1kj7K3l6K9J1k57n2K22J53
$$ -60 54 -88 57 -76 -146 7 44 111 -137 -8 -20 296 47 64 43 41 24 47 11 40 51 -206 -258 -36 117
3518A17k42K98j74k06M68m88N42j63J32j25j06j45K14k39L74k54j11K1J25k14
$$ 117 -125 173 -1 -207 261 -227 315 152 284 159 53 -92 122 -117 257 3 -108 -87 38 -176
3538a76R7j03q4L16r2J60p1j67J69L4Q9k34J97l3R7j89M7l97L14n6K61m26K77
$$ -176 -79 -182 -266 50 -42 118 47 -120 49 83 172 -62 135 102 199 10 57 -340 -26 -82 179 -247 30
3561C0j78J34m2P7k01Q5L09j94j80O0R7K68k69o9J05j46K59j60J71l00J63K5j71
$$ 30 -148 -14 -56 21 -180 -95 214 20 -160 -100 -3 265 -4 -73 32 -114 145 -15 156 -144 19 44 -127
3584a27J81k96K31J11k02J71k88J30J28j14J61j57l3n3Q0Nj35J04n0K13P5j84
$$ -127 54 -242 -11 100 -102 69 -219 -89 39 -75 86 -71 -104 -157 -77 -72 -207 -103 -153 60 135 -49
3606d9J47k76P2q4L14j42J4J6m2J47j90Q0j82K99j01k00J20J44l5k18J73k9O8
$$ -49 98 -178 -106 -190 124 -18 -4 12 -30 117 -73 7 -175 124 23 -177 -57 87 52 -166 7 -22 46
3629D6j17J42k62m1K57j77L14j49Q4j84j6K81J3k90o6J68m5L36k15J10j73n6j03
$$ 46 -71 71 -191 -232 25 -152 162 13 97 -87 -103 178 191 -99 -165 3 -42 294 79 189 16 -40 -143
3652a43J27q7K10o8Qq9lj1K56l9j2j17L5j36Q0k6j29L05j49lN5P3j65K37o1j49
$$ -143 -16 -103 107 39 47 -42 -45 -56 200 161 149 32 67 -69 11 -15 -144 161 12 9 64 137 -28 209 148 -1
3678aJ7Q0j94r4L05l1p5J59r7j0J13l05L31j86o5L22M6k84m0q3n8K74p0l3K01
$$ -1 16 96 -98 -192 113 82 7 166 69 59 172 -133 198 12 -53 269 315 31 -9 -92 -150 124 54 21 222
3703B22k84J55l22K93j32J39q2p0K63m20J71Q9j74K47O1j72j19J01l6J77j75J42
$$ 222 -62 93 -229 64 -68 71 -11 -81 182 -238 -67 22 -152 95 156 -16 -135 -34 -70 107 -68 74
3725G4pn8J12j2k73J27k27K09J49j27N1n5N0l8K97k81L7o0J19j48N4L9j58K80
$$ 74 67 9 121 109 -164 -37 -264 -55 94 -33 18 -37 13 -25 272 -9 28 -32 87 -61 -7 32 -126 154
3749A54k08j06K47J12p9P9j83o9%P2K64l65J37k64K59k51J86K78l68K83j05j17
$$ 154 -54 -160 87 199 120 199 16 -53 -53 19 283 -82 55 -209 50 -201 -15 263 -105 178 73 -44
3771d4k51M64K91n72Q3k01K85k28N3J9k24L03j19K42k98qL60n8M8j88k15K31J25
$$ -44 -295 169 460 -112 -29 -230 55 -173 -120 -101 -325 -22 -141 101 -197 -205 155 97 145 -43 -258 -27 98
3794I8J4k48K83r6j67L7K02o5n7j30L95j79M3j61J84p6O1m9k6p1m6J37J4j13n0
$$ 98 112 -136 147 51 -116 -79 123 58 1 -129 266 87 130 -31 153 77 138 89 63 -8 -54 83 97 -16 -66
3819f6L4r0J37O1OJ8J27p2L1l77K02L76o06K59J94k86k4k54P07l52k5j62K24q
$$ -66 -32 -122 15 76 82 100 227 155 186 -191 11 387 -219 40 234 -52 -76 -330 377 25 0 -162 62 54
3843E4q4q1R6K89l96L2K32oj63J40pM2P4j54N1k18K60k04J38J1p7N5j43K63k81
$$ 54 -30 -111 -15 274 -122 -90 142 136 -27 113 106 148 222 68 119 -99 161 -43 95 106 29 84 -59 204 -77
3868g7l0k98N51j39N3L3k31K49p9p9J63k10R5J4q5K10l12J10j1J91k49L8K40k35
$$ -77 -107 -405 146 7 60 93 -138 111 32 -47 116 -94 1 15 -70 140 -172 -62 -73 118 -131 -93 147 -88
3892h8K42k57O8K59m63K24j33M46l16K67m9k06m4J66q8j7L1lRQ1J21l49j03J31
$$ -88 154 -103 -35 224 -239 -15 -148 298 -18 249 200 -6 -50 116 28 11 42 39 48 129 250 -99 -202 -71
3916g1P6j30j79K08K82M1j22r4k0R4j96K49j97m0k3K60j35j01L47N7l18J3nJ69
$$ -71 5 -125 -304 -96 186 227 105 11 -9 85 -111 138 -59 -99 -122 138 3 -98 249 306 -12 1 -4 165
3940A65J0j34J12k49N6J15m5j48L9J8N6q1J48l1Q1nj18n8P6j64L80q2k11j76L69
$$ 165 175 41 153 -96 -40 75 30 -118 -79 -61 -5 -86 62 31 112 107 -11 -69 7 -157 223 141 -70 -246 123
3965A23n1l8J53l96J92n7n7J05M9j00J75j59MJ43j01K18j48M9J3k0J56m29J30
$$ 123 72 34 187 -209 -17 -74 -131 -26 23 -77 98 -61 -57 86 -15 203 55 104 117 97 253 -176 -46
3988d6N8nP4Q0o2j12o4j18K27j75L54k70o9K28Q4n8k51Q8O2M9p4j06k6K15j7l12
$$ -46 12 7 81 161 99 -13 -77 -195 32 -143 211 -59 -128 100 184 126 -125 -37 25 74 0 -106 -132 83 66 -246
4014b46K63j44J98K25l32J00j53Q5J09Q4l36P1L67m83J17J07K91l13J60j46q1
$$ -246 17 -127 71 296 -36 64 -89 -4 105 189 -147 -76 291 -192 -75 32 323 10 170 24 -57
4035e7K24l14O6M4L07j52k44j20L91l88K61M8j41J91k56J54k06J59K62q5n4j2
$$ -57 167 -147 -81 -37 270 118 -126 -246 145 -243 18 66 -75 116 -140 14 -192 -33 229 144 90 78
4057G8j28K43k25P2J10j32k06K49l69J47J48L02m83J61Q0L5j87J54k37K06J47
$$ 78 -50 193 -32 40 150 18 -188 61 -308 -161 -13 289 -194 -33 47 82 -105 49 -188 18 165
4078A65k21K45j24J75k23k51J19L5L24j37j32O9r2M9J65j01rj8J19l79L28M0j93
$$ 165 -56 189 65 240 17 -234 -115 -80 244 107 -25 44 -48 1 166 65 56 38 157 -222 106 146 -47
4101d7K51l27K42j59l1M8L2J38q9k39J25P5L05m85J83j90O2K45j81K34o18M73
$$ -47 204 -123 119 -40 -71 -23 9 147 58 -181 -56 19 324 -161 22 -168 -106 139 -42 192 -426 47
4123D7j19J02O6k75K68Q1m04J42K58k05L17m00J24L90k22N0m21J64p8K42k77K31
$$ 47 -72 30 96 -179 89 170 -234 -92 166 -39 278 -122 2 392 170 220 -201 -37 -115 127 -150 81
4145H1m16L04J69j75k12M11l15K03P2Pq4j55K2K61Ql90J49K87k17oJ6Ll35L05
$$ 81 -335 -31 138 -37 -249 162 -153 50 122 129 45 -110 -88 173 181 -209 -60 227 10 4 20 23 -312 -7
4169gM4M7o0K68l13j69K05o9R2m8P4QM9o0j62pP8nk9J2K91m86K51k60oP0J57k40
$$ -7 37 84 24 292 -21 -190 15 -54 38 -10 64 72 121 61 -101 -108 -30 -35 -64 -52 239 -247 4 -256 -262 -192 -35 -275
4197b75K03O1p0JN9j80K44k5K1j26O8J18k56Q4N9K68l67L0L46l94M5K38k09J65
$$ -275 -72 -11 -81 -80 -21 -201 43 18 39 -87 -19 99 -157 -73 -14 254 -113 -83 263 -131 -86 152 -57 108
4221A08M7k56K70K8o74M63J98j45P3r8O8j04R7q9J56P8k58J3K97l08l7L97k04
$$ 108 155 -101 169 197 -477 -14 184 39 112 14 82 -22 75 -14 142 220 -38 -25 272 -36 -73 324 120
4244A20j58j02K19j58L22k34j46rJ20j38J35j18J65r7q7J65k7K2n3P8j93K35q2
$$ 120 -38 -140 79 -79 243 9 -137 -146 -26 -164 -29 -147 18 -79 -166 -1 -28 -6 -59 19 -174 61 -21
4267b1L0r2N3Kl5J48p3m6Q0J9k14L32j10M1j24J37J6m1m1L3nR8o6l02J48j21J62
$$ -21 9 -83 -30 -28 -63 85 12 -34 46 65 -149 183 73 114 -10 127 143 102 61 94 89 187 121 -181 -33 -154 8
4294HJ42L7k49P1k85L23j90J1k4J43n3K9J04j78K17q6K23n65K86j8rJ48n5j60
$$ 8 150 187 -62 9 -276 47 -143 -132 -156 -13 -66 -37 67 -111 106 20 243 -322 -36 -54 -63 85 30 -130
4318a30P8K39k99J25j5k3n4q1p2J87Q5j79M1K40j68J19j00j76J79nj16O0l3K28
$$ -130 -52 187 -112 13 -2 -25 -79 -160 -232 -45 40 -139 -98 142 -26 93 -7 -183 -4 -9 -125 -65 -98 130
4342A30k02Q5K39j52o1j17K08l19K37k29K71J07j16j48j40L71k72j21K07K07N8
$$ 130 -72 13 252 100 39 -78 130 -189 48 -181 90 197 81 -67 -207 164 -108 -229 -22 185 243
4363B43k1k57J5j31J44n4k41K87J39j76k4K33j47n3j10K18P8k69M9K4N0K0J72
$$ 243 222 -35 -20 -151 -7 -61 -302 -15 124 -52 -76 157 10 -43 -153 65 143 -126 -77 -53 -3 17 189
4386A89k56J94k41J70j82P8J68j30j73K19k89J01J80k59N1L11N8m8r4l8L6J4p4
$$ 189 -67 127 -114 56 -126 -48 120 -10 -183 36 -253 -152 28 -231 -180 131 189 141 47 9 45 59 -15
4409a5Q4o2Mm9j06N7J08j55n9k1K05l44M58k13J3K31P2j15k49K80j29l22N30J3
$$ -15 69 7 11 -38 -144 -87 21 -134 -193 -214 -9 -353 105 -108 -95 136 208 93 -156 124 -5 -327 203 216
4433B16Jo29L30L2j46N8J54R4r6N6k9J50j84kK7J6lo8j00Nk20K70L92j53q3k13
$$ 216 217 -412 -82 -50 -196 -138 16 110 14 70 41 191 7 5 32 48 45 -23 -123 -118 -338 -68 324 171 88 -125
4459a25J16j86J61p0M6J64j06J86k02j42j73L85Lj39J93j30R2J94n60N32k98l65
$$ -125 -9 -195 -34 -104 -58 106 0 186 -16 -158 -331 54 57 -82 111 -19 73 267 -293 239 -59 -424
4481d24M87R6j12O7j27J84j31J29m27Q6J85n4j47J22N1n7O0j11J28n5M11n86L46
$$ -424 63 159 47 114 -13 171 40 169 -258 -172 13 -41 -188 -66 -15 -72 -12 -123 5 -50 361 -225 121
4504A21l69L13J70k21L2J41k6k72J14j09J53K66k12j40Q2r2L6j62L45l81J58J07
$$ 121 -248 65 235 14 46 187 161 -111 3 -106 47 313 101 -39 43 -49 -13 -175 170 -211 -53 54
4526E4q8M7M2o6J2J08j02j06J4j07K78k13K80r8j56J43R6k52J71Lq9L5m8J54p8
$$ 54 -34 13 55 -11 1 109 7 -99 -85 -192 86 -127 153 55 -101 42 138 -114 57 60 -29 6 -42 112 34
4551C4K23k83n6j23J33j1J2P1q2J92M5k47K25N1q6J35j90o5K97l26N3K44l25K10
$$ 34 257 -26 -82 -205 -72 -83 -71 0 -82 110 155 -92 133 184 98 233 43 -22 275 -51 2 246 -79 131
4575A31R8p0n7j20J6k18L64m06N15k70j86K05n2m9K7K08J14l33J61l26L87o8J49
$$ 131 229 159 102 -18 -2 -220 144 -262 253 -17 -203 2 -50 -99 -72 136 250 -83 78 -248 139 71 220
4598B20j60jk7RM6J81k78r6K09j34M9j26P1J44j44%Q4k11J39O2p7J6K46m15L59
$$ 220 60 59 32 41 87 268 -10 -106 103 -31 18 -108 -37 107 -37 -37 47 -164 -25 37 -40 -24 222 -193 166
4623A66N7k99K2M3M6j13K31k70P3M06n68L08Q2l2k38K33o0j25O1N6J02j32l52
$$ 166 223 -76 -54 -11 35 -78 153 -117 -44 362 -206 102 184 152 -86 147 87 -38 23 79 181 49 -303
4646c03L26M91o62P7O0l2O8k12L02j07k0P6j07J70N1m1j98Kjj2J43j79M6L12j05
$$ -303 23 514 -148 -71 -11 -43 25 -187 115 8 -12 64 -43 127 178 137 -61 -59 -60 -72 71 -108 -62 250 145
4671A45l8l02o0L62k28r4L15J68j47j34J45M0k25K08q9j08L0J02j00P7J30j08
$$ 145 107 -195 -255 107 -121 -215 100 268 121 -13 132 172 -53 155 66 -42 -12 90 -10 67 197 89
4693H9N4k23o2J65m5O7o7j31N1K96j81pm4J66k41K80l3k49J32j23K5Q4o9J46p1
$$ 89 143 -80 -142 23 -22 45 -22 -153 -102 194 13 6 -38 128 -113 167 134 -115 17 -106 -81 3 -66 80 9
4718In5K10k15J51q4J52j88j45m1K24r9J44j69q1J72j64L91j64k02N8K74m66J94
$$ 9 -46 164 -51 100 16 168 -20 -165 -206 18 -81 63 -106 -187 -15 -179 212 48 -154 -96 178 -288 -94
4741i4M12k76J16l64J98NJ08q5j64O0L4N5L9K1nJ6j43k16J44Q5K09p6N5r1m3j4
$$ -94 318 42 158 -206 -8 -3 105 20 -144 -84 -50 5 44 65 60 76 -67 -283 -139 -54 155 79 134 43 0 -14
4767a4j34J30Ll9j3J49R0o5p4K81l51J41k17J22P5p3Q5j53K07j92j07o0J82r1
$$ -14 -148 -18 -15 -54 -67 82 172 107 33 314 -37 104 -113 9 84 11 96 -57 150 -42 -149 -209 -27 -118
4791a18j13K17J53m4k27K45n2j28J38k2o7j64n2L17l9J86k12J83j65j05K6j57
$$ -118 -231 -14 139 95 -132 113 61 -67 71 49 -18 -182 -234 83 44 230 18 201 36 -69 -43 -200
4813b00O1K35K6q7nq3m9j8R8j33J62JJ43k36R8O3l1j27J32j10k16L68l03J29k
$$ -200 -139 96 122 35 30 -53 -102 -120 -22 -155 7 8 151 -85 13 76 45 -82 50 -60 -276 92 -211 -82 -84
4838h4J50N4m47N07j07k14K10m5K58k98j30L40m55M0N36q7m25J01J73r3n3k00
$$ -84 66 120 -327 180 73 -141 69 24 282 -16 -146 194 -261 -221 315 228 -197 -96 77 -16 -69 -269
4860b69M39l5j52k69K58k50K34r4j2L5J56J34q4l69J62L04k00j86K70k02K20q2
$$ -269 170 135 -17 -286 -28 -278 -44 -138 -150 -115 41 175 91 -278 -116 188 -12 -198 72 -130 90 8
4882Hp8L61l31m2k9O0l4J60o9P8j73oo7L85k77j94J29O0k9Q2O2J99k79k25K99
$$ 8 -70 291 -40 -82 -111 -51 -85 75 6 84 -89 -95 -162 223 -54 -248 -119 -59 -88 -6 56 255 -24 -249 50
4907E0N5o4q1O5Q6j57K67j74O7o2j68R6l5pq7J10k0j5J24J26l04J94nm5j91K6
$$ 50 105 41 -40 25 111 -46 221 47 114 52 -116 -20 -55 -62 -149 -39 -59 -74 50 176 -128 66 61 16 -175 -149
4933a49M4J36j33L68m24K72j35K56k46m02M35j07K34r9J78k38j71K70l28K95J62
$$ -149 -105 31 -102 266 -158 114 -21 235 -11 -413 22 -85 149 50 228 -10 -181 89 -239 56 218
4954B18o1k67L76k03j81J56O3k04K5j59K31J9j82J93k55P9K67k10r3Q8PJ42J86
$$ 218 157 -110 266 63 -118 38 101 -103 -78 -237 -6 13 -169 24 -231 -152 115 -95 -188 -100 -93 49 235
4977B35j28k56J47N5L3k24J87j21J30J04k30k8J2Nj04J35K53q8rj10J56j78J5
$$ 235 107 -149 -2 53 86 -138 49 -72 58 162 -68 -96 -84 -79 -183 -48 205 117 108 -2 154 -24 -9
5000il4kj51J74K57k22P8j20j66J30j8j40k07O34k43J77j71R1R5o10M83mK3n6
$$ -9 -43 -45 -196 -22 235 13 91 -29 -195 -65 -83 -223 -430 204 -39 138 -33 58 153 -457 26 22 45 -11
5024a1k0J38n7J99j85j02k0J72Q6l67J6K49j04k1l8L31l16L7J55k13J58j82n8
$$ -11 -31 107 50 249 64 -38 -58 114 200 -167 -151 98 -6 -27 -65 266 -50 -13 142 -71 87 -95 -153
5047a53J23Ko4o5K7J27K6m4J52K3j57l0o9K57k88o3L75k71j09J56o4L0J28j09
$$ -153 -30 -28 -92 -157 -130 -3 23 -21 131 154 -3 -33 -102 155 -133 -196 179 -92 -201 -45 -109 -79 49 -60
5071f0j91K84J5J01j15M7No6j58O9K86l9l82J26R3R2j00j36J54J79j35k73L87
$$ -60 -251 33 48 149 34 81 86 20 -138 -69 217 178 -204 -78 15 107 7 -129 25 204 69 -204 183
5094A83j0m40J84K66q2n7l2qO0j80K84j53M5o3p0rJ55k3j77pJ03j82L04L3N1r2
$$ 183 173 -267 -83 183 101 44 12 4 64 -116 168 15 60 -3 -73 -82 73 50 -127 -134 -31 -213 91 124 175 83
5120H3k47K65k81l7K02J06j50N4P8J48q6j43L8q7L06m66M1J99j93L51m26N19m23
$$ 83 -164 101 -180 -217 -15 91 -59 -5 73 221 135 -8 30 -57 249 -217 -176 23 -170 181 -245 274 -149
5143a49K95o9J7M0l6r4Nj21j9L3O9J94k00r3K16lr6J06m3r9J65l24L15r9R6J23
$$ -149 146 77 94 134 98 4 9 -112 -131 -98 -29 165 -35 -128 88 85 -11 95 52 -47 118 -206 109 10 106 229
5169B29j96OJ20n27N90k55K76l05J05m9P0j64N3j05J37m3K21j27j95J02k04L03
$$ 229 33 39 159 -368 222 -33 243 -62 43 -6 64 -100 -47 -152 -15 -58 163 36 -159 -57 -261 42
5191D2M6n1k28M27L9k80Pk7j80L15m0Lj46j24MK28N7Q6l9j69J0j13J31L9p9K31
$$ 42 88 37 -191 236 275 -5 2 -25 -205 110 70 73 -73 -197 -193 35 92 178 139 -30 -20 -133 -2 37 -42 189
5217A89k91j34k1K65j41nK54j36K43N3k46J5K0j71J90J07j21j3o8j97J93M8L6
$$ 189 -102 -236 -257 8 -133 -138 116 -20 223 276 30 45 65 -106 84 191 70 57 -11 -208 -15 33 69
5240F9j07j28M1J56K41j88N4m7L76m16J00m5j99J9J58j00j39L49j76o0q2K47k73
$$ 69 -38 -166 -125 31 272 84 138 91 467 51 151 106 -93 -74 84 -16 -155 194 18 -42 -124 123 -150
5263a50j6m7K71P3j66R8M4j93R5k2J21l24J73j60J74O4L5l1J15M8j17jj45J72
$$ -150 -166 -213 58 131 -35 63 107 -86 9 -13 108 -216 -43 -203 -29 35 70 39 154 202 85 84 -61 111
5287A11j95r8K22O7k97J65J77J34k86J18j85R1m3L3J6j05p6K24r0J64l83O2P4
$$ 111 -84 -182 40 107 -190 -25 152 286 0 118 -67 24 -19 14 30 -75 -151 73 -17 147 -236 -174 -100
5310a00m5K83j48J6P2j39J85M3o7K0n0m5j85K32K72o14L61l01M78l11j74K37K3
$$ -100 -145 138 -10 6 78 -61 124 167 100 120 70 25 -160 72 344 -270 91 -210 268 -43 -217 20 43
5333D3j45K42j30J46l7l6j26j13p2K11J46j91K56l5k63O0K14l09K1LK37J9k40
$$ 43 -102 140 10 156 119 83 -43 -156 -228 -17 129 -62 194 159 -104 -44 170 -139 -118 -115 122 141 -99
5356i9q4K90ol29J95K19k70p6K77k20Q0j01J06p5J9J84k43M08j70j11j10J50n8
$$ -99 -183 107 101 -228 -33 186 -84 -160 117 -103 -23 -124 -18 -93 -74 110 -133 275 105 -6 -116 34 -24
5379b4J58j62J6L5K0j6%j19J90k04J63j09J85k54O2J4J53Q1l84J28J08K3j03O0
$$ -24 134 -28 -12 23 43 27 27 -92 98 -106 57 -52 133 -121 -59 -45 108 189 -195 -67 41 64 -39 21
5403B1J9l3Q8k69N4K38l27K40ol0j12J64j55J36j13P5K30l10K54j30rK40l24J50
$$ 21 40 7 95 -174 -120 118 -209 31 25 -5 -117 47 -108 28 -85 -10 220 -90 164 34 25 265 -59 91
5427I1r9Mn0J68k79J89q6L4J22Lk94K34j85J81K18l38J33k50J03J26k49K17L4
$$ 91 -8 -4 -54 114 -165 24 -62 -28 94 97 -197 37 -148 33 251 -87 46 -204 -101 25 -224 -7 27
5450B7k29L65J72m37K94kl9j31K74m46J18m8L03m18K36q6J94j15J92N8k58K6O6
$$ 27 -202 163 335 -102 192 190 151 20 294 -152 -34 -82 221 -197 39 -47 147 32 224 282 24 50 116
5473A16k3j27n0N1K0j90j8L34k85L0J94j31J71j93j74K95K42j77Kj73J98r0j71
$$ 116 93 -34 -84 -33 -13 -203 -221 113 -172 -142 52 -79 92 -101 -275 20 262 85 87 -86 112 22 -149
5496a49K82j29O4q5m4J22J28m2j82l45L99K4ko3J56k32o5J39P5p4k16M02j04j09
$$ -149 133 4 68 -17 -61 61 189 147 -35 -380 19 43 41 -22 134 -98 -163 -24 51 -23 -239 163 59 -50
5520e0j12P7P4P2L3r9l3j38K01K63n82O89n07q4J21J17l36J67K11j47j06K45j98
$$ -50 -162 -85 -11 61 94 -5 -38 -176 25 288 -294 395 -112 -196 -75 42 -294 -127 84 -63 -169 76 -122
5543a22K27O3l99M39k8l29j0K67m19J72J1lL18j48k09L05Pl45K31j86K92J7k27
$$ -122 105 168 -231 208 180 -149 -159 108 -311 -139 -128 -131 187 39 -170 135 142 -203 28 -158 134 151 -76
5566g6mP1Q8Mj30l9kj29L1J03k7Q9m0O3p6J48j14%j4J92j29J15j5j36K24k55L3
$$ -76 -80 -9 79 83 -47 -86 -88 -217 -186 -83 -110 -21 -61 2 -74 74 -40 -40 -54 138 9 124 109 -27 197 -58 -25
5593b5J32l43M57J09n23J83J1k50J53J66K7o5j42L35k72P6K28l77P1J05Pp4j40
$$ -25 107 -236 221 330 -193 -10 1 -249 -96 70 97 32 -110 225 -47 29 257 -120 -49 56 63 -11 -151
5616a51R1k1P6J79p0P8o5l0P8k86L29M9j16l04J27J45l07K4L59k68P5p7r9J19
$$ -151 -60 -81 -5 174 104 182 117 87 165 -121 208 257 141 -163 -36 109 -198 -174 185 -83 -8 -85 -184 -65
5640f5j88K77j46l5L31l57K47kl6M0j71K20j12O8k79L37q5j77K3J3q1K21j21R4
$$ -65 -253 24 -122 -157 174 -183 64 62 26 66 -105 115 3 71 -208 129 44 -133 -110 -97 -178 43 -78 16
5664A6j79K94mj14j18j6J94p2r5p2J20J9Kj80J99k82J67L78j56K3R6o58O26k18
$$ 16 -163 131 127 13 -105 -121 73 1 -94 -166 -46 -27 -25 -205 -6 -288 -121 257 101 124 220 -438 188 -30
5688c0N6R6j41j2O1J72j69n3j21k11L75N4K5k69J38M9k23R4K01k62L4m1n3J74
$$ -30 26 122 -19 -31 30 202 33 -20 -141 -352 23 77 102 -167 -29 20 -203 -109 92 -170 -136 -177 -230 -56
5712e6p6J15J14p1j1r4Jj1J20o8J5k23J11J44j31K48n9J01j00k91J65m7J86o7
$$ -56 -132 -17 97 26 15 -79 -78 -89 31 -37 -22 -245 -134 10 -121 127 68 169 69 -222 -57 -104 82 15
5736A5j87J25j6KJ48k1K7j87j2J69j23j65L18j52L0K0j37K46k02j47N91l80qo3
$$ 15 -172 -47 -63 -61 87 66 93 -94 -106 63 -60 -225 93 -59 -29 -9 -146 100 -102 -249 342 -38 -46 -109
5760a09M6K04r3j20Q8R3l14K05N4J6l29J40M7M0k3K2n5R6r0J25%j33M74m79P3
$$ -109 -63 141 48 -72 16 109 -205 0 54 70 -259 -119 -72 -32 -55 -33 -88 8 -82 43 43 -90 384 -95 -22
5785b2l0J85k34N2K42Rl44j3L1K67k48K46N8o0j50J14j67q0J53on7L1j69J01J65
$$ -22 -52 133 -101 -49 193 202 -142 -155 -124 143 -105 141 199 139 -11 103 -64 -144 9 3 -54 -23 -192 -91 74
5810G4r8k7MJ47l76K72j10K5J64P1L4j47J94m55K2K09o4O3L16n03K23j45PL18
$$ 74 -24 -51 -47 100 -276 -4 -114 -89 75 146 180 33 227 -228 -206 3 -61 2 318 -185 38 -107 -100 218
5834B18l13L2J03j8j17j43L91K17l84Ro2m4J45J41j5j92j90M52j99l4plP5J0l5
$$ 218 -95 -63 40 22 -95 -238 153 370 -14 -5 -67 -111 34 175 160 -32 -222 230 31 -3 -10 -13 62 72 37
5859C7J19j14o1J24k15M8L03j75j86m9M1P2J50k08K32m0N4k29P3N6l6l0J27p7
$$ 37 156 42 -19 105 -110 -62 241 66 -120 -169 -128 -56 94 -114 118 78 132 -97 -24 32 -4 -34 93 16
5883A6M3j15lJ10J99J7j72l88M10m4k18l5L7k8J1L03n3l7j80N6L68m88J17r0J66
$$ 16 59 -56 -59 51 250 267 95 -293 117 73 -145 -180 -143 -171 -160 143 90 53 -127 -71 297 -191 -74 -164 2
5908BP9K38m45j17J96q1J04o6q1N0J75j60L71k59O6r9NPL7N8m6p6P4K9j43J14
$$ 2 81 319 -126 -243 -47 -128 -24 -90 -171 -121 54 -106 265 6 72 -27 -22 -15 22 80 34 -42 32 61 -82 32
5934C2m9m6J23j80j06J47rl1K30J37k33L7Q0O7k66J02k4L5j87j46K39j44J79J36
$$ 32 -17 -63 60 -120 -226 -79 -88 -119 111 248 15 52 132 199 -67 35 11 46 -141 -287 -48 -192 -13 123
5958A23J98k86j49l6K14P2j43L6j14k23N00k5q1o2Q0j36j3JJ84j63pP8N8l54J53
$$ 123 321 35 -114 -150 64 136 -7 29 -85 -308 192 167 86 24 104 -32 -45 -44 140 -23 -30 48 106 -248 -95
5983i5L58j96j87J00O5J5q2L13j69k51J43J61P7k56K27l69K35Q8n4K6k97J71k4
$$ -95 263 67 -120 -20 45 60 -22 291 122 -129 14 175 252 -4 223 -146 89 177 123 149 -148 23 -1
6006ak75M40r7p0j54K63j20o9J40m7k3kK5j2J64j87p9k01L77j20J27lJ67k91J12
$$ -1 -276 164 67 -3 -157 106 -14 -83 57 10 -13 -15 10 -2 162 -25 -104 -305 72 -48 79 76 243 -48 64
6031F4j53Q2M0jm6n0K43k08n1MJ68j66m3L40l50P6K94k49K78j49L6l19L5J85J06
$$ 64 -89 -7 33 32 -14 -64 179 -29 -80 -76 92 -74 -117 223 -127 -51 243 -6 272 123 159 -160 -125 60 166
6056A66q3M1j33J59k78L62k10L8K00j26r4Q8r0k78L13l1k79J93l4n9K35j13J37
$$ 166 83 124 -9 150 -128 234 24 62 262 136 42 130 40 -238 75 44 -235 -42 -76 -135 100 -13 124
6079A24j70K94J2R3j80l97K69k25K96j52M00l26J60j04k31J82n6%m7Jm0J16q6
$$ 124 -46 248 260 353 173 -224 45 -180 116 -36 364 38 198 94 -137 45 -11 -11 -58 -57 -97 19 -67
6102f7l2J81O7m35K73J29j63K45j43P3m1p2m43N50k22j52L17j17J23j94O8R5k06
$$ -67 -99 82 149 -286 -13 116 -47 198 55 128 87 15 -428 122 -100 -252 65 -52 71 -123 -55 40 -166
6125a66M04j01j48L9j37K38j90j90L13N9j70M3k60L87l40J21M2j1j92J55J98J6
$$ -166 238 137 -11 28 -109 129 -61 -251 62 121 -49 -6 -266 121 -219 -98 -56 -67 -259 -104 94 110
6147A10r2J8O7j03L58k33Rj50m3J11r9l9K58lo02L47J32J56j48j3q1J08J69l63
$$ 110 18 36 103 0 358 125 134 -16 -59 52 -47 -86 172 169 -433 -86 46 202 54 41 -40 68 237 -126
6171a26J64M8rl6L7k17K1N5O2L49r6l27J63m0j00n9J28j7M4kj42J43R8k75L01
$$ -126 38 86 77 41 78 -139 -118 -63 -1 348 252 -75 88 48 -52 -111 17 0 44 42 -100 43 141 -134 167
6196A67o5J45m70M3K68q3j47K78k66K42k37K08J6j1l51J80J02K17L4k05j42%K16
$$ 167 102 247 -223 -180 88 5 -142 136 -130 112 -125 83 99 88 -263 -83 19 236 270 65 -77 -77 139
6219A39l13m2K08Q9j31K5j47O7K15J7J4k36L27m40K26q9J61j39R9j65Q2L45l20
$$ 139 -174 -216 -8 81 -50 -25 -172 -105 110 127 141 -95 232 -208 18 -71 90 -49 50 -115 -33 312 -8
6242hL7j94L82k57q4L19j07j3L24l65M59l90k38%J68qJ17O3p9j06J31k12J48k73
$$ -8 29 -165 217 -40 -124 195 88 75 399 34 493 103 -135 -135 33 25 142 205 126 20 151 -61 87 -186
6266a86k9NK89r0K26j98q3o5K40j40o9J66Qn3n3o8J53m4K28l65L02l48J62lj77
$$ -186 -215 -210 79 -11 215 17 -66 -131 109 -31 -100 66 74 21 -32 -100 53 9 237 -128 174 -174 -12 -15 -192
6291a92K64p3P9l52L11p8j72K54rO3l9o0N2L8J0k48P4m8k0J65k18J28J71k05n3
$$ -192 72 -1 78 -274 37 -41 -213 41 32 95 56 -4 48 86 96 -152 -78 -126 -146 19 -199 -71 100 -105 -158
6316a58J61J51k26P7r3k8K02j72J28k7P9k98J55K07k25l2j3n4J77KJ38j07j0j48
$$ -158 3 154 -72 5 -88 -116 86 -86 42 15 94 -204 -49 158 -67 -99 -112 -166 11 13 151 44 34 -114
6340a14nK64j77J5j45K22oJ27q1m3J46m98J27L06j94Q5j84J0r0K85j25J15j48
$$ -114 -119 145 -32 -17 -162 60 54 181 100 57 203 -295 -168 138 -56 29 -155 -145 -235 50 -75 40 -108
6363a08j38J46J09j47Q2o6J14O8L5q7K35m68K86j36K83K8J2j36R0l67K32j38K
$$ -108 -246 -100 9 -138 -56 -122 -8 60 95 8 243 -225 61 -75 208 236 248 112 202 -165 67 -71 -69
6386f9j25J83K3Qj42K38r6r5J92k14N7l2J04o4K6J53K12k58j03Q2k16N1J15j36
$$ -69 -194 -11 12 20 -122 116 20 -75 117 -97 -40 -72 32 -32 -6 147 359 101 -2 80 -136 -85 30 -106
6410a06K56m05K30J48j93J75j0j93jJ15j7j7L48k41r2j23J05m8J36j10l7k0k63
$$ -106 150 -255 -25 123 -70 105 95 -98 -99 16 -1 -18 330 89 -3 -126 -21 -69 67 -43 -80 -100 -363
6433c63K07L66l3k64j30L04q5J1N6p9p9jl1j6J12J60Mj17Q8j84J34Q1j05nj72
$$ -363 -156 210 177 -87 -217 87 2 13 69 -10 -89 -90 -121 -137 -25 135 139 22 110 -74 60 141 36 31 -141
$$ [...]
8191A11
##END NTUPLES=NMR FID
##END=
