##TITLE=1H_DE-36_NaOH
 D2O
 8 sc, 
 25.6.2024
##JCAMPDX= 6.0         $$ Bruker NMR JCAMP-DX V2.0
##DATA TYPE= NMR FID
##DATA CLASS= NTUPLES
##ORIGIN= UXNMR, Bruker Analytische Messtechnik GmbH
##OWNER= root
$$ XWIN-NMR		Version 3.5
$$ Tue Jun 25 16:42:41 2024 Russian Standard Time (UT+4h)  she@DPX200
##.OBSERVE FREQUENCY= 200.1312
##.OBSERVE NUCLEUS= ^1H
##.DELAY= (6, 6)
##.ACQUISITION MODE= SIMULTANEOUS
##.ACQUISITION SCHEME= undefined
##.AVERAGES= 8
##.DIGITISER RES= 18
##SPECTROMETER/DATA SYSTEM= spect
##.PULSE SEQUENCE= zg30
##.SOLVENT NAME= CDCl3
##.SHIFT REFERENCE= (INTERNAL, CDCl3, 0, 15.7039)
##AUDIT TRAIL= $$ (NUMBER, WHEN, WHO, WHERE, WHAT)
$$ ##TITLE= Audit trail, XWIN-NMR		Version 3.5
$$ ##JCAMPDX= 5.01
$$ ##ORIGIN= Bruker BioSpin GmbH
$$ ##OWNER= she
$$ F:/spectra/data/she/nmr/H-F/1/audita.txt
$$ ##AUDIT TRAIL=  $$ (NUMBER, WHEN, WHO, WHERE, WHAT)
(   1,<2024-06-25 16:41:58.84 +0400>,<she>,<DPX200>,
      <created by zg, POWCHK disabled, PULCHK disabled
       configuration hash MD5:
       00 E9 B6 7A A2 85 ED C7 34 08 36 98 17 FE 4E 26
       data hash MD5: 16K
       F5 FA 6E 3F 23 F4 0A AE 0C 26 60 2F 57 57 2A 8C>)
$$ ##END=
$$ 
$$ hash MD5
$$ 0A C1 42 4F 67 F5 A3 E2 6C B9 27 B8 20 2B D0 89
##$RELAX= 
##$RELAX= 
##$RELAX= 
##$RELAX= 
##$RELAX= 
##$RELAX= 
$$ Bruker specific parameters
$$ --------------------------
##$DU= <F:/spectra>
##$EXPNO= 1
##$NAME= <H-F>
##$PROCNO= 1
##$TYPE= <nmr>
##$USER= <she>
##$AMP= (0..31)
100 100 100 100 100 100 100 100 100 100 100 100 100 100 100 100 100 100 
100 100 100 100 100 100 100 100 100 100 100 100 100 100 
##$AQSEQ= 0
##$AQ_mod= 1
##$AUNM= <au_zg>
##$AUTOPOS= <>
##$BF1= 200.13
##$BF2= 200.13
##$BF3= 200.13
##$BF4= 200.13
##$BF5= 200.13
##$BF6= 200.13
##$BF7= 200.13
##$BF8= 200.13
##$BYTORDA= 1
##$CFDGTYP= 0
##$CFRGTYP= 5
##$CHEMSTR= <none>
##$CNST= (0..31)
1 1 145 1 1 1 1 1 1 1 1 1 1 1 1 1 1 1 1 1 1 1 1 1 1 1 1 1 1 1 1 1 
##$CPDPRG= <>
##$CPDPRG1= <>
##$CPDPRG2= <>
##$CPDPRG3= <>
##$CPDPRG4= <mlev>
##$CPDPRG5= <mlev>
##$CPDPRG6= <mlev>
##$CPDPRG7= <mlev>
##$CPDPRG8= <mlev>
##$CPDPRGB= <>
##$CPDPRGT= <>
##$D= (0..31)
0 1.2 0 0 0 0 0 0 0 0.06 0 0.03 0 0 0 0 0.0002 0 0 0 0 0 0 0 0 0 0 0 0 
0 0 0 
##$DATE= 1719319318
##$DBL= (0..7)
120 120 120 120 120 120 120 120 
##$DBP= (0..7)
150 150 150 150 150 150 150 150 
##$DBP07= 0
##$DBPNAM0= <>
##$DBPNAM1= <>
##$DBPNAM2= <>
##$DBPNAM3= <>
##$DBPNAM4= <>
##$DBPNAM5= <>
##$DBPNAM6= <>
##$DBPNAM7= <>
##$DBPOAL= (0..7)
0.5 0.5 0.5 0.5 0.5 0.5 0.5 0.5 
##$DBPOFFS= (0..7)
0 0 0 0 0 0 0 0 
##$DE= 6
##$DECBNUC= <off>
##$DECIM= 32
##$DECNUC= <off>
##$DECSTAT= 4
##$DIGMOD= 1
##$DIGTYP= 9
##$DL= (0..7)
0 120 120 120 120 120 120 120 
##$DP= (0..7)
150 150 150 150 150 150 150 150 
##$DP07= 0
##$DPNAME0= <>
##$DPNAME1= <>
##$DPNAME2= <>
##$DPNAME3= <>
##$DPNAME4= <>
##$DPNAME5= <>
##$DPNAME6= <>
##$DPNAME7= <>
##$DPOAL= (0..7)
0.5 0.5 0.5 0.5 0.5 0.5 0.5 0.5 
##$DPOFFS= (0..7)
0 0 0 0 0 0 0 0 
##$DQDMODE= 0
##$DR= 18
##$DS= 0
##$DSLIST= <SSSSSSSSSSSSSSS>
$$ [...]
##$SUBNAM2= <"">
##$SUBNAM3= <"">
##$SUBNAM4= <"">
##$SUBNAM5= <"">
##$SUBNAM6= <"">
##$SUBNAM7= <"">
##$SUBNAM8= <"">
##$SUBNAM9= <"">
##$SW= 18.0517418723606
##$SWIBOX= (0..15)
0 0 2 0 0 0 0 0 0 0 0 0 0 0 0 0 
##$SW_h= 3612.71676300578
##$TD= 16384
##$TD0= 1
##$TE= 0
##$TE2= 300
##$TE3= 300
##$TEG= 300
##$TL= (0..7)
0 120 120 120 120 120 120 120 
##$TP= (0..7)
150 150 150 150 150 150 150 150 
##$TP07= 0
##$TPNAME0= <>
##$TPNAME1= <>
##$TPNAME2= <>
##$TPNAME3= <>
##$TPNAME4= <>
##$TPNAME5= <>
##$TPNAME6= <>
##$TPNAME7= <>
##$TPOAL= (0..7)
0.5 0.5 0.5 0.5 0.5 0.5 0.5 0.5 
##$TPOFFS= (0..7)
0 0 0 0 0 0 0 0 
##$TUNHIN= 0
##$TUNHOUT= 0
##$TUNXOUT= 0
##$USERA1= <user>
##$USERA2= <user>
##$USERA3= <user>
##$USERA4= <user>
##$USERA5= <user>
##$V9= 5
##$VALIST= <valist>
##$VCLIST= <CCCCCCCCCCCCCCC>
##$VD= 0
##$VDLIST= <DDDDDDDDDDDDDDD>
##$VPLIST= <PPPPPPPPPPPPPPP>
##$VTLIST= <TTTTTTTTTTTTTTT>
##$WBST= 1024
##$WBSW= 4
##$XGAIN= (0..3)
0 0 0 0 
##$XL= 0
##$YL= 0
##$YMAX_a= 226319
##$YMIN_a= -203492
##$ZGOPTNS= <>
##$ZL1= 120
##$ZL2= 120
##$ZL3= 120
##$ZL4= 120
##$ABSF1= 10
##$ABSF2= 0
##$ABSG= 5
##$ABSL= 3
##$ALPHA= 0
##$AQORDER= 0
##$ASSFAC= 0
##$ASSFACI= 0
##$ASSFACX= 0
##$ASSWID= 0
##$AUNMP= <proc_1d>
##$AZFE= 0.1
##$AZFW= 0.1
##$BCFW= 1
##$BC_mod= 2
##$BYTORDP= 1
##$COROFFS= 0
##$CY= 11.3945322036743
##$DATMOD= 1
##$DC= 2
##$DFILT= <>
##$DTYPP= 0
##$F1P= 15.6554695791079
##$F2P= 12.8336369535428
##$FCOR= 0.5
##$FTSIZE= 0
##$FT_mod= 4
##$GAMMA= 1
##$GB= 0.15
##$INTBC= 1
##$INTSCL= 1
##$ISEN= 128
##$LB= 0.24
##$LEV0= 0
##$LPBIN= 0
##$MAXI= 10000
##$MC2= 0
##$MEAN= 0
##$ME_mod= 0
##$MI= 1.114404
##$NCOEF= 0
##$NC_proc= 0
##$NLEV= 6
##$NOISF1= 3.799351
##$NOISF2= 2.8
##$NSP= 1
##$NTH_PI= 0
##$NZP= 0
##$OFFSET= 15.70392
##$PC= 1
##$PHC0= -25322.5
##$PHC1= 9.587481
##$PH_mod= 1
##$PKNL= yes
##$PPARMOD= 0
##$PSCAL= 0
##$PSIGN= 0
##$REVERSE= no
##$SF= 200.130013532006
##$SI= 16384
##$SIGF1= 3
##$SIGF2= 2
##$SINO= 400
##$SIOLD= 16384
##$SREGLST= <1H.CDCl3>
##$SSB= 0
##$STSI= 0
##$STSR= 0
##$SW_p= 3612.71676300578
##$SYMM= 0
##$S_DEV= 0
##$TDeff= 0
##$TDoff= 0
##$TI= <>
##$TILT= no
##$TM1= 0
##$TM2= 0
##$TOPLEV= 0
##$USERP1= <user>
##$USERP2= <user>
##$USERP3= <user>
##$USERP4= <user>
##$USERP5= <user>
##$WDW= 1
##$XDIM= 8192
##$YMAX_p= 0
##$YMIN_p= 0
$$ End of Bruker specific parameters
$$ ---------------------------------
##NTUPLES= NMR FID
##VAR_NAME=  TIME,          FID/REAL,        FID/IMAG
##SYMBOL=    X,             R,               I
##VAR_TYPE=  INDEPENDENT,   DEPENDENT,       DEPENDENT
##VAR_FORM=  AFFN,          ASDF,            ASDF
##VAR_DIM=   8192,          8192,            8192
##UNITS=     SECONDS,       ARBITRARY UNITS, ARBITRARY UNITS
##FACTOR=    0.0002768,     1,               1
##FIRST=     0,             0,               0
##LAST=      2.2672688,     0,               0
##MIN=       0,             -203492,         0
##MAX=       2.2672688,     226319,          0
$$ Real data points
##PAGE= N=1
##DATA TABLE= (X++(R..R)), XYDATA
$$ [...]
2112A82R96N44N60P36k15j240j009j000j078j049j64L23N55O41J100J423J079
2129B384K01l6k02n14j510j303r45l46l85j77Q74J228J197P15Q80P44l2p64r37
2148A072p68j062j463m95j7L88P78O87J394J288O67O6q7k72j167j429o45r38m17
2167b420m35N29J027J123P93J000R67L13m82r47o13j004j499p09j90Q4L58Q63
2185a242J223J216P14M16J67j14o18j539j039n28p79o50J0J110R03P05J012J143
2203B110P02k35o66o09p45j474j171k34j79J36N13J190J220P40N57P46N3n35j154
2222I65r63r29q10o25j51M31P58Q25R25J103R00q7k15k75p26j331j154p19o6k47
2242b391M13Q32R20J140N75N68O42l60q88r10q17q35j087m14K58N77O53J006J069
$$ plain form
2112 182 1178 1722 2282 3018 2803 1563 554 -446 -1524 -2573 -2737 -2414 -1859 -1218 -118 1305 2384
2129 2384 2585 2549 2347 1833 323 -980 -1925 -2271 -2656 -2833 -1959 -731 466 1181 2061 2805 2773 2009 1072
2148 1072 304 -758 -2221 -2716 -2733 -2345 -1567 -880 514 1802 2469 2535 2448 2176 1009 -420 -1065 -2003 -2420
2167 -2420 -2855 -2326 -1299 -176 617 1617 2584 2897 2415 1468 855 -149 -1648 -2357 -2547 -2463 -2105 -1242
2185 -1242 -19 1197 1911 2327 2494 2380 1762 223 -816 -1344 -2123 -2773 -2763 -1653 -750 -45 967 2110
2203 2110 2812 2577 1911 1302 557 -917 -2088 -2322 -2501 -2365 -1852 -662 558 1298 1855 2601 2654 2119 965
2222 965 2 -927 -1737 -2362 -2513 -2082 -1324 -499 426 1529 2429 2342 2127 1852 1126 -205 -1359 -2078 -2144 -2391
2242 -2391 -1978 -1146 -226 914 1489 2057 2699 2339 1451 541 -276 -1111 -2198 -2612 -2354 -1777 -1124 -118 951
2261I51R37M25Jk41n81j145j157o53o00k92j2Q25J049P89P46P90P00k36n07p03
2281A086q61r67j082o15K24K73M27P50J322J101M49P3J37m09j108j096p47o43
2299a686n57j79L76R60P66Q53R21R12N4l88p36m10j239j017o95j17n2M30O40J242
2319G8J085M09L31M60j84j085r09p30n71r17m70J53P42Q81O52J035J037L51l49
2338A999k45m99j034j008j044k75n3q6M59J087J165P71O32M78P5p93q77r08p32
2357h88p89p27K43N62M81N54J198R89O81j31k60j17j073j043j151k63l76k76L35
2376b051J324P66O55P55O40K13k99q22p44o75j057q39j67M43K31P04Q42J107P19
2395A745K03P7k78n31j054r03o47l01l55k7P85Q73M98J079O96M49l43l33o59q18
$$ plain form
2261 951 1888 2313 2314 2073 1492 347 -810 -1463 -2063 -2355 -2367 -1542 -493 296 1042 1832 2532 2296 1789 1086
2281 1086 225 -742 -1824 -2439 -2215 -1942 -1515 -765 557 1658 2107 2180 2317 1908 800 -296 -1043 -1686
2299 -1686 -2243 -2422 -2046 -1086 -320 533 1454 2366 2420 2032 1296 886 -353 -1370 -2065 -2182 -2234 -1804 -1164 78
2319 78 1163 1572 1903 2363 2179 1094 185 -545 -1116 -2033 -2503 -2350 -1608 -727 -75 960 1997 2348 1999
2338 1999 1754 1255 221 -787 -1831 -2106 -2159 -2245 -1786 -699 466 1237 1869 2347 2422 1629 752 -156 -888
2357 -888 -1677 -2404 -2161 -1599 -1118 -564 634 1623 2304 2173 1913 1796 723 -320 -1471 -1734 -2110 -2386 -2051
2376 -2051 -727 39 694 1449 2089 2302 2003 1181 437 -238 -1295 -2134 -2301 -1858 -1627 -923 -81 1026 1745
2395 1745 1948 2025 1747 1216 162 -741 -1388 -1689 -2044 -2071 -1286 -413 85 1164 1860 2309 1966 1633 974 156
2415A56j095r69j16J12J16N01P80J171P97K53L73j27l90q11j114n52m70n52m25
2434b362O75P63P74O17R66P95j22l06n44n89j040r47n34j52K00J04Q57J084P77
2453A016M90M72O8j13r90p73o99p58o20m35M42P46O15O83R33R39P1k63j64p67
2473H93p33j153n45m21j57K19P15P98R62N12P24L23m2o46q76n73q99p31n53J64
2493b019L71O58N83R79J077L09p3k14j49p81j279n20l67m56j88M83P68R44O21
2512G47P73L44K65n02o76n38p82p97q13j41M95K28M47J139Q83M93M01k7k39n19
2532A181j209n25p04n87k96L04P43P62N21P06Q77L6k5l39o61p81q00q84k50J88
2552a743r1O78Q12J109N41K55K96q4l43j036o00o40p63m19k7P25P73L11R84O66
$$ plain form
2415 156 -939 -1908 -2024 -1912 -1796 -1295 -515 656 1453 1706 2079 1952 1562 751 -363 -915 -1385 -1937 -2362
2434 -2362 -1687 -924 -150 467 1433 2228 2106 1800 1256 667 -373 -1320 -1854 -2006 -1806 -1702 -845 239 1016
2453 1016 1506 1978 2046 1933 943 170 -529 -1287 -1907 -2342 -1900 -1154 -539 144 1077 2016 2087 1824 1660 893
2473 893 160 -993 -1538 -1959 -2116 -1897 -1182 -384 578 1090 1814 2137 2095 1449 573 0 -899 -1630 -2183 -2019
2493 -2019 -1648 -990 -407 572 1649 1958 1885 1671 1522 741 -538 -1058 -1425 -1881 -2069 -1586 -818 126 747
2512 747 1520 1864 2129 1627 951 413 -369 -1166 -1979 -2120 -1625 -1397 -950 189 1072 1565 1966 1939 1700 1181
2532 1181 -28 -553 -1257 -1844 -2140 -1836 -1093 -331 190 896 1773 1809 1784 1445 784 3 -797 -1681 -1931 -1743
2552 -1743 -1834 -1156 -344 765 1306 1561 1857 1773 1430 394 -206 -846 -1609 -2028 -2055 -1330 -557 -246 738 1404
2572A404N60j29p9n62o17j004r83j33j46ML51N49J119O10J95M14M14m73m60r51
2592H3l86o61q65j40M80M15L91Q05R80O95l6k0l36m97q75j021m51j65l57J72P24
2613a065R70N02O30N78L65k9q43m98o75p21o92k80Q2M81K81O57R19Q18K34j03
2633A611N5m42o91j051n14l90k78j13N12P40P02M16P05M42P1m32n70n38p11q63
2653a339n07K59J60L25N50Q60P92J78N06j22k07o24r71n79m07m20l69M96O32O73
2673a14M72O14P10Q9k34o57j33p55r42n23j24J58n1N43O43J052L55M50L48l15
2693A586n68q32n54m92m47n25Q3M20Q47M19O27O42N57j08k85l91m58j035q07k68
2713a589%m7M39P01P86N20L48N38m0m60p49m55o77n89n23K60L59K18N81O48Q88
$$ plain form
2572 1404 1964 1835 1756 1194 577 -427 -1410 -1543 -1689 -1685 -1334 -785 334 944 1139 1553 1967 1494 1034 83
2592 83 -303 -964 -1829 -1969 -1489 -1074 -683 122 1102 1797 1761 1741 1405 908 33 -988 -1439 -1604 -1961 -1789 -1065
2613 -1065 -95 407 1037 1615 1980 1951 1108 610 -65 -786 -1478 -1758 -1676 -1195 -914 -257 662 1480 1714 1611
2633 1611 1666 1224 533 -518 -1032 -1422 -1700 -1813 -1301 -561 141 557 1262 1704 1775 1343 773 235 -476 -1339
2653 -1339 -1846 -1587 -1427 -1102 -552 308 1100 1278 1784 1662 1455 831 -140 -719 -1126 -1546 -1915 -1419 -787 -114
2673 -114 358 972 1682 1771 1537 880 747 -8 -950 -1473 -1597 -1439 -1490 -947 -304 748 1103 1553 1901 1586
2693 1586 1018 186 -368 -860 -1307 -1832 -1749 -1329 -482 -63 564 1206 1763 1655 1370 979 521 -514 -1321 -1589
2713 -1589 -1589 -1636 -1197 -496 290 810 1158 1696 1656 1196 447 -8 -685 -1274 -1797 -1537 -1178 -960 -379 269 1157
2734A157L49J19k34k43o18p97n68m04j34l32M94M08P15M66P09N09J43l21n73l50
2754D95n37p85o50pM3K65M81M75R33O96J29r0q6m31p14p37n05j97l30J31M94N37
2776c90N66O72M11L56r0m44n37l48p93o43j64j8PK11Q16Q07O18K67K3K64m47p39
2798D05n20m93n21k94j63K58O45N07O62N27N10r2k41l36l22o77o95o01Q1j49K02
2819a307O00Q14M88M89M16J85l97n45n81n46n47m22k28K46N05K22Q08M09Q30J4
2839A453j7l36l73n43q14l49l98k4l7O86M76O72K73M50N45j36l54o22m23o29o83
2860a183k55K04J11K04N31P61O26L46m3ml20o59o81o81m5j59k20K21P55N50L60
2881D19M80L51J88k75m95l09o26n09n95O7K7L63L51O57O26L71K02K4j16l51p21
$$ plain form
2734 1157 1506 1625 1391 1148 530 -267 -835 -1239 -1373 -1705 -1211 -803 -88 378 1087 1596 1739 1418 845 495
2754 495 -42 -827 -1477 -1484 -1441 -1176 -695 -220 713 1409 1538 1448 1362 931 217 -520 -1025 -1222 -1552 -1421 -927 -390
2776 -390 176 848 1259 1615 1525 1081 544 196 -597 -1240 -1404 -1422 -1415 -1204 -388 419 1037 1304 1327 1591 1144 405
2798 405 -115 -608 -1129 -1423 -1586 -1328 -683 -176 486 1013 1523 1431 1190 854 532 -145 -840 -1441 -1360 -1509 -1307
2819 -1307 -707 107 595 1084 1500 1685 1288 743 162 -384 -931 -1353 -1581 -1335 -830 -608 200 609 1439 1453
2839 1453 1436 1100 727 184 -630 -979 -1377 -1401 -1438 -752 -276 396 669 1119 1664 1528 1174 552 129 -500 -1183
2860 -1183 -1438 -1234 -1123 -919 -388 373 999 1345 1302 1298 978 319 -362 -1043 -1088 -1247 -1467 -1246 -491 59 419
2881 419 899 1250 1438 1163 668 359 -267 -776 -1371 -1304 -1277 -914 -563 94 720 1091 1293 1317 1201 850 129
2902A29o83k60m49j65J19O01M43M37N67M41L44k31m33m05m40o94m76j48Q7P9M33
2923g04N69N84N51J96J65L9m54o90n97m60l68j82K0L23N55M78R2J140J8K3k88
2944A010l31m16n32o52k64m0J7J65N98M96O21K56K38K28l00m47n45m11m90o43
2964a442k5M48K7M46Q01O22K86R5l6j69m62o64n77l64J0k76K8N18N21N32M22N70
2986A311N9k61l57m26m19m22p08j02K35J61P3P12M58O13L34Jj67k37o19o19o02
3007i82K2k26j22K96N88N27L72N35M37r1n68k27k92p13n62k35L7K24nL98Q09N88
3029H10K48K7N5k53m17m22m66m94l61o7K55N15M85L63M14O81j87q8l28k65o66
3050a61n92k82j00P6J94J39P20M97L79K72J96j60l51o39l90l90m61l37J58M49
$$ plain form
2902 129 -554 -814 -1263 -1428 -1309 -708 -265 172 739 1180 1524 1293 860 455 15 -679 -1155 -1303 -1216 -1137 -704
2923 -704 -135 449 1000 1196 1361 1400 946 256 -341 -801 -1169 -1351 -1331 -1008 -453 25 117 1257 1275 1298 1010
2944 1010 679 263 -269 -921 -1185 -1225 -1208 -1043 -445 51 672 928 1166 1394 1094 647 102 -309 -799 -1442
2964 -1442 -1467 -1019 -992 -546 255 877 1163 1258 1222 1053 591 -73 -650 -1014 -1004 -1280 -1252 -734 -213 319 741 1311
2986 1311 1370 1109 752 326 -93 -515 -1223 -1325 -1090 -929 -856 -144 314 927 1261 1262 1095 858 239 -380 -982
3007 -982 -960 -1186 -1308 -1012 -424 103 475 1010 1447 1356 788 561 269 -444 -1006 -1241 -1204 -980 -985 -587 222 810
3029 810 1058 1085 1140 887 470 48 -418 -912 -1273 -1340 -1085 -570 -85 278 692 1373 1186 1098 770 505 -161
3050 -161 -753 -1035 -1135 -1059 -865 -726 -6 491 870 1142 1338 1178 827 188 -202 -592 -1053 -1390 -1232 -783
3070g83L46K87P03L76L47Kl52j44p15n29m46l8j06j16K14O95P88K13O1M06N2l95
3092H66n36k53m05n19m56P8K51L30J84O67P22J74Q8Jj65m52n64n89l50j85o8J02
3114a079O11N04K72M43M50J10j77l96m53l52o37l02j79OL94J61O77M27N15K1J58
3135A174j53l22m08o61k32n18n6K7L21N21K72Q43J08L87k55k32j57m81n69o92
3155a083l36L45L3K24N88N17N07P9K63M3k25o76m42k41m51l46O6R5M95M25L21
3176B01O45L29o7m0l39l35p39k27m01j3r4J97L26O37O26J91R3Q3%n14m30l61l95
3199f27n71j58L20L76K99N56M48L94J51k24o4l73k84p92m34J87k41O4J41P03M54
3220C25J52M82K51o9l94m04m71l16o40n9N3L97J97L47N41N11L8L0K56n58k57p17
$$ plain form
3070 -783 -437 -150 553 929 1276 1278 926 782 67 -462 -908 -946 -1052 -1168 -954 -259 529 742 803 1209 1261 866
3092 866 330 77 -328 -847 -1303 -1225 -974 -644 -460 207 929 1103 1191 1192 1027 575 11 -578 -928 -1113 -1181 -1079
3114 -1079 -468 36 308 751 1201 1311 1134 738 285 -67 -704 -1006 -1185 -1179 -785 -624 53 480 995 1016 1174
3135 1174 1021 699 291 -370 -602 -1120 -1176 -1149 -828 -307 -35 808 916 1303 1048 816 659 178 -391 -1083
3155 -1083 -1419 -1074 -1041 -817 -229 288 795 874 1137 1180 955 279 -163 -404 -855 -1201 -1135 -1040 -545 -120 201
3176 201 846 1175 1108 1068 729 394 -345 -572 -973 -986 -1080 -883 -557 80 706 897 990 1073 1073 559 129 -232 -627
3199 -627 -1198 -1356 -1036 -660 -361 195 643 1037 1188 964 900 527 243 -549 -983 -796 -1037 -973 -832 -129 325
3220 325 477 959 1210 1141 747 343 -128 -444 -1084 -1143 -1090 -693 -496 -149 392 903 941 971 1227 669 412 -305
3242c05k61k35l03J03J24M90M48K40N12M31k56n6m86p4p01k39n51NP3L14L33K24
3264a70R29J33O2J25L7m32o89n19j19l12j22P4M45M89J84N29N19N9k13l19k48
3285D42m71o16l80l6J68M3J73N82N12K25L59J56j94l43l05o71k64k02l23J12K54
3306g79M22L58L64N44Q9q1o0l95l26n08k54l14N5k76L61L87P36J91M47J60Q1k19
3328I83n93m47k80n14l23O7J25M40L07L84N69K55J06p4k32j94p68l12n35K48l08
3349a096K03M20L49M28L22L08R9k7n77o3l60m47n64j39O3L83J25N47L78N43K8
3370I23J86j44k28m10q16k07j76M5j92L74L39M22L96L23K64j5l52k23m26l61m36
3391g14l76j20M34Q5L73N67L91K98k1J45k43l44o37l98k76p5k13J0Q18J65M75
$$ plain form
3242 -305 -566 -801 -1104 -1001 -877 -387 61 301 813 1244 988 932 446 372 -329 -568 -1119 -1114 -1041 -727 -394 -170
3264 -170 759 892 954 1079 1116 684 -5 -524 -643 -955 -1077 -1003 -558 -69 115 644 1163 1222 1009 690 442
3285 442 -29 -645 -1025 -1061 -893 -850 -677 -95 417 642 1001 1157 963 620 315 -356 -620 -822 -1145 -1033 -779
3306 -779 -357 1 365 909 998 917 857 462 136 -372 -626 -940 -885 -1161 -800 -413 323 514 961 1121 1202 983
3328 983 390 -57 -337 -851 -1174 -1107 -982 -542 -235 149 718 973 1079 1005 773 579 -189 -501 -1036 -788 -1096
3349 -1096 -893 -473 -124 304 626 934 1033 1006 429 366 6 -441 -1005 -1144 -1081 -698 -573 -26 352 895 923
3370 923 1109 965 737 327 -489 -696 -872 -827 -1019 -645 -306 116 512 835 1099 1084 732 509 83 -278 -714
3391 -714 -1090 -1210 -776 -691 -318 249 640 938 917 1062 819 475 -162 -560 -836 -911 -1124 -1114 -296 -131 344
3412C44L55L67P9k18j33m21n24n69k12q4N1K01K60O74L22K8M35L0P9n09n12k92
3434b49k14n79j33R0N33K79K70N79L43R6ok84r9m92n75k72l18l2q7P49K26M55
3456B80L02L7M47j02m44k71j93l81n22j36n1K43K37K75O32O68j05J4j34l9l47
3477D10o56l71l80J34k09O9O16M61L60J57N63j33k29l36l47k84m40k64j92Q8L47
3498f36J31N27N46J79J85k7L4m91l90n55j79k28k8j17O55K14L58L26M05k5lj10
3520G71l22n34m67l50j85M9K68J94M63M64L24J50J14K74m63n57l86k81l12k21
3540a007lK17M35L07L10K97M84j60k01k42m13m27l23k06r4J29K23K27O89J82L13
3561G37R1J54k89n36j16l87l37k54j9J83J45M69J31N34M95j3j81j84j40n95n15
$$ plain form
3412 344 699 1066 1145 927 794 373 -151 -720 -932 -1016 -965 -764 -504 170 492 520 955 985 1064 555 43 -249
3434 -249 -463 -1042 -1175 -1085 -552 -273 -3 576 919 1015 1009 725 626 134 -441 -713 -1031 -1063 -1150 -401 -175 280
3456 280 582 619 1066 964 520 249 56 -325 -847 -983 -1034 -791 -554 -279 353 1021 916 930 796 757 410
3477 410 -246 -617 -997 -863 -1072 -1003 -387 74 434 591 1154 1021 792 456 109 -175 -615 -879 -1071 -983 -636
3498 -636 -505 22 568 747 932 905 939 448 58 -497 -676 -904 -932 -1049 -394 -180 178 504 909 884 881 771
3520 771 449 -85 -552 -902 -1087 -1038 -770 -576 -113 351 675 825 939 1213 750 193 -193 -474 -786 -1007
3540 -1007 -1010 -793 -358 -51 259 556 1040 880 679 437 24 -403 -726 -932 -1026 -897 -674 -447 242 424 737
3561 737 828 982 693 157 41 -346 -683 -937 -956 -773 -628 -159 -28 506 1001 988 807 623 483 -112 -627
3582f27l46kj4R7L77M31M60L04J93j6p2k58l34l52l97l11P8p4Q8L85M90M90J28
3605G18P7l4k9j38m51n52k71p5K2k54J93P07L72J72M18J27O8l63k67k74m39m14
3627f87k47J55R5L42O1N29L00K87R8q9j32m27l36l75l24n2k3l5M42L89K46L34
3649E51M90j97k22j02j24n52n96j97q7L42P1K53M64M26L02kP3k5l31m52l76j98
3671d89o6l63q4N14L94J82L17K39K46q7k65j52m33l73k53j53k0J19M6Q12K45K15
3693E91L78p7j09l20l62k29l19j89n43K98K15J79M08M28L31K24j09r2j46l74m45
3714b62l93J6k83MK15L81N57J95L07J69j90M5l67k50m17k27m77J44K02K66KM07
3736D4L34M72j10o9j86l7o87j09k38j42k28J77L24M46M66J04K09K19l79j85k57
$$ plain form
3582 -627 -973 -975 -989 -892 -515 -84 376 680 873 857 785 527 193 -159 -556 -867 -789 -863 -775 -390 100 590 718
3605 718 795 761 732 594 143 -409 -680 -755 -733 -987 -794 -87 285 457 875 1002 1070 707 440 166 -273 -687
3627 -687 -934 -779 -684 -342 -281 248 548 835 933 844 712 285 -51 -426 -750 -802 -825 -860 -418 -29 217 551
3649 551 1041 844 622 520 396 -156 -752 -949 -1036 -694 -623 -370 94 520 822 820 893 868 537 85 -291 -489
3671 -489 -555 -918 -1002 -488 -94 88 405 644 890 803 538 386 -47 -420 -673 -826 -846 -727 -681 131 376 591
3693 591 969 892 783 463 101 -128 -447 -636 -1179 -881 -666 -487 -79 349 680 904 795 703 557 183 -262
3714 -262 -655 -639 -922 -918 -703 -322 235 430 737 906 716 761 394 144 -273 -500 -977 -833 -631 -365 -363 44
3736 44 378 850 740 671 485 448 -239 -348 -586 -728 -956 -779 -455 -9 457 561 770 989 610 425 168
3757A68l51j51m58jJ15M7N8N59M62K36n5L3k1j56l61n15r8m4k60L7J80L37K48
3780IK83M02PJ13k26k37k50m22j59m29K13J79o2M97K67L42j71L22J25k20l0o67
3802a14k09k69j46p8J62J46L71L45L70J81R5l09j9l84k49l10k21n8Qo2M12M30
3824I2L68N3J9O9J15l05l05k45j38m94J6J4K46K63J25K99K93L14l3j87l80j01
3846I8m07l15L1j48K21NM49L46N6J56J66K6j54k92j86k04n97QjJ55J99L74K96
3869B82K51J0J24k68K13l59l65k83j63%k37L06L99K46J87M9L16O3l26j04r2k70
3891b1l15j61j49J79J8p6M01N10K64mrj14k58k38k21j87j36k88L80J72R9K49J18
3914B13L54K05j50k90j56k27l04k49J3m7J24Q5L78K99L30J0r2J47k18J8m93k19
$$ plain form
3757 168 -183 -334 -792 -793 -678 -631 -573 -14 448 684 629 662 641 485 124 -391 -489 -533 -793 -756 -576 -239 9
3780 9 292 694 701 814 588 351 101 -321 -480 -909 -696 -517 -579 -82 185 527 356 678 803 583 553 -114
3802 -114 -323 -592 -738 -816 -654 -508 -137 208 578 759 854 545 526 142 -107 -417 -638 -696 -688 -750 -338 92
3824 92 460 513 532 601 716 411 106 -139 -277 -771 -755 -741 -495 -232 -107 192 485 799 766 579 199 98
3846 98 -309 -624 -593 -741 -520 -515 -66 280 336 492 658 684 530 238 52 -152 -749 -741 -742 -587 -388 -14 282
3869 282 533 543 667 399 612 253 -112 -395 -558 -558 -795 -489 -90 156 343 392 708 771 445 341 249 -21
3891 -21 -336 -497 -646 -467 -449 -525 -124 386 650 646 637 523 265 27 -194 -381 -517 -805 -425 -253 -154 95 213
3914 213 567 772 622 332 176 -51 -355 -604 -591 -638 -514 -429 -51 248 578 588 496 643 425 443 -50 -269
3936b69j67k49m7K75K89R5K22M05J9R9j22k31l81j26k46j50Q2K4L9K30K59K16
3958B66qL82p3m3k05l26q3l92k26R6J16K90O6J72M33O8O3j23o9k11p8n82Q9j78
3982e56M8p7K98J16M18K78l2J93j00o7m09p8k60k03k25J53r3M12J47L04J09K30
4004F06J1k35n0j97n00J58l14oq7K51J88J79L12J29J84j1k75j80p1l82k45j91
4026g26J67J68O3K71K74kL66n2k1m7k22k20j88k90p8PJ42J47O2K54L55J21J6q9
4050D78j00k83j4m46j92l8K2O8J08M76J88L79k11J36k6k65j22l86Nj41l39N9L39
4073c05j1K77J96K98K82k90k04n5j16l03r6j92J34j42J46J15N13J28OJ67J08l02
4095C54r7l11j39l13J3j62J62L45kL03L36J12O9j29k03k31j89l10r2K1j77K23
$$ plain form
3936 -269 -436 -685 -732 -457 -168 -73 149 554 573 672 550 319 -62 -188 -434 -584 -502 -478 -439 -209 50 266
3958 266 258 640 567 524 319 -7 -90 -482 -708 -612 -496 -206 -140 32 465 533 596 473 404 193 115 -467 -378 -556
3982 -556 -508 -585 -287 -171 247 525 493 686 586 519 110 32 -228 -431 -656 -503 -596 -184 -37 267 376 606
4004 606 617 382 332 135 -365 -207 -521 -527 -614 -363 -175 4 316 445 629 618 343 163 92 -290 -535 -726
4026 -726 -559 -391 -328 -57 217 215 581 529 508 461 239 19 -169 -459 -537 -530 -388 -241 -179 75 430 551 567 478
4050 478 378 95 81 -365 -557 -595 -573 -505 -397 79 267 646 435 571 545 280 158 -228 -223 -364 -703 -644 -305
4073 -305 -316 -39 157 455 737 447 243 188 72 -231 -327 -519 -385 -527 -381 -266 247 375 381 548 656 354
4095 354 257 -54 -193 -506 -493 -655 -493 -148 -150 153 489 601 670 541 338 107 -82 -392 -484 -463 -640 -417
4117d17O6K57M04R8K67L5k49k57j16k31j84l38Q3L12n9N8K19L64J71Q6j02n2n5
4140C60l03j81j15j72q7j30J57N45q1J70K76K34j35l50L4k04j69m56M5P8K00l8
4162c22J83L47J53J65n3K7j67j28n06R4j92j16O6nL66j10N12R6J48o3q8j75M3
4185B75l98j90k11O3j84J30K22L06J16K42K60j20k9k62k75r3j81k0k93K92K61
4206h9j13J34L52J49L3J06j71j43j20k89k34p0k7O4J54L48K30l3K99l0P5l53k16
4229E6l4k94j74J6KJ46J57J17Q2L21L43l12J5K8l63k56j88j40N6j16J39P9N85
4252B65J28j29L41m9j51j07k53k66k8k01O9K8mP6M25K32J3jK5m1j57k14k49k24
4276d72K8k51J52L14K9L81N6K31K9j19p9j30k54j78k03L7j09M5K63J23L56Q6J40
$$ plain form
4117 -417 -351 -94 310 408 675 710 461 204 88 -143 -327 -665 -582 -270 -329 -271 -52 312 483 569 467 415 360
4140 360 57 -124 -239 -411 -498 -628 -471 74 -7 163 439 673 538 188 222 18 -151 -607 -562 -484 -284 -322
4162 -322 -139 208 361 526 473 500 333 205 -301 -207 -399 -515 -449 -454 -88 -198 314 410 558 495 407 232 275
4185 275 -123 -313 -524 -461 -645 -515 -293 13 129 371 631 511 482 220 -55 -148 -329 -349 -642 -350 -89
4206 -89 -202 -68 284 433 466 572 401 258 138 -151 -385 -455 -482 -418 -264 84 314 281 580 550 625 272 56
4229 56 22 -272 -446 -430 -428 -282 -125 -8 74 395 738 426 441 469 106 -150 -338 -478 -422 -538 -399 -320 265
4252 265 393 264 605 556 405 298 45 -221 -249 -450 -381 -353 -357 -281 144 376 389 388 413 372 215 1 -248 -472
4276 -472 -444 -695 -543 -229 -200 181 237 468 497 378 299 169 -85 -263 -466 -429 -538 -493 -230 -107 249 335 475
4299D75P0ml71p4l87j64R4r8K0J34J11J79J05K80J89K3r4k00l24j41j95k03R6
4322d79p4Q7K17L88J28R6P7Qj22p7j67r9m35l8j0K54l8K12K71J09L23k79l0K14
4346E36l08l18j78r5j12o7J16J28K62M52Oo2k8J54k52k30%k70j91k39J76J44J90
4369a86J51L15Q9P5r7n8K9k29j71l00m6j21j6M46J5J45L28j39M44r6k62k01l4
4392H1k44j77k01J28N9M7K84L06p4J70Q8jl1l20j03j82j70j93Q8J03Q4K15J24
4415H1M7L73N6j55k52o7j82n0l05J26J4N8Q5K13J96O3J76M0j33Rk55l26rk62j
4440d60J18j17L47jN02M9K04k42kj49k38j35l32P2O7j69K53j6L15K62n7J51r9
4463C23J14m48l0m8k99j87O2J11K81N9K57K09N2m3j93J71k96k08j76O2j35q4K38
$$ plain form
4299 475 545 541 170 96 -291 -455 -361 -459 -439 -305 -194 -15 90 370 559 582 488 288 -36 -177 -372 -575 -479
4322 -479 -553 -466 -249 139 267 363 440 448 326 249 82 -17 -452 -490 -500 -246 -284 -72 199 308 631 352 322 536
4346 536 228 -90 -268 -363 -475 -542 -426 -298 -36 416 422 360 332 486 234 4 4 -266 -457 -696 -520 -376 -186
4369 -186 -35 280 369 444 347 289 318 89 -82 -382 -428 -549 -565 -119 -104 41 369 230 674 578 316 115 81
4392 81 -163 -340 -541 -413 -354 -307 -23 283 209 379 467 466 435 115 12 -170 -340 -533 -445 -342 -258 -43 81
4415 81 128 501 557 402 150 83 -99 -149 -454 -328 -314 -256 -171 42 238 301 477 517 384 393 138 -188 -197 -459 -460
4440 -460 -342 -459 -112 -113 389 438 642 400 398 249 11 -124 -456 -384 -317 -486 -233 -249 66 328 271 422 323
4463 323 437 -11 -41 -89 -388 -575 -513 -402 -121 -62 195 404 456 413 220 391 95 -113 -289 -227 -362 -446 -208
4486b08NJ15K64K12M0J73q6k53k02j51j42j77p1O6J26P3K12J99M10j87j90J48
4508C76k03l69Q4k14K2j98j2L46K28J90n0K10J80j00j98k25J98o88j31N4J10M3
4530c47O6J60K70K46j0J02l1Ml76j71j37j72q0N0J48l8K93L3L94K3j02o5j21j34
4554Ej40k10m7MK3Q2N7J36N00k82M59k59O9k84j78l6j38j84j53K34J52K00K8K00
4578B38J85j52m8O9j05k53k68J12k36Mm6L77l6R4M00J06J65k84m7j31j11k30k03
4601d00k7qP3J06L46QL21P0r7l1j47j22l31j8j62q0L1K88j70L62L60j62J40P5
4625D25l2k40p4m42J09k23M0rL74j80K68J88K48J8N4k58k1j74l85o1J4j01K17
4648b45J43L5K22m2J94N3J92k15r2j69j50k27j18J35J47P5J41J73rj28J97J02
$$ plain form
4486 -208 -203 -88 176 388 428 601 515 262 60 -91 -233 -410 -481 -415 -289 -216 -4 195 605 418 228 376
4508 376 173 -196 -112 -326 -304 -502 -514 -168 60 250 200 410 590 490 292 67 265 -423 -554 -500 -390 -347
4530 -347 -281 -121 149 395 385 487 456 460 84 -87 -224 -396 -476 -426 -278 -316 -23 10 404 427 325 260 139 5
4554 5 -135 -345 -392 -388 -365 -283 -226 -90 410 128 587 328 397 113 -65 -101 -239 -423 -576 -342 -190 10 38 238
4578 238 423 271 223 292 187 -66 -334 -222 -458 -454 -500 -123 -159 -65 335 441 606 322 275 144 33 -197 -400
4601 -400 -427 -435 -362 -256 90 98 419 489 392 361 214 92 -239 -257 -419 -499 -468 -180 -350 12 372 210 350 425
4625 425 393 153 79 -363 -254 -477 -437 -446 -72 -252 16 204 452 470 524 266 245 71 -314 -375 -361 -462 -245
4648 -245 -102 -67 155 113 307 360 552 337 245 76 -74 -301 -419 -284 -137 -62 79 252 243 115 312 414
4670D14n6l27k04j7k01j1j03L78lJ98J13J99K97k48q0l8k22k17l26K79j60j17
4692d52J60O4M89r5K65j05J73k27j86k6k36j01q0mJ50q8J37K57J77K64j96M4j88
4715A96m1k77j74j44P8j02K30J14K07Q3K26n5o2j2j96k34J65j32l65J20j9J3K46
4738a35R4L69j16P9J73nk54j94n1j74r9j41J36L5K80R0m1L32J72k62kk24J1j96
4762a23k77j17J56J47l1J99K09J60q7J27J10p3l00j82j96Pj03qR6J32L0K61K14
4785C51k6NQ2k73p9k32k14M2Ko9K45k1K18L09J02o0j09j5j34j31j99N5j80k35
4809e66J74R8J65P3K23K58K8j55n7j17j18j5m87J79k36Q1L34P1K78K78k15J09
4831C83J11k43k06m1j97L5l34j32L03O8K52J54J95n5P2k73O4J98n20j29J30l74
$$ plain form
4670 414 358 31 -173 -190 -391 -402 -505 -127 -130 68 181 380 677 429 349 311 89 -128 -454 -175 -335 -452
4692 -452 -292 -228 261 166 431 326 499 272 86 60 -176 -277 -357 -361 -211 -299 -162 95 272 536 340 384 196
4715 196 155 -122 -296 -440 -362 -464 -234 -120 87 170 396 341 279 267 71 -163 2 -130 -495 -375 -394 -381 -135
4738 -135 -41 328 212 291 464 459 205 11 -40 -214 -313 -454 -318 -283 -3 87 46 378 550 288 286 62 73 -123
4762 -123 -400 -517 -361 -214 -245 -46 163 323 236 363 473 400 100 -82 -278 -271 -374 -382 -286 -154 -124 137 351
4785 351 325 330 412 139 60 -172 -386 -344 -342 -411 -166 -187 31 340 442 382 273 258 124 -7 -206 -151 -331 -566
4809 -566 -392 -294 -129 -56 167 425 453 298 241 124 6 -9 -496 -317 -553 -472 -138 -67 211 489 274 383
4831 383 494 251 45 4 -193 -158 -492 -624 -321 -253 -1 153 348 293 365 92 156 354 -166 -295 -165 -539
4853e39P0J32K20K77M3K08j1%k19K1l30q1j56L1J5M8J74n4K39J18J87n5l6r7j18
4878H7k21q3j00j20j20J67K25J32R0J30K2J54o7lj37q7k46j77j24P4O2K18Q1L72
4902C29R4j83k1O9l2l44Oj81R7l29J72J18J45K10J79k3J53l8k20q0l3l66l11J45
4926d44J18O6o4K72J29L68j44M2q1J05k90l8k25m4j22j09l2M92k7J64K04RO2k21
4950A90O0K6l90k36L3r6JN5J67K92J18J61J02j73J08k92j91j54j50q6L1m2K81
4973a85K34r2K04J58J3L4k2m6k84k69l2q9N2K8J5L18nJ29K78K2r5j58j22j63j36
4998b13j61K6JJ42L6K89J38J03O6j86L7q9k03J06j65l15j01p0J44J17L87o0K78
5021C07R0n3rq8m01N0p9j65rr0M7L03K85K2P4j83L30k11L2l99K2o2o1j32J07R8
$$ plain form
4853 -539 -469 -337 -117 160 203 411 400 400 181 202 -128 -209 -365 -334 -319 -271 -97 -151 88 206 393 338 302 205 87
4878 87 -134 -217 -317 -437 -557 -390 -165 -33 57 187 209 363 296 293 156 69 -177 -354 -478 -404 -342 -124 -43 329
4902 329 423 240 219 288 256 -88 -82 -263 -166 -495 -323 -205 -60 150 329 306 459 421 201 121 88 -278 -589 -444
4926 -444 -326 -260 -324 -52 77 445 301 343 262 367 77 39 -186 -230 -352 -461 -493 -1 -28 136 340 349 411 190
4950 190 250 276 -114 -350 -317 -413 -412 -357 -190 102 220 381 483 310 418 126 -65 -219 -369 -455 -424 -466 -185
4973 -185 49 -43 161 319 332 366 344 298 14 -255 -287 -376 -324 -296 -281 37 32 161 439 461 366 208 86 -77 -213
4998 -213 -374 -348 -347 -205 -169 120 258 361 427 241 278 189 -14 92 -73 -388 -489 -559 -415 -298 89 29 307
5021 307 397 344 335 247 -154 -104 -183 -348 -357 -447 -400 -97 188 210 284 101 431 220 252 -147 -125 -187 -248 -380 -273 -175
5047a75K44j7L32k19M13l87J15j77j26j37k05p0J08M4o4L50J66J6J91j2P0k44
5069B16j77m0k64k0J2j27J33J47K10lK29J63r7j58k1k97k52J1q9J79p0P6J06L80
5093B47Q4M8M0l5j27j49k10j56P0r7N1k2K96n7m6K81J97j04m0j18K14m82j93J31
5117a77j58r8k6K22K77K98j26J61R9j73j03j42o1l74J23p1j9K37j68K35K01J42
5139B99n0J52r2O6m38k57N8o2L3p7Q1J72J98pK01P5jj5k58L9l52o4n1j1N2K3J56
5166a30K69R8J44k4j00n6M7l27k57J54k37K05l0J50K17J41M4J07o3j83k7r6k37
5189a91j53j62J27J50OOK43Q4J40J24J9j22p3l12l7p5n8j22j3K40J43K51j9J73
5213C69O5k64J35j77j96j02k30N0J01J45j30L85l5J60J98m7r3k50j00q8k35j77
$$ plain form
5047 -175 69 52 384 165 578 191 306 129 3 -134 -339 -409 -301 -257 -321 29 195 211 402 390 460 216
5069 216 39 -1 -265 -285 -273 -400 -267 -120 90 87 316 479 382 224 203 -94 -346 -335 -424 -245 -315 -239 -133 247
5093 247 331 379 419 384 257 108 -102 -258 -188 -285 -234 -256 40 -17 -63 218 415 311 271 153 367 -115 -308 -177
5117 -177 -335 -433 -459 -237 40 338 212 373 472 299 196 54 -7 -381 -258 -329 -348 -111 -279 -44 157 299
5139 299 249 401 309 375 -63 -320 -262 -324 -291 -368 -287 -115 83 76 277 352 351 336 78 117 -235 -299 -350 -361 -309 -286 -130
5166 -130 139 237 381 357 257 201 248 -79 -336 -182 -419 -214 -244 -94 123 264 308 415 352 169 142 46 -191
5189 -191 -344 -506 -379 -229 -223 -217 26 110 250 374 393 271 198 -114 -151 -226 -284 -406 -419 -179 -36 215 196 369
5213 369 434 170 305 128 -68 -170 -400 -350 -249 -104 -234 151 116 276 474 427 334 84 -16 -104 -339 -516
5235e16q3J93R8J96K82O6O7K41m54K84k40n6l39O3n9k41J77r7L47N0J58M3L07
5258D87j47q1m6k73j10k08o4K08K8q0J39L16J50K29j20m9N5l04l39M1k76J83p2
5281c33j02J80L31P6K96j11O5r0j97Q5l96P8k16q7P3K37J1K91KJ33J8j94O1j8
5305A93k72N8j91J0k01Q1P3J00K05J66J58J04k83m2k59J99k87j12q4K1l2Q2K12
5328a01K35L68k15J16J80k64j83j10m71J53r8j57K90K25Q9K42J61j99o3N1J7k00
5350F6j65j46o7j00J2O8J09K27L56j21P8O1Nk05p6k55r0k38J56J03JJ83l1K45
5374A76L79L0k12O2l71r2j78j87P3J7J07N7R7J58J84J24j15M3k58j18l9q6q8J
5398b36k16Q9L6L85K24L7n2J37m4k36j4q3j92k4k19m0K27K68J13J06n1Q2K9j18
$$ plain form
5235 -516 -599 -406 -308 -112 170 236 303 544 90 374 134 78 -261 -198 -257 -498 -321 -418 -71 -21 137 180 487
5258 487 340 259 213 -60 -170 -378 -442 -234 -206 -286 -147 169 319 548 428 379 434 130 -209 -168 -444 -261 -333
5281 -333 -435 -255 76 152 448 337 402 312 115 200 -196 -118 -334 -421 -348 -111 -100 191 193 326 344 150 211 193
5305 193 -79 -21 -212 -202 -403 -322 -249 -149 56 222 380 484 201 159 -100 99 -188 -300 -384 -363 -395 -313 -101
5328 -101 134 502 287 403 583 319 136 26 -445 -292 -390 -547 -257 -32 57 299 460 261 198 249 266 66
5350 66 -99 -245 -312 -412 -400 -332 -223 4 360 239 317 378 383 178 102 -153 -243 -481 -325 -222 -221 -38 -69 176
5374 176 555 585 373 435 64 -28 -206 -393 -320 -303 -196 -139 -42 116 300 424 309 352 94 -24 -63 -149 -237 -236
5398 -236 -452 -363 -327 58 282 319 267 404 360 124 110 27 -165 -189 -408 -448 -221 47 160 266 215 297 326 208
5422B08R8l20o5j92o6j76L25M9l6K47K00J65m3p4J47l04k21q4j99j04L8K48k7
5445a86K02Q7M6N3M6R4j55k17j80k36M3J2K9J9J38N9M43r0R1J18nl25p4k48J29
5470a07k02k00J49J57J81j25K45J79K14j86q1q8k38q6j17p1q8R0m9M19R9K63k1
5493C37L6j64J7j92r4j61j29l4k0K41J59Q4K5K34O6q2Jq7j13l36j79m7J68r3Q5
5518b78J09L51J34k05K68J71k82j07j63k08j06N1j36j16K38J39J07J98J69j49
5538A85J22n6L0k18j83k13J11k17R0rM69J13%J73j7n9j75k4j26q8l8l31K86l2
5562b07k3R1K45O0m1L82l24O5k17l57L48k86j43k5J78J52J02J98J01Q6j20j7k09
5585C9J32l30j49L0j09M7J79N3K50Q1J34o1L0J88m48l96P8M4j35Q2m2J24L15m1
$$ plain form
5422 208 306 -14 -79 -271 -337 -513 -188 -139 -175 72 272 437 394 320 467 163 -58 -142 -341 -445 -407 -159 -186
5445 -186 16 103 149 202 248 342 187 -30 -210 -446 -403 -391 -362 -343 -205 -146 297 207 298 416 411 86 12 -236 -107
5470 -107 -309 -509 -360 -203 -22 -147 98 277 491 305 224 136 -102 -188 -305 -376 -464 -374 -423 -4 95 358 337
5493 337 373 209 226 34 -60 -221 -350 -384 -404 -163 -4 80 105 339 405 323 324 237 124 -212 -391 -438 -270 -363 -278
5518 -278 -169 182 316 111 379 550 268 161 -2 -210 -316 -265 -401 -517 -279 -140 -33 165 334 185
5538 185 307 251 281 63 -120 -333 -222 -439 -349 -358 111 224 224 397 380 321 146 122 -4 -92 -130 -461 -175 -207
5562 -207 -230 -139 106 166 125 507 183 248 31 -326 22 -264 -407 -432 -254 -102 0 198 299 385 265 248 39
5585 39 171 -159 -308 -278 -387 -340 -161 -108 142 223 357 296 326 514 66 -330 -252 -208 -343 -261 -303 -179 136 95
5609I5R3K21N5k28Ll19k00j22n7J13j3Q0K73K56m3K3L5J88k04j12k36j33j84P0
5633c46m2J93M1k9J99K73k03J44J15k03R0k13p4k58J44j72r8L17K19n8n9K12L06
5656D98o9j58j49j14k75j52K22j62J77m0J51J97J43j09J44r9rn4j95k41j7qr7
5679d16L02K3J04J33J36J25n7n1j35j64j78l8k44K63L0j34JL54L4K77N4l15J63
5702B67k30L4k56O8j29r2R8J27JR4M18k30J83j84L3j58q0k32r7R7q9J90N0L4K78
5727A95K25j34j50J79r9k82P2l70J47j28OQ7L30r9Q7K46l2r3p8Q8j6k42j42j20
5751c23o2L0J11jL52L2J42J14j31r3K8l12jL0j98J89j04O2O7J80n3M65k94k14
5775A6R0qM9l69p4P5j39J7K47k9J75L37l02J53J36k08l27J08j25k18o4K77jM8
$$ plain form
5609 95 188 409 464 236 239 -80 -280 -402 -459 -346 -359 -279 -6 250 207 230 265 453 249 137 -99 -232 -416 -346
5633 -346 -388 -195 -154 -183 16 289 86 230 345 142 232 19 -55 -313 -169 -341 -439 -122 97 39 -20 192 498
5656 498 429 271 122 8 -267 -419 -197 -359 -182 -222 -71 126 269 160 304 205 196 142 -53 -294 -311 -319 -416
5679 -416 -114 -91 13 146 282 407 350 299 164 0 -178 -216 -460 -197 -167 -301 -300 54 88 365 419 104 267
5702 267 37 71 -185 -117 -246 -338 -240 -113 -112 -18 400 170 353 169 202 44 -36 -268 -365 -268 -357 -167 -117 -83 195
5727 195 420 286 136 315 216 -66 6 -364 -217 -345 -339 -252 78 -21 66 312 280 187 109 197 181 -61 -203 -323
5751 -323 -385 -355 -244 -245 107 139 281 395 264 171 199 -113 -114 -84 -282 -93 -197 -135 -68 112 59 524 230 16
5775 16 106 98 147 -222 -296 -221 -360 -343 -96 -125 50 387 85 238 374 166 -161 -53 -178 -396 -460 -183 -184 -136
5799a36j0M73J2j19J16J6k12k38l0J26j70j8j1J02K15M8p8J50R3nN4j19l26l12
5823c79K55j61J73K7j18J26J22K56j44L2P8J0l29j19J12j76o4J15j5J67J98j68
5845bL04m9O5K2l33L9j58k41N4Q3k8Q0m1L49J55P8o3j5j16pj77o7k3j46m1M8J39
5872i1O5J78MK59j25jj71N0k29j19j04rO4lJ61K50n4K62j9k23K70l68no2O5k45
5898b00j61K26j78J41K91J58j67J78o5j57J39j63j05m6K8p0l5lK18N6O9n5P9l9
5922A39J21j13j79r3J0l6k8J72P4k48J71RL25R8k34k5o8l6l4k85L3j09J01J96
5946c9P0O7J06J87r5l2j18j47J52j83j9j52O8j2N7K17o2J76N8M5j95K7j51l1O5
5971E9j22k56o6K25O2J75J23j61K79o7o0j46R4j91q8N8k70J32J65J24O6%PRj51
$$ plain form
5799 -136 -146 327 339 220 336 352 140 -98 -128 -2 -172 -190 -201 -99 116 164 86 236 329 324 378 259 -67 -379
5823 -379 -124 -285 -112 -85 -203 -77 45 301 157 189 267 277 -52 -171 -59 -235 -299 -184 -199 -32 166 -2
5845 -2 302 253 318 340 7 46 -112 -353 -299 -216 -244 -164 -205 144 299 377 314 299 183 176 -1 -68 -91 -237 -278 -230 -91
5872 -91 -26 152 156 415 290 289 118 168 -61 -180 -284 -293 -229 -232 -71 179 125 387 368 145 415 47 42 -20 45 -200
5898 -200 -361 -135 -313 -172 119 277 110 288 223 66 205 42 -63 -109 -81 -151 -186 -189 29 85 154 99 178 139
5922 139 260 147 -32 -125 -115 -151 -179 -7 67 -181 -10 -1 324 422 188 163 95 59 25 -260 -227 -336 -235 -39
5946 -39 31 98 204 391 296 264 146 -1 151 -32 -51 -203 -135 -147 -90 127 65 241 299 344 149 176 25 -6 59
5971 59 -63 -319 -385 -160 -98 77 200 39 318 251 191 45 139 -52 -140 -82 -352 -220 -55 69 135 135 142 151 0
5996@L07j63k01j56J0K2k2J29j5Q9P7J00J55j41K3j31J80k48j20L6k34K01K5J27
6020E0J8M0o4J55J23j07q4j18J3j11k2n1M3N2R1LJ43r7L25k87k7k2j90L6j02J32
6046e8j25j18K02K4K57j42J69l4R1j81M6l0k57K32k04q9K4L7r3K25K91o4o8Q8
6070B23p2j78J07l09R9k27J30J39J25k20K05K54M1q9j09j38J28k03Mk3L8j17P8
6093a14o0L05L8m2J2N4J03l32K3j15M5P5k77J34j46L29P6k1R1O4O6j40j50K5j78
6118a35o5r3J26R0M3J75MJ07k0n1jj55j03m2m8k6P2j11Q2j24J37J77J93q9J2j29
6144B6N6o0j08k30K45J1o8n3K53Q3K7O4k0o5J37l33m4l1J41j63j18K37k10P2J34
6169a7K20k04R9p0J87q4o7j22q2n7m8P1P5J85Jo8K30q6P5o0j73rj69M8M6j48J08
$$ plain form
5996 0 307 144 -57 -213 -203 -181 -203 -74 -89 0 77 177 332 191 214 83 263 15 -105 -69 -303 -102 -77 50
6020 50 68 108 44 199 322 215 131 13 26 -85 -107 -158 -115 -63 28 31 174 77 402 115 88 66 -124 -88 -190 -58
6046 -58 -183 -301 -99 -75 182 40 209 175 266 85 131 101 -156 76 -128 -217 -193 -156 -249 -24 267 203 135 223
6070 223 151 -27 80 -229 -130 -357 -227 -88 37 -183 22 276 317 228 119 -19 109 -94 -90 -113 -75 -192 -114
6093 -114 -174 131 169 127 139 193 296 -36 -13 -128 -83 -8 -285 -151 -297 32 108 87 178 242 308 168 18 43 -135
6118 -135 -200 -293 -167 -77 -34 141 145 252 232 181 180 25 -78 -120 -168 -194 -122 -233 -151 -275 -138 39 232 143 155 26
6144 26 82 22 -86 -316 -71 -60 -128 -181 72 155 182 246 226 161 298 -35 -79 -110 31 -132 -250 -13 -223 -151 -17
6169 -17 203 -1 98 28 215 131 64 -58 -140 -197 -245 -174 -99 86 87 19 249 163 238 178 5 -4 -173 -125 -79 -227 -119
6196a19P9R0l8N0J10j10L3p2l3j88j31J79p8K81j31R9Q6q8J70mK01m77J98j20
6220a3j22M7j61L1O7J31q7J69o6O2J38j03m5r6Mk6K8p3M2j17J82m4K13j28l3K47
6246B47k07j08P5o2k06J42j28L0O2K02m6k6J43K30l48K24l06L6l3J25j21k3K9
6269f9Q2J09q6J06R9j58R7j45o7J91j66k23J92n8k05K77J01N1Kn1pJ5j7N3j1j50
6295c8p5J5k24L04k24K41J9J05j7p6MJ97k97o4J70j62R6j16r3P0m0J96P0K1n2
6320C0N3m3j58Ln0q8J51Q6j99K43N0J3J77k18k1J76j61j98Q8r0OL4N7k6K61l49
6346a73K49K7Q8Oj30N3j56Kj94L9J46j38J03J22j74K51N7q5p8J64o6j56J11j51
6370h3q6Q3k17K95n2J98M2L0j51rP5L9q7k06j34K9Q7j20J80l3J83M6q6J23m1k8
$$ plain form
6196 -119 -40 50 12 62 172 62 95 23 -10 -198 -329 -150 -228 53 -78 21 107 19 189 185 386 -91 107 -13
6220 -13 -135 -88 -249 -218 -151 -20 -107 62 -4 58 196 93 48 -48 -44 -70 -42 -115 -73 -190 -8 -52 161 33 0 247
6246 247 40 -68 7 -55 -261 -119 -247 -217 -155 47 1 -25 118 348 0 224 -82 -46 -79 46 -75 -98 -69
6269 -69 13 122 36 142 241 83 180 35 -32 159 -7 -230 -38 -96 -301 -24 77 128 130 79 72 87 70 123 112 -38
6295 -38 -113 -98 -322 -18 -242 -1 18 123 106 30 34 231 -66 -130 40 -122 -26 -142 -235 -165 -205 -9 61 82 30
6320 30 83 40 -118 -115 -165 -253 -102 -16 -215 28 78 91 268 50 29 205 44 -154 -66 -156 -150 -116 -59 -85 176 -173
6346 -173 76 103 191 197 67 120 -36 -34 -228 -189 -43 -181 -78 44 -130 121 178 93 15 179 113 -43 68 -83
6370 -83 -169 -86 -303 -8 -60 138 180 210 59 50 125 164 77 -129 -263 -234 -147 -267 -87 -120 63 109 23 146 105 77
6396G7j39kj73K75j81Q0k01L37K1m4J46Q9j83P0j22p7J09m1k38O4r3M08p2L9j74
6421b5J22Q9k27J17j2j11p1j61k1L26o4R5m6n5J19P8J03n1j06j60J99k70J30p8
6445h0N0j18K78j11o6K00j43K74j43k00M7J03j26k22J07K30k92L41L6N0j04J26
6467B37k8j43j21J06l0j39n0R2j85L50k37M7K36k0J26k52J03j08J0Nj21J8J7M7
6491d0j94J29K14K1J07q8N1k68L3j28K3M8K0Q7k63Q0J64J20q1J04n5J38j20j35
6515c3N5Oq2q6J8Q9p9J09L6k2L7L5J80m18K40l36M7J2J75l9o9p1L25o4J16j5j04
6542F2J46j33j02j66Q4K50k55NJ52P0j01N7K7Jn0O6j21o6k3k2J62j27L0j74L08
6567H0o6J23j87L20p5k35k6J38k7j42L8l4O5m8O4J5J45j29P5o9n1J42l56O1J22
$$ plain form
6396 77 -62 -64 -237 38 -143 -63 -264 73 94 50 196 285 102 172 50 -27 82 41 -197 -133 -226 182 110 149 -25
6421 -25 97 186 -41 76 64 -47 -118 -279 -300 26 -38 57 11 -44 75 153 256 205 99 -61 138 -132 -2 -80
6445 -80 -30 -148 130 19 -47 153 10 284 141 -59 -12 91 -35 -257 -150 80 -212 129 165 215 111 237
6467 237 209 66 -55 51 21 -118 -168 -76 -261 89 -148 -101 135 115 241 -11 92 -16 -6 -1 -122 -104 -87 -40
6491 -40 -234 -105 109 130 237 149 200 -68 -35 -163 -140 -92 -72 15 -248 -168 -4 116 35 139 84 222 102 -33
6515 -33 22 28 -54 -140 -122 -33 -112 -3 33 11 48 83 263 -155 85 -251 -204 -192 -17 -56 -125 -196 129 65 181 166 62
6542 62 208 75 -27 -193 -109 141 -114 -109 43 113 12 69 96 97 47 113 -8 -74 -97 -119 43 -84 -54 -228 80
6567 80 14 137 -50 270 195 -40 -66 72 45 -97 -59 -93 -28 -76 -12 3 148 19 94 25 -26 116 -240 -179 -57
6592e7k04K70J7K6j03n9J17K64k20J92o8k63J00k40J4J40J3n4O0J45L8j09P9r4
6616DO6K3p6r2j10O8P7j25P1K20n0j1R9N7k1o8q8K9j63J1MM7L8K9l4J68n5j9L9
6645A38q9J9j75Q1LK6j59J28q0J10m1K23q7Jj4j15mJ1o7J10j39j32K13J10j11
6670d0K5J6j1K48k06K91l36o5nJ10j81J11k8J17J6m3P3j99K20R9j43n1n9J45k12
6695a08q0J77j31J37r8J17R7oML5k09J36kj89Q7N5r1J02k52M07k31Q8K06j73j53
6720g5L60j07k65j03J09R2j56K54j34J03r2J27j89L77k28m3j12k1J49k42R9%K0
6743g7J46j44L05j34k9K1J7J25k17j0j46K9k7m1J41j29J95J9J15o9Q4o0j14r9
6767i9o3k6r7K11j81J79J73L1j49N8J3q4qJ8J1N5j92R2l7ljP8R2J6j08Q3J38j79
$$ plain form
6592 -57 -261 9 26 52 -51 -110 7 271 51 243 175 -88 12 -228 -214 -74 -61 -115 -55 90 128 19 98 4
6616 4 70 93 17 -75 -185 -117 -40 -165 -94 126 76 65 164 221 200 132 44 73 -90 -79 -75 -28 10 39 5 173 118 99 138
6645 138 49 68 -107 -26 -23 3 -156 -28 -108 2 -39 184 97 98 84 -31 -35 -24 -91 19 -120 -252 -39 71 -40
6670 -40 -15 1 -10 238 32 323 -13 -78 -83 27 -154 -43 -71 46 62 19 92 -107 113 212 69 18 -41 104 -108
6695 -108 -188 -11 -142 -5 -103 14 111 105 109 144 -65 71 69 -120 -33 22 -69 33 -219 188 -43 45 251 78 -75
6720 -75 285 178 -87 -190 -81 11 -145 109 -25 78 -14 113 -76 301 73 30 -82 -103 46 -196 -97 -97 -77
6743 -77 69 -75 230 96 67 88 105 230 13 3 -143 -114 -141 -182 -41 -170 25 44 159 90 174 114 0 -99
6767 -99 -162 -188 -285 -74 -255 -76 97 128 -21 37 50 -34 -42 -24 -13 42 -150 -58 -95 -98 -99 -21 71 87 -21 62 200 21
6795B1Q8j9j98L5J5R8k34R6o4J77J95M9k20P8j80L1k2Mr0j16K12O6jj8J3P4P2
6822A62K7j73K36k57q5l7R0JN6K1l10L65n7J25k12J22Ork8l2M7o8q1J04j16P9
6848b4N4MO1J23o7j48M7m8kM0J5j51pO8O1J3Q9j18J58j0j27l3Q3j70p2M9O0J07
6876E5o9j30L12j49K8r4J46Lj93j9kP3J38j05M7K6q3K13M8j67j01k4p9J51r9M9
6902b5j57J39PpM7J17M8j40O1K6r4J11j80j00J42k2%j61J78R0q4M6L1J00m7k06
6928h0J70p2n2Mo3O3n2J83p8K64l37K16k30K80n1l31Q1k19J30P8K29j05P2n8j29
6953h7J03L6J0oj84L8R4j10K1j10K26k16L54j19m1O3k11J91O5J3j30j17l4P0J26
6978D5j51J39n1n9M0K31q6rk77J77L3j79J58j55R4j39K14j23j33K95N9k08J33
$$ plain form
6795 21 109 90 -108 -73 -58 40 -194 -98 -162 15 210 259 39 117 -63 -32 -54 -50 -140 -256 -44 22 21 3 16 90 162
6822 162 189 16 252 -5 -90 -127 -37 -36 20 41 -269 96 39 164 -48 74 80 71 43 11 58 -10 -91 13 -103 -24
6848 -24 30 34 95 218 151 3 50 2 0 40 55 -96 -103 -35 26 39 128 10 168 158 31 -2 81 -89 -161 -112 -52 55
6876 55 -14 -144 168 19 47 -47 99 102 -91 -110 -112 -39 99 -6 41 67 -16 197 245 78 -23 -47 -126 25 -74 -25
6902 -25 -182 -43 -36 -43 4 121 169 29 90 116 22 133 -47 -147 -5 -27 -27 -188 -10 80 -4 42 73 173 126 -80
6928 -80 90 18 -34 -30 -93 -30 -82 101 23 287 -50 166 -64 216 165 -166 -85 -304 -174 -96 133 28 100 42 -87
6953 -87 16 52 62 56 -128 -90 4 -106 -85 -195 31 -185 169 50 9 72 -139 52 117 130 0 -117 -151 -81 45
6978 45 -106 33 -18 -77 -37 194 108 99 -178 -1 32 -147 11 -144 -50 -189 25 -98 -231 64 123 -85 48
7001D8J25j16k00M3Kr3kR5J17j5R6k02O1J52j13O8J3j02o6P7n9O9J06O6r9j58
7027h7J59q3j20J91Lok47M1M4Q3n3N5J6M4j7J44Mj24J01j81p6m1J43k39J60J18
7053C2m3Q9MJ25r5J3jj43J63j54M6J3k10p0J10J02J1J48k38J27K15j75K04m07
7077a34J3J62j81p8J14J25k3l1N4l4LQR6M4j90j25M8n1J38n2M3J78k5k1J3M4o2
7104G6l4K6j21j28J88K7m6l4j10J47M9Q7j30Q0k81L27k26J04M2j55o2L3J29N2
7128D0L1j05K59j91P8j3R3k81J7l9K5L8K2Nr4J76j05J83K3Pj66J0r3K3nj81R8
7155a45Q0O6M8j59J72r8m7J92k21Q5J57k64J39k99K74JJ33j03O3j12L24k15N7
7178A28nj25o0L6j74J00J78r4qKJ36p0M3l0k13J52k3j5N9n0N9j85N3jRJ42J44
$$ plain form
7001 48 173 57 -143 -100 -98 -191 -193 -98 19 4 100 -102 -41 111 -2 66 79 -23 -89 -12 -71 -2 104 170 71 -87
7027 -87 72 -11 -131 60 63 57 -190 -149 -105 -22 -75 -20 -4 40 23 167 171 47 148 -33 -109 -150 -7 -246 -86 32
7053 32 -11 78 82 207 112 125 124 -19 144 -10 36 49 -161 -231 -121 -19 -8 140 -98 29 244 69 273 -134
7077 -134 -121 41 -140 -218 -104 21 -2 -33 21 -13 -10 -2 94 138 -52 -177 -129 -180 -42 -94 -51 127 102 81 94 138 76
7104 76 42 68 -53 -181 7 34 -12 -46 -156 -9 40 127 -3 77 -204 123 -103 1 43 -112 -174 -141 -12 40
7128 40 71 -34 225 34 112 99 192 -89 -72 -111 -86 -48 -26 -21 -115 61 -44 139 162 169 3 13 -80 -57 -62 -243 -145
7155 -145 -65 1 49 -110 62 -36 -83 109 -112 -27 130 -134 5 -294 -20 -19 114 11 74 -38 286 71 128
7178 128 123 -2 -62 -26 -200 -100 78 -16 -24 -22 114 44 87 57 -156 -4 -27 -42 17 -33 26 -159 -106 -107 -98 44 188
7205A88j04p6J52j96j29J07M8l7L6O0L1r1N6JJ95k35Q3j8K6k08Q0o0J6K3J47l13
7231b18K10K2K3rj7O6j08R6j48R2j07M3J38j68k9JJ20pL8J06l0n7J6j29K3L9j58
7258a52r8K23J02j86K4J75o6j7%r5M5N4j02M1j28J99R9j32m3M0L9k8J79k81K4
7283h4N9m4R3j69K05k58J91O5q1J0j33O1P8m5j23K40j52O1o8J27n4K5l9N4O4M1
7309A24k04Q5K6j23J46j67J44k24L04j91P2pK6l0o3J54j5oj57Qk6J41o3r7O5J11
7335C3j11lJ05K41k12L8j92K12j7k09l9O5J11P4N3j39J72j14N7j01n1J1l0m1J1
7360g6J08j72J00P8l2L0p7j09O7j8P3N6J00j87j15K14K2r0J58j48L0K6l8N7jk6
7386C0J8p0j36J88k62M13k36J22M3j82J67j3j2J09k70M5J5j39J83o4q9P8j8Q0
$$ plain form
7205 188 84 8 160 -36 -165 -58 -10 -47 -11 49 80 -11 45 46 241 6 89 71 97 -111 -31 -91 -75 -52 95 -218
7231 -218 -8 14 37 28 11 77 -31 65 -83 9 -98 -55 83 -85 -114 -113 7 0 38 144 114 57 73 -56 -33 6 -152
7258 -152 -250 -27 75 -111 -87 88 22 5 5 -90 -45 9 -93 -52 -180 19 118 -14 -57 -17 22 -6 173 -108 -84
7283 -84 -25 -69 24 -145 60 -198 -7 58 -23 -13 -146 -85 -7 -52 -175 65 -87 -26 -94 33 -21 4 -35 19 83 124
7309 124 -80 5 31 -92 54 -113 31 -193 111 -80 -8 -15 11 -19 -82 72 57 51 -106 -98 -124 17 -46 -143 -78 33
7335 33 -78 -81 24 265 53 91 -101 111 94 -115 -154 -89 22 96 149 10 182 68 125 24 -27 -16 -46 -87 -76
7360 -76 32 -140 -40 38 6 36 -41 -150 -83 -101 -28 28 128 -59 -174 40 62 -28 130 -18 12 38 0 57 56 30
7386 30 48 -22 -158 30 -232 181 -55 67 110 -72 95 82 70 179 -91 -46 -31 -170 13 -51 -140 -62 -80 0
7410@J3J33j17L5m1r8N6M6j29J22n8J12k8m8M4rl4j07K23j18N6k0lL1j25K2L8
7437dJ31l2n7M0o7Q6j28J86k23o8RK36k64J72l4K2Lq4M5J16M9l6J7j47r4J00N0
7464B4j97J49P6n0j08L1l2N4l7J18j84K20Nj56L4m4J91J2j19q2j2L97k87J85k00
7489a2qj83K00q1p7J22N6Q2l25L03l5J0Q3j4n8k82K7J1J54J21q8j87m5L43j24
7514gQ1R9r8k6r2j1K9j9N8j35rQ0J26o1J0j15J34r4M4N5k20K66l39p3L07l1M7
7541FJ19r2k8O2n2q2q3J88K2j01j07J58j45O5J6J05pl4j48K65n2N3j16KO2k0j5
7568D1j4k77J90J32J53o1n7p2l5q7K02r9k25J96j50P4L01j49p3J16q2l5l8r4K88
7593A45l16J42rr3L09j81O7j47N0L4L3J33j11n5p1n9P3L1j79M0R9Q0p0J51O0q0
$$ plain form
7410 0 13 146 29 64 23 -75 -19 27 -102 20 -38 74 46 -2 42 33 -1 -108 115 -3 53 33 30 61 -64 -42 -4
7437 -4 127 95 38 78 11 97 -31 155 -68 -136 -127 109 -155 17 -17 5 8 -76 -31 85 134 98 115 -32 -126 -26 24
7464 24 -173 -24 52 2 -106 -75 -107 -53 -90 28 -156 64 69 -87 -53 -97 94 106 -13 -95 -107 290 3 188 -12
7489 -12 -20 -203 -3 -84 -161 -39 17 99 -226 77 42 52 135 121 63 -219 -192 -181 -27 94 6 -181 -226 117 -7
7514 -7 74 173 75 49 -43 -54 -25 -44 14 -121 -130 -50 76 15 25 -90 44 -50 -6 49 -171 95 -244 -317 -10 -41 6
7541 6 125 33 5 67 15 -67 -150 38 60 -41 -148 10 -135 -70 -54 51 44 10 -138 127 75 128 12 14 76 56 41
7568 41 27 -250 -60 72 225 164 107 35 0 -87 115 16 -209 -13 -163 -89 212 63 -10 106 24 -11 -49 -143 145
7593 145 -171 -29 -38 -131 178 -3 64 -83 -33 1 34 167 56 1 -70 -129 -56 -25 -204 -164 -65 15 -55 96 156 76
7619G6n7k8Q3k66J23oJ85j63kKJ23Lj89K66p3q0q7K6J70j57J38k08P3n5j3K26
7645A10j33j92L75j25Q2j32O8j68J86r6J01j08N2K3K1j41l4M6L18k35j22L3Q7
7668A6o3r7J23j14j20J99l9J2k5J77j2P2j4j39k33J82N7p4l2N5J10j4R0j09o6
7693e8K09l7j10p2M9%k24K30p9M2Q3k5m2J00m8n7N3O7l43P1R1J52j82K65j08j70
7719a43L01j69Q8J01k39J95o9j44K7J56j77J29j63KJ99j05J61m2L5j44m0o2m2
7742a45J3J43l8j3j9J87j29k1n2m6K39j90K33k21J3J20j84P9k08L66k62N28k71
7765A22k34J03k6K01l81K28qKj38J51j0j47J99J27j64n9M7M8j14q2N5J3N2p2L9
7790d8R4J4j11J23k05K34o0R3j26J1k7l8J53k84J53m5J00qp1L5K2Mq1Q8l1k0k1
$$ plain form
7619 76 19 -9 74 -192 -69 -75 110 -53 -55 -53 70 73 -116 150 77 -3 -90 -64 106 -51 87 -121 -48 -103 -116 110
7645 110 -23 -215 160 35 117 -15 53 -115 71 -25 76 -32 20 43 64 -77 -111 -65 253 18 -104 -71 16
7668 16 -47 -144 -21 -135 -255 -56 -95 -83 -108 69 57 129 115 -24 -257 -75 -18 -92 -124 -69 41 27 117 8 -58
7693 -58 151 114 4 -68 -19 -19 -243 -13 -92 -50 33 8 -34 66 18 -39 14 81 -262 -191 -100 52 -130 135 27 -143
7719 -143 158 -11 77 178 -61 134 65 -79 -52 104 -73 56 -107 -105 94 -11 150 108 143 -1 -41 -103 -145
7742 -145 -132 11 -27 -40 -59 128 -1 -22 -74 -120 119 -71 162 -59 -46 74 -110 -31 -239 127 -135 393 122
7765 122 -112 -9 -35 166 -215 13 5 7 -131 20 10 -137 62 189 25 -34 13 61 -53 -135 -80 -67 -15 -87 -48
7790 -48 46 60 -51 72 -133 101 41 134 8 19 -8 -46 107 -177 -24 -69 31 23 -48 -13 9 13 -68 20 -11 -31 -52
7817e2j02q3K13R0p5j14R5J02j25K47j18k20J08q4N4J06k22J64L5k5LL9k9L3j21
7842h1oK21k07N5k1l3K00k31n3K72k75L22Mm13L94j98k2M5j99J30N6N4nr3M4J37
7868I7mO6o3O5j7o8j35R4O2mM2k28J63j24J29l1P8j30M4J19k19p9O1j6J34k83
7894b47K52Q0j15K0j0J05l2L9k29K43j48j5Jk1J15j07K42k09J27O5o8j52J93j28
7918Aj58K53j16k0J27j45pM3J07l8J5L2k4K4k53Q3j6L0j9k6J29q1J26l9J3Q8k98
7945a69L35j20l5L2j42j65J02N2J70rq7rK54k31j7N4j11L5r8J29k21K39J05M3
7969A36j30n2K36m4pj76m1J86m7Q7k40jM6Q6m9j13J22jJ76j00k7K1l6o1j18J45
7995bp3O0p2K32m2l6k1mP6j52P2j19J17J56l62J75k15K31R7r4J53j26k02K11L0
$$ plain form
7817 -52 -154 -237 -24 66 -9 -123 -28 74 -51 196 78 -142 -34 -118 -64 42 -180 -16 19 -6 -3 36 7 40 -81
7842 -81 -87 134 -73 -18 -39 -72 128 -103 -156 116 -159 163 167 -246 148 -50 -72 -27 -226 -96 -40 14 9 -84 -40 97
7868 97 93 159 96 161 144 76 -59 35 97 93 135 -93 70 -54 75 44 122 -8 36 155 -64 -143 -82 -98 36 -247
7894 -247 5 85 -30 -10 -20 85 53 92 -137 106 -42 -57 -56 -77 38 -69 173 -36 91 156 88 -64 129 1
7918 1 -157 96 -20 -40 87 -58 -65 -22 85 47 62 94 70 94 -159 -76 -92 -62 -81 -107 22 -59 67 28 41 129 -169
7945 -169 166 46 11 43 -99 -264 -162 -110 60 51 -36 -45 209 -22 -39 15 -96 -61 -159 -30 -251 -12 93 136
7969 136 6 -46 190 146 139 -37 -78 108 61 148 -92 -93 -47 39 -10 -123 -1 -2 174 74 47 68 32 -29 -147 -2
7995 -2 -75 -15 -87 145 103 67 46 42 118 -34 38 -81 36 192 -170 5 -210 21 118 24 177 51 -151 60 90
8020I0l2NL9j76j1P3r4J05L4Jj96P9R3J47j9j39j85o0K20J16l46O6N5K01r9J63
8046A30q2O5k32JR0Q2l6J36k35P6o8K48q1k24K91p5N3k59J77J4j71J08j20p8J87
8071ck7l6N2N6J03p7q8L0J59m0j50o1L4J8J40j28J30j53R3N8j17N6j40L02k56
8096d5j59L00k21o7L22j53J90k37J76M5j88j35J95J83k27k15K73j61J14Q7j1r7
8118c1r0Q8R5J14j24k0j8j06J73j78Q5n7PR4m8j3K2J32r4k3K7j13O2j65J23N6
8144bK9j12J97m0M3j13o6Q3o6P5J90k53j66K53k46OO4R8J34j95K36p4m5K21l34
8169h3J19j47N9J52Ok59O5J34o1L7M7Roo0L0R1j97M2j2j36K62r9
$$ plain form
8020 90 58 63 102 -74 -85 -12 -106 -1 33 34 -162 -83 10 157 138 -1 -186 -246 -26 90 -256 -190 -135 66 -33 130
8046 130 48 113 -119 -118 -28 54 18 154 -81 -5 -73 175 94 -130 161 86 139 -120 57 71 -100 8 -112 -190 -3
8071 -3 -30 -66 -14 42 145 68 -20 10 169 129 -21 -82 -48 -30 110 -18 112 -41 52 110 -7 49 -91 211 -45
8096 -45 -204 96 -125 -192 130 -23 167 -70 106 151 -37 -172 23 206 -21 -236 37 -124 -10 77 66 -31
8118 -31 -121 -33 62 176 52 32 14 -92 81 -97 -12 -69 -62 32 -16 -29 -7 125 31 8 35 -78 -16 -181 -58 -2
8144 -2 27 -85 112 72 115 2 -64 19 -47 28 218 -35 -201 52 -194 -188 -124 -26 108 -87 149 75 30 251 -83
8169 -83 36 -111 -52 100 106 -153 -88 46 -15 22 69 78 72 12 42 133 -64 -22 -34 -170 92 -7
8191g
$$ Imaginary data points
##PAGE= N=2
##DATA TABLE= (X++(I..I)), XYDATA
0@%%%%%%%%%%%%%qJ6j6J6j7K5l2M0m8N6o5P3q8J04j20J37j61J85k10K42k74L07
35A62l45L89m37M89n45O06o75P50q31R20j015J120j237J365j503J655j824K010
53A054k217K449k711L005l341L731m188M730n392O222p286Q719j0762J3926j9561
68a1622L2704j23930p6582J28640N1910R0010P5058O0131k2845m6108n8305o2176
80C6885j01290q7042m1096J0006J4735L6105P4245J02424P0426L6274K3614J2298
92A87584l7995q0871q1876n6368n4300n1686j3294M2911O2160N6832O2594P7045
104A12736N5780M327l0366l4748n0429p9319q1122m3135p528L655J9502N9168
116g1479Q3865O5815L7340K9038J6920k3015o3544o6622n0289n0031n0119j8197
$$ plain form
0 0 0 0 0 0 0 0 0 0 0 0 0 0 0 -8 8 -8 8 -9 16 -16 24 -24 32 -33 40 -48 56 -64 73 -88 97 -113 129 -145 162
35 162 -183 206 -231 258 -287 319 -356 394 -437 483 -532 588 -649 716 -787 868 -956 1054
53 1054 -1163 1286 -1425 1580 -1761 1970 -2218 2512 -2880 3342 -3944 4775 -5987 7939 -11622
68 -11622 21082 -102848 -179430 -50790 1120 91130 166188 226319 203474 157366 99061 36885
80 36885 -64405 -151447 -192543 -182537 -167802 -131697 -57452 44972 115398 151672 175286 187584
92 187584 149589 68718 -13158 -69526 -123826 -175512 -188806 -145895 -83735 -26903 35691 112736
104 112736 168516 172843 142477 107729 57300 -22019 -103141 -146276 -153804 -150149 -130647 -71479
116 -71479 12386 78201 115541 144579 161499 138484 74940 8318 -41971 -92002 -142121 -160318
128a60318K7057M6988M4906N3367O8007N3770J2579j5512k2427l7655o5799p2448
140f7485m5123j7058q642P794M4669O9553N9752M1941L6186K5812r739m7052n5474
153C5134m8123n1695n2680k7106J2693L3846L6599M8388O4290N4759K0999l021
165A24083j1274k7959n5854o4884m5037k5079j8090l074L0321N5321N1977M0850
177E1301M1027L4304L448k9946m0580m0223m8860n5313l5727j841J7559K3481
189h1370L9573N9314N5446K9510J0098J777j6284m5583n7985m4804l0913k6779
201a08000j2867J8696M3296M4170L8376M1912L8690J2570j7647k8335l0893m2841
213b873n2291l8228j0629M984J0967K8565N0183N1059L2189J8265J2709m059l2968
$$ plain form
128 -160318 -133261 -86273 -41367 12000 80007 133777 146356 130844 108417 70762 4963 -67485
140 -67485 -112608 -129666 -138308 -130514 -85845 -16292 43460 85401 121587 147399 137660 90608 35134
153 35134 -12989 -64684 -117364 -144470 -131777 -97931 -61332 -12944 51346 106105 127104 124083
165 124083 112809 84850 28996 -35888 -80925 -106004 -124094 -127168 -96847 -41526 10451 51301
177 51301 92328 126632 130080 100134 59554 19331 -29529 -84842 -120569 -122410 -104851 -81370
189 -81370 -41797 17517 72963 102473 112571 114348 98064 52481 -5504 -50308 -81221 -108000
201 -108000 -120867 -102171 -58875 -14705 23671 65583 104273 116843 99196 70861 39968 -2873
213 -2873 -55164 -93392 -104021 -99037 -88070 -59505 -9322 41737 73926 92191 104900 100841 67873
226F7873m8294m0628l2818l2934k2254O889L1370L5237L4287M1895M2535J9934
238A03092p304j8642k2511l7261m9751l9533j5904l252K504K0054M2318M6034
250A9844L1535K1790J8895M508k2812l8840l4762l0851l4670k7565k509K0325
262g5112K5886K7529L8580M3013K6043K191q095j4139k9993m5275m0219k1753
274g1344j0758n777J1354L4771M1815L1543K4617K3913J1497j4612l0837k9974
286A6208k8343l4277l1057q821J2207J8005K0977L3661M0837K7998Q188l90n712
299F9481k1329l8880l7455k3176j6035j3071K243K5213L4987K9133K5639K7771
311F4521J8452n483k2198k4071k5572l3763l3376j4987M656J0796J5536K9176
$$ plain form
226 67873 19579 -21049 -53867 -86801 -109055 -102166 -70796 -35559 -1272 40623 83158 103092
238 103092 95788 77146 54635 17374 -32377 -71910 -87814 -91066 -88562 -68508 -26190 19844
250 19844 51379 73169 92064 96572 73760 34920 158 -30693 -65363 -92928 -95437 -75112
262 -75112 -49226 -21697 16883 59896 85939 88130 80035 65896 35903 -9372 -49591 -71344
274 -71344 -82102 -87879 -76525 -41754 61 31604 56221 80134 91631 77019 46182 16208
286 16208 -12135 -46412 -77469 -86290 -74083 -56078 -35101 -1440 39397 67395 75583 75193 69481
299 69481 48152 9272 -28183 -51359 -67394 -80465 -78222 -53009 -18022 11111 36750 64521
311 64521 82973 77490 55292 31221 5649 -28114 -61490 -76477 -71821 -61025 -45489 -16313
323a6313L8557K9309J2603M916L93j4958l2570l3939k3523j8124j6593m060J7344
336e6958K8102K4998K3714K8210K1964J926j4225j7435k0457l0614l3624j9253
348f3652k344L768R073K3466L4944L0423J6354J0286O293q640k6656l0863k3629
361b1177k0458k0084r106J0984K2541K1926K2593K7969K3948P099q278j2233j6259
374B9465k7159l1691k1513p358j289L435J7438L0104K8289J8630J4389J1321k099
387F1962j9481k6334k2280k1635k3196j4261L929J5810J7874K0891K8073K6506
399D7858J1940k067o554j2154k4462l0409k2962j1218o418j281J2468K5733K5839
412F313J9032J7130J4747L125j3431k0724j9119k0546k4309j7626j836R094J1794
$$ plain form
323 -16313 22244 51553 64156 69072 69465 54507 21937 -12002 -35525 -53649 -70242 -74302 -56958
336 -56958 -28856 -3858 19856 48066 70030 71956 57731 40296 19839 -10775 -44399 -63652
348 -63652 -65996 -62228 -53155 -29689 5255 35678 52032 62318 68611 59971 33315 2452 -21177
361 -21177 -41635 -61719 -70825 -59841 -37300 -15374 7219 35188 59136 66235 57957 45724 29465
374 29465 2306 -29385 -50898 -58256 -59545 -56110 -38672 -8568 19721 38351 52740 64061 61962
387 61962 42481 16147 -6133 -27768 -50964 -65225 -61296 -45486 -27612 -6721 21352 47858
399 47858 59798 57731 51177 39023 14561 -15848 -38810 -50028 -56446 -57727 -45259 -19526 6313
412 6313 25345 42475 57222 60347 46916 26192 7073 -13473 -37782 -55408 -57244 -48150 -36356
425c6356J6856K5772K6897J5295M162k23o687j9194k7847k3057j4327j1372o634
438e6715O801K0523K2875J8762J8516J8226P682p748j5692j5631j9126k4127j9528
451d5182o148M157O849J2504K2640K4972J6665P515M335j188j3690k3560k0917
464a1048j4728j4130j1058J122J4744J8344J6691J8094K0192J2172k754j0416
476C7225j1621j6073k3670k0864r187k18K667Q470J9498K3653J7171R341P515
489D3907K352r790j9635j8722j4659j4649j2943k858J0204J4476J4053J6404J9970
502B8110J4053J427n882p605j2713k0790k1042j1400m129j519M177J5703K1408
515b02J7179J1474J0242O239n436j5896j7161j3888j5665j5259n963O299J1264
$$ plain form
425 -36356 -19500 6272 33169 48464 52626 52403 45716 26522 -1325 -24382 -38709 -50081 -56715
438 -56715 -49914 -29391 -6516 12246 30762 48988 56670 48922 33230 17599 -1527 -25654 -45182
451 -45182 -51330 -47173 -40324 -27820 -5180 19792 36457 43972 48307 47119 33429 9869 -11048
464 -11048 -25776 -39906 -50964 -49842 -35098 -16754 -63 18031 38223 50395 47641 37225
476 37225 25604 9531 -14139 -35003 -44190 -44408 -41741 -33271 -13773 9880 27051 36392 43907
489 43907 46259 36469 16834 -1888 -16547 -31196 -44139 -46997 -36793 -22317 -8264 8140 28110
502 28110 42163 43590 37708 30103 17390 -3400 -24442 -35842 -39971 -41490 -37313 -21610 -202
515 -202 16977 28451 38693 44932 39496 23600 6439 -7449 -23114 -38373 -44336 -38037 -26773
528b6773J1499J5324J9729J5587M199k424m261j0122j8497j9738j2600o416m473
541c8966M94J1776J8319J6163J2220J1876R259j193j1731j3927j2888j5553j6506
554c0657r420J991P300Q687J3626J9277J6712P380J353j238p080j5783j9216j3564
568b0632q281p108k388P868J5757J4789J1884J3119J1171K109p951j0506j0950
581H881j4224j7090j1239j601L509N295J0764J7409J6568R851M379K390l201j2593
595A9098j7269j3476j0302r603n732M246J2297J3052J1719J3646J3147M963m158
608C1628p773q949j3205j6404j2572m024L24K474Q105J5162J5700J0308O198N431
622C2403l3r446j4085j2203j0543j1236q310J011Q404J0027J0295J3443J4058
$$ plain form
528 -26773 -15274 50 19779 35366 39565 37141 32880 22758 4261 -15477 -28077 -34493 -38966
541 -38966 -38472 -26696 -8377 7786 20006 31882 41141 39948 28217 14290 1402 -14151 -30657
554 -30657 -40077 -38086 -30786 -22099 -8473 10804 27516 34896 36249 35011 27931 12148 -7068 -20632
568 -20632 -28913 -36021 -38409 -30541 -14784 5 11889 25008 36179 38288 30337 19831 8881
581 8881 -5343 -22433 -33672 -35273 -31764 -26469 -15705 1704 18272 28123 32502 34892 31691 19098
595 19098 1829 -11647 -21949 -31552 -37284 -33038 -20741 -7689 4030 17676 30823 35786 31628
608 31628 23855 14906 1701 -14703 -27275 -31299 -30975 -28501 -20396 -5234 10466 20774 26972 32403
622 32403 32370 22924 8839 -3364 -13907 -25143 -33453 -32442 -24038 -14011 -3716 9727 23785
635B3785P437n84m417n836j1592j6191j3011o128k631m67N492J2979J4798J0295
649A3929Q149O933K695o510j1833j0671j0097j1438r779j572N215P065Q592J2243
663B921J3755Q826J828j108l478q739j4225j2831p438m962l245K603J0206J2870
677c017J0042Q850Q947N018l589q935r023r451j2095j0767l958K812M977O383
691a3806J1159J3649R587L281J206r74o746j2405j2160p733n910n291k27P791
705a8579J0572Q963Q674J0147O975p72o379o975p954j1509j1867n721L22K448
719b1655M061R472J3112J0198N070L087J353m128j0845j1317q422p001o896k005
733b5916N367Q887P954Q320J0152Q460J280m026m805o573j0475j1789p070j783
$$ plain form
635 23785 31222 30638 26221 20385 8793 -7398 -20409 -26537 -29168 -29635 -24143 -11164 3634 13929
649 13929 22078 29011 31706 25196 13363 2692 -7405 -18843 -28622 -30194 -24979 -17914 -9322 2921
663 2921 16676 25502 27330 26222 22744 14005 -220 -13051 -20489 -25451 -28696 -26093 -15887 -3017
677 -3017 7025 15875 24822 29840 26251 17316 8293 -1158 -13253 -24020 -27978 -25166 -20189 -13806
691 -13806 -2647 11002 20589 23870 25076 24102 17356 4951 -7209 -14942 -20852 -26143 -26370 -18579
705 -18579 -8007 956 9630 19777 26752 25980 19601 12626 4672 -6837 -18704 -24425 -24103 -21655
719 -21655 -17594 -8122 4990 15188 20258 23345 24698 20570 9725 -1592 -10014 -17015 -23911 -25916
733 -25916 -20549 -11662 -3708 4612 14764 23224 24504 20478 15673 9100 -1375 -13164 -20234 -22017
747b2017K77J765P439J1982J0228N860M890L655j735q340j0257q034p670q318
761b0275m597L007O548P160P598J0300R545L428j880k787n156r379j1401q080
775a5969l176j779j25N505R999R700O734N746N125O01n816q540o979p567q887
790a5428o165L5M339M972O531J0027R633N311O12q27k822p785j0877q485m675
805a5604l366k023L246Q336Q680O926O553O287K310l854o217o218p094q929p053
820a8020j718K425L226M902Q577R676N928K325J023j019n845r334q089n194m856
835a5993l560R91O423P375O244O739P395M013j559m732m888o467q830p574l117
850a7540P42J490L685P963Q831O391L131K284M62m539p780p194n570n197m734
$$ plain form
747 -22017 -21740 -19975 -12536 -554 9674 15534 20424 24079 22344 14004 3747 -4287 -11957 -20275
761 -20275 -24872 -21865 -15317 -8157 -559 9741 19286 22714 20834 18047 12891 3512 -7889 -15969
775 -15969 -19145 -20924 -21049 -15544 -5545 4155 10889 16635 21760 22361 16545 8005 1026 -6541 -15428
790 -15428 -21593 -21558 -17219 -12247 -5716 4311 13944 19255 19867 19040 16218 8433 -2444 -10929 -15604
805 -15604 -18970 -20993 -17747 -9411 -731 6195 12748 19035 21345 17491 11274 5056 -2038 -10967 -18020
820 -18020 -19738 -17313 -14087 -9185 -608 9068 14996 17321 18344 17325 11480 2146 -5943 -11137 -15993
835 -15993 -19553 -18562 -12139 -4764 1480 8219 15614 19627 18068 13336 8448 1981 -6849 -14423 -17540
850 -17540 -16798 -15308 -11623 -3660 5171 11562 14693 16977 17439 12900 5120 -2074 -7644 -12841 -17575
865a7575m26M533N961N527O707P469M984j80k679l567n444q202q213l851j093
880a6049K7K233O810Q567O385M290L435J876k983o633o759n667n938n602j510
895a7518L108M869M802O059P792N823R91j311k077m607p518p904m522k396j406
910a5815P73N385P677O291M670M829L416j516n231n949n212o465o507l064J704
925a5014L273L812N770P978O590K364j14p24l290p160p636n176l311k551n50M122
941a1617O613O042M985N218M451J84l631m838m699o143p062m091j54J703K595
956a0444M760P907O780L352J433O01j680n863p371n348m102l889k020K512N654
971g718N516M862N816N327J446k273l529l879n521p436m870j363N92J132L822
$$ plain form
865 -17575 -18001 -13468 -7507 -1980 4727 12196 17180 17000 14321 10754 5310 -2892 -11105 -14956 -16049
880 -16049 -16022 -13789 -6979 1588 7973 12263 15698 17574 14591 7958 1199 -4468 -10406 -16008 -17518
895 -17518 -14410 -9541 -4739 1320 9112 14935 15926 14615 12538 7931 413 -7491 -12013 -14409 -15815
910 -15815 -15042 -9657 -1980 4311 8981 13810 17226 15710 10479 4530 -682 -7147 -13654 -16718 -15014
925 -15014 -11741 -7929 -2159 5819 12409 14773 14659 13935 10645 3485 -4151 -9327 -12638 -15189 -15739 -11617
941 -11617 -5004 1038 6023 11241 15692 15876 12245 7407 2708 -3435 -10497 -14588 -14742 -13039 -10444
956 -10444 -5684 2223 9003 12355 13788 14389 12709 6846 -525 -5873 -9975 -13864 -15884 -13372 -7718
971 -7718 -2202 2660 8476 13803 15249 12976 9447 5568 47 -7389 -12259 -13622 -13030 -11898 -8076
986h076O848O789M158K209K081k85m561o418n357m131m641l395J067M052M357
1001e303M557N786N821L024r05k224k651n210o934n541k227p71R1K504O132O273
1017B422M268L220K764J089l301n355m515m201n400l939k28K645L319L677N492
1032A957O043L670J78n87j348m408o374n652l021j896r50J288M778N739M558L687
1048G662L814J717j866m358l964m251n304m646j371J536K603K762N155O165M062
1063I716J296K6p34l068n689n376l486k507j918p2L929M834M193L738M649K795
1079A2326o72l168l350l693n470n099k246M22J323K089M683N803M638K245J060
1094A0891K07k358m987n274l761l000k827q11K830M202L836M024M562L669K78
$$ plain form
986 -8076 -1228 5561 9719 11928 14009 13724 9163 2745 -2612 -6743 -11384 -14779 -13712 -9660 -5303
1001 -5303 -746 5040 10861 13885 12980 10756 8105 2895 -4039 -9580 -11807 -12578 -12487 -9983 -3851 2422
1017 2422 6690 9910 12674 13763 10462 5107 592 -3609 -9009 -12948 -13176 -10531 -7212 -3535 1957
1032 1957 8000 11670 11848 11261 9913 5505 -869 -6521 -9542 -11438 -12388 -11100 -6322 -583 3975 7662
1048 7662 11476 13193 11327 6969 3005 -1246 -6550 -11196 -12567 -11031 -8428 -5666 -511 5654 9716
1063 9716 11012 11038 10304 7236 1547 -3829 -7315 -9822 -11740 -11812 -7883 -3049 1144 4882 9531 12326
1079 12326 11654 8486 5136 1443 -4027 -9126 -11372 -10950 -9627 -7538 -2855 2948 7586 9831 10891
1094 10891 11098 8740 3753 -1521 -5282 -8282 -11109 -11920 -9090 -4888 -1052 2972 7534 11203 11481
1109A1481k247k490l343m703n452l138l98J47J366L761N358M864K740J993J363
1124A1302j234m219m715l818l688l631j717J645L548L276L744M964M311J066j051
1139I783j756k314m892n299l553j438n37J60K991M973M447L089K720K418k27l191
1155G374m193l333l596m575k570P70K076K593L315N170M482K221k04l59j749m180
1171C242n446l822j874j725p54J935M412M411L359L246K729Q11k077l449k966
1186B032l702m432l241n97J287J921K666M664M706K772P17L67o59l361m918l846
1202c624k578k149j737Q15L863L775L066L525L628J601j324k680k357l594m510
1217d280l642j209N43R10K074M185M806L013J346J013J61k371m242l877k713k832
$$ plain form
1109 11481 9234 6744 3401 -1302 -6754 -9892 -10290 -10143 -8777 -5016 342 5206 7946 9939 11302
1124 11302 10068 5849 1134 -2684 -6372 -10003 -11720 -10075 -6527 -3251 493 5457 9768 10834 9783
1139 9783 8027 5713 821 -4478 -8031 -9469 -10006 -9846 -6855 -1882 2565 5654 8374 10792 10565 7374
1155 7374 3181 -152 -3748 -8323 -10893 -10123 -8047 -5454 -2139 3031 7513 9734 9530 9171 7422 3242
1171 3242 -2204 -6026 -7900 -9625 -10379 -8444 -4032 379 3738 6984 9713 10524 8447 4998 2032
1186 2032 -1670 -6102 -9343 -9940 -8653 -6732 -4066 598 5304 8076 8793 9160 8501 5140 222 -3624
1202 -3624 -6202 -8351 -10088 -9273 -5410 -1635 1431 4956 8584 10185 8861 6181 3824 230 -4280
1217 -4280 -7922 -9131 -8588 -7678 -5604 -1419 3387 6400 7746 8759 8920 6549 2307 -1570 -4283 -7115
1233g115k175k69K874L287K989L277L915K477l16j759j947k855m540m197j847
1248h201k13R5J399L578M729L319K046J651P83j665l804l769k663l077k919p44
1264i455J887K726K682L382M152K807N30j027j235k464m237m247k498p25o55N04
1280g873L219M069L447K480K198J610p18l353k951k982l301l449j511J142J860
1295f113K224L317M211L338J126k34o51j860l679m334k465j850j450N6K366L669
1311b329L247K660K758K458l89k168k656k474l401l874k103M71Q75J588K743M200
1327A606L712J656O62J90j192l374m088k801k106j904p97J582L117L023K620L107
1343E013K675O73j459k270j788l385l905k597l93L90Q08K175L965L536K022J306
$$ plain form
1233 -7115 -9290 -9559 -6685 -3398 -409 2868 6783 9260 8944 7185 5238 2383 -2157 -6354 -8201
1248 -8201 -8414 -8319 -6920 -3342 1387 4706 6752 8403 9186 7521 3717 -52 -2715 -5792 -8711 -9455
1264 -9455 -7568 -4842 -2160 1222 5374 8181 8711 7684 6449 3985 -252 -4499 -6997 -7722 -8377 -7873
1280 -7873 -4654 -585 2862 5342 7540 9150 8432 5079 2128 -854 -4155 -7604 -9115 -7973 -6113
1295 -6113 -3889 -572 3639 6977 8103 7869 7218 5358 1679 -2655 -5120 -6970 -8420 -8364 -5998 -2329
1311 -2329 918 3578 6336 8794 8405 6237 3581 1107 -2294 -6168 -8271 -7800 -6925 -5337 -2594 1606
1327 1606 5318 6974 7636 7826 6634 3260 -828 -3629 -5735 -7639 -8436 -6854 -3737 -714 1906 5013
1343 5013 7688 8361 6902 4632 2844 -541 -4446 -7043 -7436 -7046 -6238 -4063 -98 3438 5460 6766
1359F766J010m48k735l551k738k444k449j518O52K465K585K436L368L042J146
1374G587o99j056j728k884m001k808j022m63L30J672L409L662K219J410J820K95
1390G743k399l082k578k325k829k034K65J609J992K090L210L540J649j56q00q18
1406E077k651l840k857j360p65o26J050K820L397K453K015K157P49j489k572k363
1422A195k568k914k443l74J455J147J827L096L473J802M19O7o12k065l402l132
1438c029j477j236j099L11K595K923K237J993K668J302r13j849j944k340l255
1453c113k700q51M20J140J226K886L402K559P71N27o5j419l084l115j890j829
1469e135j459j46K024K552K252J992K714J951k97j519j512j987l040l000j437
$$ plain form
1359 6766 7776 7328 4593 1042 -1696 -4140 -6589 -8107 -7455 -4990 -2405 31 3399 6441 7587
1374 7587 6888 5832 4104 1220 -2781 -5589 -6611 -7074 -6744 -5072 -1663 1999 4218 5628 7448 7743
1390 7743 5344 2262 -316 -2641 -5470 -7504 -7239 -5630 -3638 -1548 1662 5202 6851 6695 5895 5077
1406 5077 2426 -1414 -4271 -5631 -6396 -7022 -5972 -3152 245 2698 4713 6870 7619 6130 3558 1195
1422 1195 -1373 -4287 -6730 -7104 -5649 -4502 -2675 421 3894 5696 6115 6182 5570 3505 103 -3029
1438 -3029 -4506 -5742 -6841 -6530 -3935 -1012 1225 3218 5886 7188 6275 4426 2482 142 -3113
1453 -3113 -5813 -6664 -6244 -5104 -3878 -992 2410 4969 5740 6267 6202 4783 1699 -1416 -3306 -5135
1469 -5135 -6594 -6740 -4716 -2164 88 2080 4794 6745 6448 4929 3417 1430 -1610 -4610 -6047
1484f047RL63R76K192L570K767J158J095N13r36k855k908k098j792k057o99J078
1501e671K317K283J992K795K226M53j087j045j487k868l131j942m73j10L41J842
1517c565L020K812J511J553J006l59k099k541k033k219k316j262N80J728J498
1532b686K043L021K571R94m07m72j087k695l210k211p22o49l92J635K648K474
1548H55J800J750J694J66j723k154j913k141k417j846J53J128J068J854K918K574
1564C766J437Q2j12n67k266k917k155j406r71q46J114K069K273J931J885K023
1580E340N57r64j518j790j994k758j864k94N09N87J497K542K725J815M55M03j61
1597E087j735k719k145j457j557j272N12J679J923J913J938K264J089n63j176
$$ plain form
1484 -6047 -6038 -5675 -4699 -2507 1063 3830 4988 6083 6596 5660 2805 -103 -2201 -3993 -6050 -6749 -5671
1501 -5671 -3354 -1071 921 3716 5942 6395 5308 4263 2776 -92 -3223 -5165 -5638 -5748 -5407 -3565
1517 -3565 -545 2267 3778 5331 6337 5978 3879 1338 -695 -2914 -5230 -6492 -5912 -4184 -2686
1532 -2686 -643 2378 4949 5943 5536 5064 3977 1282 -1928 -4139 -4861 -5510 -5902 -4267 -1619 855
1548 855 2655 4405 6099 6265 4542 2388 475 -1666 -4083 -5929 -5776 -4648 -3580 -1726 1192 3766
1564 3766 5203 5285 5173 4606 2340 -577 -2732 -4138 -5109 -5955 -4841 -2772 -499 1432 3317 5340
1580 5340 5897 4933 3415 1625 -369 -3127 -4991 -5285 -4776 -4189 -2692 -150 2575 4390 4845 5248 5087
1597 5087 3352 633 -1512 -2969 -4526 -5798 -5286 -3607 -1684 229 2167 4431 5520 4957 3781
1612C781j058k044k728k153q71J07L29J002K587K519J785R08P91J37j241k210
1628A641k107j760j596j346j51J358J642J543J963K514J356k33n09q13j812k434
1644g44k558j112j43k34N24K087K542J916J218J309M19o29j958k066j696j861
1660b986j726o24J057R74J397K165K381J659M21j36p14j286k410k454j266o39
1676d187p14K65J556K344J918J309J554R65k43j572j667j432k074j986q68J73
1692d659J005R97J832K440K139P03k9N9j042k279k351j591r12j178J28J153J933
1709a652J628J567J731J440P0j281j212j224k056k168j099k87O32O82J430K384
1725E85K042Q74N83M01o41j640k380j322j274j334n71N33J773J471J623J751J873
$$ plain form
1612 3781 2723 679 -2049 -4202 -5073 -4966 -4637 -3635 -1048 1471 3256 4164 4955 5092 3851 1641
1628 1641 -466 -2226 -3822 -5168 -5319 -3961 -2319 -776 1187 3701 5057 4824 4315 3502 1690 -744
1644 -744 -3302 -4414 -4557 -4791 -4267 -2180 362 2278 3496 4805 5224 4595 2637 571 -1125 -2986
1660 -2986 -4712 -5336 -4279 -3305 -1908 257 2638 4297 4718 4582 3868 2582 172 -2282 -3548 -4187
1676 -4187 -4901 -4636 -3080 -736 1182 2491 4045 5010 4767 3195 1528 96 -1978 -3964 -4832 -4659
1692 -4659 -3654 -2657 -825 1615 3754 4457 4428 4487 3445 1166 -1185 -2776 -3688 -4866 -4738 -3585 -1652
1709 -1652 -24 1543 3274 4714 4784 3503 2291 1067 -989 -3157 -4256 -4543 -3911 -3229 -1799 585
1725 585 2627 3501 4084 4485 3844 2204 -176 -1498 -2772 -4106 -4677 -4144 -2371 -900 723 2474 4347
1742D347L53p81j002q64k018k335j458l14Q3M37J018K204K006Q95R60P65mj497
1760B795k006j499j229j467j227L93J293J346J218K001J756R27k22p41q38j591
1776I09k080j758o98l04Q0Q93J683K012J312J067R31K08j084j633j282j427j760
1793b931j204J2Q20Q89J266J725K075J091J18m25k43j369k111j723r69m19o70
1810d068O13J320J748J436J300J379O67p78j356j282j253j895j333n16M77O45
1826b896J023J626K119J282L15J36p3j123j856j727j027j080n38J24J148J400
1842a147J326J327J655R24l08j036r37j219j780j881o44K65J92P83J291K022J708
1859B541M45N85K34p56j769j706r94j289j113J8R19J232J020J403J631J257K25
$$ plain form
1742 4347 4700 3919 2917 2053 35 -2300 -3758 -4072 -3989 -3552 -2534 -330 1676 2571 3531 4296 4292 2795
1760 2795 789 -710 -1939 -3406 -4633 -4240 -2947 -1601 -383 1618 3374 4301 4079 3338 2500 909
1776 909 -1171 -2929 -3627 -3931 -3851 -2958 -1275 737 2049 3116 4047 4255 3171 1538 256 -1171 -2931
1793 -2931 -4135 -4123 -3303 -2414 -1148 577 2652 3743 3861 3436 3193 1824 -287 -2010 -2979 -3398 -4068
1810 -4068 -3455 -2135 -387 1049 2349 3728 4395 3617 2261 979 -274 -2169 -3502 -4018 -3541 -2896
1826 -2896 -1873 -247 1872 3154 3469 3605 3532 2409 553 -1174 -2201 -3281 -3819 -3695 -2547 -1147
1842 -1147 179 1506 3161 4085 3777 2741 1804 585 -1195 -3076 -3720 -3455 -3263 -2480 -1189 833 2541
1859 2541 2986 3571 3805 3049 1280 -426 -1420 -2709 -3822 -3804 -2885 -1653 -633 770 2401 3658 3883
1876C883q34n41j023j907j768r75k65k1L78J211J771J671Q39Q51L92k20j453j311
1894F78j257j303j503m32N37P05J222J305J843J309L64k48l10o65j662j975j012
1911b404o28m39L2J019J696J438J115O91J103j33r68j221j129j312j492r94K09
1928c417P35P91J008J742J414Q11J37j19o33j216j708j463o67o23j80N41J292
1945a555J555J093J144Q31N53p58r76q90j282j530j231l10N40M93Q60J730J350
1962A617J024L64J86k55r59j777j281p81r46m90J68J153J344R42J071J304O32
1979C316l67p74p14j325j425j337l48p7L61P86J211J695R55O85L22l1l90j681
1997H62j296q15j122p12j16Q42J029R12J256J405R65j47m40o07j072j503j519
$$ plain form
1876 3883 3049 2508 1485 -422 -2190 -3165 -3430 -3451 -3073 -1862 -91 1580 2419 3270 3662 3442 1989 678
1894 678 -579 -1882 -3385 -3817 -3280 -2575 -1353 -48 1795 3104 3468 3220 2910 2245 583 -1392 -2404
1911 -2404 -3032 -3471 -3439 -2420 -724 714 1829 2520 3623 3490 2522 1301 172 -1140 -2632 -3626 -3417
1928 -3417 -2682 -1891 -883 859 2273 3084 3221 3102 2469 1253 -455 -1918 -2585 -3208 -3388 -2847 -1555
1945 -1555 0 1093 2237 3068 3621 2863 1887 997 -285 -1815 -3046 -3356 -2816 -2323 -1463 267 1617
1962 1617 2641 3005 3191 2936 1977 200 -1081 -1862 -2808 -3298 -3130 -1977 -633 309 1380 2684 3316
1979 3316 2949 2175 1461 136 -1289 -2626 -2974 -3051 -2690 -1904 -693 1002 1957 2642 2964 2933 2543 862
1997 862 -434 -1249 -2371 -3083 -3199 -2357 -1328 -416 840 2245 3210 3063 2623 2016 944 -559 -2078
2014b078n33k20n2M03J302J344J319O21N29N78m82j160j269r55j175q77n55N88
2032b672R19P80J183J567R56K15l34j60r43j465j273r38n25k83J13J038J416J139
2050G33Q69J001O22l33q87j116r78j182j250n19K03M69P05J264J346J247N40O
2068B740n8n64j198j687r12n73o98j4M53J525J047Q59J215P07J73o17r62q46j256
2087f66j353p26q9L07N02Q08J675J151O47M52Q3k32j185j195j080q92p73m06K66
2106b706J267Q23Q45J298J137J02k78m72q27j091j381j038l55qL53O29J465J161
2124I24P42P54L52l4r48j101j080q69q66r07L77P37P90R48R32J376O41k49k54
2143B265n87r28j572r57n02k52k49O85J079J335R50O43O94K28o75j040p45r71
$$ plain form
2014 -2078 -2611 -2831 -2883 -2480 -1178 166 1485 2106 2635 3213 2731 1571 302 -653 -1828 -2705 -3260 -2672
2032 -2672 -1753 -973 210 1777 2733 2948 2614 2454 1511 46 -1227 -2165 -2690 -2973 -2860 -1822 -406 733
2050 733 1602 2603 3225 2892 2005 889 -89 -1271 -2521 -3040 -2837 -2368 -1663 -399 947 2194 2734 2740
2068 2740 2682 2118 920 -767 -1679 -2252 -2950 -2964 -2511 -986 61 920 2135 2842 3015 2398 1436 590 -666
2087 -666 -2019 -2745 -2834 -2527 -2025 -1217 458 1609 2256 2708 2791 2559 1374 179 -901 -1793 -2566 -2972 -2706
2106 -2706 -1439 -616 229 1527 2664 2766 2488 2016 1189 98 -1283 -2321 -2676 -2684 -2331 -1702 -237 924
2124 924 1666 2420 2772 2738 1790 689 -391 -1260 -2126 -3033 -2656 -1919 -1129 -181 751 2127 2768 2519 2265
2143 2265 1678 750 -822 -1779 -2281 -2533 -2782 -2097 -1018 317 1267 1910 2604 2832 2157 1117 372 -599
2161e99j224r46K01K05R90P11J016J374P15Oj45j09r14j519r60q31m04k20L81
2180b272Q57J087J132O62Q59N50m29p12r95p77j199j125l29J62O28O14Q15J525
2198A053R99M17M6j69n96j225j294n16q15k57l13R14Q71Q17J147Q50P09j59m39
2217B040o75p66j354j120o04jJ63N68R16J233J261K98M30J87m05j139j088q14
2235h70q59n89l36N33P10Q50R34J110Q64L03o23l38n24j262j056q74l89O3K62
2254b091N00J362R75P12O27M48j09r54q69r04p35r33o04J68N48Q20P69J330J032
2273B092L95j52l33m56j067j223r66l82k92n3N44J208R08P84P09P40J14p61r76
2292H33n94q09j121q24J27N47L35P09J170J060O14J46Oj31r80j219q26q43l63
$$ plain form
2161 -599 -1823 -2769 -2568 -2363 -1373 -662 354 1728 2443 2449 2304 2195 1281 -238 -1198 -2029 -2433 -2653 -2272
2180 -2272 -1415 -328 804 1466 2325 2875 2446 1734 739 -38 -1237 -2362 -2691 -2529 -1901 -1287 -472 1053
2198 1053 2052 2469 2515 2346 1750 525 -769 -1285 -2100 -2357 -2670 -1756 -885 -68 1079 1929 2638 2479 2040
2217 2040 1365 599 -755 -1875 -2479 -2480 -2317 -1749 -833 400 1661 1959 2389 2576 2171 1032 -56 -870
2235 -870 -1729 -2318 -2654 -2121 -1411 -561 373 1483 2347 2650 2027 1689 1165 -97 -1153 -2027 -2416 -2353 -2091
2254 -2091 -1591 -229 746 1458 2085 2533 2424 1470 601 -303 -1038 -1971 -2575 -2407 -1859 -1039 -270 1060 2092
2273 2092 2487 2335 2002 1546 479 -744 -1710 -2092 -2384 -2437 -1893 -685 223 1007 1716 2456 2570 1809 833
2292 833 239 -570 -1691 -2515 -2388 -1841 -1506 -797 373 1433 2047 2193 2199 2068 1088 -131 -957 -1800 -2163
2311b163l13L52J027P79Q61R12Q07R6m58n91o49q32r21r15k95L25K01N52J128
2330i7J020P64L46J47m7n64j236j015m65n59p27J21O29J046O50P10J177P72m73
2349B199m17o14o71j213j130r3K1mK74J176R62Q54M35L56K35m40j013j000o70
2368g53q65o25MM22O91O60P20J091P52P2m15j92o61j236r80l21j95l16J81Q42
2388a124J033R60N42O06K86l26n69j043n88q40r19k86L81N03M06P99J133R44P2
2407A970l8k4o30p89j311n81l57m92J39P44Q96Q41O95O59O54j23p36q56l58r37
2427f34j052n18Q8M57L75O61J120R17N25K0mj59j000j030q41l57n46k28M11J030
2447g65O71O06O56R57J07m59n75n50q74j152n09l35M24J52L31J363R00N55M86
$$ plain form
2311 -2163 -2476 -2124 -1097 -318 543 1455 2262 2358 1900 1309 660 -172 -1093 -2008 -2303 -1978 -1777 -1225 -97
2330 -97 923 1687 2033 2180 2133 1569 333 -682 -1147 -1706 -2433 -2312 -1683 -637 13 723 1900 2672 2199
2349 2199 1782 1168 497 -716 -1846 -1939 -1918 -1922 -1648 -472 490 1344 1779 2135 2370 1930 917 -83 -753
2368 -753 -1618 -2243 -2239 -1817 -1126 -466 254 1345 2097 2169 1754 1562 901 -335 -1315 -1636 -1831 -2147 -1966 -1124
2388 -1124 -91 869 1411 2017 2303 1977 1408 365 -223 -1063 -1982 -2268 -1887 -1384 -978 -179 954 1898 1970
2407 1970 1932 1908 1278 489 -822 -1403 -1760 -2252 -2113 -1369 -473 368 1063 1722 2376 2253 1517 661 303 -634
2427 -634 -1686 -2204 -2116 -1659 -1284 -623 497 1414 1939 1959 1955 1796 796 -234 -1075 -1432 -1978 -2206 -1795 -765
2447 -765 -94 512 1168 2125 2232 1773 1198 648 -226 -1378 -1887 -2222 -1798 -1646 -1315 48 948 1503 1989
2466A989J41p4q12j027o66o39r45k72L58P39M36O11J005R71K41j51m14l80p78
2485C33j128r00k72J57O9N33Q31Q77O37N23L76O4n37q61q83n13q20o02j6N59O04
2506i69M76Q46J025M67J00m2l74q38q07j049n21%l08L71Q10P44Q19O61L79M09
2526B199n56o15o32p30q31p54p1K14M72N41O90J205M74J23K13l78m51j092o76
2545f55n05m56m69K07P76Q10N42N14R44L57j96m12p08o36p23q98m13K59j0N56
2565a116O81J007P45L29K63k3n05r77o97m71n64o50O8L14Q22O87O20P35O79j16
2585A831l08k31p22p77j152l27r4L20k04R08R29O81N42K74L24k62q36p71o31n56
2605a062o30l54K39P86L85O56Q46O66J83j32j32n61o58r40p14l01M2L7M42R92
$$ plain form
2466 1989 2130 2056 1244 217 -449 -1088 -2033 -2305 -1947 -1208 -772 -161 844 1815 2056 1905 1491 1111 333
2485 333 -795 -1695 -1967 -1810 -1741 -1208 -377 500 1137 1660 2036 2100 1563 702 -181 -694 -1514 -2116 -2132 -1573 -969
2506 -969 -493 353 1378 1845 1945 1903 1529 691 -116 -1165 -1686 -1686 -1994 -1623 -813 -69 750 1411 1790 2199
2526 2199 1643 1028 396 -334 -1165 -1919 -1990 -1776 -1304 -763 -73 1132 1606 1729 1942 1564 1113 21 -655
2545 -655 -1160 -1616 -2085 -1878 -1102 -292 250 764 1708 2065 1869 1457 749 113 -610 -1508 -1921 -1662 -1672 -1116
2565 -1116 -435 572 1317 1646 1909 1886 1381 404 -293 -764 -1328 -1978 -1910 -1596 -774 -87 533 1268 1947 1831
2585 1831 1523 1292 570 -207 -1359 -1686 -1780 -1460 -1664 -756 173 854 1396 1670 1994 1732 896 125 -506 -1062
2605 -1062 -1692 -2046 -1807 -1021 -636 20 866 1532 1715 1583 1451 890 232 -708 -1422 -1723 -1681 -1644 -1202 -210
2625b10P93M06N72J97n2m11q79o48n88o42n41J32M99M68Q28N42J081J33P2k60
2645A492k89o61j009o62m32rk67K21R80O86N70M91O63J2l70l86n84p82r38m01
2665a675k43N13K31N54P45Q36N11J72K6k19n83q49r05l47k66l70L05M47Q73N22
2685B78N75Q96N9k34m66n78n06p73r05o0J3K29N14P00J002N84J62K73l8n05r55
2706B65o60l77p01k38o5P06N01N78O45O25L80q5l01m30n86p18p23m17J71q3L07
2727a206P15P46N85N70J76J5j76o46p98l94o54n32j05L93L98M20P52O61O89M2
2747A651l01j11n02q92p28l81Nj79k27R02O53P02L21N63L26j88q24l73n87o44
2767h14n41l74J58O29K58M88Q92O33J56j0j13k73q31r53k26l74k30j6M38P75N02
$$ plain form
2625 -210 583 989 1561 1758 1706 1295 416 -232 -820 -1462 -2003 -1871 -1372 -904 -76 466 1547 1680 1752 1492
2645 1492 1203 542 -467 -1129 -1561 -1570 -1837 -1616 -636 50 620 1111 1774 1786 1416 1030 446 -336 -1274 -1675
2665 -1675 -1918 -1405 -1174 -620 125 961 1472 1644 1670 1451 868 19 -886 -1233 -1499 -1869 -1564 -1117 -244 278
2685 278 853 1749 1808 1574 1108 530 24 -749 -1654 -1714 -1701 -1472 -958 -258 744 1328 1490 1763 1725 1220 265
2706 265 -395 -772 -1473 -1711 -1776 -1070 -569 9 654 1279 1659 1574 1273 843 257 -461 -1184 -1601 -1430 -1513 -1206
2727 -1206 -491 255 840 1410 1586 1601 1425 779 -19 -413 -1067 -1599 -1704 -1311 -913 -493 259 920 1609 1651
2747 1651 1350 1239 737 -155 -883 -1264 -1259 -1438 -1665 -763 -110 592 913 1476 1802 1614 790 417 -170 -814
2767 -814 -1355 -1729 -1571 -942 -684 -196 696 1329 1485 1475 1362 1089 258 -695 -921 -1295 -1525 -1541 -1103 -328 174
2788A74N38N04M81L5m95n18m45p93p15k78J54K25Q7M91Q62O46K84J32J3r2o33
2809F57p97n28m62k45k15J71N75P62M72M77N85K91l54m72l31o26p96k87k54J90
2829a187Q3L44O93P40L51K00K20M5n86p64n30l24n42m68M04L85O59J65P02M91
2849A081M97j55k00j89p72p91n05j37k06J42J78O27O73N44J79M76L6m05o68l50
2869E5m42p15l73j34O29L94L51L86Q17L58J26l17k6n35p06n32k96l15j57J45N71
2890g16Q04K28O40M51J27k77p01m03n23n65l48k9J38K36K37O08P15M26M19k3j72
2911A272o31p20m23j73m60l37J12N80M60N93L54N52K31j42m38k82l49p51o50m8
2931a250j4J86K62M82Q15M02K74j39J80k56o74n30l49l63j30l64L95O49L54M65
$$ plain form
2788 174 712 1216 1697 1732 1237 719 274 -519 -1234 -1512 -1358 -1133 -1046 -555 307 953 1237 1369 1382 1290 657
2809 657 -140 -668 -1130 -1375 -1590 -1419 -844 -82 390 867 1452 1743 1389 917 586 -40 -836 -1123 -1377 -1187
2829 -1187 -1104 -760 -67 673 1024 1224 1444 1489 903 139 -391 -715 -1257 -1725 -1321 -936 -277 -112 590 1081
2849 1081 1578 1423 1223 1034 262 -529 -1034 -1171 -1377 -1235 -1057 -430 243 787 966 1442 1478 1073 405 55
2869 55 -387 -1102 -1475 -1609 -980 -586 -235 151 968 1326 1452 1135 1109 574 -132 -664 -960 -1275 -1432 -1287 -716
2890 -716 88 316 956 1407 1534 1257 556 153 -370 -935 -1283 -1312 -1174 -938 -701 -93 622 1048 1467 1444 1272
2911 1272 641 -79 -502 -675 -1135 -1472 -1360 -780 -320 273 627 1179 1410 1268 830 548 199 -552 -1202 -1250
2931 -1250 -1264 -1078 -816 -334 481 883 1157 1018 1198 942 268 -262 -611 -974 -1104 -1468 -1073 -424 -70 395
2951C95P54K75j31k44q6m63q66n60k33j44J19j6O07P33N33J76M83Qj05n89m08
2972B38o72l73m54j80M26L06L39N35N27L57K62p9m47k88m54p33l10j31j51P8L98
2993h06O41O02L07L15K34J29o38k95n27o03l36k78J09P3L11N47O62N90J14K7q8
3014A090k07n22p67m27j69k11J92j36O09N67M70L67M73J3l82l92m12n70m01n73
3034a388J15K31K78M59M63P30J80K20j01k7o61p47j65k96m88k05K51N96N04L13
3054B62M75M58J90j77m80j58l09q61m88l3J02m2L54O22L92M12K14J38M3j57q59
3075I8m64k39l70l11J35K82M42M33N49N88J5o0l24p6l98n31q60J56k6j46K70M38
3097c99N55N04K39J63K20l44n83m05j18o24l89k3K76M12J17O47N30L03Q2j24j24
$$ plain form
2951 395 1149 1424 1293 1049 963 500 -366 -926 -1159 -1303 -1184 -1200 -593 140 673 849 1332 1340 1235 646 238
2972 238 -434 -807 -1261 -1441 -1015 -709 -370 165 692 1049 1311 1232 785 497 43 -690 -1000 -1131 -1282 -1204 -806
2993 -806 -165 437 744 1059 1293 1422 784 489 -38 -641 -977 -1255 -1146 -1073 -762 -215 447 1037 1151 1178 1090
3014 1090 883 361 -406 -833 -1002 -1213 -1021 -1157 -548 19 489 856 1329 1342 960 568 156 -414 -815 -1388
3034 -1388 -1273 -1042 -764 -305 158 888 1068 1288 1187 1160 499 -248 -413 -709 -1197 -1402 -1151 -555 -51 262
3054 262 737 1195 1385 1208 728 570 261 -600 -1088 -1121 -1019 -1061 -707 -85 307 719 933 1071 1114 957 98
3075 98 -366 -605 -975 -1286 -1151 -869 -427 6 555 1143 1158 1098 774 698 300 -231 -1091 -935 -961 -1107 -837 -399
3097 -399 156 660 899 1062 1282 938 355 -50 -168 -792 -1181 -1204 -928 -516 -399 248 778 1081 1163 1039 915
3118I15n76l89n48m74N7j80K43M37M32N44K59M17J66j23n45m58j28p29m32j24
3138a236K20J04L11M77N87N63J38j6j01l70n76m48k04m67L3j10L28M19L94N17
3158E63L22L69%l25m55k01q88j11l41p0J19L75L25M71P41K39j31J36m3o73n04
3179h2o03k54j60j57M01K97N20J68O32M41q1m8l21o22j53p40j77j23Q9J23K00
3200f50O63M09L67L48J44k83m58n58k26k50m33l39K27L53K78L05O34K37L41j79
3220I30q2j43n51n11o47j8ro7L04O49L06M59P5L03P7k89l47l93m16m79k15J6J52
3243h96L79K46M94N76L02J29j81k53l01o60k83m20o1k4M5M24N37L27M12L29M5
3264A166k31l83l14l94n37o01J76P8K47N33L12N22K58L40j62j81k08o32l77k67
$$ plain form
3118 915 339 -50 -598 -1072 -1015 -1195 -952 -515 -83 461 720 1137 1303 1180 635 177 49 -680 -1112 -1236
3138 -1236 -1016 -912 -601 -124 463 1026 1164 1148 1047 677 101 -347 -551 -1018 -985 -1095 -767 -348 46 563
3158 563 885 1254 1254 929 474 273 -615 -726 -1067 -1137 -1018 -643 -318 153 894 1133 1002 1138 1095 422 -82
3179 -82 -685 -939 -1099 -1256 -855 -558 -38 130 762 1203 1122 1074 753 131 -22 -762 -939 -1062 -973 -850 -650
3200 -650 13 422 789 1137 1281 998 540 -18 -244 -494 -927 -1266 -1039 -686 -408 -103 531 768 1109 930
3220 930 848 705 154 -357 -1004 -1022 -1031 -1098 -794 -145 161 620 695 998 1075 786 439 46 -370 -849 -1064 -1048 -896
3243 -896 -517 -271 223 799 1101 1230 1049 796 495 -165 -448 -868 -929 -953 -908 -484 53 380 792 1121 1166
3264 1166 935 552 238 -156 -693 -1294 -1118 -1040 -793 -260 52 574 832 1172 1010 829 621 -11 -388 -655
3284f55l20k35K48M42M22L56L47J26M51j45l01k52o49l55m36j87K34k5K96M93
3304a45N92M04j6L28j69j80n74m78l79k10l78J24K63K86M92L24N04M10j90j91
3324H17k51k94n73n84j29Q7O8J35L13N02L79M13J65O2M1n95m48m70m81j47j78
3345a168J85M77K87L56N01J32K96k65j20j86o50l67l17j44J40j41M19L98N70J83
3365E86L56J44O2o81j83n77j83o57L7L3L34K45L84M45M35L00j05j51j91j97q38
3386d02k88l19R4j98M09M07L65L96M12J06J47k17l97l63m28m88o3k18J50K88L03
3407c04L46O39L16m0J01k94m36l72o18K7j76m09J24N84M59L49M60L09J69k36l18
3428F80l52l48n08m32k6J46O3J55N96L80L88O7L40p0n21l28m98k27m22j73L8M12
$$ plain form
3284 -655 -975 -1210 -962 -520 -98 258 605 731 1182 1037 736 484 -165 -520 -956 -1143 -909 -934 -638 -145
3304 -145 447 851 835 1163 994 814 240 -238 -617 -827 -1205 -1081 -818 -532 -40 284 788 1198 1008 817
3324 817 566 272 -301 -885 -1014 -927 -859 -724 -411 91 470 883 1048 1110 1151 556 108 -362 -843 -990 -1168
3345 -1168 -983 -506 -219 137 638 770 1066 801 681 495 -155 -522 -839 -983 -843 -984 -565 -167 403 586
3365 586 942 1086 1148 467 284 -293 -476 -1133 -1096 -1063 -729 -484 -100 345 780 1080 975 824 633 436 -402
3386 -402 -690 -1009 -915 -1113 -704 -297 68 464 876 982 1129 912 515 152 -276 -764 -827 -1045 -895 -607 -304
3407 -304 42 681 997 957 1058 764 328 -44 -662 -635 -811 -1220 -1096 -512 -53 296 756 1065 1234 998 680
3428 680 328 -20 -528 -960 -986 -840 -777 -622 -26 354 742 809 1149 1079 558 230 -268 -495 -917 -1090 -1052 -640
3450f40K69L89L36M88M82n72R0l10k99m36o71l49L59oK22K53O31M81J36P7J01
3471A031l94n35k12k03l90m29Q6K49M03L39J71O68K50M9k16j09m60l93o08j44
3491h47J5k34J97N63K44M59L21J01K89k78k32m37l79l46m55n5L7L56M14K91M19
3512D43N09m3j69j43q1n27n12k73J2j73J19L29K95N54J44M63J17N1m81m00l48
3533a14k88k97l57Q7J42K49M91M46L61K07MR9m23k59p17k42j25k21p1K69L31O44
3555B16J04L92K41J96k67n12j49l47n07j62j16J87k3K17Q15L32N0J67J36k6m13
3576E31n83j70j83m49k65J67L71N05K89J44N45J05m7l36k81m08n64k05j88K47
3596g75l2M17L08N09J80K07K8N7j89n39m80q5k90l60J12K91K81L88L84M19K28
$$ plain form
3450 -640 -371 18 354 842 1324 752 842 532 233 -203 -874 -1223 -864 -870 -648 -395 236 717 853 930 1031
3471 1031 637 102 -110 -313 -703 -1132 -1046 -797 -394 -55 116 784 1034 1083 867 758 298 -95 -703 -847
3491 -847 -832 -1066 -869 -306 -62 397 718 819 1108 830 598 161 -218 -564 -1019 -1074 -1037 -681 -267 24 443
3512 443 952 909 740 597 516 -11 -523 -796 -784 -957 -838 -509 -214 340 484 947 1064 1115 634 234 -114
3533 -114 -402 -699 -1056 -969 -827 -578 -87 359 720 927 931 1030 607 348 -369 -611 -736 -957 -1028 -759 -428 216
3555 216 320 712 953 1149 882 370 221 -126 -633 -795 -911 -724 -747 -530 285 617 667 834 970 944 531
3576 531 -52 -222 -405 -854 -1119 -952 -581 -76 213 357 902 1007 960 624 343 -65 -629 -834 -1022 -775
3596 -775 -807 -390 -82 427 607 814 842 899 710 171 -309 -394 -684 -1044 -932 -641 -360 28 412 831 1059
3617A059k22j43p7m02n76m03j27j10N2L15K65O29L33K33j25K82l69k64l83j24
3637a57m64l62j8L65K17K79L48L31L82k52J58j13j97n85m32j19k50n4J69L63M56
3658F5K16K84L40n3k23k02k87k49m87k72L8R7J18K07M02K86L47L04j18kk84m66
3680F1l46k20k23k78N8L43N38J90L91J56J23J18l19k59j70l93l44l35J85R0j27
3701g61N52N50K74R6J11l9j20l98l07l98o8l73QL93J01J69M47L20M35j12j43k06
3723E31l96k43n10j36l2K2P0L92O00K14P3K72l7j67l43j62l78l28k08j25R3M24
3745c74J78J30O27J77J28j34J6m55k80n37k11j0r0J70J02P10LL81K70M1j83j12
3767E47m35j72k79l05j74k7K38L76J06N35M48j83K4J03l06m69j83l25j85P5k57
$$ plain form
3617 1059 837 694 617 215 -361 -764 -891 -1001 -949 -634 -369 260 593 826 701 983 614 350 -33 -157
3637 -157 -621 -983 -1001 -636 -419 -140 208 539 921 669 827 714 517 -68 -500 -619 -869 -923 -754 -391 65
3658 65 281 565 905 852 629 427 140 -109 -596 -868 -830 -733 -615 -408 -6 280 627 931 813 811 527 61
3680 61 -285 -505 -728 -1006 -948 -605 -67 123 514 670 793 911 592 333 163 -230 -574 -909 -724 -634 -761
3701 -761 -209 341 615 711 822 783 663 265 -42 -440 -508 -881 -873 -480 -379 -210 237 557 992 880 737 531
3723 531 135 -108 -618 -754 -786 -764 -694 -302 298 512 585 857 820 653 310 148 -230 -558 -766 -891 -798 -374
3745 -374 -196 -66 561 738 866 732 748 293 13 -524 -735 -745 -835 -665 -563 147 150 531 801 842 659 547
3767 547 112 -60 -339 -644 -818 -845 -607 -231 -125 410 858 675 699 802 496 27 -156 -481 -666 -591 -848
3788h48Q5O62K64K01K27L08r7k85k61l19k40k04l37N3K40J48K63K29M60R9J54
3809H02k38J32k14n30l06p2l07Q3k0L85J71K21N72R8P4l37l6k71k80l79k53O0
3831f45J6q7L08M23K10L19J16j2q0k25k08l42l12j17j47k1M18J68Q5L48L40jP5
3854F29j38j67n3n46k96n3O1j25L44J8M29J78L25J64k13j52k41j43k34l62q2j42
3876g99L08J61K09L23K53K8N8Q8k57j72k11l87j50j26P6n5M15K77J85Q5L43J16
3898G68j03j50m33r9l98j95j85K03J95R6L42L10Q9k5Q7N6l06j34l57k72k23J44
3920e90p7J73L36K56K41K77J32k46o5j89j29m14k22n7N4ON8J63N03J27K67L3j64
3943D73j55k33o0l24k47l7k07L39K48J88J47K34J92N8j75j54k18j70l29J3j26
$$ plain form
3788 -848 -763 -101 163 364 591 899 802 517 256 -63 -303 -507 -844 -791 -551 -403 -140 89 549 648 802
3809 802 564 696 482 -48 -354 -426 -733 -650 -670 -285 -114 107 679 777 851 514 478 207 -73 -452 -705 -645
3831 -645 -629 -716 -408 15 225 544 660 648 568 343 135 -207 -519 -636 -783 -804 -386 -218 -133 215 555 554 629
3854 629 491 324 271 -275 -571 -624 -563 -688 -344 -326 103 281 606 770 557 405 164 21 -213 -575 -657 -799
3876 -799 -491 -330 -121 202 455 483 541 629 372 200 -11 -398 -548 -674 -598 -653 -238 39 224 309 652 768
3898 768 665 515 82 -17 -415 -610 -795 -592 -397 -301 41 351 440 415 502 558 252 118 -239 -511 -734 -590
3920 -590 -667 -494 -158 98 339 616 748 502 437 248 119 -295 -517 -574 -520 -514 -456 -293 210 337 604 637 473
3943 473 318 85 25 -299 -546 -583 -790 -451 -203 -15 132 366 558 616 441 287 69 -101 -430 -417 -543
3964e43MM4K02M14K00K29M5J00j37k82k33l15q8o5k80L20J28O8K51J96M04j71
3986D91k3j18%l47l74m4k9q8K3M2L16L93n3L64M8R9j41o08P1k30j38k70J8J05
4010d93K34J76K93J33K28O5j98n3j95k36k76k35M0j29J57K43L03K10RK78p3j7
4032D64l36j84J1k38l37r0J76J27J23L04L56R1J26j77M9j96l83k48j01n2k83L32
4054d66K86K03K77O8J96O1k88j17j6l29j43k42j22P6J11J49L81L24J59P0r1j00
4076D47J02m82l37M1l95pK00J51m4L58O8M86Q1j45k2k05j43l62j86o5q8L9J62
4099c46J01M19K15R5P1L3p7k43k27j58k03k17j61L47K4J50M91J6K08j05J80k54
4121C59j25k16l24j4k79J52jK77l1L04J59K75r8jj29j76j15m14q9j29J4K81J99
$$ plain form
3964 -543 -539 -495 -293 121 321 550 595 695 558 276 43 -272 -360 -425 -705 -385 -257 -189 62 258 662 491
3986 491 468 350 350 3 -371 -415 -444 -532 -509 -467 -151 242 189 553 601 700 559 -49 22 -208 -346 -616 -598 -493
4010 -493 -259 -83 210 343 571 636 438 385 190 -46 -322 -557 -517 -646 -489 -246 57 267 276 554 481 464
4032 464 128 -56 -45 -283 -620 -710 -534 -407 -284 20 376 467 593 416 465 269 -114 -362 -463 -515 -798 -466
4054 -466 -180 23 300 368 564 625 337 220 204 -125 -268 -510 -632 -556 -445 -296 85 409 568 638 547 447
4076 447 549 67 -270 -229 -624 -631 -431 -280 -324 34 102 588 669 524 502 297 154 -208 -394 -459 -547 -508 -346
4099 -346 -245 174 389 484 555 588 511 268 41 -117 -320 -537 -698 -351 -327 -177 314 330 538 433 613 359
4121 359 234 18 -306 -320 -599 -447 -448 -171 -202 102 261 536 438 437 308 132 17 -397 -486 -615 -601 -320 -121
4144a21J08L07J68J10l8ok90p7m83l3r4j21j01L32P1M00M4K76N5J87k82k26k57
4167g1j87k55j76K04N8R6N6N07K51o0K29k84J21m07l00j54j51L8mn2M92O3O3M15
4191D92q3K18j85j85j06j26m00k63k4K09J60M5K36K49J15r9K49m5k90j71j92j15
4213c11k65J15o4K93J03K96j8K81K8J78k83j56p4m02k47J05n8j25K83J97L65P2
4235C13J41J49J10k60l74k95oj85j52K19N5J31J44K79K93m4j4r6q5k07m7l97k18
4258e46j47J96l4M13J71K01M5J23J10n9l02J0l52j54p5q4j25L31l6L36K57J4n8
4281B35K82k09k8k83k84j20j28O2J10J47L13j11L23K6K04l9k18l38J80m35l34
4302f45K21j31J71J3K73J94L67m7K8k41J45k22m70p6M2j63MK49o9L27L10J5K32
$$ plain form
4144 -121 -13 294 462 572 534 528 238 161 -322 -355 -449 -570 -671 -339 -268 132 176 452 507 694 412 186 -71
4167 -71 -258 -513 -689 -485 -427 -331 -275 232 483 423 652 368 489 82 -218 -372 -523 -485 -489 -541 -49 14 77 492
4191 492 409 627 442 257 151 25 -375 -638 -662 -453 -293 -248 -12 237 352 253 502 457 167 -4 -196 -311
4213 -311 -576 -461 -525 -232 -129 167 149 430 458 636 353 197 123 -279 -526 -421 -479 -604 -321 -124 241 313
4235 313 454 603 713 453 79 -216 -222 -407 -559 -340 -285 -154 -10 269 562 518 504 408 323 116 69 -328 -546
4258 -546 -693 -497 -531 -118 53 254 299 422 532 473 171 181 -171 -325 -400 -484 -609 -278 -314 22 279 293 235
4281 235 517 308 280 -3 -287 -407 -535 -473 -363 -216 97 -14 309 335 539 500 282 -56 124 -311 -645
4302 -645 -424 -555 -384 -371 -98 96 463 416 444 203 348 126 -344 -420 -378 -541 -537 -288 -357 -30 280 295 527
4325E27Kk2k87o3k91j60j71N8J41l4J59K26K95M4P1j33l5N2m86Qj31k68j13J75
4349d36O2K86K37J47K12M7j15lk13m10q6j46qJ09J4n8L40K17K2J38%J43k22l06
4373b9j37q4k34p4K00J30J1J33K98K9K35j26J49l6m31k05l42PR7Q6pK02J93J26
4397A91K2L92j80r1n8j52m07l2k06j45K96P9K93j0M66j5%N5o5k65q1k93o4j84
4421d54j51J82J23K39L6J71K98M4j23k71pk48Ol82J46j67K13K44P5K26K62q5j5
4444C62O9m7k25m37j13Nq3j07K90RL56p5N58o8j39J11k94j81q7j79j41N7j93L45
4468b07K5K46L00pL2J9M1m49j09j0l31j28J04P7Q0L03K14J80P1N9j19Q4l03k50
4492g8j91k01J4K3l0L54Q8K53J21o8K14q6l29L3K5o15K1O5JP3K08K3K77J25J93
$$ plain form
4325 527 529 507 220 157 -134 -294 -465 -407 -266 -300 -141 85 380 424 495 362 327 379 -107 -99 -230 -498 -611 -436
4349 -436 -374 -88 149 296 508 555 440 437 224 -186 -272 -418 -426 -317 -303 -361 -21 196 218 356 356 499 277 -29
4373 -29 -166 -250 -484 -558 -358 -228 -217 -84 214 243 478 352 501 465 34 -171 -513 -506 -409 -323 -330 -128 65 191
4397 191 213 605 425 334 276 124 -283 -315 -521 -666 -370 -291 2 -8 458 443 443 498 433 168 87 -206 -270 -454
4421 -454 -605 -423 -300 -61 -25 146 444 488 365 94 87 -161 -155 -537 -391 -558 -345 -101 -26 200 462 377 362
4444 362 431 384 159 -278 -391 -386 -469 -576 -286 -277 79 4 562 494 355 466 172 -9 -96 -275 -416 -359 -552 -207
4468 -207 -182 64 364 357 389 408 449 0 -109 -119 -450 -578 -474 -397 -317 -14 200 380 451 510 391 475 172 -78
4492 -78 -269 -470 -456 -433 -463 -109 -21 232 353 285 499 413 84 117 142 -473 -452 -387 -386 -313 -105 -82 195 320 513
4517E13R2l11O8m45j64q2q7r4N1j1L24J13J34L28J84j84J25l99j52k49j83j23
4539e52N9K85M6K78N0N1K47p8PPk69j64j64J03k02l40L48J79K14l2K29J81k19
4562B64J15k19Lk42k14l15K59k47K48j4L48L24J47oJ14j37j53l30j92N0k94L9
4584d52M1K0K12K09L25J81P1k77q6o5r4k46j15k06O5J46MJ45J67K14K5J82n7n3
4608C56k18l12M0j26k95J15L6K27K57K42O5N2j77r0M7j06k74q4j61j65N3J79R2
4631b47L03L6J30J32J14j18n7k24p7j86l91K03J45J98j68K76K63O3MO8j95j00
4653A72k10j01o7k85J5N7J32K08J21J55K64m2k9j39j31j02m26j7p6K31n8K31N0
4676d7K42J58J35j57K7j86j77j71k26K24j05k30L19M7J07K78J84p5J09j75l24
$$ plain form
4517 513 605 294 362 -83 -247 -329 -416 -510 -459 -470 -146 -33 101 429 613 429 554 155 3 -246 -429 -552
4539 -552 -493 -208 -162 116 166 217 464 386 393 400 131 -33 -197 -94 -296 -636 -288 -109 105 73 302 483 264
4562 264 379 160 163 -79 -293 -608 -349 -596 -348 -362 -14 310 457 451 565 428 275 -55 -247 -197 -491 -452
4584 -452 -411 -391 -179 30 355 536 607 330 244 179 85 -161 -276 -482 -417 -271 -267 -122 45 259 284 466 409 356
4608 356 138 -174 -134 -260 -555 -440 -404 -177 80 322 387 439 262 172 219 113 -161 -245 -406 -571 -518 -339 -247
4631 -247 56 92 222 354 468 350 293 69 -8 -194 -585 -382 -237 -39 -207 69 332 395 399 467 272 172
4653 172 -38 -139 -206 -491 -476 -419 -287 -79 42 197 461 419 390 251 120 18 -408 -425 -501 -270 -328 -97 -47
4676 -47 195 353 488 331 358 172 -5 -176 -402 -178 -283 -513 -194 -147 -40 238 422 347 456 281 -43
4697d3J01r8k45k90K87N7j53L95R0K45J4j8j09J40k41j69j88k3p5j61J04K66R3
4720b1O7L37j22J24O3n6j53j85l14o8j33J25J09Q6J01L40JK19l00K61k93j13m8
4743B7p2k64l65L77j39K72O3K71K01J82j52r2q3k98q6j88J83j15j58J40K14O8
4765a4L36P7j1J58l11j56j4j09k06k93R5K52l3P0L12Q5q2J84q0p9M0l07j04j26
4789c16l9l9P7L21P1M6R4J96J03j74j6l51L3k92q6k3k1J33J33K57Q5J38pJ00j06
4814C17j8l27m3j39j49j33J6K92J0M07m9J88L0m7k03J02j65j88k42K8m7N9J17
4837a84J51K81k5M4J61q3j20l0k41j50k43o5J38J33Q7P9L84r5L03l02K10k46j79
4860Hk25j90K3K1m4J63J08J98j1J37K82o7q2k55k9k10j69n5oL17j73PL39R3L33
$$ plain form
4697 -43 58 -40 -285 -575 -288 -231 -384 11 101 346 360 342 233 373 132 -37 -225 -248 -323 -484 -380 -114 -21
4720 -21 46 383 261 385 448 392 239 54 -260 -328 -461 -336 -227 -141 -40 300 301 520 220 481 188 75 27
4743 27 -45 -309 -674 -297 -436 -164 -101 170 371 553 401 309 226 -72 -158 -346 -163 -278 -436 -296 -82 -14
4765 -14 322 399 388 546 235 79 65 -44 -250 -543 -448 -196 -229 -159 153 238 156 340 260 181 221 -86 -190 -316
4789 -316 -355 -394 -317 4 75 121 215 411 514 340 324 -27 6 -286 -372 -395 -416 -283 -150 107 192 330 323 423 317
4814 317 299 -28 -71 -210 -359 -492 -476 -184 -174 233 184 372 402 355 152 254 89 -99 -341 -313 -360 -301 -184
4837 -184 -33 248 223 267 428 345 225 195 -46 -196 -439 -504 -366 -233 -146 -67 317 222 525 223 433 187 8
4860 8 -217 -407 -384 -363 -407 -244 -136 62 51 188 470 403 321 66 37 -173 -342 -397 -403 -86 -259 -252 87 180 513
4885E13j18m4L7j65l86k5r1p7j68L48K4J18K19K14J3m6K7j91J0l89m0j25k2R6
4909b68J40jJ04K18J99M3r6Q6j88k37j50k60J14On1LM19L2R6rK58J22l47j25j20
4934a2j53j82L3L3o5J54O9J44J51J41J59k70O3o7k60l0j88q9j24J79Q7N4L10N9
4958A96L41j11j21j76j8j32k70L5p8n1R3J37J30L61j14Q6P8n4k47K8o2q1l95j31
4982e56J31K08J07K13K49J48j56J9N8l47J03k20m21J93q8p3j8M02K56N8J08m5
5004C29n8nk20p8o9j80r0L9J10o8K76K38J22J12Lq6l27O3k37o6p1n2o8R4K24J98
$$ plain form
4885 513 395 351 388 223 -163 -188 -279 -356 -524 -176 -152 -34 185 399 412 366 393 202 212 -177 -217 -342 -364 -268
4909 -268 -128 -129 -25 193 392 435 339 425 237 0 -150 -410 -296 -290 -341 -338 81 113 209 200 458 580 233 108 -12
4934 -12 -165 -347 -314 -281 -346 -192 -123 21 172 313 472 202 265 198 -62 -92 -280 -369 -493 -314 -227 -173 137 196
4958 196 537 426 305 129 111 -21 -291 -256 -334 -385 -292 -155 -25 336 222 308 386 332 85 113 51 -30 -425 -556
4982 -556 -425 -217 -110 103 352 500 344 363 421 74 177 -43 -464 -271 -359 -432 -450 -48 208 266 374 329
5004 329 271 266 46 -32 -101 -281 -371 -332 -222 -290 -14 224 346 458 461 375 48 111 -126 -192 -263 -315 -383 -289 -65 133
$$ [...]
8191H4
##END NTUPLES=NMR FID
##END=
