##TITLE=1H_DE-35_oil_TFAA2
 CDCl3
 8 sc, 
 5.3.2024
##JCAMPDX= 6.0         $$ Bruker NMR JCAMP-DX V2.0
##DATA TYPE= NMR FID
##DATA CLASS= NTUPLES
##ORIGIN= UXNMR, Bruker Analytische Messtechnik GmbH
##OWNER= root
$$ XWIN-NMR		Version 3.5
$$ Tue Mar  5 14:52:26 2024 Russian Standard Time (UT+4h)  she@DPX200
##.OBSERVE FREQUENCY= 200.1313
##.OBSERVE NUCLEUS= ^1H
##.DELAY= (6, 6)
##.ACQUISITION MODE= SIMULTANEOUS
##.ACQUISITION SCHEME= undefined
##.AVERAGES= 9
##.DIGITISER RES= 18
##SPECTROMETER/DATA SYSTEM= spect
##.PULSE SEQUENCE= zg30
##.SOLVENT NAME= CDCl3
##.SHIFT REFERENCE= (INTERNAL, CDCl3, 0, 15.7039)
##AUDIT TRAIL= $$ (NUMBER, WHEN, WHO, WHERE, WHAT)
$$ ##TITLE= Audit trail, XWIN-NMR		Version 3.5
$$ ##JCAMPDX= 5.01
$$ ##ORIGIN= Bruker BioSpin GmbH
$$ ##OWNER= she
$$ F:/spectra/data/she/nmr/H-F/1/audita.txt
$$ ##AUDIT TRAIL=  $$ (NUMBER, WHEN, WHO, WHERE, WHAT)
(   1,<2024-03-05 14:51:25.67 +0400>,<she>,<DPX200>,
      <created by zg, POWCHK disabled, PULCHK disabled
       terminated by command 'halt'
       configuration hash MD5:
       00 E9 B6 7A A2 85 ED C7 34 08 36 98 17 FE 4E 26
       data hash MD5: 16K
       EF 4F D7 84 F6 8B B9 16 DC F5 72 21 78 87 25 1D>)
$$ ##END=
$$ 
$$ hash MD5
$$ 52 20 F3 3E A2 11 79 76 A7 E9 53 1F 24 2E 14 21
##$RELAX= 
##$RELAX= 
##$RELAX= 
##$RELAX= 
##$RELAX= 
##$RELAX= 
$$ Bruker specific parameters
$$ --------------------------
##$DU= <F:/spectra>
##$EXPNO= 1
##$NAME= <H-F>
##$PROCNO= 1
##$TYPE= <nmr>
##$USER= <she>
##$AMP= (0..31)
100 100 100 100 100 100 100 100 100 100 100 100 100 100 100 100 100 100 
100 100 100 100 100 100 100 100 100 100 100 100 100 100 
##$AQSEQ= 0
##$AQ_mod= 1
##$AUNM= <au_zg>
##$AUTOPOS= <>
##$BF1= 200.13
##$BF2= 200.13
##$BF3= 200.13
##$BF4= 200.13
##$BF5= 200.13
##$BF6= 200.13
##$BF7= 200.13
##$BF8= 200.13
##$BYTORDA= 1
##$CFDGTYP= 0
##$CFRGTYP= 5
##$CHEMSTR= <none>
##$CNST= (0..31)
1 1 145 1 1 1 1 1 1 1 1 1 1 1 1 1 1 1 1 1 1 1 1 1 1 1 1 1 1 1 1 1 
##$CPDPRG= <>
##$CPDPRG1= <>
##$CPDPRG2= <>
##$CPDPRG3= <>
##$CPDPRG4= <mlev>
##$CPDPRG5= <mlev>
##$CPDPRG6= <mlev>
##$CPDPRG7= <mlev>
##$CPDPRG8= <mlev>
##$CPDPRGB= <>
##$CPDPRGT= <>
##$D= (0..31)
0 1.2 0 0 0 0 0 0 0 0.06 0 0.03 0 0 0 0 0.0002 0 0 0 0 0 0 0 0 0 0 0 0 
0 0 0 
##$DATE= 1709635885
##$DBL= (0..7)
120 120 120 120 120 120 120 120 
##$DBP= (0..7)
150 150 150 150 150 150 150 150 
##$DBP07= 0
##$DBPNAM0= <>
##$DBPNAM1= <>
##$DBPNAM2= <>
##$DBPNAM3= <>
##$DBPNAM4= <>
##$DBPNAM5= <>
##$DBPNAM6= <>
##$DBPNAM7= <>
##$DBPOAL= (0..7)
0.5 0.5 0.5 0.5 0.5 0.5 0.5 0.5 
##$DBPOFFS= (0..7)
0 0 0 0 0 0 0 0 
##$DE= 6
##$DECBNUC= <off>
##$DECIM= 32
##$DECNUC= <off>
##$DECSTAT= 4
##$DIGMOD= 1
##$DIGTYP= 9
##$DL= (0..7)
0 120 120 120 120 120 120 120 
##$DP= (0..7)
150 150 150 150 150 150 150 150 
##$DP07= 0
##$DPNAME0= <>
##$DPNAME1= <>
##$DPNAME2= <>
##$DPNAME3= <>
##$DPNAME4= <>
##$DPNAME5= <>
##$DPNAME6= <>
##$DPNAME7= <>
##$DPOAL= (0..7)
0.5 0.5 0.5 0.5 0.5 0.5 0.5 0.5 
##$DPOFFS= (0..7)
0 0 0 0 0 0 0 0 
##$DQDMODE= 0
##$DR= 18
$$ [...]
##$SUBNAM2= <"">
##$SUBNAM3= <"">
##$SUBNAM4= <"">
##$SUBNAM5= <"">
##$SUBNAM6= <"">
##$SUBNAM7= <"">
##$SUBNAM8= <"">
##$SUBNAM9= <"">
##$SW= 18.0517328524113
##$SWIBOX= (0..15)
0 0 2 0 0 0 0 0 0 0 0 0 0 0 0 0 
##$SW_h= 3612.71676300578
##$TD= 16384
##$TD0= 1
##$TE= 0
##$TE2= 300
##$TE3= 300
##$TEG= 300
##$TL= (0..7)
0 120 120 120 120 120 120 120 
##$TP= (0..7)
150 150 150 150 150 150 150 150 
##$TP07= 0
##$TPNAME0= <>
##$TPNAME1= <>
##$TPNAME2= <>
##$TPNAME3= <>
##$TPNAME4= <>
##$TPNAME5= <>
##$TPNAME6= <>
##$TPNAME7= <>
##$TPOAL= (0..7)
0.5 0.5 0.5 0.5 0.5 0.5 0.5 0.5 
##$TPOFFS= (0..7)
0 0 0 0 0 0 0 0 
##$TUNHIN= 0
##$TUNHOUT= 0
##$TUNXOUT= 0
##$USERA1= <user>
##$USERA2= <user>
##$USERA3= <user>
##$USERA4= <user>
##$USERA5= <user>
##$V9= 5
##$VALIST= <valist>
##$VCLIST= <CCCCCCCCCCCCCCC>
##$VD= 0
##$VDLIST= <DDDDDDDDDDDDDDD>
##$VPLIST= <PPPPPPPPPPPPPPP>
##$VTLIST= <TTTTTTTTTTTTTTT>
##$WBST= 1024
##$WBSW= 4
##$XGAIN= (0..3)
0 0 0 0 
##$XL= 0
##$YL= 0
##$YMAX_a= 61875
##$YMIN_a= -45177
##$ZGOPTNS= <>
##$ZL1= 120
##$ZL2= 120
##$ZL3= 120
##$ZL4= 120
##$ABSF1= 10
##$ABSF2= 0
##$ABSG= 5
##$ABSL= 3
##$ALPHA= 0
##$AQORDER= 0
##$ASSFAC= 0
##$ASSFACI= 0
##$ASSFACX= 0
##$ASSWID= 0
##$AUNMP= <proc_1d>
##$AZFE= 0.1
##$AZFW= 0.1
##$BCFW= 1
##$BC_mod= 2
##$BYTORDP= 1
##$COROFFS= 0
##$CY= 11.3945322036743
##$DATMOD= 1
##$DC= 2
##$DFILT= <>
##$DTYPP= 0
##$F1P= 15.7292609196834
##$F2P= 12.9074282941183
##$FCOR= 0.5
##$FTSIZE= 0
##$FT_mod= 4
##$GAMMA= 1
##$GB= 0.15
##$INTBC= 1
##$INTSCL= 1
##$ISEN= 128
##$LB= 0.24
##$LEV0= 0
##$LPBIN= 0
##$MAXI= 10000
##$MC2= 0
##$MEAN= 0
##$ME_mod= 0
##$MI= 1.114404
##$NCOEF= 0
##$NC_proc= 0
##$NLEV= 6
##$NOISF1= 3.799351
##$NOISF2= 2.8
##$NSP= 1
##$NTH_PI= 0
##$NZP= 0
##$OFFSET= 15.70392
##$PC= 1
##$PHC0= -24942.94
##$PHC1= 15.05264
##$PH_mod= 1
##$PKNL= yes
##$PPARMOD= 0
##$PSCAL= 0
##$PSIGN= 0
##$REVERSE= no
##$SF= 200.130013532006
##$SI= 16384
##$SIGF1= 3
##$SIGF2= 2
##$SINO= 400
##$SIOLD= 16384
##$SREGLST= <1H.CDCl3>
##$SSB= 0
##$STSI= 0
##$STSR= 0
##$SW_p= 3612.71676300578
##$SYMM= 0
##$S_DEV= 0
##$TDeff= 0
##$TDoff= 0
##$TI= <>
##$TILT= no
##$TM1= 0
##$TM2= 0
##$TOPLEV= 0
##$USERP1= <user>
##$USERP2= <user>
##$USERP3= <user>
##$USERP4= <user>
##$USERP5= <user>
##$WDW= 1
##$XDIM= 8192
##$YMAX_p= 0
##$YMIN_p= 0
$$ End of Bruker specific parameters
$$ ---------------------------------
##NTUPLES= NMR FID
##VAR_NAME=  TIME,          FID/REAL,        FID/IMAG
##SYMBOL=    X,             R,               I
##VAR_TYPE=  INDEPENDENT,   DEPENDENT,       DEPENDENT
##VAR_FORM=  AFFN,          ASDF,            ASDF
##VAR_DIM=   8192,          8192,            8192
##UNITS=     SECONDS,       ARBITRARY UNITS, ARBITRARY UNITS
##FACTOR=    0.0002768,     1,               1
##FIRST=     0,             0,               0
##LAST=      2.2672688,     0,               0
##MIN=       0,             -45177,          0
##MAX=       2.2672688,     61875,           0
$$ Real data points
##PAGE= N=1
##DATA TABLE= (X++(R..R)), XYDATA
$$ [...]
1737E5n1J6L07l21j55K27K71m46Q1K45M6j18l57L12r2J8o5J46l3j00M07j19m44
1760a70PR5K08j61j28L38q4k95M32j48kJ45L3k26Oj2j12P9O2J82j56k33J63M2
1784F5j06J88m9N0l4q6J50P2P3q5j26qJ52l45K72j62K65o14M1K36j04O9J76j04
1808a4K36k13q7K79k8k35J22K70k11K11q6J27k54r8K03k44J46j42j27J94R8k17
1830g0N1K92k35L50j74m3L08l79K70m73N61n91RK84R3k79q1J38q7K5O3J33j64
1853Aj59J60J07p8L14j57j66K22j87K98k78N6j51J26J8j93J14k5j51K56J6j68
1875b5P9J3j17J15N8pL2J2k53K10J29q8k81J80N7j01j1K10l48J38q0K98o0l0k82
1900a52K61J5Q9j42Rj78K85l0k1n6j3nk18J61j06P8R8j32O5Q7K91n9j13M6o3J26
$$ y = [55, 4, 20, 327, 6, -149, 78, 349, -97, -16, 229, 275, 157, -200, 112, 20, 38, -27, 119, 86, -14, 393, 274, -170, -163, -68, 140, -21, -149, 189, 105, -190, 242, 94, 92, 237, 270, 44, 50, 38, -74, 5, 67, 249, 93, -140, 23, 65, -41, 147, 98, 148, 114, 28, 178, 250, 323, 238, 112, 104, 256, -89, 183, 21, 286, -328, -287, -51, -155, -86, 90, -14, 222, 9, -78, 201, 173, -62, 60, 330, 119, 330, 244, 371, 117, 19, 222, -22, 124, -18, -145, 49, 147, -70, -19, 273, 38, 388, 214, 171, 479, 100, 370, -103, 458, -133, -124, 160, 253, -26, -107, 31, -56, -31, 32, 165, 1, -158, 2, 109, 31, 345, 188, 22, 244, 57, 355, 77, 133, -18, 108, 126, -67, 47, 22, -129, 127, 143, -25, 54, 67, -50, 65, 123, 116, 148, 160, -93, 117, 246, 158, -123, 57, 114, 13, 2, 212, -136, 2, -78, 220, 160, 130, -152, 109, 124, 213, 71, 80, -98, 187, 157, 136, 80, 67, 62, -156, 5, -101, -23, 75, -57, 8, 95, 386, 327, 214, 260, 197, 323]
1926C23j13L1j88J04k4l29K83J75l77L03k68K7J70l24K18p2K46k7p4l2N1O9j18
1949E4P5j03L19k34p7j26O0K0n0o9J69j71N03l88J8K4O8k4j00K78j01M07n65J07
1973I4J86R7k57l8j88K21J41l24P5Q6j98K97k56J07L1J52j47j19O7jN6J32j21
1996I3J43n0k34J88j12J06r7M5k55P1k62L69k14N76l30q4J95N0q5J10k29J95o1
2019A28K19k95N7j86K15l48L21k5N5j17M1J97l60O3R3p0L43l32j10L99j86L87
2041D89o96L30M7j93j18O8m8K73M8l07K66R9j33O1j79R1NrJ53J25k04k03j8J27
2065G4M4K10k28l9P8k78o2K51j12k7NM7L46j37R4k40J0j41K33K38l53k5K01k70
2089h1J30L8o8J77O0m74J66j88R5qQL42j03n0k32M39J39k12l0j17J23L8M3l04
$$ y = [323, 210, 241, 53, 157, 133, -196, 87, 262, -115, 188, -80, -53, 117, -207, 11, -61, 185, 158, 84, 52, 103, 172, 54, 129, 26, 345, 111, 34, -92, -32, -12, -62, -131, 38, -133, 370, -18, 0, 24, 92, 68, -32, 246, 145, 552, -13, 94, 280, 377, 120, 82, -106, 115, 256, -68, 7, 93, -105, 192, -64, 43, 74, 226, 79, -40, 27, 26, 82, 214, 93, 236, 186, -48, 140, 28, 134, 37, 82, -173, -102, -364, 5, -209, 367, 37, -47, 148, 198, 113, 223, -6, 189, 128, 347, 52, 109, -77, 138, -210, 111, 86, 141, 24, 65, 262, -98, -35, 58, -12, 331, -1, -111, 288, 102, 489, -207, 123, 170, -23, -141, -73, -121, 152, 200, -107, 159, 258, 125, 186, 7, 98, 103, 94, 247, 372, 168, -35, -53, 74, 118, 328, 100, 61, 139, -139, -201, 50, -62, -89, -84, -37, 309, 172, 266, 26, 36, -105, 128, 366, 13, -12, 189, -81, 49, 87, 19, 196, 256, -218, -52, -240, -145, -153, -145, 197, 94, 44, -188, 251, 390, 178, 148, 31, 154, 192, 235, -69]
2113f9Q4J15r0m3J25M3l44R2J57N5j02N8j1O7j27K67j21j69J39M6l35M9n9Q3n6
2138a46K44m8J8J9q2Q4k29J50J86k47n8J36P0P0j71K88k79J68p1m4q8Q4J14l87
2162b19K46M8k40K49n5o1n5M84m60K53M6n6j34K59j5j97k58J63R5J35k13KJ40
2185A57j58l0J00Q9p8p4J50m11L14N8P2j39Q0J14k73R6j20L20l11K8q2M22n92
2208b68K13K39k43K53R1j84r0j53K57K7k13K9J86r0j15M03j60Q3n8k33J45j19
2230@K6K0J8k22Q8K63p1m5K80m53K98k68J01J72k64rK83p0j51J53j51J59J2j09
2254F0l9J82n07M98l65M12L1m23L00k80L43K9k36J40L8m57L52K10l62K11j12R4
2276A19M8M2l67K15K28k27K0J53o2j02j4J04m6QJ79o7Q4k70P4J4k10r6K16j40
$$ y = [-69, 15, 130, 40, -3, 122, 165, -179, -87, 70, 125, 23, 81, 70, 137, 10, 277, 156, -13, 126, 172, -163, -114, -173, -90, -146, 98, 50, 68, 87, 5, 89, -140, 10, 196, -51, -109, 27, 97, 167, -4, 284, 5, 173, 102, 58, -30, 54, 168, -219, 27, 75, -165, 84, 29, -32, -87, 397, -63, 190, 236, 180, 46, 305, 290, 93, -165, -2, 93, 228, 15, 17, 157, -1, -31, 69, 158, 80, 6, 156, -255, 59, 117, 189, 50, 130, 244, -29, 67, -53, 267, -44, -16, -98, 324, -268, -55, 184, -59, 194, 285, 101, 11, -142, 115, 142, -71, -42, 144, 54, -61, 342, 182, 265, 207, -26, 119, 0, 26, 46, 64, -158, -70, 193, 122, 77, 357, -96, 202, -66, 35, 207, -57, -66, 217, 147, -4, 149, -2, 157, 169, 60, 21, 203, -304, 194, -171, 241, 272, -151, 149, -131, 212, 241, 5, 145, 183, -274, 78, 288, -74, 137, 25, 119, 167, 209, -158, 57, 285, 58, 78, 231, 169, 67, 53, 157, 111, 119, 298, 231, 315, 45, 119, 133, -77, -173, 43, -97]
2300i7K79q1J18k89N8K3N7J39J10m12K01m5k9j00R4j80K74m6k61K46K8J15j91
2323A1k5J92K0k36PJ44p2J15j33R7J34l52L27k28J9Q9R8l85O8K45J9n2J83k41
2347D4l1k4%J68J4j24p1K85O8l33o4Q8L3r2J80k13l1K61M9j65J41k99L86j29k4
2372A17n2k04L81k04q3K16O3r5j39M8OO9j30P8mk35J80P0j70J88n1K34j67q2J76
2397B10l81K03r6K13k02J44nJ0l2o0J11j01P5j73J38R9l13L25k88L69k59M8K72
2420C07r8j91M7J19P4j16n9J39j94P3r5Q0M8o9J31l37O12m59j79K52M9R6j79P3
2444A24n4O9r4j51J37M7j92L15k2j92K1J08p0j88K35k4m5j01J23q5K58j71r4J61
2468A15j56l9K27j33P9j88J10J06N8m35L14Q4k24Q4K94k93K26nr6l7J76j40j57
$$ y = [-97, 182, 101, 219, -70, -12, 11, 68, 207, 317, -95, 106, 61, 32, -68, 26, -154, 120, 74, -187, 59, 87, 202, 11, -14, 178, 198, -38, -31, 113, 41, 156, 23, 120, 254, -98, 229, 1, 20, 109, 207, -178, -110, 135, 154, 102, 285, 44, 13, -11, -11, 157, 171, 47, -24, 261, 329, -4, -68, 20, 53, -39, 141, -72, -103, 158, 207, 42, 183, -116, 270, 141, 117, 65, -139, 242, 38, -45, 171, 234, 139, 0, 48, 54, 123, -7, 71, 67, -168, 12, 82, -88, 100, 49, 283, 116, 34, 210, -171, 32, -64, 149, -53, 91, 86, 96, 64, 4, 115, 14, 89, -84, 54, 153, -160, 165, -123, 246, -13, 35, 307, 209, 18, 65, 184, 258, 142, 83, 222, 28, 101, 6, 86, 134, 65, 196, -141, 471, 12, -167, 85, 134, 230, 51, 124, 70, 139, 45, -106, 31, 78, -114, 201, 179, -13, 8, 116, 46, -142, 93, 69, 24, -77, 46, -39, 219, 48, -46, 115, -41, -80, 147, 14, 93, -95, 15, 121, 179, -256, 58, 142, -82, 2, 296, 3, 229, 224, 128, 91, 267, 127, -30]
2491c0J16O4j69R6k97K10J64J10k07j0J09j70j15K98K3j60k03J83J47M2N8j42
2513A17l1l03K61j49J27L8n8P9q7j74J91N8j82J3K45l2j85K90lk71J27k19J23
2536b5J62J39k40pK2l99N13j20Q9k9j41K34k35n6J38J37J6j62N4K52l21O9l0J94
2560B54k41R3l5J35k16j07J17Q5n0O4K66n70M29k61O3J95l55N12k03lj20j9j67
2583a34L78m57J02M88m98J30N6n8J00j71L56j64l8J22M1j4k0j17j22J7k95K83
2605a5K6j71J71J08J09j01j55M7N4j78J79L33k16j31J13k26Q5L06k53n2j56K41
2627A18k35K79k41L6L25O9k58k20Q6J29o1P7n31N26R1k33K56k35Q7j5r3P5k36
2650b04J48J81r1K44k47j41K29l6J61j31J44m04J96j19J13Oj6r5J4J60J45k45
$$ y = [-30, 86, 150, -19, 77, -220, -10, 154, 264, 57, 47, 156, -14, -129, 169, 192, 32, -171, 12, 159, 201, 259, 117, 86, -217, 44, -105, 22, 60, 2, 81, -6, -180, 11, 69, -113, -100, 145, 113, -72, 218, 215, -56, 71, -148, -25, 137, 276, 36, 29, 51, -348, 165, 45, 134, 105, -36, 198, -37, -93, 45, 182, 198, 36, 90, 342, 21, 90, 60, 254, 13, 106, 71, 206, -10, -117, 0, 85, 35, 99, 365, -205, 224, -37, 26, 221, -134, 378, 175, 172, 52, 33, -134, 244, -213, -111, 377, -121, 9, 65, 7, 107, -64, 292, 128, 90, 212, 253, 239, 219, 102, -20, -3, -298, -15, 11, -160, 11, 119, 228, 127, -28, 19, 73, -105, 74, 407, 191, 60, 173, -53, 32, 338, 85, 33, -123, 118, -117, 162, -79, -43, 282, 351, 93, -127, -41, 88, 27, 104, -427, 99, 190, -43, 213, -22, 65, 50, -43, 32, -204, -56, 125, 34, 278, 31, -110, 119, 83, 244, 113, 257, -147, 49, -70, 43, 49, 33, -62, -48, 112, 257, 12]
2672A2j09J80L1J58l77K35m8J86k65k04L90k13O7l8K09L1q5J38k89l0M4J03j5
2695A11j29M2k31K68K08M0m7j82j54K69j39m9k38L41J24j64j19J26K11k88J32
2716A32j58J86l38N13j55j04O8j81P0j65L10J5N8o5l03L01J14Q8k52J0J90l85
2738e1j4L25k36n8Q2N3j24K44J86l41J71n1Q0j92N6L3m09N07m39L65J88j64j22
2761H9j87K07J48j63Q3j83l9J08M6K83j20p4j17l41L91j0n5n0J20J54m18K02k16
2784a42K31Nk7K1J13j77n2r5N71o12O8K58j64j6L6K23k96M12j56l36L10j1n4Q7
2808A97J02o5k3P5k10k3j7K3K42m96M44l31Q8omK03m88J03J56L95m62J5M6J33
2832I7l8J05k34K99J3K1k80J90l02j66J79K7O5L10L5j8q5J51k73p6J51j11k38
$$ y = [12, -97, 83, 114, 272, -105, 130, 82, 268, 3, -201, 189, -24, 43, 5, 214, 245, 160, 298, 9, -21, 23, 126, 111, -18, 24, -207, 61, 269, 309, 262, 80, -74, 195, 56, 7, -231, 110, 234, 70, -49, 77, 288, 0, 132, -26, 160, -178, 335, 180, 76, 144, -37, 33, -132, 178, 193, 251, 186, -117, 184, 298, 386, 134, 144, 334, -51, -65, 260, 24, -34, 48, 101, -23, 221, 407, 66, 237, 186, 266, 74, 130, 163, -246, 261, -178, 187, 375, 211, 89, -98, 109, 257, 94, 177, -6, -45, 63, 109, 392, 272, 198, 81, -260, 131, 121, 66, 16, 136, 290, -128, 74, -142, 89, 94, 67, 88, 201, 24, -28, -123, 448, -164, -96, 162, -2, -18, 18, 241, -55, 357, 201, -135, 175, 164, 110, 197, 299, 234, 211, 286, 76, 53, 36, 59, 301, -195, 249, -82, 6, 0, -4, 199, -289, -186, -30, 365, -97, -82, -36, 97, 59, 164, -70, 229, 242, 263, -17, 173, -129, -295, -116, -89, -24, 286, 321, 303, 218, 369, 96, 20, 171, 60, -178]
2855a78K29m1J3K3qJ91o9n7k48J91J97k7j96oJ98Pk44Q8j23N3J22k48Q2R0PJ45
2881A91q6L1k79K13RK09l0k92N1j25L12k83J09J71j08jm1J66Nk17K70j75o3K26
2905B63l87K63R9k6j71L00o28K59Q4J7J1J6j91r3J78j1j8M9L84j4k44j44o0K83
2929B19k92K79j31J2P4k5r7J32k08j79Q8nO4K43k6r3R0k12nj62L97R1k28Mj9J31
2955A42k77L74j88NOj00K36j36J15r6P3J43l86Q0L52O7j63q4j99p8J78Q7o9l9
2979D3j63L21j46o7K32k54k6J80QR0k25J35j0n2k4K5l3L1k26L6K91k05K66mm39
3004b16J31M0O5on0J6J48m9kP2j21K25kj92L7J84k94L56j72n7P1r7Q5l11k5K09
3030D5K18k77qJ2J60q9k7K72l24L08n42N94l37k0m7K52K6j41mq6Q5k8j53J3L45
$$ y = [-178, 51, 10, 23, 46, 38, 229, 160, 103, -145, 46, 243, 216, 20, 14, 212, 219, -25, 63, -60, -7, 115, -133, -51, 39, 46, 191, 105, 136, -143, 70, 79, 288, 258, -34, 17, -108, 204, -79, 30, 201, 93, 92, 51, 217, 222, 5, 275, 100, 37, 263, -124, 139, 238, 212, 41, 341, -287, -28, 56, 73, 84, 100, -91, -184, -6, -17, -35, 14, 398, 384, 140, -4, -64, 219, -73, 206, 75, 87, 161, 136, 39, 171, -37, -216, -128, -133, -69, 174, 148, 55, 145, -67, -72, -234, 163, 254, 26, 30, 11, 142, -135, 239, 51, 56, 62, -38, 198, 62, 177, 81, 154, 297, -89, -9, 343, 410, 247, 163, -36, -114, 64, 151, 82, 43, -120, 201, 55, -12, 220, -34, -60, 120, 128, 218, -7, 128, 118, 66, 42, 67, 34, 65, -161, -125, 166, -39, 227, 223, -216, -85, -45, 20, 14, -36, -20, 128, 79, 77, 149, 28, 253, 251, 59, 96, 280, -14, 342, 170, 113, 184, 87, 172, -139, -164, 45, 263, -14, -22, -10, 150, 61, 34, 306, -18, 290, -252, 342, 5, -15, -62, 190, 216, 75, 71, -15, 70, 42, -111, -98, 247]
3055B47j52R4j03k2N1O3Kk01N8J96j46j5Q1k4l39K63n8M3k7J84j53J16n7n7K12
3080B56k46N6j65J46K4O2j1k33Q4M4N9j15o5K41l21K31q0L53j89m2j84L36j68
3103G3l80L14q4J14J3j30M57m58M6Q8P8L1L1j75K15ll35K68j74j49Q6K52m02L53
3127A29jJ08j08Q7l85J9j6L81j17q3m8P1m8NL49j58r7j32p0L06r9K16m10R9J38
3152A36o0n9K34k08J2p3J83l30J86J25J85l58k74K97R3Q7k3O4l74l5K75k57K88
3175A14J31m6K4j01j90J54L41k67k36j22L86j06j50J10L31j79m9l28L67O4j18
3196A30qoRO7j36Q6J72j70J23j53j47J42j6K24k32j50K07j70K4J90k43K89j10
3219A22j84n7L57K3q0p2l4J6O7J0m3LJ83j17k30R9j27L22j62L85o59M33q0p3j83
$$ y = [247, 95, 189, 86, 64, 115, 178, 180, -21, 37, 233, 87, 72, 153, 129, -210, 53, -5, 38, 11, 195, 42, 158, 101, 44, 256, 10, 66, -99, 47, 71, 133, 122, -111, -27, 17, 76, -39, -104, 137, -184, 47, -33, 320, 131, 89, -95, 241, 73, -307, 7, -77, 37, 50, -80, 377, -81, -35, 53, 131, 162, 193, 18, 233, 230, -105, 163, -11, -160, -74, 178, -224, 129, 128, 236, 128, 215, -170, -151, -167, 214, 97, 14, -34, 37, -11, -6, 343, 185, 88, -44, -114, 192, 93, 309, -101, -2, 136, 76, 17, 251, 43, 55, -18, 165, -165, 21, 146, 331, -27, -301, -4, 89, 176, 153, 217, -157, -192, 83, -174, 114, 245, 199, 223, 122, -68, 86, 427, 160, -76, -198, 188, 82, -68, 42, 373, 194, 145, -183, 184, 248, 130, 122, 116, 125, 192, 56, 142, 314, 144, 267, 114, -33, 109, 93, 317, 85, -65, 142, -28, -4, 186, -57, 232, 122, -62, -119, 238, 261, 181, 109, 75, 91, 158, 168, 125, 128, 311, 194, -36, 63, -64, 258, 96, 481, -178, 255, 175, 102, -81]
3244h1J99j42J31j64k08K75J28j33O5N7k79L58nj86K89p4k16K50o0j41j46O6K50
3267B33j18o1k1L23m49K37k89J16K07k4r4R2j01j67L88q6K4Qj66R8j80k52M04
3290A22J10j32J3R4j23j01K11l06J06j37L97j70j85M54k92j59QJ84K83j10j43
3311A24qK38k24q1M1l8p9n0K09J3k71J01N6p8J14J0L3n0K13r3J1k51K05K05k73
3336G7J62m49K31jn4n8j32L76j19L56k66K8j67M9R5l8j74K83j5q5J02j27J82k43
3360A3j35L82l21J82J50l40K7J46k23J20o0QK41J29l65J91k21q6L60k60K00Rp4
3383G3m1K5J8J83m4k31J8K3J07P5k09K32k05J24q4q2K13k04L19l91K75j65K23
3406B52R1k77J02m1L2j59j89K79j04L10j50j31Q1N7m7n9K1j34K87k37L19l84J57
$$ y = [-81, 118, -24, 107, -57, -265, 10, 138, 5, 70, 127, -152, 206, 201, 15, 304, 230, 14, 264, 204, 63, -83, -17, 233, 115, 54, 33, 356, -93, 144, -145, -29, 178, 154, 60, 152, 51, -116, 272, 186, 210, 218, 52, 150, -30, -282, 122, 232, 100, 113, 207, 84, -17, 194, -112, -6, -143, 254, 84, -101, 353, 61, -98, -90, 94, 377, 267, 124, 116, 354, 130, 49, 90, 52, -27, -77, 132, 145, -126, -25, 31, -47, 67, 77, 110, 60, 273, 180, 191, -60, 145, 350, 77, 239, -210, 21, 20, -34, -92, -224, 152, 33, 389, 123, 151, -16, 33, 128, 90, -84, 199, 184, 99, 201, 74, 256, 13, -122, 260, -61, 121, 271, -69, -42, 104, -119, 1, -59, -51, 190, 319, -46, 145, -76, -162, 198, -62, 138, 147, 73, 32, 57, 75, 258, 214, -17, 1, 24, 131, 206, -3, 229, 24, 148, 64, -18, 195, -9, 310, -81, 194, 29, 252, 343, 66, 168, 127, 159, 0, -189, 90, -14, 296, 146, 15, 96, 153, 106, 47, 68, -66, 221, -16, 303, -81, 76]
3429G6j01O9k13K09l5m6L82m97K21M3k9l8j58M84k25n8k62K99RJ01j26j82K20
3452A43k29K47j1j28j05J82j87k0J20P3N1j08M4L27k73O5k88K56J9p2k68L87j95
3475C0RJ32K53k09j25j63K32j9j70nKjL39j87J8r6NK11k86J99J11j71n0j66O2
3500d5J19j41J10k60J45J62mj7M47m08K49k94J05k7J83k46j6K15k54J42ol0n5
3523G4N3Q2K7r2Lk02J97k63M1l0K01k07M6L26J60k58k96J14p4N0L5J05l08L20
3547A04p0O0r9Nj22K37k53J27n2M6M9J09K8n2k23R5j5J90j9J13nM1k02O2k07J83
3573A30o8k6q7kK69k30l7M4J56q1j05J28J20j87j83K51j04M27l64J81k05J37j87
3596b3j92K74j05J59L24l19N1m3Po7m6K61p1j34nK19n11J97K78q7k50Q0n5O4N9
$$ y = [76, -25, 44, -169, 40, 5, -41, 341, -156, 65, 108, 79, 41, -117, 367, 142, 84, -178, 121, 130, 231, 105, -77, 143, -86, 161, 150, 22, -83, 99, -88, -108, 12, 85, 136, 28, 72, 399, 126, 191, -97, 159, 178, 106, -162, 225, 30, 39, 171, 424, 215, 90, -73, 159, 140, -30, -35, -33, -34, 305, 118, 136, 40, 45, 256, -30, 169, 280, 109, 59, -107, -45, 74, -67, 43, -217, -72, 90, 86, 69, 516, 108, 357, 63, 168, 141, 324, 78, 62, 277, 23, 165, 159, 129, 74, 127, 209, 236, 144, 147, -55, 142, -121, -80, -110, 91, -116, -70, 256, 416, 158, -138, -24, -98, -48, -13, 92, -216, 104, 34, 94, -5, 0, -122, 115, -138, -11, -63, -17, 32, 141, 169, 117, -106, -11, -26, 164, 145, 258, 253, 294, 92, 154, -53, 130, 62, 36, -51, -53, 216, -14, -51, -7, 149, 68, -37, 91, 211, 24, -159, 92, -12, 415, 51, 232, 27, 164, -23, -215, 59, -46, 113, 437, 118, 169, 126, 133, 66, 20, 281, 210, 76, 71, 290, -221, -24, 254, 167, -83, -3, -58, 6, 65]
3621F5k47J30L3J17j14N8N3j16P6j55J93j65K68k03n9J2J61J30m6L0o7k88J40
3644FJ42j71m4j46J97rN9N4J08k22J22q4K82k65m0j08oJ19Rr5K89l44J44r0K36
3669A43K45m57J51j05l20L70k41J43k4K97J30k70L63m19J18j23KR9j57P6J43k09
3691d5k4J78j34L5P6j68N25m35j13K57l7k72K27m6k31K59k79L52q3p1r4Q5M87
3714D49l72J14l11K27j84l4K73k67J44q5J62j11j30M11j33n0p3M6L17j69qj99
3736A7k9J32m8L18m02K32j88Q7j13J59l39N09j55j88J14k01L37j63L0R3j52L9
3758H9q1N7l88L47l2J60j02K4J34J2r0l2q5J16J02M5m18K55L37l85L7J20j78o0
3782a6L65l23K51k79P5j86J18m4J29Kj41J48k37L35j21j17L0K04nKl22K02RP7
$$ y = [65, -182, -52, -19, 98, -16, 42, 95, -21, 55, -100, 93, -72, 196, -7, -66, -54, 107, 237, 191, 221, 154, -134, 6, 148, -23, -67, -213, -16, -25, 34, 88, 196, -26, 96, 12, 294, 29, -11, -119, -125, -6, 3, -92, 197, -147, -3, -93, 143, 388, -69, 82, -23, -343, 27, -214, -71, -95, 202, 332, 62, 425, 6, 124, 1, 3, 102, -55, 21, 164, -45, -69, 109, -25, 10, 86, -82, 443, 8, -105, 152, 115, -157, 70, 24, -207, 52, -227, 125, 42, -29, -123, -38, 449, 77, 191, -120, 107, -77, -111, 162, -105, 39, -46, 116, 5, -125, 286, 153, 103, 30, 76, 393, 224, 216, 17, -12, 120, 72, 390, -12, 220, 32, 119, 6, 165, -174, 335, 180, -8, 106, -95, 242, 79, 109, 202, 50, 89, 8, 65, -323, 24, -8, 152, 50, 74, 208, 220, 130, 98, 13, 129, 231, 276, -142, 113, 450, 65, 102, 222, 44, -16, 349, 26, 277, -2, 73, -113, 5, -39, 90, 92, -49, 99, -138, 197, 76, -41, -11, 193, 188, 190, -132, 70, 79, 156]
3806A56j87q2K51p0p4j0o9M29l39p7J03K22k5j68O4k27J23j89L8L29m60K19K35
3829A92j11M2n1Q6k46P2o4r3J64K72j08PM2m3j36j4J20k72K83j67j56J40j2J79
3853A26k61K32j52NP7K14R3q6l90J62R2O5J84j77j00k24K71j72o2O8K32J0P9r9
3877A87j99o2J61k60J32K16k05K28j73P3n1j58m7J48K83k07J04j52j35K23q1l6
3899a1P9P8p3j91J21M44k82k59j63N16j38k9o6R8O5J93l05j37o0k0J71l41M74
3922A64j75O2L6Rj12J55L29n40K74P3k45l3J99k69K27lj92L17k47J11k02rRL12
3946B50j27k85K36p4J50o4J01l41K31o8q2l6J70J7j0k04O02m33OJ86n2J27j89
3969A11L9j76k8k55M37j70p0M97l79J09n0J36l50M4Q7MJ04L24j93j63l3lJ4r0
$$ y = [156, -31, -113, 138, 68, -6, -16, -85, 344, 5, -72, 31, 253, 228, 60, 124, -103, 20, -169, -131, 198, -262, -43, 192, 81, 123, 72, 158, -88, -16, -80, -173, -9, 263, 155, 162, 204, 161, 25, 11, 131, -141, 142, -25, -181, -41, -53, 126, -135, 97, -55, -50, 27, 241, 334, 248, -142, 20, 112, 177, 361, 184, 84, -140, 131, -41, -103, -35, 197, 207, 286, 187, -12, -74, 87, -173, -41, 175, -30, 198, 25, 98, 47, -111, -158, -10, 273, 66, 170, 18, -117, 106, 25, -11, 68, 146, 73, -118, 3, 447, 165, -94, -257, 259, 121, 92, 26, 124, 189, 382, 77, -60, -120, -140, 31, -310, 164, -11, 51, 87, 96, -16, 139, 468, -72, 202, 275, 30, -3, 196, -73, 154, 151, -41, 276, 29, 140, -62, -71, -62, 250, 123, -162, 74, 0, 150, 86, 187, -154, 77, 9, -73, -109, 61, 78, 68, -136, 466, 33, 39, 225, 173, 300, 111, 150, -26, -54, -309, 128, -42, -112, 385, 6, 115, 65, 201, -149, -105, -18, -14, 90, 414, 221, 58, 25, 22, 36, -54]
3993e4oJ40J60l30L20j13Q1m27M59L7k7j93j04L80r3o7p0j26j9R3J54n5j66M2
4017A6J9n2J30pr8J18k96K51K4r6J36j63K9K1RL21l34l6K23j11k03J31L05j35
4041B02J86k88J31l30o4K17P1K6j99J9p5J65K1p2M0K64k48J09K02J5l12j64J23
4064C9j55J96q1j73l3p2K92K60m09J51K13j97L4j60J13J23j29j84J33M18m47K52
4086A84j23j02Q1j45K37j76K84m49M99k55mLK31l82J73j93M52r2j73J56k03J34
4108A37j12J0k91K96p2K39n2r6P8J82n9J25l10K09j96q2L21Kk43j12J93l9j40
4131a2M3O9O7l2M5j75J30J46l19J5K30l5j98J2K5J47j14K70k09m2M6P8Q2o3L6
4156B42n8j29j42K28q7j43P3O0J32q1O1k02Q1o5R9n2l1j03M1K55o3N7p4J11q9
$$ y = [-54, -60, 80, 240, -90, 230, 117, 198, -229, 230, 267, 240, 47, -57, 323, 230, 163, 93, -33, -52, 41, 195, 140, -26, 16, 35, -17, 113, 106, 8, 126, -170, 81, 105, 9, 145, -18, 11, 32, 41, 362, 28, -8, 215, 104, -99, 32, 337, 202, 388, 100, 231, -99, -163, 54, 125, 151, -48, -29, -104, 61, 82, 10, 50, 314, 66, 175, 377, 392, 80, -84, 39, -116, 80, -1, -174, -207, -279, 13, 273, -136, 15, 228, 31, 65, -95, 18, 141, 12, -172, -39, 379, -68, 184, 61, -41, 40, -105, 132, -44, 240, -209, 290, 35, 31, 34, 265, -117, 56, -137, 315, 223, 50, 206, 3, 137, 25, 35, -256, 40, -32, 207, 155, 59, 137, 319, 260, 385, 75, 284, 88, 6, 327, 329, 86, -26, 167, 128, -12, 31, 100, 167, 135, 180, 5, 135, 281, -38, -23, 207, 172, -26, -14, 11, 158, 44, 314, 105, 63, 109, 187, 269, 206, 242, 184, 55, -87, 141, 54, -89, -16, 44, 176, 95, 156, -46, 35, -30, 69, 17, -14, -117, -76, 179, 116, 173, 99, 210, 121]
4181A21r9K15k63N7J45j30n7M1J41j69J29l5l16K29j02J70r5K04N2k43M51j00
4203C46l16p4J26j53J92k55K08J70M1p9p1j6R9j66J6K6k0r0Qk70L62o1J1MM6j82
4229i8j70L31P3l22L70j93R2j8K65m20J73L4%l2K8j16q4J94j28J77j8Q7k84K19
4253A60m9j12O9O1R2n7Q1k85K62k74J50o2J3l31K17J80l27J55K13J45j62r8N8
4276I9m6M0J8k94K32M7J07J9n18J25L85k49K21l4j94J30k18J58J59k55L75k53
4298E4k5Q8j99Q6j06J80lM3L6k61K27L61n63J5J51J23j81P7o2K19n0j55N1j34
4322b8o7j9J06K25j6j26k30K3O3j91N09l79P9J20j16N60m55j3q5l0LJ80k03K52
4346A62k46K07M2K06k85m1j06j05L40R4n6k87L11k2j51j5p8J42M2M6o1k15L86
$$ y = [121, 22, 237, -26, 31, 176, 46, -11, 30, 171, 2, 131, 96, -220, 9, -93, 77, -18, 186, 238, -5, 446, 346, 30, -44, 82, -71, 121, -134, 74, 244, 285, 206, 135, 119, 218, 52, 68, 94, 74, -16, -8, -278, 84, 23, 34, 38, 84, -98, -268, 63, 136, -186, 184, -9, 83, 65, 330, -90, 83, 117, 117, 85, 113, -3, -87, 107, -21, 156, 138, 225, -59, 160, 111, -1, 68, 129, 221, 164, 245, -40, 222, -52, 98, 36, 49, -282, -65, 115, -212, -57, 156, 301, 139, 41, 99, 53, 93, 111, -183, 49, 96, 203, 222, -296, -171, 214, -35, 186, 152, -42, 88, -130, 28, 187, -68, 307, 54, 29, 117, -82, 4, -102, 78, 75, 118, 154, -107, 120, 481, -82, -67, 84, 207, 26, 103, 41, 260, 210, 55, 106, -28, -95, -114, -8, 217, 201, 75, -155, -132, -69, -260, 249, -130, -51, 69, -47, 513, 58, 45, -40, -70, -67, 113, -90, 162, -84, 123, 165, 371, 86, 45, -61, -166, 174, 268, 212, -75, 236, 214, 63, 48, -30, 112, 154, 200, 139, -76, 310]
4369C10m52J71m3j10K29j49L64k30K3k25L29j36M3J05K21n27K89j69r5L8o4J89
4391A11O5j05j97m1J96N4q9K17K2k70P2J84l04K36l6J6J7J17j64n1K18k69J48
4414A47%n5KJ19k25L89l74k5M1j86R9J40j55lq3L12j05j4l0M8J13l7j71k51K96
4439hN3J47J21l21J27j33r7R6J38k1R2Jr9j25K99l19k8K21o1M8j3K52m97L0J52
4464E5m1o8L21j04j45j23jL14k23K21j14PL0M5R8j92k07m6J94L2n5Q6m1j59J47
4489C1j11N6Q2Q3L5J00m9k20K78P0m84L40k89J57Q7j35k0Q7k52K53p4J71r4Kr
4514I5k74M60r2m3j24k32J53N3RK07l61J46L4m8q7K2J7P7L61k97j42J4j66N67
4538C49k99r0L0r3j4K46J57l24K81k33M5J42j75m7pJ40jj81K96l62K69n2l0Oj63
$$ y = [310, -142, 29, -14, -124, 105, -44, 320, 90, 113, -112, 217, 81, 124, 229, 450, -77, 212, 43, -52, -14, -78, 111, 176, 71, -126, -167, 29, 83, -6, 211, 233, -37, 35, 219, -85, 151, 115, 131, 148, 265, 101, 50, 268, -1, 147, 147, 92, 94, 213, -12, 377, 3, -22, 19, -167, -68, 72, -83, -86, -169, 143, 38, 24, -6, 42, 155, 118, -53, -304, -8, 45, 192, 313, -8, 119, -14, -111, -15, 123, 102, 194, 195, 96, -29, 270, -49, -77, 144, 83, 131, 118, 370, -127, -97, 55, 14, -54, 267, 163, 18, -105, -106, 208, -15, 206, 92, 99, 129, 174, 272, 80, -127, -173, 21, 53, -2, 84, 43, -116, 31, -80, -24, 58, 141, 176, 276, 227, 7, 285, 355, -129, 211, -78, 79, 166, 31, 11, 98, -154, 99, 25, 196, 102, 104, 95, -179, 281, 189, 146, 22, -210, -57, -4, 5, 212, -149, -3, 31, -17, -104, -82, -65, 12, 373, 76, -66, -52, -218, 349, 50, -40, -10, -103, -117, 129, 286, -38, 243, 10, 55, 197, 22, -25, -32, 108, 107, -74, 222, -140, 129, 77, 47, 53, -110]
4563a10K38J4J12j54jj09j28K91k8Q5l25P6J33j54K50j63K31j74K0K4or0k99M00
4587A33j8j51J10j90pK86J55k64R0J41j49l13r2K39O5K1J29j58j50J48L92k89
4609A28j29Q4l0j08K5J03q6J04j28J77j97l4J51M5p8K85k45J03j96M0J66k54j68
4632b42O9K16M4M9n1k10j42K88l53R3N96k92j88J28j93J99J41j8O0N2o3l3j14
4655C6K30k36J90l71J62J45j24m6K5K11l29J97j27L01k94J29QJ83k33k09K18J1
4677G7l9m6K39j47p8J38k8Q6q4J0j26L9j40O8Q3j47Q0M4J80K01n06M23n7m71M09
4702B08j90K11n27M20L0j84j88M69o1l36J17M9l3J33l20J87R7k2k14M46j73n0
4724F9m5N4L0J27k72l6K88m22K17q6K61j2j80j62K73j31L42N3l74j30J08J40j02
$$ y = [-110, 128, 142, 254, 100, 99, -10, -138, 153, 125, 210, -115, -39, 94, -60, 190, 27, 258, 84, 104, 128, 122, 32, -267, 133, 115, -36, 74, -116, -123, 163, 318, 54, 144, 285, 136, -177, -269, -30, 35, 56, 185, 27, -123, 25, 417, 128, -1, 83, 53, -55, -30, 73, -13, 91, -37, 140, -57, -91, 60, 105, 27, 312, 67, 170, -26, 14, 180, -74, -242, -173, 43, 87, 136, 85, -125, -267, 21, -332, -239, 357, 65, -123, 5, -188, 11, 152, 134, 194, 246, 183, 150, 36, 266, 30, 220, -151, 11, 156, 32, -14, 11, 222, -107, 90, -37, 264, -30, 99, 107, 290, 57, -152, 66, 77, 38, -8, 231, 84, 6, 144, 116, 202, 118, 128, 2, 41, -99, -31, 52, -95, -15, 29, 209, 410, -96, 327, 270, -201, 208, 18, 229, -298, 122, 152, -32, -220, 249, 188, -148, -31, 18, -15, 118, -202, -15, 82, 60, -154, 292, 119, 69, 24, 78, 108, 235, -37, -73, 215, -207, 10, -76, 185, 173, -7, -169, 104, -27, 315, 368, -6, -136, -28, 112, 10]
4747A0J79R4n97K44L78n45K22K20k10J27j34P9J12J43k50J32l5l53J84J58J90
4768C48k95k86N7L93j27J9q9m4K79j55j30J52k74J18M04m27P5O9o8K02l69L45
4790A97j17l26J33K32j28j34R8qq8j5J17j07L61j32j00P0K67j86K01m08J08K30
4812B65q0l8r9J74P5J24k86J04k12r4K31j73K13j30J54n6j73J52o4J9nk93K78
4835H6k20L00k73J76J1L6j7j65K23q2j01K05j19q0R6k67Q4J05M2J24Nk02K39o7
4859A39J73p6Jk75l8L34M4k32Q6j60j8J18j76K67R2k50j01j66L81j07J46l91J90
4882a9J84j02o9N5N5J31K44l74OJ4j42L7j85L75k76k7K31L2j59J14M9p3n7r5K
4907d9J63l5p6l6J44L2j08J19k70k1L93k00k26L32j10J05n6k5oK64l69N0j09J99
$$ y = [10, 189, 283, -314, -70, 308, -237, -15, 205, -5, 122, -12, 67, 179, 322, 72, 204, 169, -184, 0, 158, 348, 53, -233, -176, 217, 90, 109, 20, -24, 255, 100, -30, 122, -152, -34, 370, -57, 18, 87, 19, 221, -148, 197, 80, -246, -113, 119, -9, -143, -45, -53, -141, -156, -39, -146, 215, 83, -17, 53, 320, 134, 335, -73, 35, 265, 185, 147, 48, 222, 297, 421, 135, 239, 27, -67, 164, -9, 204, 74, 228, 172, -1, 151, 87, 106, 101, -192, 86, -134, 166, -107, 69, 80, 116, 99, -66, 157, 75, -26, 179, 60, -20, 76, -191, -107, -2, 40, 164, 169, -33, 206, 139, 312, 236, 237, -38, -76, 258, 302, 70, 156, -4, -22, 96, -80, 187, 279, 29, -72, -238, 143, 36, 182, -209, -19, 165, 63, -6, 49, 104, 235, 479, 105, 111, 125, -17, 20, -165, 210, -66, -93, 138, 170, 11, 125, 174, 101, 44, -51, -49, 114, 79, 3, -33, 111, 143, 35, 154, -116, -137, 256, 56, -170, 162, 52, 157, 101, 76, 70, 334, -35, 15, -94, 105]
4931A05r5L8R3Oq3J26k88J84k72K58J01k19P7M1J75j36j87Q9j27J96K7N0l59L14
4955A14Q1l26M02j43j25L38l26J03O7j22q2K1J84k6k97J85K9k30L03M8k47K41
4977A92l02K59l1j67M32k60J33j48L4K03j30J64k95j15K19l64L46j32QM8J24m56
4999b38J77J90J6j22O4KP0kj41J24Mj32N8j20k2K29k67J52n2K42m61M85k08l8
5023A0J53k18m3J11J00q7J63R0l32J23J02k82L68k58L5N3m1k1J92J31j38L6p8
5046A69k68J08k3J39j41n6p5J58Q8J31j21J95n90L04j42J59K4K75o23J66J35M3
5068E5J37r2J06k33q5oJ41J17j57N3Q3K8m0J2j45L29l35Qo1J2L12l18N09m49J91
5093A72j59M3j5J26lj94m6J20j75N14k30j44J83J26m10O4L6J8Qk8P7P7J01l00
$$ y = [105, 10, 48, 141, 147, 64, 190, -98, 86, -186, 72, 173, -46, 31, 72, 247, 111, -76, 13, -114, 82, 109, 159, -200, 114, 195, -131, 271, 128, 3, 341, 15, 118, 185, 63, -19, 2, 186, 160, -137, 48, 77, -153, 150, 198, -49, 192, -110, 149, 118, -49, 383, 123, 256, 108, 142, 345, 215, 379, 84, -31, 188, -176, 170, 38, 46, 94, 218, -238, -61, 129, 145, 23, 87, 89, 159, 157, 16, 140, 144, 12, 70, -50, -72, 157, -110, 42, -10, 232, -229, 256, 48, 10, 163, -55, -98, 13, 113, 26, 189, 279, -53, 70, 172, -110, 258, 0, 35, 88, 47, 26, 218, 349, 211, 247, 169, -99, 9, -14, 125, -16, -72, -147, 11, 99, 230, 109, 304, -286, 18, -124, 35, 59, 334, -289, -123, 12, 55, 192, 100, 206, -27, -112, -118, 23, 140, -17, 36, 119, 147, 107, 119, -26, 303, -32, -24, -85, -73, 239, -79, 430, -19, 172, 13, 56, 41, 167, 164, -30, -76, 44, -131, 383, 153, 9, 192, 318, -92, -28, 8, 26, 34, 6, 83, 160, 261, -39]
5117c9M83l60j85J43k58K22m6J10k7N9M0q4j74J75J38Jk17j52R8J35j81L20%k47
5141d6R6j56K17mk67K69J94m84M33l89Q0K77k72L37n20K22J17M7J80j61j56k8
5163a4K2J89j30N3j28K11j48k69M50l40l9K09o2J64J8k60K75l90K32K65k64r1
5185d7k0j51J28J9L87l79L01m53L63L6j08r1J26J9l16Q6K10R8k40J17J65j71P2
5208A51k17j2n5K43j16J00L8J82j58l11n1K23o9j12L07m9j6L2r6K5Q8K00j91p4
5232F2N2n0oQ7l44N14k60J81k50q7L04k69K43n4j33J51P3j75n8J28j76K65P2k27
5256D3K76j6k83k0K97o3j12j75R6k1J14j35j42L94m9J8p9K67l42N6n1N6k60j63
5280b94J83M15k55j36R7J2J15l06K25M0K52k53K53k70j91J84j1O2l8k7j02l1N7
$$ y = [-39, 444, 84, -101, 42, -216, 6, -40, 70, 43, 102, 142, 58, -116, 59, 197, 198, -19, -171, -73, 62, -119, 201, 201, -46, 50, -106, 111, 107, -160, 109, 303, -181, 252, -137, -57, 220, -52, 285, -235, -13, 104, 151, 331, 170, 14, -14, 8, 197, 67, 120, -8, 203, 55, -214, 236, -104, -143, 66, 4, 168, 186, -74, 201, -189, 43, 308, 44, -47, -67, -218, -90, -71, 316, -63, 238, -215, 148, 184, 76, -15, 111, 130, -186, -100, 110, 208, -32, 85, 250, 79, 151, -66, -78, -133, 110, -6, 94, 132, 314, 156, -155, -206, 17, -52, -164, 143, 94, 78, 110, 14, 39, 127, 327, 136, 62, 114, 64, 58, 145, -199, 315, 55, 236, -14, -101, 203, -66, 177, 123, -10, 141, 214, 39, -19, 109, -67, 198, 270, 43, 319, 303, 20, 0, 297, 234, 122, -53, 43, 22, 136, 1, -141, 253, 204, 222, 143, 410, 68, 124, 73, 129, -131, -294, -111, 304, 49, -87, 10, 22, 137, -169, 56, 96, 348, 95, 348, 78, -113, 71, 60, 122, 84, 57, -45, -76, -19]
5303a9J39j30J52p7j05K72k73M52j88k90K00j02k05M24k30k40M04j89K01K8n7
5324A67m3r9j40L2K13j38j39K31k57J55J82k7j8n3N0K57l39j24o0M15j34P7l47
5347a39K12q2Q0n1k42M00j86o0K35j15j20K03p2L48k66j00R3j62M2J66j73j43
5369a32K37J28q8o5J16k77m0R0q1J99j55j26K49J62k25J40K2k03M3J63o4k06J87
5392G4KPj18Q1J30k50L14k65o2j01M21k12L35k28l3R0k10j7o9J28m6J07J00j27
5416E1Qj1R2J72n49M06k23Q1L03l21q2L75l9l91O9R9P0p1k1J0R1kJL40k75j18
5442F5k6J87k0k44n4K54r3j29m0K90m4q9Q0j09o3m0L65j10Lj37K64m28L78l56
5466i6Q1J97k67K24n2R9k52k6J8K70k3j57K8k80M03L9r9j47J30l5P0k49K04J06
$$ y = [-19, 120, -10, 142, 65, -40, 232, -41, 411, 223, -67, 133, 31, -174, 250, 20, -220, 184, -5, 196, 224, 167, 124, 25, -115, -83, 130, -8, -147, 84, -173, -18, 164, 137, 119, 66, 116, 373, 34, -90, -150, 265, 131, 208, -139, 73, -9, 71, 20, -222, 178, -8, -68, 167, 52, -68, 135, 63, 411, 145, 45, 138, -24, 18, 184, 11, -132, 105, 233, 145, 80, 196, -81, -121, -31, -112, 87, -68, -194, 55, 217, -8, 132, 154, -49, -6, 157, 93, -113, 74, 76, 83, -35, 46, 176, -74, 240, -25, -87, -188, 233, 21, 356, 128, 95, 185, -25, -42, -111, 17, -29, 78, 178, 51, 59, 48, 140, 312, -237, 169, -54, 27, 330, 9, -73, 302, 263, -128, -59, 40, 110, 39, 18, 28, 119, 117, 118, 458, 183, 65, 39, 226, 206, -38, -92, 162, 69, -60, -100, 190, 146, 57, 137, 28, -35, -75, 290, 180, 183, 46, 310, -118, 260, -96, -15, 182, -85, 139, 87, 186, -66, -92, -74, 196, 173, 16, 44, -236, 167, 206, 107, -40, 90, 55, 125, -124, 80, 186]
5490A86j06j51j76L44o3k40K08K50l65R9j51J71J15k20L56j30P8k40o0P8KM6J08
5513A39l2n2j79J74Q4k35o3J40Q0K95l18j18j35M53j68o3M3J73j55J38l3k03K74
5536B39l99J2l0m0L36j77K05R3m14J49r4L83j69J19j34k1j50K14J53j86j2J33
5558B10j03PK94m30K75m18K20k11K36l9o2K08j96r3K98r9j50K56k48K00k89JL72
5581B39j55j07J64k28k10L05J08r8j15K13rN3q0J58j54l35L73j82N8J41j22k39
5603b22J50J40j46J00J18P4k31m3J37N5n6Q2j63K13j21Q9k55K59q3k01R8K9K8
5626E1J78j59J6J3K0K18l81L19m99l8L46m2m6M4rJ45j14Rj37K16o7kL28n13L90
5651B86j86m6K33m19J51J76j59R9k97r1N34l34m4L17J42l66l8J73l20L74l8j12
$$ y = [186, 80, -71, -247, 97, 34, -206, 2, 252, -113, -14, -165, 6, 121, -99, 257, 127, 205, -35, -95, -17, -15, 31, 139, 107, 55, -124, 50, 134, -101, -164, -24, 56, 351, 33, -85, -220, 233, 65, 2, 45, 218, 63, 201, 168, -35, 239, -160, -148, -178, -218, 118, -59, 146, 239, -175, -26, -120, 263, 94, 213, 79, 58, -92, 122, 275, 89, 77, 210, 107, 114, 408, -22, 253, -165, 55, -156, 80, 41, -21, 187, -9, -102, 196, 97, -53, 203, -45, 155, -134, -133, 239, 84, -23, 141, -87, -297, 8, 116, 18, -97, 116, 107, 160, 80, 238, 84, -251, 122, -60, -2, 139, 17, -222, -72, 68, -78, 22, 140, 214, -17, -60, 77, 132, 76, 158, -5, 208, 87, 176, -79, 180, 97, -104, -6, 23, 51, 229, 70, 86, 99, 119, 337, -44, 275, -224, -262, 84, 42, -4, 40, 31, 176, 62, 71, -66, 150, 83, 81, 409, -104, 286, 100, 54, 287, -132, 19, 195, 36, 135, -162, -253, 281, -53, -97, 220, 362, -4, -42, 131, -189, 185, 147, 35]
5673C5J33m6Q6k83R1P2j84N4K20J57o05L93J64j69j70Q0J10k55K59L8j84r8o9
5696a71L81l06m2L98k21P5l31R3J39RJ4n4J20j55K21m22L75j00J61j09q5r0J32
5719C2J46k64M21k86L9m8J46j68K47k84J74q7j83K00J5l4K62l03nK56j87j11j35
5742a57K70J14k28k49L37q2N9J85k09k5k5L23j81J68k90J80j51m0j32K52j65L17
5764B71l14J16K0l02K78P1j0r5K22l31N0K21j44p4k1P2K75l38kK10p5p7J07l29
5788a99K04J3%J14J14k13k5J48J78j44N5m8J1j08K20j96j75J69N1k20o7K71J48
5811C01k17j54K06j87k05L73n6N0n1R7n5j7P8J49j01k20J36k12J72J4k0q8p9K20
5835A34J80k02k36K95j49M7L1K31m13K51oK50o39L77j34K38J8k96J34j11n4J0
$$ y = [35, 168, 122, 208, -75, 16, 88, -96, -42, 178, 335, -270, 123, 287, 118, -52, 28, 138, -117, 142, 180, -4, -102, -171, 210, -96, -138, 260, 39, 114, -217, -124, 15, 24, 38, -16, 104, -51, 170, -252, 123, 23, 184, 75, -10, -100, 32, 178, -86, 335, 49, 88, 40, 186, 18, 265, -19, 155, 68, -115, 85, 100, 66, 328, 25, 20, 276, 89, -22, -157, 113, 227, -1, -250, 87, 5, 64, 249, 40, 15, -10, 313, 132, 300, 10, 190, 39, -1, -133, 119, -46, 271, -43, 73, 93, -209, 69, 140, 130, 35, 257, -74, -24, 197, 53, -21, -42, 30, 305, -33, -35, 175, 100, 23, 130, -199, 5, 18, 18, 132, 246, 33, 8, 156, 334, 190, 245, 197, 208, 100, 320, 124, -51, 118, 169, -51, -118, 153, 301, 84, -70, 136, -51, -256, 117, 61, 111, 60, 157, 102, 85, 163, 312, 211, -9, 127, -85, 87, 101, 81, -7, -86, 134, 314, 112, -124, 171, 22, 69, 100, 331, -82, 169, 163, 413, -226, 151, 17, 255, 273, -23, 111, 0, -54, -44]
5857d4L44l37L78k14J45j93p3M4R3j02Q5r7L67l36K25j04K3j78q1K23J22k68l9
5880a7j7J53K37l15J23m4j35K11j33P9j48j57P0K57L8l30M60k99P5o7J04J01j62
5903H4Q7k45J46n6J5J65j3j29j70P8M49j60J27k80J01N3k75K28j68K68j71p4J34
5926A94j74J64j64M6j68L70l11q0K79J76j81j87n2l35Q36k98j45KJ20l40N15j87
5948H0QqJ12o6j86nL57k44J22r9k79M32l3K6j03j49J10k10R6J51j48J3M44k40
5972A81n1m2O0J4l31M79j80l60J68J15J74J26m72K53k03K63m5n1j80K24j16pJ47
5995A66N0r0J81m17K5L43j32j49j4M0J71k3j29l3K32l45J17Q1K49r1J09m01Q6
6018B6R9P8M6l43k0P2mJ53N1k35K72j12l8j22P1L8J69j56K18l83M16k24J4o3l5
$$ y = [-44, 300, -37, 341, 127, 272, 79, 6, 50, 143, 41, 126, 29, 396, 60, 285, 181, 204, 26, -55, 168, 290, 22, -17, -34, 119, 356, 41, 164, 120, -15, 196, 63, 142, -6, -163, -93, 164, 202, -128, 332, 33, 108, 41, 145, 246, 84, 171, -74, 72, 16, 31, 196, 183, 54, -116, -38, 411, 251, 378, 98, 199, 252, -23, 205, 37, 305, 134, 60, 194, 20, 184, 20, 66, -102, 268, -43, -123, 156, 332, 151, -36, -88, -423, 413, 115, -30, -28, 92, -248, 267, 80, 88, 80, 192, 126, -60, -65, 292, 48, 170, 71, -208, 224, 191, 217, 114, -35, 75, -135, -39, 112, -36, -23, 421, 181, 130, 88, 148, 162, -169, 310, 130, -230, -62, 53, 227, 353, -119, 134, -69, 194, 149, 98, -82, 142, 26, 19, 166, 216, 126, 307, -110, -85, 258, 126, -23, -37, 3, 174, 151, 22, -11, 221, -124, -7, 74, 323, 232, 341, -60, 26, 125, 203, 249, -94, -114, -42, -46, 107, 158, -77, 195, 83, 45, -77, -6, 32, 201, 45, 263, -120, 296, 72, 86, 23, -12]
6043a2K75j57l1k81M38r3j35N4P5k09L10k81K58l7k06P2NJ97n9k9j89Q7n3k96
6067b97O41k44j62R6K81k03K50r5k80J80k5j56J05qQ9l31L92k46K17j50j32J17
6089C9L59j91K7j62j39J77j30j6K39J08k48O6k06L2l1J64r1k5K10j97R5k83J11
6112i2J40K48k66l7J50K07j61o0j81J57J72l08K53k78R9L01j41k75J37K0J93j50
6134A28J74k58o9m9M49j97l48J88l4K67m11L20kk97J53j9J61r0j2k3Pj34K6J24
6158E4j66J94r0q4L44k18P7m6J07l58J23K05l59J85p9L34j91J34k05K92j70L2
6180A15n9j54M18q7n5j61J18k47L12Q4j48p7K43j04p6j76M02j51Q4l78J02Q3l9
6203D9k72K10j08M26k54j30L66j26k4K24j53K74n13J74n4p3N2k03K2L00o0p5J43
$$ y = [-12, 263, 106, 75, -206, 232, 139, 4, 58, 133, -76, 234, -47, 211, 174, -32, 40, 45, 242, 183, 154, -35, 52, -1, -297, 344, 100, -62, 34, 315, 112, 362, 267, -13, 167, 142, -14, 91, 83, 172, -159, 233, -13, 204, 54, -78, 39, 398, 207, 234, 72, -67, 110, -20, -36, 203, 311, 63, 129, -77, -45, -76, 88, -3, -28, 182, -15, 80, -203, -92, 48, 296, 30, -7, 143, 350, 189, 129, -52, 105, 277, -31, 222, -56, 43, 344, 203, -72, 65, 85, 278, 128, 302, 44, -25, -74, 375, 178, -170, 18, -16, 251, -160, 160, 158, -139, 14, -5, 156, 66, 54, 31, 38, -96, -70, 54, -112, 82, -8, -92, 252, 34, 111, 65, 172, -186, -63, 142, -217, -32, -111, 223, 32, 166, -39, 253, 83, 115, 56, -98, 320, 233, 178, 17, 135, -112, 200, 284, 136, 59, 302, 198, 122, -54, 348, 197, 281, -97, 5, 88, 49, -223, -13, -121, 305, 51, -79, 287, 161, 137, 361, 208, 482, -31, 143, 89, 16, 68, -135, -113, 187, 127, 52, 195]
6226A95r3Q1k25R2K62k32k50L87j42r4K08j17l8j37K55k70M73n21R6J20J70r6
6248A24j71Q4o8J65j42m2k6j7M11l43K35n7rl2k99K17L59k66j97L02j96J3j39
6271i4R0l2N1n6K22Or6Rj72K00PL4n9j8k29L77k86J41k55jP7K25k03J38K2j33
6297c5J04j04K33o4j99m2K16m8m8R2j21J56j44k01K58l2K34m23K90j80Q3K5pr5
6321e2J19K2j59J64Q2n2K75m79k2J32L75k43j11N7O1r7L00m06l8K88m8q5L6j6
6345A03m4O7J85l87K76j73q6J38Q3j46k49K69K13r6k6j92Q8J57k55K25j60p1J33
6368E2J29q3k5kL4K31q1j56k9J84l38L03j43j15L01j00L6k51J21K3R9m9m4q8J48
6393A57j03P1k33J29O7K00k46k3j68J74n7rL29m06K19q5K70k55j12q1K38J42j42
$$ y = [195, 102, 183, -42, 50, 312, 80, -170, 217, 75, -19, 189, 72, 34, -103, 152, -118, 355, -166, -70, 50, 220, 124, -47, 37, -31, 134, -8, -50, -76, -93, 318, -25, 210, 153, 144, 112, -187, 30, 389, 123, -74, 228, 32, 45, -94, -4, -36, 15, -41, 181, 187, 91, 100, -72, 128, 135, 169, 110, 92, -137, 240, -46, 95, -160, -161, -84, 141, -62, 76, 98, -35, 69, -35, 198, 134, -65, -107, 109, 61, 13, 105, -16, 140, -4, -205, 53, 21, 255, -168, 122, -58, 25, 50, 43, -52, 67, 89, -70, 94, 176, 124, 399, -80, -102, 30, 405, 162, 51, 108, 169, 72, 372, -34, -72, 216, 168, 83, 119, 103, 59, 126, 311, -76, 200, 27, -59, 79, 162, 16, -233, 36, 249, 153, 127, -65, 23, 180, -75, 150, -10, -81, 52, 181, 98, 73, 71, 105, 336, 255, 99, 70, 254, -84, 219, 76, -39, 262, 162, 198, -53, 68, 91, 190, 141, 97, 9, 157, 54, 125, -108, 21, 88, 288, 42, 19, -149, 25, -32, -41, 288, -118, 101, 16, 286, 31, -81, -162, 76, 218, 76]
6416G6n3j87L36k45L19k42J21j23J87j08k98K85j03j48K92k5J85j91P2J39o30
6437c41N09lq6j06K05j3J31k50J34L6k97J74j92K77pj49J00p7J31k92J96L2k22
6460a10J83M2j04l0k29J13Q5K89l11J13j41J73N8l0j98Q0J7l1J0K22j81K5J90
6483B35J13l70O9K23k66K04K6O0j60j12j49K33j12j79J85N9K13j38J62j61o1m4
6505C0J28p0R7r7l00J12K7M10m33J39j10j01J43r4J80k2L00Q6l57Nj36M41m47
6528f9L6J13K69m04L6J59l54K94pj99K54j86K83j83L8M3k28K87o6L8k8r1M9q4
6552@l0j12J44L17m17K23M6j57p9K82m9l6O0N1l00K27j63K81j95j44K34k06L5
6575A2J09r9j93K6K07J44j41j78p9M04qq0J06%l73R3L35q6%l2K3j26j44N7j02
$$ y = [76, 23, -164, 172, -73, 246, 4, 125, 2, 189, 81, -217, 68, -35, -183, 109, 84, 269, 78, 150, 289, -341, 168, 165, 79, -27, 178, 165, 296, 46, 180, 216, -81, 93, -99, 178, 171, 22, 122, 45, 176, -116, 80, 112, -110, 73, 115, 11, -19, -248, -135, -50, 239, -72, 41, -100, 73, 131, 101, -97, -17, 0, -31, -21, 201, 20, 45, 235, 348, -22, 47, 270, 4, 208, 234, 294, 134, 22, -127, 106, -6, -185, 0, 59, 272, 134, 296, 135, 74, 30, 158, 88, 185, 88, -212, -100, -73, 337, -96, 43, -67, -168, -25, -119, 61, 39, 339, 425, 68, 73, -63, 378, -69, -33, 80, 349, -55, -19, 140, -214, 80, 73, -126, 128, -58, 225, 42, 80, 123, -105, 182, 116, 154, 126, 35, 84, 0, -30, -142, 2, 319, -98, 125, 171, 14, -65, 217, 168, 132, 192, 243, -57, 170, 7, 288, 93, -51, 183, -23, 12, 121, 22, -171, -145, 62, 206, 65, -113, -192, 212, 204, 124, 230, 230, -143, -50, 285, 199, 199, 167, 190, 64, -80, -23, -125]
6600a25J95RR1K8j95O6Jlj84M30l11J05J99k15m5j6j40j71K12R7J05o1j77K24
6624A19N6J51l7k01J54j54q2k10N3K6J41P0k36J81L65l28J03k07J53k90R8L41
6646B66L5l63K08r3j69L87r3j00O2m28N70l17L76n82L85OK05j71j98P8k40L83
6668B07n8j52K03j10K28p7k33o4J36J77n03J61K18o8J07q8J81j6k72J17j28q1
6690a15J58j13L66l25K32k35L16l92J09N2P6j24N9P8q4r2n5O5N7J42j44J70q2
6713A19k02K35Q4j98J67j24j38J69k3M9l69L02O7O1p0o1J40k33K08l84N39m10
6735g2J46L1k6j2J36j45R8P0j04M11k66j73j9J1k12L46k74Q0j89M68j83J39k81
6758b0J44k43k5O6k4K35N3j17Q3q3p3Q4k34K22pj42Q5R8n8rj4O4m2Q8K73l80J07
$$ y = [-125, 70, 79, 170, 198, 3, 69, 70, 67, -117, 313, 2, 107, 306, 91, 46, 30, -110, -281, -69, 28, 133, 72, -105, 119, 175, 326, 289, 88, 242, 88, 6, -204, -151, -125, 16, 86, -150, 31, 396, 68, 171, -36, 117, -173, -75, 266, 301, -62, 146, 53, -116, 271, 178, 78, 140, -288, 282, -35, 341, -241, 144, 150, 355, 184, -14, 64, -176, 207, 149, -3, 200, 90, 318, 241, 8, -56, 80, 257, -246, -85, 133, 65, 172, 84, 265, 249, -23, 94, -34, -115, 43, -70, 296, -29, 203, -32, 284, -108, 1, 53, 129, 5, 64, 142, 58, -34, -89, -24, 33, 175, 31, 201, 119, -83, 152, 236, 38, 205, 81, -57, 112, 89, 138, -231, 71, 138, 199, 129, 68, 208, -25, 183, -201, 338, -72, 74, 105, 79, 67, 203, 58, 156, 226, 122, 533, 267, 94, 75, 86, -126, 220, -54, 26, -163, 305, 122, 261, -20, 124, -119, -144, -78, -102, 133, 186, 69, 152, 69, -4, 80, -154, 68, 61, -81, 4, 102, 44, 35, 21, 85, 43, 131, 404, 24, 131]
6785A31k70J51J43q8K13l22J72p1K9j0o3O6j91J8L32k10Q7k81J14K74l10K70j18
6808F6K9q6P1j81J13j91M34l77n4L03r7J46k92N4k23N88j49J36p2j51lk02L10
6831A72j25k83L26q1Q2j74J50Q0q8Q4j96L88l15K98m38K27l35O47k11k25j05K42
6853A20k34M3K00j78M21l56K38m34K17l3J65j52J86J43j32k03k29P0L49r8j73
6874g0K85l79K38J70k37q3J44Lj6j4J10m41K66j97J95J58j49K1k9J50J8k24J62
6897H1j52J74j74R5J84k07J57j70J15j43K99l89J68J98k40n5K46j93J77p7P7k24
6919e3m8K64j6n1K03o7n2o1j42R6J62k63L9N9p6J62l6K25k73j42P5q8RJ96j72
6944e0J01pL83n02L58k09mq9OJ70J47l52J0L08k02l7K09l54L45m51L8R9K88k30
$$ y = [131, -139, 12, 155, 67, 280, -42, 130, 59, 88, 78, 15, 81, -110, -92, 240, 30, 117, -164, -50, 224, -86, 184, 66, 95, 9, 80, -101, 12, -179, 255, -122, -176, 127, 30, 176, -116, -62, -285, 303, 154, 290, 218, 67, 64, -138, 172, 47, -236, 90, 9, 91, -83, 67, 147, 59, 143, -53, 335, 20, 318, -120, 107, -228, 419, 208, -17, -122, 120, -114, -71, 129, -49, 372, 16, 254, -180, 37, 4, 169, 17, 203, 346, 214, 11, -218, -148, 201, 103, -70, 215, -164, 74, 244, 7, -76, 68, 71, 55, 41, 151, -290, -24, -221, -26, 132, -17, 4, -25, 125, 143, -81, 81, -71, 103, -71, 24, 208, 1, 158, -12, 103, -40, 259, -130, 38, 236, -4, -59, 187, -6, 171, 94, 171, -53, -101, 163, 147, 96, 299, 232, 180, 119, -23, 73, 235, -28, 11, 70, -6, 156, 120, 345, 72, -70, 5, -83, -74, 122, -50, 51, 44, 427, -75, 283, 74, 70, -19, -13, 157, 304, -48, -38, 270, 68, 31, 240, -114, 231, -220, -182, -83, 205, -25]
6968b5k12L29k27L74q3j11r0P2J60q9j67J10K47l78k21K82p0j4J64K03j03Nj46
6991A0k18L03P6j44j70L64k36j10J08K20OK8o5m4j84K75q2k96j8J11MJ17r0M5
7015A0L25k62q1L38k85J57o6k20o4K86k17K97k11P4l57K45J31k3m8p2J89k00J02
7038D8j02K1m9K84l14M16l0l19J44j0q7L18n1j77K82m36L07k07k7J33n3q0l7J98
7062A72n5k09K83J74k57l33M80m46L49o1m1J3L8J02mj62p1KQ1p9J80L9jr6l9p1
7088a2J20L1p8K2J80k35j81K48n2K87k38Ok40J34j47J18L02k29K5J42m09L54n5
7111I3N0J64l35rJ79j67j34J30K24l7K5j49J7M4j70J79J19j67k16M86l18J22q3
7134D7j96M24l42K20n7q6j72K93J59m53L09q7k4k20L57j76pN1O9PMj86K61j01
$$ y = [-25, -237, 92, -135, 239, 156, 45, -45, 27, 187, 98, -69, 41, 288, -90, -311, -29, -99, -113, 51, 254, 151, 156, 10, -208, 95, 171, 27, -143, 221, -15, -125, -17, 203, 209, 237, 172, 128, -56, 219, 137, -159, -177, -66, -62, 55, -35, 10, 335, 73, -8, 330, 45, 202, 136, -84, -148, 138, -79, 218, 7, 81, -276, -31, 100, 77, 29, -43, 146, -54, 48, -54, -33, -82, 202, -112, 304, 274, -45, 99, 89, 2, 320, 269, 92, 374, -62, 245, 38, 11, 144, 91, 11, -26, 172, 117, -92, 191, 365, 108, -225, 255, -191, 158, 97, 56, 69, 107, 209, 205, 43, -28, -26, 55, -24, 156, 195, 194, 98, 59, -12, 108, 139, 61, 83, 263, 28, -153, 95, 43, 330, 92, 98, -142, -8, -155, -37, 265, 36, 61, 203, -206, 148, 93, 143, 307, -28, -37, 142, -25, -159, -29, 195, 158, 183, 34, 51, 95, -75, 104, 223, 56, -160, 326, 8, 130, 47, -149, 275, -67, 153, 96, 10, -162, 131, 290, -163, 146, 59, 35, -185, 172, -4, -11, 40, 109, 116, 120, -66, 195, 94]
7158I4Q5l75N03l75L3K92l22pJ84j47J90k60J40J9J11k6j40R2K7k7j78K16O7j46
7182E0L8o2K28jj40j70K48j18k4p0k0K73j4r2r3k25K53P5RJ21n1k04j65P2J04
7207B2O6O5j07J05Qk54L50q6k63K88J22m00K67j53J34j5M0j95O2j71J16P9N4J07
7231B41j2k82j13K15j37L76r1k72J93J30k68J24k36J00J53j09l8j4m8R7L2k39
7253a98K17J04P7j64o5J93L0k13J35J99k92J63Q9l05m2K29j75J62Mj52K68n6j13
7276I5j69K6KK4J5J56k50K19k01J59L0QJ57n3j08R0j56j33r8K52j07l3m7L85k21
7301D2J48k44QK76j60q8J85k2k63J03k98O26m61K25l00J47J39q4Q5k97J42L29
7323B38o1L31k39k73K62j78K17k47J28K60n33K60j93q8K44m14N00r4q6j09J17
$$ y = [94, 179, -196, 307, -68, -35, 257, -65, -72, 112, -35, 155, -105, 35, 54, 165, 139, -1, 91, 118, 91, -87, 129, 196, 50, 88, 26, 254, 253, 113, -57, 191, 73, 49, -21, -41, 232, 218, 126, 33, -192, 61, 136, 145, 266, 215, 11, -154, -82, 22, 88, 153, 46, 151, 159, -95, 255, 169, -94, 194, 316, -84, 183, 30, 164, 149, 189, -6, 56, -115, 1, 80, 134, 241, 229, -53, -166, 49, -88, 288, 197, -75, 118, 248, -20, 104, -132, -32, 121, 12, -26, -40, -88, 9, 41, -198, 19, 123, 200, 36, -29, 164, 194, -19, 116, 315, 23, 186, 275, -30, -72, 157, -18, 144, 148, -4, 264, 208, 95, -74, -48, -46, -22, -7, 149, -101, 118, -83, 76, 106, 114, 271, 218, 110, 200, 44, -89, -187, 65, -42, -75, -122, 263, 42, 190, -54, -46, 230, 70, -18, 167, 145, -118, -15, -313, 313, -148, 77, -223, -76, 63, -21, 64, -233, -91, 238, 177, 508, 269, -4, 258, 80, 297, 50, 178, 438, -95, 165, -28, -116, 128, -286, 214, 120, 34, -75, 42]
7344D2l5n8k5R1L42m04N0j66J38l6M8J22j10L07j35l08J44K45k56K97l08j52J56
7367a1K48l37P1K33k51J52J39n6n3K6J1j37j80J90K79l51K44l23j71K16k4J29
7389D4p1l4J36j45J02j27L30k75J47j51J19j4q6J76K9j20J31Mk54J41j47K11m6
7412A00L8L9l21J82r5n1K97jN1l41L00o9k18L80l87L54l56K53N0j92O2q0J06j90
7436h9L05n12M05j4k06K29P4n4j28K7rJ18j31nL31l93K95k51J81k85M3J4J57J7
7460A19o4J42Nj03JR7j43K22n78M88j0k63J58n9K44k37J42M1j51L7j25K15K04
7483C82m56L91l45K14j01j53K27l71L34j98L77k25j73K39P9k25J15k86K88j90
7503g7J76j77M6J65l47O19m37P7K97k07j41K24Rj10N2j43L5PP4j48J33r8J56j95
$$ y = [42, 7, -51, -76, 15, 357, -47, 3, -163, -25, -61, -13, 109, -1, 306, 171, -137, 7, 252, -4, 293, -15, -167, -11, 237, -100, -29, 204, -47, 105, 244, 188, 135, 161, 172, 35, -145, 45, 324, -27, 217, -106, -277, -61, -85, 44, -27, -61, 75, -70, 32, -95, 235, -40, 107, -44, 75, 61, -25, 151, 180, 60, 191, 195, -59, 82, -65, 146, 100, 138, 177, -144, 38, -57, -108, 189, 188, 239, -102, 198, 129, -89, 291, -96, 258, -98, 155, 205, 13, 75, -5, 101, -89, 216, -296, 109, 95, -111, 118, 192, 138, 10, 37, 28, 146, 15, 10, 341, -52, 243, -8, 173, -112, -69, -55, 102, 119, 55, 197, 202, 99, 100, 197, 54, 276, -302, 186, 176, -87, 71, 12, 256, 19, 161, 202, 51, 88, -37, 178, 382, -74, 317, -28, 186, 85, -68, 159, -212, 122, -76, 301, 76, -97, 142, 221, -4, 111, -175, 113, -77, 99, -78, -32, 133, -214, 405, -32, 45, 342, 135, -6, 218, 227, 117, 169, 26, 61, 68, 142, -6, 127, 29, 185, -10]
7527a0j31M70j60o1J16qk29jK46k18OJJ71J20k83M5o4j80K13j95J67J8N0m3P3
7552A13k3l96M26J14k01J78k42K47O2J91o18L27j2k81M01k74P4O8k01K30j69Q9
7574A03L29l17JK09k71P3j24lJ04J92l68J61M4k28K04j22j26K52j21O3r7l6J45
7597F7K21m7K6n9k2k84K35k96lJ64J89k48l27M73K0lj08J3K76k94K1j10J32J55
7621A91%q8j66K18j0q9j8J14l31L21j5k72K16k3R9N5k07K21k71j73M39o2j06M28
7645D71m05p9p6mj90K97J53k24K32l0L6j19J31k61N1J86j34K49k36J52k8n8k90
7668a76J89P0J75j23m08M25j3p2K93l60j39O6L18j10J04nl9o7q6K45l27J96m8
7691A08j34J51m6q7p7J28j5M3P8j85L9r2P7K55j34K2J3j35Q4j00l2M5L74m6j65
$$ y = [-10, -141, 329, 169, 108, 224, 216, -13, -14, 232, 14, 20, 21, 192, 312, 29, 74, 10, -170, 43, -152, 15, 33, 83, 40, 113, 90, -306, 120, 234, 33, 211, -31, 216, 278, 469, -149, 178, 166, -115, 286, 12, 86, 154, -47, 183, 14, 103, 432, 115, 116, 325, 54, 127, 3, 0, 104, 296, -72, 89, 133, -95, 109, -13, -139, 113, -8, 55, -42, -78, 67, 288, 241, 267, 208, 186, -98, 137, -159, -162, 2, 191, -57, -384, 89, 109, 106, -2, 11, 287, -7, 14, -96, 36, 191, 191, 103, -63, 155, 145, 56, 38, 152, -179, 142, 127, -145, 71, 48, 147, 202, -5, 216, -55, -228, 211, 149, 43, 471, 66, -13, -89, -93, -283, 14, 167, -57, 175, 145, 181, 62, 193, -68, -17, 169, 35, 284, 48, 200, 172, 114, -176, 13, 83, 258, 135, -273, 152, 139, 67, 360, 0, -139, -73, 245, 135, 239, 234, 195, 128, 42, 287, -40, 156, 108, -26, 125, 79, -8, -85, 43, 28, 71, 149, -36, 3, -89, -12, 243, 109, 131, 144, 9, 93, -7, -39, 6, 380, 334, 169]
7716A69l17J74r6J72N9k44J46J31k5O4l14K48J40j56j42K12j73k26M42K11j97
7737B78j65j45L23m26J57j75K32K4K60j81J8k30J86j36Q7n2j99J22J42n8r6L6
7759BJ99P2j18l52K69J03Km7j3K2l19K44j52L50N7j42J5l29L56k38Q0ol5j51J78
7784D7O2j80j45M69j70J25j91j87J82k96M75l7j52K3O9j0RJ83m36K31O9P0j41
7807F9k07K15P9k3J51j52k9L24m27R3j8J07k30N2j03J90R9k50K84q8j46j45j52
7830c07O81j26P7k97k53N24r6J73l82L14j16k3l23J27M7k89L10j90J79K21j97
7851E4j34J36o1PL62l10J60j47j27O02l44l64J44l09K04L80j20l83j29O83j5j97
7873I2oj78N0J03L1r7j76O2J2M79l40K77l2l78N9P3j17J58k7p0K74o9l53K65J07
$$ y = [169, -148, 26, -70, 102, 161, -83, 63, 194, 169, 233, -81, 167, 307, 151, 9, 221, 48, -178, 264, 475, 278, 113, -32, 291, -135, 22, -153, 79, 103, 363, 182, 200, -30, 156, 20, 107, 55, -144, -22, 120, 62, -34, 2, 201, 273, 155, -197, 72, 175, 177, 130, 117, 139, -180, 64, -88, 262, 319, 177, 192, -137, 219, -19, 61, 55, 20, -131, 47, 109, -71, -216, 253, 83, 208, 17, -170, 12, -284, 191, 154, 2, 25, 94, 84, 93, 276, -160, 71, 140, 210, 69, -138, 77, 156, 133, 284, 132, 103, 427, 0, 93, 75, 182, -48, 4, -99, 91, 190, -60, 224, 136, -10, -155, -307, 374, 248, 325, 28, -225, 299, 203, 376, -6, 308, 192, 169, -154, -27, 20, -269, 41, -149, 30, 251, 54, -80, 56, -5, 2, 364, 54, 214, 67, -60, 542, 198, -166, -22, -331, -127, 253, 133, -250, -379, 304, 289, 92, 86, -92, -42, 61, 92, -5, -181, -119, -107, 372, 32, 309, 277, -101, -42, 31, -86, 72, 45, -25, 249, 180, -173, 92, 199]
7898A99M9j63J24n7r1J51J7j21J07l11K02j60K09r9O2m0j01l6j86K99L62m41K99
7921B74k51OJq0j19K74l8k61L81J3k62L59K28n22J1J15k58J34J34m9J49n24L02
7944A7k7LK57o4k48J88r2P4p9r2K26j16j3K78j70k31K91o3k46K20j60M01l44L8
7968D8N3j46J09K21K77n41J4P4m9J19K1k83K31rl15j1M7M18j09j15K03Rrp8Oj07
7994G8r5l7J76J12k2k38L52k80J13j87OR3j0O9p6K11l33K50k90J81q5q5J28J68
8018A99l81J19J50j55J56lj87J44p0Q2o6J27J95l40pJ4L46o51O24p2k28J46k25
8041h3K02J23q6j63j5MK70l26J56k4K35k43r9P1p9K91j11L8q4k22K41j17o8L44
8065B55m67K40k9J88m57M15R7n6r6J58o9q8k95L04P1j07J42q8J01l18J43K97m15
$$ y = [199, 248, 85, 209, 152, 61, 212, 229, 108, 215, -96, 106, -54, 155, 56, 118, 78, -23, -59, -245, 54, 416, -25, 274, 23, 29, 30, -50, -169, 105, 67, -194, 187, 200, -62, 297, 525, 3, 14, 129, -129, 5, 139, 90, 239, -285, 17, -10, -7, 250, 186, -62, 126, 34, 108, 29, -63, 163, 47, 34, 312, 142, -89, 202, 139, -107, 113, -47, 354, 10, 48, 101, -45, 64, 285, 562, 21, 35, 109, 60, 179, 200, -83, 148, 139, -176, -187, -140, 278, 169, 54, 257, 266, 257, 179, 185, 78, -17, -54, 122, 234, 212, -26, 326, 46, 159, -28, -22, 71, 61, 130, 54, 265, -68, 182, -108, 73, -12, -97, 31, 199, -182, -63, 87, -68, 88, 85, -102, 42, -28, 54, -12, 115, 310, -30, -37, -23, 323, -328, 296, 224, -4, 142, -83, 119, 242, 156, -7, -22, -18, 252, -74, 82, 58, 293, 50, -49, 22, -57, 234, 123, 161, 77, -145, 96, -21, -89, 255, -212, 28, -1, 187, -270, 145, 242, 186, 90, 248, 179, 91, -204, 100, 171, 64, 206, 118, 219, -99, 44, 341, -74]
8088g4j56K38K12j87Q4K96n04K54n3L66m22J04j95p5Q9O9L7p3l9P7J10p1J81j80
8112H8p1K79J6k81J63j43lK8j53J40J01k40J65j91J05p2l8K10r3n1J58p0K7N6
8136A30l9N3J07mk11J07N6j35l9n1L3M7j23Q9Nn0J26o4J90k15K90l79J48Qk05
8161a26J31K11j28o4J54n31M93j68J46j18j26RJ81k09K85QK26l96N9K47j71k21
8183a08k9K27l93J71L49j61j0K66
$$ y = [-74, -230, 8, 220, 33, 117, 413, -91, 163, 110, 476, 54, 158, -37, -112, -23, 46, 83, 10, -29, 48, 158, 87, 268, 88, 17, 296, 312, 31, 194, 51, 48, 76, -77, 63, 164, -76, 89, -102, 3, -69, -107, 103, 10, -41, 117, 47, 74, 130, 91, 144, 251, 247, 36, 143, 199, 64, 25, -26, 7, 54, -69, 20, 25, -25, 101, 37, 227, 12, 302, -77, 71, 79, -126, 5, 216, 88, 24, 178, -353, 140, -28, 118, 0, -126, -117, 64, -145, 140, 148, 374, -22, 37, 284, 113, -108, -137, 90, -303, -132, 217, 56, 46, 312]
8191C12
$$ Imaginary data points
##PAGE= N=2
##DATA TABLE= (X++(I..I)), XYDATA
0@%%%%%%%%%%%%%%%%Rj8J8j8J8j8K7l6L6m5N4n5O4p8Q7r9J17j33J48j67J88k08
38a09K32k59K90l24L58l96M39m86N36n92O51p15P90q70R58j057J167j292J433
57G54j592J777j997K256k570K960l462M136n090O561r132J4935n4713K0514Q6538
72F1875o0830m6214M2009M1627m3430j9365L3610J5753l4054o580K6637O641k6600
85h921j296K0963l313k4770J0504K5403j4146k9761J7886K9763j9119k9797K4250
98b354L1446k6154l0178L0706K7363l3837k4620L7129J8816l8368j2802L6140
110A3287M169l4167R69K9201n971k3543R321J9563j0789j5644J2996J4696j3386
123G02j3374J6990J3745k0439j4734K3215J4656k7039j5422K9007J3649l1206
$$ y = [0, 0, 0, 0, 0, 0, 0, 0, 0, 0, 0, 0, 0, 0, 0, 0, 0, 9, -9, 9, -9, 9, -9, 18, -18, 18, -27, 27, -28, 36, -42, 45, -54, 63, -70, 78, -89, 99, -109, 123, -136, 154, -170, 188, -208, 231, -255, 281, -311, 340, -375, 415, -455, 503, -554, 613, -679, 754, -838, 939, -1058, 1198, -1372, 1588, -1874, 2262, -2828, 3733, -5399, 9536, -45177, -24663, 61875, 1045, -45169, -3160, 38467, -4963, -24328, 9282, 25035, -9019, -15599, 11038, 17679, -8921, -10217, 10746, 7433, -17337, -6833, 18570, 4424, -25337, -7451, 22312, 3193, -26604, -2354, 29092, 2938, -27240, 3466, 30829, -3008, -27628, 9501, 28317, -10051, -22853, 13287, 17456, -16711, -15742, 13459, 7488, -16055, -6734, 12829, 2040, -13604, -608, 14088, 702, -12672, 4318, 18063, -2376, -17110, 6105, 20761, -6278, -21700, 7307, 20956, -10250]
135a0250j3128L1515J0058l0478o717K9872M432k7173K68K5683l812k2068Q437
148c361J8386j2295j5383J4046J2083j6265j0757J5809R270j6479q905J5982R505
161A1636j6672r168J8455R534j9106o658K0348N211k0668k042K0112j167j9478
174i663L828J7487p775j6411R305J2918j1013j0598J1801Q780j2648n638J3977
187D350M482j3408k066J3887J525j3949p91J4348l67j5385J58J5653j938j6561
201a0062J984J6820l898j6877N868J6572p608j4459J0515J2485j0984r521J2480
214C315P272j2703n043J2480K880j3351k122J2428R31j2698j405J2363O75j1628
228f606L4J1610k95j0762K030J1250k749j0333M372R872n999r397P463P974j0066
$$ y = [-10250, -23378, 8137, 18195, -12283, -19000, 10872, 15304, -11869, -11601, 14082, 10270, -11798, -3361, 15025, 2730, -12653, 1393, 13476, -2789, -13546, 2263, 11533, -4946, -13851, 2131, 11636, -5036, -14204, 4251, 13785, -5321, -11979, 8369, 13580, -7088, -9130, 10982, 9815, -9663, -5835, 11652, 3877, -12534, -3229, 9689, -1324, -11922, -121, 8659, -3989, -9627, 4350, 8832, -4576, -6642, 7245, 8770, -5179, -5970, 8378, 8011, -7374, -7216, 8437, 6499, -10062, -8078, 8742, 4844, -12033, -6165, 10407, 2799, -11660, -1145, 11340, 356, -9165, 3315, 10587, -2116, -7159, 5321, 8201, -5150, -7272, 5156, 6087, -6611, -8016, 4347, 5022, -6606, -6572, 5038, 4743, -6019, -3989, 7261, 4512, -5821, -1449, 8423, 2424, -6973, 490, 8464, -1602]
243a602o807J0033N153j1343l544J1199J957j0598J63R789o12q549K397P958k445
258C149o824L283O437l748o905L968O406n472o468N053O377o876n872P654N585
273E747q848l952J0173L180j0044j006J0758k07j0525J649J0302k838j0030K980
287b661Q267l749q033L765O719m278n830M301N832l957n004M554M849m695l844
302c764N828L879p123l172P726K311q628j959P979J083q785k4P569j422o292K194
318b600N704k822l629L692L241l701j823M339J062m286q35M341N17n157j323M952
334A672R07n880j036O060O03o133M42O446j011o038K361O505k547o186M144N277
350E586m456m856M790L152n404k559M839J415n219r11M761O00m647J92M937K93
$$ y = [-1602, -8409, 1624, 6777, -4566, -8110, 3089, 5046, -5552, -5389, 4400, 3788, -4761, -2364, 5594, 3149, -3675, -392, 6045, 2297, -4608, -640, 5766, 294, -6174, -1121, 5256, -1620, -7492, 162, 5747, -3101, -7053, 3120, 6300, -3744, -4750, 6008, 5801, -4724, -3075, 7227, 4389, -5641, -2661, 5606, 1857, -6176, -2411, 4308, 30, -5800, -1499, 4333, 376, -4628, -74, 4775, 80, -3764, 2064, 5943, -1180, -4352, 3374, 5685, -2943, -4902, 3077, 4160, -4625, -4649, 2920, 1498, -4794, -2600, 3104, 282, -3347, 345, 3586, -115, -1938, 2401, 3463, -823, -1658, 2683, 3200, -1957, -3280, 1672, 2579, -3301, -4337, 1723, 2326, -3807, -3365, 3081, 2070, -3968, -1607, 4898, 2351, -3835, 309, 5586, 1130, -3726, 1064, 4216, -1188, -3747, 1092, 2507, -2712, -3623, 1138, 1738, -2909, -2717, 2220, 2513]
366B513m880K83N815j0o266J61O822m46p063M71O291j397o167J325M881k098l889
383c654K324K946k344j087L003K64l040J055L353j147l077J644K790j768l417
398b155J384L053j614l551J071L702j524l712J761L971k101l328L119L082l008
413A50k212L636J857l976j158M148j74m320N94L680j804l848J742L682k186l163
429c352K564L125k052l200K983K995j684l930K565L755k127m108K111L638k553
444G30l808K108K979k613k482K837J250k527K7K405m18k133K400J652k251j301
460a145K164J526k251j658K004Q33j919j315J469J074j624j252J595J162j559
475h96o86K127P90k093l01K844m18k456J305K613j696l068J795K558k512k620
$$ y = [2513, -2367, -2084, 3731, 3721, -2545, -2384, 4438, 3992, -3071, -2600, 3691, 2294, -3873, -2548, 2333, 235, -3654, -1330, 1616, -728, -1815, 1188, 1452, -1588, -533, 2820, 1673, -1404, 240, 3030, 1262, -2155, -771, 2282, 668, -2883, -1812, 1890, 366, -3346, -1585, 2386, 285, -3043, 76, 3158, 150, -2062, 1574, 3431, -545, -1703, 2445, 2271, -2049, -1455, 2225, 421, -3427, -1685, 1997, -189, -3352, -788, 2337, 285, -2915, 68, 3063, 1379, -2551, 14, 3769, 1642, -2466, -355, 3283, 730, -3078, -970, 2009, -604, -3086, -249, 1001, -1526, -1499, 906, 488, -1645, 755, 2407, 156, -1145, 1019, 2545, 294, -1364, 640, 1473, -446, -1761, -292, 782, -842, -2094, -499, 663, -896, -1582, 545, 1335, -758, -1059, 1785, 1367, -1089, 216, 2829, 1133, -1935, -140, 2418, -94, -2714]
491b714K319J802k791j000K533Q47k318l36K775M64k086o87K756N83k413n60K164
508A338N95k862p32K643L86l216n30K772Rk415O79K327q09j657J844J482j719
525A35o89J829N88j819m64J579J10j898M16L48j28r80K00O37l37m16L17J029l02
544A55j060P74J792j278j585J738J618j791j818K213R67k025j124J795M7k069
560a651O01J228m35j250J343J421j284j053J811J046j385j423J541J347r28j824
576h95L41J939j085j785M18J956j078j732J154J642j374j038J803J019j398l56
592d69J613L8j459O00J079j003r71P38R5n47o23O30qn28r6P89L40p16j7O88O12
613G85m07o30Q67P04j084n91J015j3j022j03P50n36q04O29R12j242m74J596L80
$$ y = [-2714, -395, 1407, -1384, -2384, 149, 996, -1322, -1658, 1117, 1581, -505, -1192, 1564, 2147, -266, -826, 1338, 1933, -929, -1661, 982, 1368, -1848, -2378, 394, 403, -2012, -1333, 994, 185, -1472, 372, 1854, 135, -554, 1275, 1863, 44, -420, 1159, 1269, -629, -213, 135, 7, -973, -773, -136, -473, -889, -572, 457, 155, -905, -131, 1661, 383, -1202, 536, 2154, 363, -1455, 758, 1725, -300, -1424, 371, 418, -1651, -1050, 178, -257, -1507, -164, 1257, -27, -1080, 731, 1777, 392, -1031, 510, 1857, 929, -895, -554, 1385, 300, -1485, -1067, 889, -189, -1921, -767, 875, -499, -1537, 266, 1285, -113, -469, 1144, 1182, -277, 323, 1402, 399, -572, 166, 261, -286, -909, -279, -287, -815, -911, -122, 218, -498, -515, 173, 785, 378, -252, 615, 1319, 235, -356, 659, 646, -376, -479, 271, -265, -1069, -440, 472, -770, -1244, 352, 732]
632G32j605j54K083K4j450l8J566mr68o81Q49L55q22o92N56J025j617m77J297
651b1K31j105k64J648O6j353Q24J312q44q12J129P39j132r73P45N19r52l96L68
670b71P1m39m10O91K89j5l99M10K42L42j25L2P8J14M6l29m8j72K10j99m76m48
692h06J104k64j443M52J762l65j652N36J326o8r24K97J064k58p44J38O47m56n57
711b11O1J16j74n76J67M91l10l50N56O28p63n88J469O69j251n39J644K57j273
730B3o08J267J49j259m13R94r3n02o39L45Q22k29m13K30N23K58m73j03N59J47
750E85k91J06j52Q3Q7j86o03J50j22M0o70M90Q35o21p39P92Q32o75m88Q46N84
771H83o48r4M60j52j62rk20o7k99k7K26l26l02L54O14k33q97L07J286j46r46K24
$$ y = [732, -873, -1027, 1056, 1080, -370, -408, 1158, 1154, 186, -495, 354, 709, -113, -805, -249, 776, -841, -1318, -21, 210, -895, -1159, 489, 555, -798, 26, 1338, 494, -318, 811, 1550, 418, -555, 190, 709, -243, -639, -271, -200, -639, -1049, -358, -69, -84, -483, -73, 169, 511, 386, 418, 496, 610, 656, 327, 279, 107, 317, 118, -358, -806, 298, 34, -1409, -957, 805, 440, -1212, -676, 650, 582, -342, -45, 1019, 761, 17, 155, 802, 346, -211, -150, -34, -208, -784, -617, -126, -436, -786, -230, 398, -365, -953, 516, 1185, -66, -605, 1039, 1296, 23, -585, 682, 831, -428, -841, 153, 60, -442, -1081, -736, 86, -143, -556, -326, 197, 455, -18, -121, 438, 585, 294, 400, 248, 331, 418, 232, -371, -221, -343, -303, -973, -483, 352, -269, -1008, -216, 616, -59, -547, 299, 883, 235, 141, 601, 449, 287, 278, 58, -9, -308, -335, -109, -435, -737, -383, 231, -2, -899, -592, 694, 548, -398, -174]
793a74R96K30j224K34O56K3j048j54P57k44m59j04L77j16j18m8L02kn1n2L89M15
815E85l27j44M71k41j71j84J98q2k58k18L57j75J9L20o28q1M47K71n59J80N91
836C71K41n70K33K85k55l68K57J98n01j32K42L20m77q88P90N09q13k8L41M28j02
857H1k04J52O00j79n66N26M22n99m10N71n3p45j33L19J4n64K66L97Q0m08k37P70
879A00K69l5m62O9O51j74k86J32L20l17l30q1J25k69k75J22J36p2M16k16k87K75
901a89O31k51m17M58K84m94m2L43O1n79K28K45p8m91N0J51j74p7J09J47j64J75
923g4J25rL30j48k69N16j02j90k4N14m48o17J70M85k00p04L22N48k69n00J55M85
945I6J92o63M04J66J72j40l53L83M17l69l28k95M92k91L6j86j42M1K62o8n43M05
$$ y = [-174, 822, 1052, -172, 62, 718, 741, -307, -461, 296, 52, -407, -511, -134, -250, -368, -416, -114, -116, -167, -219, 170, 585, 258, 114, 585, 344, 173, -11, 187, 105, -153, -371, -14, -189, -170, 150, -478, -559, -112, 159, -400, -220, 371, 612, 42, 275, 560, 305, -63, 194, 392, -109, -241, 1, 321, -156, -1044, -254, 255, -558, -586, -245, 183, 81, -123, 29, 629, 450, -116, 410, 832, 233, -177, 394, 341, -404, -537, -218, -204, -768, -502, -105, -25, -433, -670, 100, 369, 334, -128, -59, 592, 418, 132, 264, 584, 267, -63, -144, -19, -288, -563, -441, -305, -377, 39, -177, -464, -189, 442, 191, -226, 232, 516, 22, -20, 323, 384, -195, 33, 278, 200, -291, -241, -90, -264, -341, -232, -85, -249, -74, 51, 42, 372, 224, -45, 471, 369, 179, 155, 669, 221, -396, -226, 259, 59, -645, -323, 225, -44, -544, -389, 96, 288, -375, 29, 195, 367, 227, -126, 257, 674, 305, -23, -318, 174, -117, -81, -267, -409, -368, -106, -174, -717, -312]
967c12M99M2k59P1L65j71j24K43j73L9J23l67j49J43J66r5o06O6N62k97n07M23
989c18M11K15m52J33K67L58l46m64L74N11p01m26J84O04n14n12L53P71m48o34
1009f34J95M32k22mL27J16L4L7l6k97N22j18l15m1n3R8L3m17k65L00K40J88p03
1032e83J4R61m54j45j15O05L65m99k82J86J88K26o43j70O28O5o81n08P10L50k30
1053a2n83M27M46J10o26K88O18j47m01P8L12L64q10m21K86P91r44m72P80k60R
1074a67j48J52R7m99N89KO6L09j59j4q2J36q5K26n11j14L85r4l90N2mK73l02o33
1098i15M65N55j52m18J51O14K19l80m56Q72J5m78k44N8J11m1n20J99L46K7l20
1119b92k21M58J9m81J66M76N5J01j10R1N7p2l10J12N9j3l81J42K6q5M7k9J98j96
$$ y = [-312, 187, 229, -30, 41, 406, 235, 111, 354, 181, 220, 343, -24, -173, -30, 136, 41, -565, -499, 63, -234, -741, -318, 93, 308, -144, -11, 256, 614, 268, -196, 178, 689, -12, -438, -254, 350, -164, -676, -323, 448, 0, -634, -439, -7, -229, -233, 94, 210, 244, 281, 245, -52, 470, 352, 37, -4, -57, 41, 74, -343, -608, -308, -68, 120, -583, -569, 392, -62, -207, -322, 283, 648, 149, -133, 53, 241, 467, -176, -346, 282, 347, -334, -842, -132, 218, -12, -595, -168, 278, 388, -238, 50, 668, 521, 120, 198, 510, 874, 64, -357, -71, 720, -224, -696, 84, -176, -167, -315, -163, -66, -565, 24, 26, 92, 401, 242, 228, 146, 282, 197, 423, -88, -202, 183, 89, -301, -249, -253, 20, -282, -915, -450, 105, -47, -465, -314, 300, 519, 139, -317, 555, 570, 92, -152, -94, 17, -24, -544, -345, 1, 28, -292, -513, -55, -36, -517, -351, 125, 180, 281, 171, 262, 319, 247, -63, 49, 108, 95, -286, -144, -118, -203, -156, -185, 13, -183]
1143a83j59J71Q0K7J02r5K76k58L71M5j37o6K3j20J70n96J39P0K95m61j13J90
1165b29L8k9j82K52J39j67J45J27K16km9j44N9L5n6l17R4M9l19J10o8j5o3J91
1189a85J11l4K07j33L02q9p8l0J93R6m92N4J96k22K15l58k15O68j02l27j72J28
1211b67L47m63J56L82J9J9Q9l1Q0j85L9L6j47j05o5K06m06l0J98j98R1R3k5J81
1235A4J33l23K81L62j75m23L6N27J6m61L55J7j26o12L92o2j90J66j06K9M5M5j14
1258a74O5M49k2l02R4N85m44%r8N6o7k08r2j55J96l6j94j2J14R8J18j11L00n4
1282A06l68L76KJ94L5m0k87k84K49L79l74l55j80L37K53m30j30M82K80k92k11
1303b58L07K84j99o0N9K18j43j50J2K49l12J2j51J88j73j83Q6o9N79l41k43P9
$$ y = [-183, -342, -171, -91, -64, 38, -57, 219, -39, 332, 377, 240, 174, 197, 77, 247, -349, -210, -140, 155, -306, -419, -229, -191, -220, -402, -150, -11, -178, -33, 94, 310, 308, 259, 115, 174, 209, 153, -164, -70, -21, -340, -230, -298, -313, -376, -185, -74, -108, 99, -34, 268, 179, 101, 71, 264, 360, -132, -78, 118, -104, 111, -247, -462, 206, 104, -223, -395, -267, 80, -383, -227, 155, 174, 193, 282, 251, 331, 146, 185, 221, 74, -31, -96, 110, -296, -326, -128, -326, -235, -142, -167, 14, 147, -176, 105, 467, 292, -131, -95, 432, 448, -13, 342, 359, 233, -379, 13, -49, -239, -73, -179, -150, -105, -60, -174, -109, 340, 318, 16, 110, 695, 251, 251, 153, 209, 142, -66, -158, -313, -117, -153, -347, -359, -245, -147, -29, -140, 160, 106, -262, 114, 116, 310, 345, 305, 18, -266, -17, 362, -12, -367, -547, -210, 43, -387, -517, -35, 245, -47, -258, 49, 333, 134, 74, 133, 351, 208, 58, 70, 319, 7, 19, -132, 56, -117, -300, -214, -283, 296, -45, -288, -209]
1325b09K90P7J7m06J91L31l04J40R6l0J53l62l48L03R5j06k65J61M86l73k41P3
1347b31J97L80k33o5j05J40N1j06k76M98L77o78l60M09L81n66k11J14L98K78n17
1368a25p0M70qk84l3k20M07l12K66l0J70j26l51K90j32j71J35j57J80j62K13l0
1390h0P8J78j59J80q4k23J48J68k2k36K02j03J62k57J30O8l36J9j17j8L83l84
1412c03o9K60K10j20j15J44J82J84n65J21J45J13k46j15K24k00k39K27K70j07
1432AR1j5j12R3j21J92k89L46O3m11J36L32k22n9J04j71O1l30L11O3k35L9o2J40
1456e5o3j2K61m6L1l14J95J99m3k3k23M16p9m07q6R4K63k59J56j76j8j40J23J07
1480i9J23j52J33K6J70k61J26L26k74k00O4J73J42l40K95j95P3l67j6J58k31J22
$$ y = [-209, 81, 158, 175, -231, -40, 291, -13, 127, 223, 193, 346, -16, -364, -61, 34, -72, -337, -176, 310, -63, -304, -231, -34, 346, 113, 48, -57, 83, 134, 28, -248, 250, 627, -51, -411, -2, 379, -187, -398, -284, 114, 392, -125, -195, 275, 267, -17, -50, -270, 137, -175, 91, 61, 231, 105, -246, 44, -88, -259, -124, -281, -101, -263, -50, -80, -2, 176, 17, 197, 113, -110, 38, 206, 184, -52, 150, 47, 209, -48, 82, 150, -186, -167, -284, -302, 81, -303, -372, -112, 98, -22, -137, 7, 189, 373, -192, -71, 74, 187, -59, -174, 50, -150, -389, -162, 108, 1, 92, 77, -35, 58, -63, 129, -160, 186, 249, -162, -26, 306, 84, 25, 129, -42, 19, -311, 0, 63, -172, -133, -195, -55, -118, -130, 131, 85, 116, -198, -3, 196, 153, 130, -93, 323, 244, -163, -249, -155, 108, -151, 5, -171, -189, -329, -206, -99, 24, -128, 5, 31, 201, -60, 66, 392, 118, -82, -18, 155, 297, -43, 252, 57, 130, -237, -253, -95, -326, -204]
1502b04K72n6K57L8m46L31o5N0J54l85K78l55O2J70j16Q0m59L07J71j46k90K44
1524a08J0K11k27K9K13L9r9J09k24Q4m5L38k40j42mj54K19k45J46j89K24j31L4
1547a52K92o8k78L69l48N18l59K31j80J18K42j51n60M52j17NJ29m53L71q7j11
1568a37j40J43j10K23k2J89J35n61J95L64Rll66R6j19K92l17p2k8J32k76N15m63
1591c21M0L98j14J84k45O8P5q2J94k45J88ln20L88JO8k26j0K89pj73O5J21k43
1615a10K59k31J34L42k60l07K24Q9J23l25j3J35J19j37j77J35j25P8j30nL10j42
1637a4L6O6J2o5K17j84Q0Q9R3k33j2K40j48j95q0n8r1K81k84J65L4J63j1l24P
1662b16M05J88n68J38J30L13j70m94J78J92j51M8k61K74n0o3k35L62K9rj95J70
$$ y = [-204, 68, 12, 269, 307, -139, 192, 127, 177, 331, -54, 224, -131, -69, 101, -15, 65, -394, -87, 84, -62, -352, -108, -98, 113, -114, -85, 128, 167, 68, 177, -47, 37, -8, 330, 90, -52, -56, -210, 9, -236, -90, -279, -55, -186, -152, 140, 72, -206, 163, -185, 333, -26, 205, 25, 143, 385, 234, -326, 126, 9, 14, 143, -310, 61, -26, -137, -277, -134, -244, -21, -43, 146, 281, -280, -85, 279, 288, 285, -81, 15, -104, 188, -129, -201, -229, -97, -373, 142, -321, -281, 117, 3, 187, -58, 10, 85, 3, 197, -48, 140, 137, -383, 5, 6, 74, -152, -162, 127, 120, -53, 12, 133, -110, 149, -82, 52, 394, 134, -173, 51, 140, 263, -62, -75, 60, 179, 42, -135, 0, -125, -47, -177, -182, 128, -14, 22, 88, 100, 35, 252, 68, 148, 237, 330, 97, 85, 325, 177, -18, -98, -156, -247, 34, -250, -85, -51, 112, 101, -223, -216, 189, 377, -191, -53, 77, 390, 220, -274, -96, 96, -55, -7, -268, 6, -44, -107, -342, 20, 49, 40, -155, 15]
1684A5L7j36M28l09K43jj60k4p3p0J51j58R7J61j47o3o1j1K27l68P2N0m4K20J42
1709B18J15l32J43r2J37l07L72j66m64J78p1K65l08J26K1M0J40j47J77Q7L3m19
1731b54J10K33P1l98J67M1K40j39n15K81N0M8K01q3j62J10k18K06J25J25m83L56
1753A12n5j72K35j00J89k8j90o0j9J86l49K49O0l4K8j1O5j37o4n3Q1n7M1J18K45
1778B80j50p3m4J41oj87L8j42J65J29l52o5L70q2k43L64JK03l95J76J02j43k1
1801F6j1K84j79l24pL14j25k88L82K6l63L53l66J47M0P9j38O0K1J50k00K16m6
1824I1j61K0k9J07k95J54J09J10j17Q6K67k33k99N1o6J78K04l04K06J38l06J9
1846g0J61L2l24L62m26N01l20l4L63k92J1p9J57J4J6k94L31J78k83J84j31J40
$$ y = [15, 52, -84, 344, 35, 278, 277, 117, 93, 20, -50, 101, -57, 40, 201, 54, -9, -70, -81, 146, -222, -150, -100, -144, 76, 218, 333, 1, 144, 52, 189, -118, 254, 88, -376, -198, -269, -4, -312, -186, -165, -125, 15, -132, 45, 132, 165, -254, -144, 89, 160, -238, -71, -30, 210, 71, -444, -163, -113, -65, 136, 53, -109, 1, -217, -11, 114, 239, -244, 112, 57, -115, 120, 20, 209, 181, -9, -69, -88, 98, -251, -2, 58, 24, 52, 41, 106, -31, -95, -148, -67, -124, -83, 35, 280, 130, 57, 13, 154, 148, -39, -1, -143, 22, 151, -201, -266, 104, 22, -221, 143, 144, 347, -48, 128, 230, 87, 66, 55, 339, 160, -164, -171, 143, 18, -270, 112, 138, -225, 128, -238, -91, -51, 28, -110, -50, -29, 121, -79, 137, 91, -70, -50, -79, 28, -267, -113, -4, 106, -11, 75, 342, 109, -190, -139, -205, -27, 177, -127, 79, 217, -89, -70, 91, 123, -201, 161, -265, 236, -84, -118, 245, -47, -36, -115, 42, 56, 72, -222, 109, 287, 4, 188, 57, 197]
1868A97P9j42J0j66j74J75j40R5L4o8k71J13R6rK55J36j93N8K6k2j59J19l6j26
1892a13L37j65Mk6k26J08j11K07O0R1k62m5J72k90K49L58l45J65j13j7J40j65
1914A3O3ko4J18m0r2J52j27l2NQ5k36M2k7j11N87l2m30L49l03R9j00q1K30J94
1939B60k20j70J0J34n6n3Q3R6R0l49J75K11n0j44n2K4N0J10r1r0K0n3L28n34K84
1964A3k5J47k83k9Q0K55l79K51J66j72Q6q6N1j86P8j7Q1j88M68m33L92l35L1O9
1988C5j37J81k3j38K10k18J10K56l12R0j80M14k92n8J29J72m00k4J18j2O0l3l37
2011c89K71J22k60M11j60m7P9Q9J03j01j35J96k85n2N8P2J70k34J94j18Jk97L88
2034G6o2J5K5k4Q6l3k15q4K61j8J5j27K72P7j54l29M79l55L04j90j44J08j4j63
$$ y = [197, 276, 134, 144, -22, -196, -21, -161, -66, -32, -100, -371, -258, -162, -171, 84, 220, 27, 85, 111, 89, -70, 49, 13, -113, 224, 59, 63, 37, -189, -81, -192, 15, 75, 166, -96, -141, 31, -259, -10, 348, 3, 168, 55, 38, 178, 13, 76, 74, 10, 128, 88, -4, 148, 21, -11, -6, 79, -157, -115, -142, -253, 334, 302, -128, 221, -82, 17, -83, -164, 66, 260, 40, -130, -120, 14, -42, -95, -12, 84, 174, -175, 0, 211, 161, 17, -35, -11, 39, 149, 58, -32, -12, -65, 263, -271, 13, -12, 135, -148, -177, -97, 158, -221, 30, 196, 24, 110, 24, 75, -111, -33, -50, 31, -157, 311, -122, 270, -65, -34, 35, -102, 79, 56, -82, 128, -90, 20, 276, -36, 54, -126, 288, -4, -62, 67, 239, -161, -185, -67, -79, -19, -52, -389, -118, 4, -256, 155, -5, -52, 27, 116, 219, 118, -17, 179, -106, -158, -100, -28, 142, -92, 102, -16, -15, -312, 76, 14, 29, 54, 30, 116, 83, -132, -216, 45, 27, 42, -85, 187, 264, 110, -219, 260, -95, 209, 19, -125, -17, -31, -194]
2058a94L4K72k30J55Q7j19r6P1L02j79j49l3K05l86Q8o7J55l7J17j05N2R7k33
2081a93q8K44J8J11m5r5q3L09j70O2O4J41k47J0k04J76q8j31L39j64q0L93j55
2104A24N6j05k03K16n6j52M0j0m5L05O1m36K42j09K9J22k16K44k02K44j35nP1
2127H0m30M02r1M1o2l4K10k44L21o4R8k50Q0k50K49m6j17l0P3Q9r2r4J41R8q0
2152bn9K92j50o8J17J40L3k03Rj24p3q7L6L19l01%J80j84o6qL12l1L0J13p6j93
2178d4Q1M80m00J12jm41J63J72k68P4r7Q7n48N40l3J62K43m77L48k42R0J46j03
2201D4j15K24j04k50N2K16l8j79R7K23l64L68k32J94p9k49j66L77k20O3r5K91
2223E8J63l24K0J20j06j6J37l60J96l6r1K75oM2rj04k6J91j66lJ33j76j1j32L49
$$ y = [-194, -160, 112, -118, 37, 124, 5, -91, -20, 282, 103, -46, -79, 126, -260, -172, -239, -84, -121, -4, -109, -57, 40, -193, -281, -37, -19, 92, 47, -48, -131, 178, 8, 70, 134, 275, 28, 38, -166, 10, -78, -209, 130, -34, -114, 279, 124, 180, 75, -128, 88, 32, -120, -80, -90, -135, 170, 231, -205, 37, -72, -43, 79, -137, 107, -95, 149, 14, 9, 80, -350, 52, -39, 2, -60, -94, 116, -128, 193, 129, 227, -23, 57, -193, 56, 10, -107, -137, -64, 25, -67, -161, -20, 78, -2, -61, 231, 81, 13, 130, 270, 303, 100, 109, -15, -88, -175, -139, 180, -121, -121, 59, -125, -191, -199, 113, 82, 112, 225, 149, -44, 37, 517, 117, 229, 228, -213, -50, 122, -146, -72, -169, -82, -630, -90, -123, 39, 282, -195, 153, -89, 1, 147, 44, -71, 153, 49, -201, -149, 67, 29, -150, -53, 170, -194, 174, -58, 136, 57, -192, -358, 19, -201, -138, -233, 58, 221, -103, -83, 37, -69, -85, 52, -308, -112, -148, -239, 36, 30, 72, 63, -41, -67, 124, -42, -45, 88, -88, -99, -231, 118]
2248A18k04J58n1j57J35j6l6n0J17N9j14n6J31J34q6j10j05L53n57L86O3K2j07
2271B7P0j38L8r1J66j25j40J44k2j4j8K13j3J97l28m6k2J90N7J66k91M0j64J22
2295A8p6%j39K40O0p8k62J83J15j24n2M7l4Q2K1J93j01J28j64Q4M4l45q6J15k2
2320a53J59J16K9p6j1J07Q7j12M5q8j40J83j07L18l84K88k18L7j20j28J14p4K02
2343G4j32j02L49j74j48l3L47R7p6k80J88J52l37M5K23k85J24j40j51K57J81k25
2365d6k86K46k0k9K12R3l06R6K72k79K29l01L18k78p4Q9J91j01J31m0j52kL9O0
2389F2j74J57p0j93M12j61k99M48n08M18r6k4nJ98j42J69m17L43%j64k35L11k60
2412b30J21N8m0L08k80p6K52L4j71K64Jj65j50j01Q6J90J10j72l7J00n1k80K79
$$ y = [118, -86, 72, 21, -136, -1, -17, -53, -103, 14, 73, -41, -97, 34, 168, 82, -28, -133, 220, -337, 49, 112, 134, 27, 97, -41, -3, -94, 72, -53, -193, -49, -71, -85, -103, 110, 97, 294, -34, -80, -102, 88, 145, 311, 20, 60, -104, 18, -58, -58, -197, 43, 103, 25, -237, -54, 61, -63, -115, -68, -102, -20, 1, 194, 93, 221, 57, 141, 185, -160, -246, -131, -153, 6, 122, 151, 75, 64, 171, 258, 146, 191, 103, -37, 146, 39, 357, -27, 261, 43, 80, -40, -168, -54, -128, 74, -58, -160, 189, 15, -133, -166, 181, 278, 202, -78, 110, 262, -75, -30, 193, -92, 32, -108, -259, -2, 179, -46, -332, -86, -106, -135, 77, 170, -136, -40, 232, -47, 182, -119, 199, -79, -153, -64, 127, 26, 157, 117, -35, -37, 2, 62, -112, 45, -25, -218, 194, 33, -266, 182, -326, 92, -4, -28, -33, 165, 23, 192, -225, 118, 118, -46, -281, 30, -230, -109, -51, -91, 217, -63, -139, 113, 147, -24, 240, 241, 76, -74, -175, -89, 101, 211, 39, 2, 102, 51, -229, 50]
2435E0M6k04j09M17l02p8L29k73K72n3N3j97K63L0l43j17K89J05l45J16K69o6
2457A52M7k66q1Q1J04j85M79l54M3p7q6K25J36k13k6J5P8m25K77J46N7o3j39j10
2481a85J42n1K25k3l4p2R2r3K11m35J92j33J88M0Mp5R6L9k5k58J90l1k73N29k44
2506A6j30J48K58k02rj91J53Jm2K34k81L57l16J07r1n1k7J6KJ45J61n09M08j98
2530d1Rr3K66l09L21j96p3J93j73R3o7J20j78P6j46K40k04j60M08m0j25J41j81
2553a19J28J50p4l14R2j22M60m43K07M2o1J91n11O57l89J57N4k25L2K29l75L49
2575A15j64j09K6K67j75roj16l0J05L14l15l4p7L24k5j73M73n02p1q4J10M21k11
2599E4J39l13J17m3J2m9J87k04L74l46J28J00n6K2n23O58n32J28j31L35KJ31l79
$$ y = [50, 96, -108, -217, 200, -102, -180, 149, -124, 148, 95, 148, -49, 214, 244, -99, -216, 73, 178, -167, -51, 218, 152, 199, -67, -148, -67, 37, -148, 331, -23, 20, -57, -143, 82, 218, 5, -21, -6, 72, -353, -76, 70, 127, 64, -75, -185, -43, -94, 131, 108, 74, 2, 94, 1, 212, -223, -31, -164, 24, 64, 68, -7, 89, 128, 103, -155, 35, 4, -269, 260, 16, -114, 34, 292, 90, 81, -110, 43, 44, 2, 236, -45, 312, -4, 103, 12, -39, -66, -50, -48, 97, 258, -251, 157, -41, -32, -125, 141, -168, 153, -43, -116, 77, -96, -3, -70, 50, -128, -52, -198, 42, -162, -322, 86, 46, -79, 62, -119, 9, 159, 85, -229, -137, -259, 201, -242, -35, 7, -54, 137, -374, 283, -106, 51, 105, -120, -88, 141, -234, 115, -49, -158, -132, 135, -40, -49, -55, -171, -201, -96, 218, -97, -131, -208, 116, 91, -82, 391, -111, -182, -266, -156, 265, 54, 193, -120, -3, -46, -34, -83, 104, -100, 274, -72, 56, 156, 100, 122, -401, 257, -275, -147, -278, 57, 59, 190, -189]
2622a89K27N2Q2k50K1R5J59k12J5j3L2RR9k84kK61k40M0j17K03j70K45k81J98
2646b0J54m7j92O9k3j34K43l1k78J59J67j41L31j16k36J2N6j86L58l83K68k32
2668b02K74k0k41J82M6q6n3L9m5Q4k5l4m5K72j50o1l3j85K44K11l26J47J90j36
2692D7K5j19k57L91Q5K1k28j84J98J13q6N9j59J8Np0L83n18K01J40p7J2M8j14
2716f6r3J53j99N0K34k02R0J42p4m2n6J20j32Q0q6q2K03Jj0o3Q9o6K05J59l20
2741C5K1m8j73K96j58n3J42k6j47j1J05L9k52M28k53J28j89J29J55j20K5J6N1
2764A40k03J15j39N9k14L50j94j8j45J77q2M14l03R3j03J23k96K68J61p5m62L5
2786b99M34k39P1r3rJ68k05j22L20j84n1J57J93q6m2j39K00%JMj54J59r9j47L8
$$ y = [-189, 38, 90, 172, -78, -57, 38, 197, -15, 0, -13, 19, 28, 127, -157, -159, 102, -138, -98, -215, -12, -182, 63, -218, -20, 134, 87, -105, -36, -59, -193, 50, 19, -259, -100, 67, -74, 257, 141, -95, -83, -27, -213, 145, -238, 30, -202, 72, 52, -189, -7, 39, -47, -100, -61, -106, -22, -47, -81, -126, 146, -4, -65, -98, -283, -39, 172, -154, -7, 183, 47, 72, -47, -304, 87, 172, 193, -35, -219, -21, 92, 6, 65, -94, -76, -71, -141, 242, -276, -75, 65, -12, 0, 48, -66, -159, -6, -205, -155, 79, -123, -33, 109, 35, -7, -63, 57, -75, 5, -81, -163, 40, 41, 31, -32, 57, -9, 196, 355, 35, 56, 8, -165, 131, -27, -80, 62, 36, -111, -122, -17, 22, -230, 198, -55, 73, -116, 13, 168, 48, 73, 89, 140, -63, 52, -87, -28, -242, 108, -86, -104, -249, -72, -154, 260, -43, 50, -53, 70, -226, 42, 203, 128, -334, -299, 135, -104, -33, -126, -135, 33, -172, -294, 26, -158, -209, -52, 141, 55, 13, -126, 74, 74, 75, 79, -75, 84, -15, -162, -124]
2811a24O8J29P7k38J64j55M42l40J98n0k98J00k4K99j12j96lJ40r7J55K5J73k37
2834I6P4l10k4K26k14K21r8PJ99j58k62K81p6J21j62J66J65k20Km38N73k23J33
2857G9k72q7L37K32l98K14j69k2J40p0J84j01J0j34L58n25K20r8m5J6L19l92N34
2880C30p0k37K67j72m12K05k8K79J90k59j87L18l48M1lJ51j8O9k01J25k97J25
2902a32J0j17R2K16j52l9OP9J57J26l5k16J22l1j54R8k56K90J5q1k03K17Qj0P3
2927H3j82l5O1j60jL52o6M1l32J22K17k00N6n9J52j4K30n95K51R7n3r3P8M0j04
2952a14N3P4L43n16J80J99j91J02k80J86j29Q8j92J93Kj62K95j33L6o8j1OK93
2975B54l55J62j44J53k21J09k5nJ60P0l20J13R6J95l75J31k6L7M0M6r3K23j15
$$ y = [-124, -56, 73, 150, -88, 76, -79, 363, 23, 221, 171, -127, -27, -51, 248, 136, -60, -63, 77, -20, 135, 160, 333, 96, 170, -140, -164, 62, -152, 69, -29, -22, 177, 19, -243, 38, -38, 83, -79, 87, 252, 32, 34, -404, 169, -54, 79, -193, -280, 57, 289, -109, 105, -64, -86, 54, -16, 168, 67, 77, -57, 301, -224, -4, -102, -147, -131, 188, -204, 330, 260, 23, 290, 118, -294, -89, -117, 162, 352, 93, -94, 224, -124, -83, -86, 65, 47, 116, -85, 40, -257, -132, -122, -239, -147, 69, -83, -122, -116, -37, 120, 246, 211, -5, 117, 86, -68, 30, -226, 64, 79, -2, -205, 12, 20, 10, 83, -99, -134, -73, -233, -234, 118, 52, 93, -239, -117, 100, -100, -44, -103, 49, 35, 265, -330, -79, 18, -35, -128, -50, -10, -114, -61, 13, 356, -160, 20, 219, 28, 130, -150, 36, -93, -5, -197, -4, -2, -164, 131, -2, 34, -34, -45, -39, 254, -101, 61, -83, 70, -151, -42, -67, -72, 88, 158, -162, -49, 47, 242, -133, -2, -28, 9, 49, 95, 2, 225, 110]
2998A10j73K13r5j46N5p8J73k50K42J12j93j44J43K65l3m66J85k29Q7M03j92j85
3020a96J70r3o9R6M5K9k9K15j15k03J69o2J1r4J40K4o6J99M4j30k2L4N7j44k0
3045a0k36J28J03o2J28J11k30L2q7o0J40J60J19k7n8Q6k75L59j58l63L27r3n3
3068a9J34l2k0l2Jj23K84k33n8j7L38j29l93L25QQ6M5o9j04j5J2m8Jo5K78j48
3094Gj17J60l3j03L8L1l0m5N8L5k5k5M9m3O1K22n06K02J98l3k32J80p9oq7J58
3120C5K03j22j06j33R4J04Lk32K79J55m34pm9R5L02k62J55l05k2K60nk28K08K19
3144B07k01K53k08K5l45J07J09L04l45J56P9j69j43P8J94K5j41k7J3k02J44O6
3166b1pq4L20J19o79M58N6k34P4j44J48Q5m0l7l0n0J77L6P7k41j84N00m8k68K95
$$ y = [110, -63, 150, 55, -91, -36, -114, 59, -191, 51, 163, -30, -174, -31, 234, 201, -265, -80, -309, -222, 181, -11, -196, -26, -119, -188, -92, -47, -18, -47, 168, 53, -150, 19, -43, -32, -126, 14, 38, -28, 171, 215, 85, 63, 97, 154, 10, -10, -246, -118, -15, -77, 51, 162, -68, -36, -123, -183, -43, 117, 236, 209, 151, 237, -38, 321, 163, -200, 127, 34, -19, 115, 83, 63, 31, 32, -91, 193, -40, -98, -115, 223, 94, -299, 26, 34, 120, 165, 96, -8, -23, -11, -59, -58, -123, 155, 7, -110, 50, 17, -86, -48, -17, -47, -92, -34, 1, -24, -49, 0, -43, 18, 240, -266, -64, 134, 101, -131, 49, -30, -36, -123, 35, 238, 116, 10, -123, -29, 75, 78, -154, 125, 280, -154, -161, -210, -115, 187, -75, 80, -225, -247, 13, 8, -220, -12, 207, 6, 259, 51, 76, -269, -162, -53, 251, -94, 62, 141, -28, -171, -93, 101, 126, -15, -42, -29, -231, -87, -21, -28, -112, 208, 327, -352, 106, 162, -72, 2, -142, 6, 91, 51, 14, -16, -66, 111, 147, 224, -17, -201, 299, 251, -17, 278]
3191B78m55p4K34l53N71j08l17K73j14M1k11J84n7K96M2k08M1n8N0Ml7l5M5O2
3215I4j32R9k20J36R2N3P9l34L66j13j24j19J64j7l3R7k25j4J15j17K3K90l36
3238a76J98j56K41k18K73k55K51j02k16M50k12k25L20J84m47j23J43J73n0r3N49
3259E09n80R3J15k2j96O1J76Qm4J80l26j5K16j89L18l61J64k19J48j57L2P3J65
3282A49j17M2K04j76R5k67K36o8k60M21j38k78J75K11k98K50k98L38j71r0K7k2
3304c5q8J33k87M45N8j08L3j99L68m92J43J76l66R5K31k7k03j39K16J51lMo8K3
3328F1J06k42o1O0J57k81K1J53n5J55m5L70m94L71k60L5K28j85K3k27J99k26o1
3351a98Q0Q2k07K97k53M01J4m25J66n5J44N3o9l4k45J02N0J18m45M71M3j92J97
$$ y = [278, -177, -251, -17, -370, 201, 93, -224, 49, -65, -24, -235, -51, -108, 188, 230, 22, 63, 5, 55, 59, 22, -13, 32, 94, -38, 61, -159, -23, 69, 122, 201, -133, 233, 120, -4, -123, 41, 24, -9, 88, -137, -151, -36, -153, -130, 160, -176, 22, -134, 107, -111, 162, -93, 158, 56, -160, 290, 78, -147, 173, 357, -90, -213, -70, 103, 53, -40, 509, -71, 22, 137, 115, -81, -20, 156, 164, 120, 300, -26, -41, 175, -14, 304, -57, 107, -112, 36, -121, -89, -16, 149, 32, 74, 278, 102, 197, -70, 166, 98, -162, 259, 121, -157, 18, 229, -69, 181, -117, 221, 50, -40, -13, -35, -123, 10, -277, 168, 226, 118, 151, -48, 320, -172, -29, 147, -219, -124, 107, 80, -123, -262, -46, 105, 102, 106, 38, 61, 167, -75, -136, -76, 81, -200, -179, -26, -81, 74, 29, 399, -95, 276, 16, 51, 279, 94, 117, -110, 89, -137, -198, -118, -36, -243, 54, -199, 202, 216, -209, -43, -98, 46, 99, 30, -4, -249, -147, -97, 21, -424, 47, 90, -102, 95]
3374I5K0J18k71j22K56j32o7j10J97o8L1K1j05J85j2Q1Kj44O4o3l14K19J94j49
3398g4P3P9Q6j29J05qj38N0L5j73J36k4J06j03N9o5K6J39l95L40k4k96J37K46
3422A88j12J04k34k8k1q9j5K0L2J00O7K0j0j48J15j5L1j91N97l40k46K12j05J24
3446E6N1j20P5j47J96P1j85J36k42J39k1J2j27J10Rn8l15J67K95j99J1p8J12K67
3470B15k02k05K66j24J21P8r9J61k22K69j60o4j55l60L90J11P0j24k36K06K76
3491B12o4k83K83p3J21k13L58k71k21M6J3K69Jk44M1l9J26l5Q8j86J78r4j66J40
3515a3k13J66J35j12M3K3J2k4K6n8o1J61k8j31M7l18J85Q9K42j76r3J74Q6k48
3539h6J17N4j18M8j65M63k89j55K2M3K7K24k87K9J10j00k21L63kj95K7K65j91
$$ y = [95, 115, 233, -38, -160, 96, -36, -103, -213, -16, -84, -53, -32, -137, 48, 36, 117, 119, -25, 39, -24, -338, -119, 75, -74, -1, 78, 164, 35, 140, 132, -6, 44, 79, -94, 42, 18, 124, 21, 80, 15, 41, 180, -215, 125, 101, -195, -58, 188, 76, 180, -54, -82, -103, -192, -207, -187, -155, -55, 12, 32, 22, -126, -11, -26, 5, -186, 411, 71, -175, 37, -68, 56, 107, -13, 62, -85, 111, 182, -3, 133, -109, 30, 9, 21, -106, 4, 13, -45, -360, -193, 102, -97, -86, -164, -52, 215, 13, -192, 74, -50, 71, 149, 50, 211, -11, 258, 98, 34, -121, -481, -91, 20, 90, -34, -270, -64, 212, 148, -135, 148, 75, 196, -17, 341, 70, -151, -105, -92, 177, 178, -66, -25, -64, 62, 27, 115, -71, 107, 13, -153, -13, -226, -60, 75, -37, 6, 29, 41, 17, 43, -15, -76, 85, 57, -74, -27, -345, -160, -71, 171, -5, -98, 76, 162, -86, 31, 85, -33, 15, -150, 313, 24, -131, -109, -66, -39, 185, -102, -73, 37, -63, -284, 79, 77, -118, -91, 174, -17]
3562a7j69J40j1R2RP5k79J20K85l82J64P4m11M87l38j66L65O8j22N9k22J05J26
3585E2j22j13J97m1q9K32J27l17J1K09k64j87K37j12K96j16k22L25J9J07m64K14
3607b1m7L49k32p9J21j62O4N0kK4J14K5l81P1J88J3J20n61M59j94K1m6K61k76
3631a21k05L90R9p5K6j98K49Nl78N24k90n0JJ44p0o1Q3j39J14k58K19l1j40K40
3655G8j03N2L0K33j45k21l8jj81L70q3J53j69N3j13L84l15J51j16J47J98m96R9
3678c3o1M33k57K2J01l1k85Q4j6j01J79J58Rk5m8J10j77J70l76K4J29l5j08K56
3702A22m1j36k97M38k63J04K40k12J80q9k8p4P3K64k27R8l02K96m8j42J84j4k14
3725h8J2J99j54J31N2M9k94K03k08N6J40k78M79m38Q8K33j93k8M2P0n7j31O4j13
$$ y = [-17, -186, -46, -57, 35, 44, 119, -160, -40, 245, -137, 27, 101, -310, 177, -161, -327, 38, 106, -16, 43, -179, -74, 52, -70, -183, 14, -27, -116, 116, 243, -74, -63, 146, -118, -305, -68, -180, 116, 0, -222, 103, 122, 229, -235, -21, -68, 281, 49, -30, 91, -71, -7, 43, 41, 65, 179, 204, -177, -106, 82, 95, 215, -346, 113, -81, -60, -106, 155, -121, -326, 64, 163, 88, 114, -84, 165, 170, -208, 316, 26, -24, -23, 121, 51, -10, 73, -66, 48, -210, 9, -22, -162, 78, -25, 27, 57, 290, 145, -76, -114, -115, -296, 74, -9, 144, -25, 28, -85, 299, -16, 135, 19, 166, 364, -132, -33, -94, 339, 82, 104, 205, 174, -111, -27, -43, -144, 35, 193, 202, 177, 129, 239, 62, 232, -144, -120, 9, -26, -134, 122, 81, -55, -352, 86, -177, -73, 167, -45, 135, 46, 18, -56, 17, 281, 54, 152, -150, 146, 98, -44, 140, 126, -88, -76, 123, -31, 100, 152, 201, -93, 110, -98, -42, 98, -180, 299, -139, -51, 182, -11, -39, 3, 73, 16, -115, -51, -164]
3749a64L76j54p9Kq3J89m02N25n22K83n0M1j74K5P0K00k55J41j53P9K30k08J44
3772F1M3j10k60L55l02J08j5P6J18k26K10j16N1J14j06L48k24o0k09jJ39k21N80
3795C53l16l0q7k46N11m24L86j52q0J80l03J33K9K6O8k32J91j74J79j4n10M63
3817d9p7P4K61k56j96J74l6M6J84l36K56K51l48K30O5k14k96K66J42j70J3k35
3839b51L1L17l12K27j30O7l5j54L14j98J81L1Q7m36K46KJ71j99N4L1j90L61k02
3862A3j88P9K98l46K01Q0l51J11J76l20J85J3K43j09j66K50j05k80J27J18J14
3883A43q1j32m8n2L26k60N0J87j3J30k91K8L7o5O8Q6M4k13J76k77J97J1J58j96
3907A3n8K29K92n65J93j30K21j80k7L7J23O8l2k68K94j84k2K26l36J3N0J91J26
$$ y = [-164, 212, 58, -21, -19, -102, 87, -315, 210, -312, -29, -79, -38, -212, -187, -117, 83, -172, -31, -184, -105, 125, -83, 61, 104, -6, -266, 89, -213, -105, -120, -44, 74, -152, 58, -58, -7, 107, 1, 349, 125, 65, -144, -145, -6, -227, 353, 37, 7, -80, -326, 185, -239, 147, -5, -85, 95, -208, -75, -46, -20, 48, -184, 7, -167, 12, -2, -512, -49, -126, -52, 209, -47, -243, -69, -105, -59, 125, -211, 45, 296, -52, 178, 243, 29, -267, -1, 141, -29, -16, -251, -220, 97, -215, 12, -118, -51, -86, -240, 74, -124, 57, 88, 175, -261, -15, -13, 158, -41, 13, 44, -146, 215, 13, -175, -96, 202, -144, 57, 137, -214, -103, 73, -247, -62, -49, 194, 85, -81, 169, 64, -216, -89, 29, 143, 62, -70, -118, -170, 156, -104, -54, 133, 120, 250, -41, -13, 24, -41, 27, 113, 157, -56, 120, -157, 40, 51, 209, 13, -45, 184, 476, -89, 104, -26, 195, 15, -12, 25, 148, 216, 184, -84, 210, 26, 4, 230, -106, -93, -43, 148, 274]
3930B74m10o6J42J52j63j00R1J63j41J8J56k65l0K97J23j96j82R3k0j67o4L31
3952C6l3j26K79l36L33j66P0j09Q3K52k02j26K42j99J20m05L46j9K3K03j10j54
3974Bo1N2k41K52Q1j27J21p5j13j65M09j43n2J16Qop8J28r7j07l6J22k0J47r6
3999B1j6KJ71m11L16J6k72M94k52m3K2M9j28J2J04k16r2K42Pk04J7J09j83O2J13
4024f0K8K16k03K58l29K0J26P6L9r5j14K95m20o3J19J36N8o8k45M22j99K13M4
4047B54l02J77N2l00m6L76k77k2p0L52k74K27K66m68J96P0k41L33m63k64N48K09
4069C33j90p3k1J18j65k37M05k41J11J55k01J42L3k86L74k55rN2j76J60l4Q3Q6
4092A64l18J79j87P1N3q4n6J53J30j65J69r7O7j64J6O2j22m3O3J54j31K61l03
$$ y = [274, -136, -202, -60, 92, -71, -171, -80, 83, -58, -40, 116, -149, -179, 118, 241, 45, -137, -44, -64, -231, -295, 36, 3, -123, 156, -180, 153, -13, 57, -52, 31, 283, 81, -45, 197, -2, 118, -287, 59, 40, 63, 266, 156, 2, -59, -7, -248, 4, 85, -42, 79, 4, -109, -274, 135, -8, -60, 56, 64, 58, -20, 108, 11, -96, -132, -10, -30, 117, 21, 5, 7, 178, -233, 83, 99, -173, 321, 69, 26, 48, 97, -31, -19, 85, -131, -223, 19, 26, -178, -161, -52, -235, -173, -60, -32, 184, -19, 239, -90, -70, 56, 132, 171, 76, -38, 257, -163, -226, -107, 29, 87, 19, -226, 196, -3, 210, 254, -48, 129, 181, -119, -165, 211, -66, -88, -158, 194, -80, 147, 413, -55, 141, 211, -30, 303, -160, -424, 124, 333, 143, 70, 49, 167, 2, -235, 170, -71, 40, 195, -6, 136, 169, -117, 257, 2, -7, 45, -131, 29, -5, 78, 164, -154, 25, -162, -91, -38, -122, -178, -25, 105, -60, 109, 12, 79, -85, -69, -7, -129, -172, -109, 45, -86, 175, -128]
4115a28J77K60n03K57j3J05k85Q7J3K6j39J55p8J82m3j29K66M8k85kR4n6q4R5
4139B0j93J29K32pk29j8N3R5J31j93Q4j30Q4Q9j84J22j01O1k54K98J07j87K01
4162B10j07J82l09J18n9k74J34M15n01J36j02O8K5j28J85o0K15J6L5k51J66r9
4184A5pm4lJ23l2n7P5j75mJ90r9K6k46N1M44l64J73Q5j03qK5L0J1j11O0j46K1
4211g0M5K22l40J7K45k17M4J07k67P7K46p4J84n08K47R8ql08J33K91j77J81p7
4234I1J03j3j79J79k4O1ll71L24l47M2r1J50K75J29n32L06P2j82l0r2J47R8p8
4258C5n8Q7j77Q0j53J92N4k94K57J60r8J06j55k96L62o9o8K54k74j1Mj58L8J89
4282GK67r5j01j04l6LJ06q5m2J73o3nL4Q9Jj45K5j47K46j00K07m7j18lq6j48K8
$$ y = [-128, 49, 309, -194, 63, 50, 155, -130, -43, -30, -4, -143, 12, -66, 116, 73, -56, 210, 258, -27, -29, 65, 9, -75, 20, -173, -44, 188, 181, -48, -66, -13, 82, 213, 20, 104, -26, 58, 147, -37, 85, -16, 45, -209, 89, 196, 9, 210, 103, 285, -24, 94, 35, -239, -105, 310, -191, -55, -157, -89, -64, -192, -7, -67, 148, 164, 199, -52, 114, 15, 8, -36, -39, 84, 52, -5, 70, -105, -109, 81, -18, 8, -238, -187, 257, -107, 66, 151, 48, 40, 65, 95, 106, -5, 55, -91, -70, -25, 197, -143, -126, 119, -98, -54, 53, -214, -137, 109, 35, 219, -289, -42, 56, 48, -260, -127, 164, -13, 168, 91, 194, 181, 2, 181, 157, 218, 215, -156, 168, -179, -137, -228, -78, 197, 326, -206, 100, 172, -10, -40, -132, 15, 113, 35, -23, 64, -113, -33, -186, 6, 60, -234, 23, 183, 85, 191, 36, -260, 102, 33, -35, 219, -55, -66, -62, -220, -182, 7, 274, 179, 78, -26, -62, -59, 47, -38, -80, 93, 30, 25, 59, 148, 149, 4, 29, -118, 128, 28, 235, 188, 70, 67, -19, -167, -139]
4309a39J04n8J47J23j79L6j82Q6M8j32J23K29o2j39j21kO9N3r6K95k12j43j5L10
4333A43k34j5J58J30j8j51J52j79j8J79k16J48m10O44ol48N2J18j98o6j7L69j03
4356A14O6l98L6L37P0k50J5J65k45K02k54l9L24j87j70K56N4l19L63m3j39P2P6
4379A06l77K47m2pK30k40J64j15l6n7L02O8l13k40L73J98j6j66M6p7k39L01k09
4402i9m3L8J8L74l70L5j45N67l16r7P3l9j63J18m6K28r3j75K70M5j85O8j81N4
4426f4J1J5J19m63M93r7K15m41L60r5l9P3j81k06K59K4K14p8k02K31k74j38R6
4449a68L19l46j44L30q4R5O4q0l4p6K03l3q0J55J2k90J66j35R1k14K46n0J61L6
4473A44l73K63Lk39M05j02q0j35Q0l4K34l16pL59J2l85J59J30qj99O1K9K19r8
$$ y = [-139, -35, -93, 54, 177, -2, 34, -148, -62, -14, -146, -23, 206, 144, 5, -116, -118, -49, 4, -92, 203, -9, -152, -167, 143, -91, -106, 52, 182, 164, 13, 165, -14, -32, 147, -69, 79, -331, 313, 307, -41, 11, 129, -69, -135, -152, 217, 114, 180, -218, -182, 155, 225, -25, -10, 155, -90, 112, -142, -181, 143, -44, -214, 42, 96, -223, 140, 97, -42, 30, 106, -271, -24, -66, -73, 157, -83, 81, -34, -70, -127, 175, 243, -70, -310, 63, 261, 245, 79, 125, 48, -191, 110, -99, -142, -104, -86, 288, -82, -47, -192, 375, 59, -38, 35, -4, -167, -49, -95, 133, 40, -135, 135, 180, -5, 63, -118, -64, -53, -38, 81, -382, 111, 14, 229, -212, 148, 53, 14, 87, -94, -300, -41, -17, 197, 119, -83, 148, -126, -264, -168, 151, -195, -339, -9, -93, 2, 66, -14, -48, -124, 79, 46, -34, 121, 133, -157, 9, -126, -35, -249, -3, -53, 108, 144, -229, 34, 37, -202, 203, 101, 21, -114, -34, -68, 166, -150, -157, 202, 214, -171, -12, 118, 110, -89, -28, 1, 220, 122]
4497A22k25J67K05m61L14k3Q2m09L03j56J97q2k5n0p1J32l3J23k4J80l78o4K15
4520C9j38j05K65L8K16k56j12N9L09k88J13n5k81K39J5J93k58P1r5N9j01J03j21
4543i1L1L01m68L84N5m19K13j53O3O6L28k8l88L5J63K63q0j48j73J3o5J13Q1l44
4567b48J73J71j58P7N5n0L7j1n2J22p2k20O2J35k31o4K34J1m6J31L4o9Q3j78K12
4592A38l51L88q2j9j13J43J21n74L64r9K3j05J73M2n9j56J77K3j74J63R0j80J33
4615F6j85p9K18j79q2M22m2l9k42J59J89l39K4J91j97K59p9J45j38j06k9J82o
4638A13k3J73l94l7P8j45J2J05K51p5j66j48K26J8j32J31M1k85N06k12l35O00
4660C02k78k17j06L33K9l37K63J33m53N30j55N2j39j42K64p0P6k17L46j47J66
$$ y = [122, -103, 64, 269, -192, 122, 99, 181, -228, 75, -81, 116, 34, 9, -41, -112, 20, -13, 110, 86, 266, -112, -176, 39, -99, -204, 61, 99, 315, 59, -53, 6, 315, 27, 140, 85, -196, 43, 58, 251, -7, 64, -31, 28, -73, 30, -91, -60, 241, -227, 157, 212, -207, 6, -147, -84, -18, 310, 282, -106, -71, 92, 355, 275, 127, -46, -33, -98, 15, 96, -248, -75, 96, -62, 15, 70, 20, 57, 46, -6, 116, 44, -176, -114, 21, -210, -274, -40, -29, -75, 56, 90, 21, 104, -74, 138, -213, 175, 93, 74, -39, 104, 225, -349, 15, -84, -61, -166, 7, 49, -10, -166, 11, 34, -140, 23, 113, -67, 66, -119, -198, 20, -159, -241, 181, 139, 100, -142, 17, 206, -133, -109, 82, -115, 144, 65, 210, 72, -34, -63, 119, 113, 90, 263, -131, -168, -90, -235, -223, -118, 133, 58, -108, -256, -30, -12, -144, -13, 28, -257, 249, 37, -298, 302, 24, -193, -299, 34, 63, -274, -11, 122, -331, 199, 44, 96, -43, -185, 79, 9, 85, -132, 214, 67, 233]
4681B33l46Q6O1k23o8K76j07K00l39J10J74J23k16L5m25L04J00r5M10m00k5J53
4703B1k49L72l5M8l73L20L1k86J77l7K88k49j04o9j25L65k94l2L85j60n0j4K31
4726A61J6j70J25Ql61M01k47O5J33j5o4m5j65K5K50j7k17J42o0P1j31J71l6l59
4750c19L06J12j81n0K07j35K06m8J34l28L7K87j39J10n4j78Lj30J49J36k74J94
4772D5j80K82j5k58k01M30j4j75J82q2J15j59K0J49j99J23k44J81J53m13J81q6
4794a65K26J7lk69NK79j40k19L06J45k88L51r8l36K22L49k81O4j85j63J54J65
4816A36k31J16j28j1K40k65%J91k8j16k77K66L82k34k0k64K08N5j35q6J6J70K38
4839B23j06l28K68k31K41k54J37K86l8l63J74Q2j95O9r5K4P8J64J96k40q9J44
$$ y = [233, -113, -27, 34, -189, -257, 19, -88, 112, -227, -117, 57, 180, -36, -1, -426, -122, -22, -117, 293, -107, -132, 21, -228, 144, 109, 157, -216, 104, 135, -151, 26, -11, 277, 28, -76, -145, -270, 95, -199, -231, 154, -6, -56, -70, 161, 177, 7, 132, 140, -221, 180, -67, -2, 131, 116, 52, 7, -158, -133, 117, 100, -117, 25, -35, 36, -95, 76, 40, -319, -13, 99, -82, -132, 75, -60, 146, 98, 232, -96, -59, 228, 89, 199, 145, -33, -30, -160, -11, 125, -149, 45, -135, 147, 132, -126, -327, 103, 89, -86, 96, 14, 129, -30, -10, 139, -60, 63, -181, 0, 153, -260, -79, -165, 61, 78, 75, -194, -189, 90, -50, -269, 37, 182, -106, 245, 147, -189, 33, 382, 101, 165, -20, -183, -29, 136, -95, 21, -107, -118, 122, -143, -143, 48, 20, -96, -373, -107, 275, 41, 21, -243, -35, 20, -115, -201, -185, -15, 223, 117, -211, 57, -174, 67, -187, -50, 236, 198, -165, 9, 91, -104, -35, -130, -106, -28, 136, 332, 92, 3, 147]
4861A47j63j50J34lp5P4n6l7K53N2k77K43o8q3Q3j14r8l6O2J6O0K2p9J03p7kP
4888f2Q8k58K35P7k42J18q3J09J59k93J1L11k49N6j19R4j07K23j8j71L41P9k9
4911B70j43n7j30J04n4r1P8J65j82J76l79J80p1K78q4k21J58p7J90l1P1k06K32
4934A76r7l23J75p8K29k71K53k0j32K00M0k97K07k74n1L51k50M45l34P8o4J34
4956I7q0J0k62m0M25j69J33k2j51j58L34n6k37j92K63N2K29mk33K10j88J29j55
4979f5O4K00l44M4Q2rJ1Q6q1o2J18q6kL9J09j44j%j19j2J78p2K01r5k5O3k09J82
5007E1k90L39P2j67O1j71J15K0j97K5K78k50L18k77p5K97l1j19R3P8k01J45j85
5030g1j12J49p9P0j2L9J80r6k05k76N63k4l02N0K21j63J11n5j62RL16j94Q2K61
$$ y = [147, -16, -166, -32, -35, -110, -36, -92, -129, 124, 176, -101, 142, 74, -9, 74, -40, -138, -174, -112, -96, -36, -14, -93, 10, -67, -69, -62, 26, -232, 3, 80, -162, -44, -127, -18, 141, -152, -141, 170, -79, -23, -142, -48, -155, 68, 50, -121, 220, 299, 270, 127, 70, -60, 44, -10, -101, -23, 142, -40, 136, -243, -63, -134, 144, 60, -161, -3, -80, 110, 79, 150, -56, 176, 79, -244, -69, -147, 82, -189, 64, 44, -88, 112, 152, -145, 62, -212, -263, 88, -162, 283, -51, 27, -37, 97, 17, 27, -235, -275, 150, -19, 114, 92, -59, -217, 117, 61, -176, -368, -105, -53, 176, 172, -61, 149, -39, 90, -65, -1, 199, -145, -101, -19, -28, -17, 69, -12, -74, 44, -42, -44, -5, 104, -40, -41, -41, -160, -172, 6, -66, 135, 40, 15, 78, -131, 51, -239, 100, 172, 5, 66, -105, 10, 30, -167, -142, 136, -114, 204, -73, -148, 149, 118, -1, 92, 170, -31, 114, -71, -183, -34, -113, -43, -55, -16, 164, 68, -137, -413, 150, 126, -176, -126, 95, -68, 43, -12, -174, -165, 151, -43, 39, 300]
5054C00l29J65J17m38K00J69j03l8k97O08k43k37J54j68K25k11J12J47k34j95
5074b96L73k06J1Q6RJ84j80J79k04J24j78J13k9P1M7q6o1K30l24K47q7j28M2L5
5098b8Q0p3K18k09J18m3k2j53Q1j69J47mJ5l3K01l03J48J81J15l41J64k69K05
5121B6Pj16J80l12J33M3K27q1j55j13RK09K5j05j30M64n60J21K24j79J01J18j18
5144A8k97L01J38k34r4n1K05J31n7j39M7P0j75nK34J27k17r2r6o0L86n2J15m97
5168b94J45J26N4J07j03k44L05l56M50L8K06m78K24k03j28M1J48J11J36k37l30
5189b82J60j31N24l42rn4n8K07J12k55J33K38l45o1J24j99J53J74j67J33o8J83
5211A70k65R5j58P2J18L0r4L14k72J88l90Q3K40j65j1M3K8K65k23n8k35J86K0
$$ y = [300, -29, 136, 253, -185, 15, 184, 81, 43, -254, 354, 111, -126, 28, -140, 85, -126, -14, 133, -101, -296, 77, -129, -118, -32, -23, 161, -19, 160, -44, 80, -98, 15, -14, 57, 104, 18, -43, 187, -137, 110, 23, -105, -63, -28, 52, -21, 197, -12, 106, 63, 41, -112, -31, -200, -53, -57, -42, -75, 126, -177, -29, 152, 267, -74, 90, -179, 26, 33, -83, 97, -215, -82, -39, 188, 107, -48, -161, -152, 57, 82, -23, -153, 311, -249, -128, 96, -83, 18, 136, 18, -279, 22, 160, -74, -168, -219, -14, 117, 60, -79, -32, 38, -137, -142, 92, 219, 2, -90, -186, -246, 140, 88, 203, -294, -149, -23, 31, 138, 35, -209, 96, -260, 190, 228, 434, -44, 180, -23, -151, -110, 38, 149, 285, 48, -282, -122, -253, 271, -71, -80, -134, -192, 15, 127, -128, 5, 243, -102, -163, -39, -238, -85, 89, -78, 55, -13, 170, -95, 0, -158, -86, 32, 62, -32, 282, 10, 198, -192, -109, 131, -34, -45, -2, 26, 291, 68, 10, -225, -39, -19]
5234a9J8n3J80j84J22r1j51J30m8L9K69n5r1k08J93j00LN1K4m4p2K13j09j17O7
5259c3q7O8K55j86N0m35L76K09r2k50K87j13n1j21P2K14Rl86K03Nj09j62K96J
5283B0j03j21K73Q4k20J78j6j86K52k37j45L2J48N7j88o7o9K44K45j91L7n6n2
5306h1K11o2J38k90j60L00J17j36j00j23P5K59j96R7j37N6j07J88L44k39j91m0
5328g7J81j45M2K3j98K96R5n22O16m24L81l78q4K6R8R2j11K04m61M90j17J19j94
5351d8P0Nq4J67p4l0J4j45K01P5l46l19K61J76J44k19L89k4j20j08J14m95M06
5374A0r6J5J41j04m1J97M5k81K44j65RJ96j74J82j32l61J57K90k28J12m7L80m23
5397g4j3K43n7j04R8k94J02r4M05l15r8N8J59p8J01J95l3l4j62J27k27K17P4j84
$$ y = [-19, -1, -54, 126, -58, 64, -27, -178, -48, -96, -57, 212, 157, 66, -142, 51, -49, -46, 5, 29, -15, -87, 126, 17, -100, -33, -120, -52, 203, 17, 67, -368, 8, 217, 125, -125, 162, 49, -2, -123, -51, 163, 172, -214, -11, -6, -115, -277, 19, 20, -83, -204, 69, 153, -67, 111, 95, -91, 161, -76, -221, -189, -41, 16, -172, -239, -308, -64, 181, -10, 27, -29, -81, 130, 68, 206, -84, -244, 56, 173, 37, -63, -186, -111, 148, -48, 49, -88, -32, -139, 49, 393, 154, -37, -77, 104, -41, 1, 24, -174, 122, 217, -305, 311, -113, 268, -110, -194, -168, -70, 22, -89, 115, -346, 144, 27, 146, -48, 22, 27, -57, 110, 36, 6, 20, -125, 76, 151, -195, -514, -253, -77, 67, -152, 237, 213, 93, -15, 99, -396, 10, -86, -71, 70, -34, -75, 122, 167, -114, 130, -35, -26, 170, -4, 178, 46, -315, -158, 132, -96, 16, -31, 349, -74, -87, 156, 99, -5, 93, -201, -99, -193, 212, -103, -201, -143, 16, -62, 39, 234, 201, 167, 5, 132, -95, 122, 196, 12]
5421A2J16j77j02M85l85Q2r8M88n96R1l6L73k82q2J96k23P5kK78j26L8l87O2K56
5445E6j02J85m30L05o5l6J40k13P3p5J47m6j00m1L54l08J88k66M90k31L7l93K73
5468e8K59m3k99J70j10j30L58k19o2KJ6K46j32n1P6k9J19j02R1r5k7j16K15l63
5492b84L50j11J71j5l20R5J46j23N5n6LR3J56J22j01q1O5j83p2o3N1J42l6O5N6
5517A25k05K40j59q8k5n5M3P2L54o13M96j04O6j44rLL0R4O4j59k09J48J16j58
5541g7M9L8K06J22m07j5Q0j5J69j40j76K55q1q0K33j98j59k6J35Q4j13K16k08
5564a08P7j60M36l81j1J00K06k03J02K36l64j79M28k95m3J66k9p2j04n0M71M9
5586B72l8l64K27k01K9J96L06k70L3q7k2J32k25K90l29J21J48j52j74K73l18p7
$$ y = [12, 128, -49, -151, 334, -51, 31, -67, 421, -175, -84, -120, 253, -29, -111, 85, -138, -63, -65, 213, 87, 125, -262, -200, 56, -46, 139, -291, 14, -51, -87, 53, -160, -87, -162, -15, -61, -161, -202, 152, -156, 32, -234, 256, 25, 62, -331, -58, 201, 158, -141, 29, -81, -211, 147, -72, -134, -132, -116, 130, -2, -53, 23, -6, 113, 11, 102, 7, -20, -136, 79, -284, 66, -45, 126, 111, -209, -114, 32, -91, -36, -92, -89, 4, 160, 282, 181, 100, 165, -18, -90, -153, -102, 40, 4, 69, 125, -80, 160, 1, -87, -112, -167, -124, -52, 302, -311, 185, 81, 147, 3, -6, -3, 27, 121, 185, 26, -183, -35, 81, -77, -28, 10, 216, 338, -69, -84, -4, -19, 150, 10, -166, 89, 8, -72, 161, -37, -196, -222, -87, -3, -116, 100, -108, -31, -191, 245, -136, -147, -47, 159, -44, 58, 294, -70, -249, 179, -116, -159, 7, -22, -94, -198, -248, 223, 272, 234, -130, 97, -104, -75, 121, 427, 157, 190, 103, 81, 213, -12, 278, -51, 70, 218, 66, -108, 165, -153, -230]
5608b30J56M36l22K4k15M8J19rj04o4J68m5m9j7Q1j49L25k05R0N3j99K24l9qj40
5633g1J75Rl03J15l1M70l47k63J32J20p7j31L69k79L16m0l68l2N4K30J29k85k50
5656c58K40PlK34j97P3K96l00K60l68R7M0rj1j5l2J88j62M0J19k25J1P4J26l15
5681a90L4J05p0l8R5P4Q1P8L1P1l00R3q5j41J82R8j07JM3n7k1J60k48L30l06L68
5707B81k40P4K5k88J93k11N6j81J15J84P1O3j86L8K01l56J92K74j26j09j01o5
5729i6j34K11Q9k6j39K18Qj0k29O1l0J9j09q7L95K6j23J52l74K86j0o0J70r9n7
5754E2q5J52j98K2O1o0m7K20p7K2P2j61l1K70j28r2r6k0O6L2O9K29k42j39J20
5779A1J65k77K2p1J21O8l06R4%L52j14j3k31M08j76j79J86m1o1n2P3J4j55J44
$$ y = [-230, -74, 362, 40, 64, -151, -103, 16, 7, -97, -161, 7, -38, -87, -104, -23, -172, 153, -52, 38, 91, -108, 116, 77, 69, -71, 104, 113, -190, -75, -106, 364, 17, -246, -114, 6, -71, -202, 167, -112, 204, 164, -204, -236, -182, 48, 177, -108, -358, -118, -111, -114, 120, -77, -4, 292, -8, 252, -116, -19, 21, 12, 1, -14, -46, 142, -20, 20, 139, -86, -75, -1, 125, -190, -156, -51, -121, -159, -64, 10, 91, 169, 200, 271, -29, 64, -21, -162, 20, 118, 11, 12, 55, -2, -23, 137, -111, 219, -87, 281, 41, 115, 140, -148, 45, -166, -110, -291, -176, 8, 79, 142, -44, -6, 195, -161, 31, 305, 179, 70, -31, -96, -230, -19, 70, 44, -95, 123, 131, 121, -108, -47, -77, -58, -167, -254, 141, 167, 44, 196, -178, 108, 98, 38, 208, 109, 52, -33, 119, -79, -57, 4, -56, -103, 117, 40, 62, 134, -27, -58, 212, 84, -8, -104, -124, -58, -26, 43, 272, 30, -109, 11, 176, -101, -79, -150, -29, 39, -267, -173, -173, 179, 65, 52, -179, 229, 53, -126, 60, 19, -42, -94, -21, -7, -162, -18]
5803a8J52Ll22J73L09m41J45N5r4N8J70p1LJ11j91k00K7J22j42M66n77J89n2l8
5827a63J03N2K44k17j05Q8m2j30L97j35P6n4l6j34J12j62R9j30j21L25k13n3L60
5850A61l27K42j10q3J45k2J73k70J77%j56o1L23j39L2r9j9j21J50j81K56j17N2
5873Fj12L10k12j82K83k06P1J71k84K02J32k71q0n9K13P8p1p0K5Q7J62l12L67
5896B48k28j44J61m2K04j04J93l83p6j7K45j5o1j24L00j30k00L25l62O1L73n19
5918b95L05k1R7k8k4J5R1r9j90J01o2M3J08j26O7N8j5k29J14Q3l6J5j86L25k55
5943a44J57nr4J26l4j92M05j40j13J48n3M7o7Q0n1J04k43K57l88Q8J37J26n0k03
5967a02L4MR5J03k66K85P1l10O1J27P2l53K31o7K90l04K6j21J58J5m7K75l56K42
$$ y = [-18, 134, 137, -185, -12, 297, -144, 1, 56, -38, 20, 190, 119, 122, 233, 42, -158, -131, -9, -151, 315, -262, -73, -125, -163, -60, -8, 236, 19, -86, 2, -40, -170, 227, 92, 168, 114, 78, -56, 56, -106, -7, -137, -258, 67, -146, -199, 161, -166, 76, -34, -117, 28, 6, 179, -91, 86, 86, -70, -131, 192, 53, 85, -14, -33, -154, -4, -185, 71, -46, 6, -106, 204, -8, -190, 93, -113, -42, 129, -155, 47, 179, -92, -172, -231, -18, 60, -11, -81, -56, 31, 193, -119, 248, 20, -124, 37, -5, 199, 95, 288, -95, -171, -188, 57, 42, -19, -143, 157, 27, -173, 152, -210, -149, 224, -295, 10, -11, 86, 58, 34, 49, 140, 41, -149, -48, -110, -67, 41, -85, -18, 40, 25, -204, -90, -7, -43, -28, -214, 111, -144, 13, 8, -86, 40, 6, -186, 219, 79, -34, 114, 61, 108, 41, 121, 70, 174, -69, 188, -200, -112, 25, 151, 101, -102, -68, -64, 31, 134, -132, 153, 224, -86, -25, 102, 174, -179, 52, -15, 275, -29, -3, -124, 34, 49, 2, 277, -79, 163]
5991A63J04j69k4j74L2r3M6J33j47M1L58k81j06no2J24j54K52m3j6P3j21lJ69
6015I7j50J19p9L17j25n3Q2m75K94j9j27Q6J56l45K76rn7j44K19J0R9r8mk77J86
6040b1r1K04p7k39K09NK20k41J30n6k22J31N1J89l65m6K66lR7k67L9Q0o6P8r7
6065i2P8r4L15l73J02nj16K2J66j05p4K61o4j37K81k0n6Q0m92M53K4k25N3j74
6089a92M6oQP8L6j4L4p2M1N1j89J21L3J60k19J54j77J85r3j47L92k32J36k22R2
6114DJ15k36r2JJ72Q2J08o7j23J04j75K10j78k6L9O3K19m48K38Q3p7Jo7p1R9J23
6140A01J77k80J99j89p2R4M5n2j50K26J71j13j88M8o1M25l35k60L64k33O0L7j75
6163a61J11L3K97j35j66l8r9J09K12k71k3O0K07N2O7j67K19j77l1k2k25m5L38
$$ y = [163, 267, 98, 74, -100, -68, -161, -115, 18, -129, -88, 270, -11, -117, -122, -184, -60, -214, 38, -5, -21, 52, -69, -72, 97, -53, 66, -13, 304, 179, 126, 208, -267, 27, 8, -119, -33, 123, -222, 54, 45, -12, -156, 63, 73, 172, 74, 70, -207, -21, -112, 92, 15, -224, -15, -10, 210, -31, 99, 43, -179, -48, 3, 192, -173, -219, 47, 44, 141, -126, -87, -7, -73, 5, -92, -14, -108, 207, -166, -64, -69, -185, -163, 3, -102, -176, 85, 21, -116, 165, 145, 89, 169, -323, 130, 154, -71, -18, -192, -146, -152, -144, -66, -30, -44, -10, -82, -41, 10, -179, -58, -25, 135, -84, 70, -107, 78, -15, -162, 230, -2, 134, -88, 4, 119, -117, -209, -208, -36, 46, 154, 87, -36, 68, -107, 103, -75, -101, -62, 1, 220, -228, 10, 93, 16, 17, -50, -121, -22, 101, 278, -2, 197, 8, -64, 30, 75, 23, -127, 99, 270, 157, -31, 17, -44, 381, 46, -214, 150, -83, -23, 14, -161, -50, -17, 280, 145, -21, -59, -158, -49, 163, -108, -131, -71, 136, 188, 255, 88, 307, 130, 99, 77, -148, -193, 145]
6186A45M3k45K87k55K54j13k27k8k9J14J1J37l2j13j8Q3J38Mq9K3M9k97K32k05
6210a31n0J0K19l91K34K51Q5l13Q0K46l55L56l61P0J16K50n71K71j6q8j25K7J50
6233c6p2K25k41N01l52j47J22O9o5q8J35L6j27j19L71j61j33L38k84j15lJ4O6
6256f6L0J27N4m56P3K92M3J13l41L8J85j27J34J02M3l75L79m08L74l09K16r5k7
6279aL8n9J9k5M5J23j83r2L67m79J83p6L8K63k50O3Q8o9k40L34j40J72p5k42R4
6304a04M0k2%J06k4N5j2p1j44J29J29r8M0m8K01j3K8k92K39j39j23K94k80K12
6328A03K2j91j76R1p4J48K54l10J21oP0j74K02l47J73M4K38k42J32j06k6LN3j66
6352a64K91l88K63k08K80j07j1k3p1J47p6K06k12K21k54K29l09k5K42k3j08J04
$$ y = [145, 188, -57, 230, -25, 229, 116, -111, -139, -168, -54, -43, 94, 62, -51, -69, 14, 152, 156, 67, 90, 139, -158, 74, -131, -181, -171, 48, -343, -109, 142, 227, -86, -6, 240, -115, 241, -120, -50, 66, 316, -255, 16, 0, -88, -213, -186, -36, -108, 117, -124, 377, 25, -122, 0, 69, 4, -84, 51, 87, -40, -159, 212, 51, -82, 256, -28, -143, -146, -132, -66, -36, 91, 145, -311, -238, 54, 97, 210, -131, -93, 92, -35, 99, 201, 244, -131, 248, -160, 214, -95, 121, 26, -1, 37, -22, -3, -28, 17, 140, -43, -135, 232, -247, -64, -140, -102, 161, -89, -26, 62, -7, -247, 87, -53, 119, 44, -198, -104, -64, -86, -86, 20, -4, 51, 39, -32, -176, -47, 82, -16, 24, -24, 177, 164, 192, -100, 139, 0, -123, 171, -109, 103, 125, -66, -242, -151, -225, -77, 177, -133, -12, -18, 52, -122, 80, -267, -94, -50, 188, -54, 78, -28, -54, -51, 2, -164, 127, -261, 2, -206, 74, -33, -44, -67, -138, 9, -67, 139, -73, 148, -106, 123, -186, -211, 31, 8, -100, 4]
$$ [...]
8191A77
##END NTUPLES=NMR FID
##END=
