##TITLE=1H_DE-35_oil_TFAA
 CDCl3
 64 sc, 
 4.3.2024
##JCAMPDX= 6.0         $$ Bruker NMR JCAMP-DX V2.0
##DATA TYPE= NMR FID
##DATA CLASS= NTUPLES
##ORIGIN= UXNMR, Bruker Analytische Messtechnik GmbH
##OWNER= root
$$ XWIN-NMR		Version 3.5
$$ Mon Mar  4 16:05:24 2024 Russian Standard Time (UT+4h)  she@DPX200
##.OBSERVE FREQUENCY= 200.1313
##.OBSERVE NUCLEUS= ^1H
##.DELAY= (6, 6)
##.ACQUISITION MODE= SIMULTANEOUS
##.ACQUISITION SCHEME= undefined
##.AVERAGES= 64
##.DIGITISER RES= 18
##SPECTROMETER/DATA SYSTEM= spect
##.PULSE SEQUENCE= zg30
##.SOLVENT NAME= CDCl3
##.SHIFT REFERENCE= (INTERNAL, CDCl3, 0, 15.7039)
##AUDIT TRAIL= $$ (NUMBER, WHEN, WHO, WHERE, WHAT)
$$ ##TITLE= Audit trail, XWIN-NMR		Version 3.5
$$ ##JCAMPDX= 5.01
$$ ##ORIGIN= Bruker BioSpin GmbH
$$ ##OWNER= she
$$ F:/spectra/data/she/nmr/H-F/1/audita.txt
$$ ##AUDIT TRAIL=  $$ (NUMBER, WHEN, WHO, WHERE, WHAT)
(   1,<2024-03-04 16:04:27.29 +0400>,<she>,<DPX200>,
      <continue with go, POWCHK disabled, PULCHK disabled
       configuration hash MD5:
       00 E9 B6 7A A2 85 ED C7 34 08 36 98 17 FE 4E 26
       data hash MD5: 16K
       A8 5C 68 B7 A6 F8 A0 29 3C DC AE FF C9 07 19 B7>)
$$ ##END=
$$ 
$$ hash MD5
$$ CE AD C5 FC E5 8E 75 E2 5E 60 7C E6 49 BE 0A 54
##$RELAX= 
##$RELAX= 
##$RELAX= 
##$RELAX= 
##$RELAX= 
##$RELAX= 
$$ Bruker specific parameters
$$ --------------------------
##$DU= <F:/spectra>
##$EXPNO= 1
##$NAME= <H-F>
##$PROCNO= 1
##$TYPE= <nmr>
##$USER= <she>
##$AMP= (0..31)
100 100 100 100 100 100 100 100 100 100 100 100 100 100 100 100 100 100 
100 100 100 100 100 100 100 100 100 100 100 100 100 100 
##$AQSEQ= 0
##$AQ_mod= 1
##$AUNM= <au_zg>
##$AUTOPOS= <>
##$BF1= 200.13
##$BF2= 200.13
##$BF3= 200.13
##$BF4= 200.13
##$BF5= 200.13
##$BF6= 200.13
##$BF7= 200.13
##$BF8= 200.13
##$BYTORDA= 1
##$CFDGTYP= 0
##$CFRGTYP= 5
##$CHEMSTR= <none>
##$CNST= (0..31)
1 1 145 1 1 1 1 1 1 1 1 1 1 1 1 1 1 1 1 1 1 1 1 1 1 1 1 1 1 1 1 1 
##$CPDPRG= <>
##$CPDPRG1= <>
##$CPDPRG2= <>
##$CPDPRG3= <>
##$CPDPRG4= <mlev>
##$CPDPRG5= <mlev>
##$CPDPRG6= <mlev>
##$CPDPRG7= <mlev>
##$CPDPRG8= <mlev>
##$CPDPRGB= <>
##$CPDPRGT= <>
##$D= (0..31)
0 1.2 0 0 0 0 0 0 0 0.06 0 0.03 0 0 0 0 0.0002 0 0 0 0 0 0 0 0 0 0 0 0 
0 0 0 
##$DATE= 1709553644
##$DBL= (0..7)
120 120 120 120 120 120 120 120 
##$DBP= (0..7)
150 150 150 150 150 150 150 150 
##$DBP07= 0
##$DBPNAM0= <>
##$DBPNAM1= <>
##$DBPNAM2= <>
##$DBPNAM3= <>
##$DBPNAM4= <>
##$DBPNAM5= <>
##$DBPNAM6= <>
##$DBPNAM7= <>
##$DBPOAL= (0..7)
0.5 0.5 0.5 0.5 0.5 0.5 0.5 0.5 
##$DBPOFFS= (0..7)
0 0 0 0 0 0 0 0 
##$DE= 6
##$DECBNUC= <off>
##$DECIM= 32
##$DECNUC= <off>
##$DECSTAT= 4
##$DIGMOD= 1
##$DIGTYP= 9
##$DL= (0..7)
0 120 120 120 120 120 120 120 
##$DP= (0..7)
150 150 150 150 150 150 150 150 
##$DP07= 0
##$DPNAME0= <>
##$DPNAME1= <>
##$DPNAME2= <>
##$DPNAME3= <>
##$DPNAME4= <>
##$DPNAME5= <>
##$DPNAME6= <>
##$DPNAME7= <>
##$DPOAL= (0..7)
0.5 0.5 0.5 0.5 0.5 0.5 0.5 0.5 
##$DPOFFS= (0..7)
0 0 0 0 0 0 0 0 
##$DQDMODE= 0
##$DR= 18
##$DS= 0
##$DSLIST= <SSSSSSSSSSSSSSS>
$$ [...]
##$SUBNAM2= <"">
##$SUBNAM3= <"">
##$SUBNAM4= <"">
##$SUBNAM5= <"">
##$SUBNAM6= <"">
##$SUBNAM7= <"">
##$SUBNAM8= <"">
##$SUBNAM9= <"">
##$SW= 18.0517328524113
##$SWIBOX= (0..15)
0 0 2 0 0 0 0 0 0 0 0 0 0 0 0 0 
##$SW_h= 3612.71676300578
##$TD= 16384
##$TD0= 1
##$TE= 0
##$TE2= 300
##$TE3= 300
##$TEG= 300
##$TL= (0..7)
0 120 120 120 120 120 120 120 
##$TP= (0..7)
150 150 150 150 150 150 150 150 
##$TP07= 0
##$TPNAME0= <>
##$TPNAME1= <>
##$TPNAME2= <>
##$TPNAME3= <>
##$TPNAME4= <>
##$TPNAME5= <>
##$TPNAME6= <>
##$TPNAME7= <>
##$TPOAL= (0..7)
0.5 0.5 0.5 0.5 0.5 0.5 0.5 0.5 
##$TPOFFS= (0..7)
0 0 0 0 0 0 0 0 
##$TUNHIN= 0
##$TUNHOUT= 0
##$TUNXOUT= 0
##$USERA1= <user>
##$USERA2= <user>
##$USERA3= <user>
##$USERA4= <user>
##$USERA5= <user>
##$V9= 5
##$VALIST= <valist>
##$VCLIST= <CCCCCCCCCCCCCCC>
##$VD= 0
##$VDLIST= <DDDDDDDDDDDDDDD>
##$VPLIST= <PPPPPPPPPPPPPPP>
##$VTLIST= <TTTTTTTTTTTTTTT>
##$WBST= 1024
##$WBSW= 4
##$XGAIN= (0..3)
0 0 0 0 
##$XL= 0
##$YL= 0
##$YMAX_a= 180631
##$YMIN_a= -189826
##$ZGOPTNS= <>
##$ZL1= 120
##$ZL2= 120
##$ZL3= 120
##$ZL4= 120
##$ABSF1= 10
##$ABSF2= 0
##$ABSG= 5
##$ABSL= 3
##$ALPHA= 0
##$AQORDER= 0
##$ASSFAC= 0
##$ASSFACI= 0
##$ASSFACX= 0
##$ASSWID= 0
##$AUNMP= <proc_1d>
##$AZFE= 0.1
##$AZFW= 0.1
##$BCFW= 1
##$BC_mod= 2
##$BYTORDP= 1
##$COROFFS= 0
##$CY= 11.3945322036743
##$DATMOD= 1
##$DC= 2
##$DFILT= <>
##$DTYPP= 0
##$F1P= 15.7292609196834
##$F2P= 12.9074282941183
##$FCOR= 0.5
##$FTSIZE= 0
##$FT_mod= 4
##$GAMMA= 1
##$GB= 0.15
##$INTBC= 1
##$INTSCL= 1
##$ISEN= 128
##$LB= 0.24
##$LEV0= 0
##$LPBIN= 0
##$MAXI= 10000
##$MC2= 0
##$MEAN= 0
##$ME_mod= 0
##$MI= 1.114404
##$NCOEF= 0
##$NC_proc= 0
##$NLEV= 6
##$NOISF1= 3.799351
##$NOISF2= 2.8
##$NSP= 1
##$NTH_PI= 0
##$NZP= 0
##$OFFSET= 15.70392
##$PC= 1
##$PHC0= -24943.89
##$PHC1= 17.45264
##$PH_mod= 1
##$PKNL= yes
##$PPARMOD= 0
##$PSCAL= 0
##$PSIGN= 0
##$REVERSE= no
##$SF= 200.130013532006
##$SI= 16384
##$SIGF1= 3
##$SIGF2= 2
##$SINO= 400
##$SIOLD= 16384
##$SREGLST= <1H.CDCl3>
##$SSB= 0
##$STSI= 0
##$STSR= 0
##$SW_p= 3612.71676300578
##$SYMM= 0
##$S_DEV= 0
##$TDeff= 0
##$TDoff= 0
##$TI= <>
##$TILT= no
##$TM1= 0
##$TM2= 0
##$TOPLEV= 0
##$USERP1= <user>
##$USERP2= <user>
##$USERP3= <user>
##$USERP4= <user>
##$USERP5= <user>
##$WDW= 1
##$XDIM= 8192
##$YMAX_p= 0
##$YMIN_p= 0
$$ End of Bruker specific parameters
$$ ---------------------------------
##NTUPLES= NMR FID
##VAR_NAME=  TIME,          FID/REAL,        FID/IMAG
##SYMBOL=    X,             R,               I
##VAR_TYPE=  INDEPENDENT,   DEPENDENT,       DEPENDENT
##VAR_FORM=  AFFN,          ASDF,            ASDF
##VAR_DIM=   8192,          8192,            8192
##UNITS=     SECONDS,       ARBITRARY UNITS, ARBITRARY UNITS
##FACTOR=    0.0002768,     1,               1
##FIRST=     0,             0,               0
##LAST=      2.2672688,     0,               0
##MIN=       0,             -189826,         0
##MAX=       2.2672688,     180631,          0
$$ Real data points
##PAGE= N=1
##DATA TABLE= (X++(R..R)), XYDATA
0@%%%%%%%%%%%%%%%%%%%%%%%%%%%%%%%%%%JpJ4j9K3k9M0n3O5p4Q1q9R9j07J13
$$ 0 0 0 0 0 0 0 0 0 0 0 0 0 0 0 0 0 0 0 0 0 0 0 0 0 0 0 0 0 0 0 0 0 0 0 1 -6 8 -11 12 -17 23 -30 35 -39 42 -47 52 -55 58
49E8j20J30j43J59j75J94k19K41k68L03l37L77m23M88n72O75q25J058j440K179
$$ 58 -62 68 -75 84 -91 103 -116 125 -143 160 -177 200 -223 265 -307 368 -457 601 -839 1340
69A340O886n087J5883m6504N048R7039N005j27674j2008J35124J3789j39802l4864
$$ 1340 8226 3139 19022 -27482 -22434 74605 79610 -48064 -60072 75052 88841 -50961 -85825
82h5825J09852L8493r2550n4811O7438O9991m6221q4020L1771J07238j04j04285
$$ -85825 24027 62520 -30030 -84841 -17403 52588 6367 -77653 -45882 61356 61252 -43033
94d3033j7634J13383M3932j09544o0500J03143P0827r7948q5717P3590Q0023o0900
$$ -43033 -60667 52716 96648 -12896 -73396 29747 100574 2626 -83091 -9501 70522 9622
106I622q8657K8230Q9109J937r0719k6911R8402N5415r2336o6084R9682Q3100
$$ 9622 -79035 -50805 38304 40241 -50478 -77389 21013 76428 -15908 -81992 17690 100790
118A00790q4810q4701O9363Q5050n2504r1186K2818Q7451m763r6172k5492R0011
$$ 100790 15980 -68721 642 85692 33188 -57998 -35180 52271 47508 -48664 -74156 15855
130A5855M3195q7030o1430Q0820Q0319n9897q4260M9941R6786k6190r4458J1351
$$ 15855 59050 -27980 -89410 -8590 71729 11832 -72428 -22487 74299 48109 -46349 -34998
142c4998R1340Q018q5687k9694O8439M3073o1699o6352M2597P3771l3290q2468
$$ -34998 56342 64360 -21327 -51021 17418 60491 -1208 -67560 -24963 48808 15518 -66950
154f6950K0992Q6625o378p8726O93P7044J7892o0168k8364N1500M4188l8618n8201
$$ -66950 -45958 40667 34289 -44437 -43744 33300 51192 -8976 -37340 14160 58348 19730 -38471
167c8471K3966O4855j9043p5969L344O9815L463p1130j5041O2956K8015n1474
$$ -38471 -14505 50350 31307 -44662 -41318 28497 31960 -39170 -54211 8745 36760 -14714
179a4714l5768M5563N1667k7924n3719J9795O3371m824o5466q811O1953J8459
$$ -14714 -50482 -4919 46748 18824 -34895 -15100 48271 43447 -22019 -30830 31123 49582
191D9582o5170l3248N5046L4931m9457m6695L7326M8860k3001n0771J2188N7630
$$ 49582 -15588 -48836 6210 41141 -8316 -55011 -17685 31175 8174 -42597 -30409 27221
203B7221P120n4598j3704N8884K7724n4862l4701N0648L8777m4971m7265L0579
$$ 27221 34341 -20257 -33961 24923 52647 -2215 -36916 13732 52509 7538 -39727 -9148
215i148M4573k4285m9754P398M8536L130m9410j2794N1385K6937m5907k9738M4804
$$ -9148 35425 11140 -38614 -31216 17320 20450 -28960 -41754 9631 36568 -9339 -39077 5727
228E727M1905l4861m3473K8351M5682j9479m8839P119M2556j236m4387j4757L7500
$$ 5727 47632 12771 -30702 -2351 43331 23852 -24987 -17868 24688 23452 -20935 -35692 1808
241A808K3398l6006l2642L2137M1357k3256m2169K1736M6976r132m1925L795M0301
$$ 1808 25206 -10800 -43442 -11305 30052 6796 -35373 -13637 33339 24207 -17718 -13923 26378
254B6378O925l7025j7479K8260K2262k7805l3605J8685L4745j4997m0493P907
$$ 26378 33303 -3722 -21201 7059 29321 1516 -32089 -13404 21341 6344 -34149 -26242
266b6242M3512j610l8787j290L8323J3981l0654j6277K6993K5006j9955l1451
$$ -26242 17270 15660 -23127 -24417 13906 27887 -2767 -19044 7949 32955 13000 -18451
278a8451J2170L4923q701m2797j588M0246L251m1792j1636L8036J6479l1249k0152
$$ -18451 -6281 28642 19941 -22856 -24444 15802 19053 -22739 -34375 3661 20140 -11109 -31261
291c1261K7797K9873j7932k9382J2082L7551k044l8813m479L8458R266l9851j8722
$$ -31261 -3464 26409 8477 -20905 -8823 28728 26684 -12129 -16608 21850 31116 -8735 -27457
304b7457L3330J9351l3071k5832K4891K7085j8489k9566J2958L4348o92l2694
$$ -27457 5873 25224 -7847 -33679 -8788 18297 -192 -29758 -16800 17548 16856 -15838
316a5838l746L7766J2911l3236j7895L1855K1338k9669k7353K2151K6615j9266
$$ -15838 -19584 18182 31093 -2143 -20038 11817 33155 3486 -23867 -1716 24899 5633
328E633l1790Q155K9950k047l0214o372K9844J6297k5403j7933K6686K5818j9700
$$ 5633 -26157 -18002 11948 9901 -20313 -26685 3159 19456 -5947 -23880 2806 28624 8924
341H924k5930J7096K6280r752k9671L458K5394Q53k7497j1346K1617J4602k0016
$$ 8924 -17006 90 26370 16618 -13053 -9595 15799 16652 -10845 -22191 -574 14028 -5988
354e988k1815J7166K6355j0534k6733R421L0426r71k7041P3K5671O580k1762j4173
$$ -5988 -27803 -10637 15718 5184 -21549 -12128 18298 17327 -9714 -9641 16030 22610 848 -13325
368a3325J8265J6583j6437k4996Q436K6049p765k9312k74L1081M204k7765n411
$$ -13325 4940 21523 5086 -19910 -11474 14575 6810 -22502 -22776 8305 12509 -15256 -20667
381b0667K6615J3820j9517j3964J6478K1610j0959k4626O637K3912k711k8867
$$ -20667 5948 19768 251 -13713 2765 24375 13416 -11210 -4573 19339 16628 -12239
393a2239n192K5931N981k7694j1436K4066J3642k0663j4331J7062K0977j0503
$$ -12239 -17431 8500 14481 -13213 -24649 -583 13059 -7604 -21935 -4873 16104 5601
405E601j9139P753K4373m50k3919m328K5806O555k6017j2981K1345J1547k0973
$$ 5601 -13538 -5785 18588 18138 -5781 -10109 15697 22252 -3765 -16746 4599 16146 -4827
418d827j7623J5345J6874j0991j8241P242K0438Q45j8579j788J9887J0942j7445
$$ -4827 -22450 -7105 9769 -1222 -19463 -12221 8217 9062 -9517 -11305 8582 19524 2079
431B079j2393J7293J3507j5299j6240J0683J3887j0303j7023L271J3930Q42j6413
$$ 2079 -10314 6979 20486 5187 -11053 -370 13517 3214 -13809 -10538 3392 4234 -12179
444a2179l362J4564R561j2684r478J2768J6427p982j6009Q794J7184n587j7422
$$ -12179 -15541 -977 8584 -4100 -13578 -810 15617 7635 -8374 420 17604 12017 -5405
457e405Q81J3835J340j6660p960J2266R452j1520j4474P960J8880m702j7834L450
$$ -5405 -4524 9311 10651 -6009 -13969 -1703 7749 -3771 -18245 -10285 8595 3893 -13941 -10491
471a0491K0644K003j6262k117J6651O134j4464q757J0621J1297j0846j6879N177
$$ -10491 10153 12156 -4106 -6223 10428 16562 2098 -6659 3962 15259 4413 -12466 -7289
484g289J5662m149j9318j66J9103L108j7259l324J8026P041j3137p319J3386J1872
$$ -7289 8373 4224 -15094 -15260 3843 6951 -10308 -13632 4394 11435 -1702 -9021 4365 16237
498A6237q647j3288N236J5142l476j9448j376J6967K051j9941n127J6041O274
$$ 16237 7590 -5698 -462 14680 11204 -8244 -9620 7347 9398 -10543 -15670 371 6645
511F645j4658o967J3126J1541q995j1067R040J4294k040j3707rJ3811L233j5480
$$ 6645 -8013 -14980 -1854 9687 692 -10375 -1335 12959 10919 -2788 -2797 11014 14247 -1233
525a233o859J2244N755j4413q151R076Q614q564r346N223J2258j172j0451O72
$$ -1233 -8092 4152 9907 -4506 -12657 -3581 5033 -3531 -12877 -7654 4604 3432 -7019 -6347
539f347J2987N427j1233n657J0444R611j0651j0634O815R684p063j3050J916Q942
$$ -6347 6640 12067 834 -4823 5621 15232 4581 -6053 762 10446 3383 -9667 -7751 1191
553A191Q50j0269l679R586Q054p773q732Q682J2744m238j2372M767J4146k347
$$ 1191 2041 -8228 -11907 -2321 5733 -2040 -10772 -2090 10654 6416 -5956 -1189 12957 10610
567A0610j2117k175J0590K185j0816p923O542Q117p384j0774M248J2875k032j2458
$$ 10610 -1507 -3682 6908 9093 -1723 -9646 -3104 5013 -2371 -13145 -8897 3978 1946 -10512
581a0512K086J4738L166j3303j066J3190N083j1290o449Q787O804p701j0356K086
$$ -10512 -8426 6312 9478 -3825 -4891 8299 13382 2092 -4357 4430 11234 3533 -6823 -4737
595d737J0503l744j3075K60J2563J527j2172j462J2958M119r081l814R065P389
$$ -4737 5766 2022 -11053 -10793 1770 3297 -8875 -10337 2621 6740 -2341 -6155 2910 10299
609A0299n159p116L944Q081k743j1333O17P833N00j1266l593Q685L344p554m470
$$ 10299 5140 -1976 1968 10049 7306 -4027 -3410 4423 4923 -6343 -9936 -1251 2093 -5461 -9931
624i931Q152N261l768m570M841P131o65o420P39O686M80p367l661O012L190q754
$$ -9931 -1779 3482 -286 -4856 -15 7116 6451 31 770 7456 7936 569 -3092 2920 6110 -2644
640b644m798M780M337n289o566M785O195n79m750L1P864M243o450l990P228O288
$$ -2644 -7442 -2662 1675 -3614 -10180 -5395 800 221 -4529 -4498 3366 7609 1159 -2831 4397 10685
656A0685o432p528M961O143n367q093P95O353m09q096j474N968M801n994m547
$$ 10685 4253 -3275 1686 7829 2462 -5631 -4836 1517 1108 -6988 -8462 -2494 2307 -3687 -8234
671h234P542P177l166q018N553R154j848j0275P00R363j143r367l363P203K449
$$ -8234 -692 6485 3319 -4699 854 10008 8160 -2115 -1415 7948 6805 -2562 -5925 1278 3727
686C727p129p472O178P936m083q773L765J2171j148j0309K423J0513J408q699
$$ 3727 -3402 -10874 -4696 3240 -843 -9616 -5851 6320 5172 -5137 -2714 7799 9207 508
700E08l552Q164L751p109o865L392O690m181q436O65Q519r48q118l59R089K523
$$ 508 -3044 5120 8871 1762 -5103 -1711 4979 798 -7638 -6973 1546 598 -7520 -7879 1210 3733
716C733o218k115P289N467m914l553J833O137k525o828k20N518j48p595k804N981
$$ 3733 -2485 -4600 2689 8156 3242 -311 1522 7659 5134 -1694 -1914 3604 3456 -4139 -6943 -962
732i62K574o266l359N352M480k604l356K933O374n07n216m41N650M290o902m784
$$ -962 1612 -4654 -8013 -2661 1819 -785 -4141 -1208 5166 4659 -557 -998 4652 8942 2040 -2744
748b744M697M083o239n525K244N407l245m560o55N963J941m752k364O208M385
$$ -2744 1953 6036 -203 -5728 -3484 1923 -1322 -5882 -6537 -574 1367 -3385 -5749 459 4844
763D844j548m988L880N714l066o180J807N241k051p461M13M496j79n351l090N127
$$ 4844 3296 -1692 2188 7902 4836 -1344 463 5704 3653 -3808 -3395 1101 922 -4429 -7519 -2392
779b392L574l799m046M385O784k347n313L744P264k291o833M85O298l55n788k390
$$ -2392 1182 -2617 -6663 -2278 4506 2159 -3154 590 7854 5563 -1270 -785 5513 5158 -630 -3020
795c020L197K821n132l702J588M737j518n177J830O128K16m205J681M547P51l637
$$ -3020 177 2998 -2134 -5836 -4248 489 -1029 -6206 -4376 1752 1968 -2237 -556 3991 4742 1105
811A105n40L601O16l380k612J714Q87j844l888K68L594p59k989q9L663J054k559
$$ 1105 565 4166 4782 1402 -1210 504 1391 -453 -4341 -4073 -479 -1238 -4227 -4316 -653 401 -2158
828b158J67K795K945j677j319J758J308n56k382r15K206J58l937j865J982J909
$$ -2158 -1991 804 3749 2072 753 2511 3819 3263 881 -34 2172 2330 -1607 -3472 -1490 419
844D19l516l196L173K759o28k006J549L649P63j624j058L260J556k730k413K386
$$ 419 -3097 -6293 -3120 -361 -989 -2995 -1446 2203 2966 1342 284 3544 5100 2370 -43 2343
860B343K131m090l892K219K760l197l535Q19M877o50l571m13M983K939l917k096
$$ 2343 4474 384 -3508 -1289 1471 -1726 -5261 -4442 435 -215 -3786 -4199 784 3723 -194 -2290
876b290N622K661l107l765K886M665m671n361J475M308j966n102pL606J697l615
$$ -2290 3332 5993 2886 -879 2007 6672 2001 -3360 -1885 2423 457 -4645 -4652 -1046 651 -2964
892b964k424M340M104k921l392M315M715j760m303J352M114j308m620j426L650
$$ -2964 -5388 -1048 3056 135 -3257 1058 5773 4013 -290 1062 5176 3868 -752 -2178 1472
907A472L64l907k190J591K067j490k758J700M488P8k805L76L331J071k022n36
$$ 1472 1836 -2071 -4261 -2670 -603 -2093 -4851 -3151 1337 1415 -1390 -1014 2317 3388 1366 830
923H30K483P65j222l024N75J049j019k871j270K398O30k844j400L063K250j231
$$ 830 3313 4078 2856 -168 407 1456 437 -2434 -3704 -1306 -676 -3520 -4920 -1857 393 -838
939h38j363K000K751R28k391l64L094L74k995j489J761J614k642l590R73K596
$$ -838 -2201 -201 2550 3478 1087 723 3817 4191 1196 -293 1468 3082 440 -3150 -2177 419
955D19k128k661R61L202k19j593Q9K870J146p67p95K227J904k047k365J804Q57
$$ 419 -1709 -4370 -3409 -207 -426 -2019 -1930 940 2086 1319 524 2751 4655 2608 243 2047 2904
972B904k245k684R80J577j628l123J786J744j00k602R81K588N72q22m29K920K241
$$ 2904 659 -2025 -1045 532 -1096 -4219 -2433 -689 -789 -3391 -2410 178 750 -72 -501 2419 4660
989D660k908o64J164J230j277l434L85J429k99k556m54P67K61r22j54J660J222
$$ 4660 1752 1088 2252 3482 2205 -1229 -844 585 286 -2270 -2724 -1957 -1696 -2618 -2772 -1112 110
1006A10m80j37K114J152j008j010J424J348j704o62j058J166l11k102j133Q92
$$ 110 -370 -507 1607 2759 1751 741 2165 3513 1809 1147 89 1255 944 -1158 -2291 -1399
1022a399J54o35r48J274J180j2r82J496J191J076r21j64Q28P84k57o30j377MM25
$$ -1399 -1245 -1880 -2828 -1554 -374 -386 -1368 128 1319 2395 1474 1310 2138 2922 2665 2035 658 662 1087
1041A087k313o87M4P50j831q50J357K115j387q6J665J617m07o01J589O16l86q75
$$ 1087 -1226 -1913 -1869 -1119 -2950 -3800 -2443 -328 -1715 -1801 -136 1481 1074 473 2062 2678 2292 1417
1059A417m38R22L95k270j881J629r6k565o42K679Q41j725j001J962K670r04k050
$$ 1417 979 1901 2296 26 -1855 -226 -322 -2887 -3529 -850 -9 -1734 -2735 -773 1897 993 -1057
1076a057J492L046o98k050k91K175L43l459j249J496J214k716j472K006O81j174
$$ -1057 435 3481 2783 733 442 2617 2960 -499 -1748 -252 962 -1754 -3226 -1220 -539 -1713
1092a713j245J072K339n5j333R34J933J318j441r94J320J593k806j151J358j14
$$ -1713 -2958 -1886 453 398 -935 -1 1932 3250 1809 815 2135 3728 922 -229 1129 1015
1108A015j607k194J614L31j76j844R29K00J834k22l73O25J332J365j672K34J255
$$ 1015 -592 -2786 -1172 -841 -1017 -2861 -1932 -1732 102 -120 -493 132 1464 2829 1157 1391 2646
1125B646j77j098n43R0m6j467j370o12J366l19l79r83J853J44l51j22J393J817
$$ 2646 2469 1371 828 918 872 -595 -1965 -2577 -1211 -1530 -1909 -2892 -1039 -895 -1246 -1368 25 1842
1143A842p16r49J742K25M85j330o72K47M71j602j139J141l14j547l75O21J227
$$ 1842 1126 177 1919 2144 2629 1299 627 874 1345 -257 -1396 -255 -569 -2116 -2491 -1870 -643
1160f43j070q19K177J569p93k92J167J046n45o03j84O29q1j131j293J171n89j379
$$ -643 -1713 -2532 -355 1214 421 129 1296 2342 1797 1194 1010 1639 1558 427 -866 305 -284 -1663
1178a663l65K09J115j519L29J462J028o53p7J458M92K6m52O01K70j071q21l02
$$ -1663 -2028 -1819 -704 -2223 -1894 -432 596 -57 -134 1324 1816 1842 1390 1991 2261 1190 369 67
1196F7J303j346j250p63J393o91j371J26J293L23L49r21J535J248p45J91Q8J447
$$ 67 1370 24 -1226 -1989 -596 -1287 -2658 -2532 -1239 -916 -567 -1488 47 1295 550 741 829 2276
1214B276J00j401j074J048j29j062l90k65j16m78j52o99J013R40n60o5P45J597
$$ 2276 2376 975 -99 949 820 -242 -632 -897 -1013 -1491 -1643 -2342 -1329 -389 -949 -1014 -269 1328
1232A328j81l39O78J36J262j549j13n52J48r72j407K03j44K78j344Q63P58P0n36
$$ 1328 1147 808 1486 1622 2884 1335 1222 670 818 -154 -1561 -1358 -1502 -1224 -2568 -1705 -947 -877 -1413
1251a413J98K042K18n19qJ570j67o07j264J385L32j52j552j593J391J67k012q63
$$ -1413 -1215 827 1045 526 518 2088 1921 1314 50 1435 1767 1615 63 -1530 -139 28 -1984 -2847
1269b847J897L33j415K63J444P45r34Q24J271l34J105j095J91M86o59j559L06
$$ -2847 -950 -617 -2032 -1769 -325 420 -514 310 1581 1247 2352 1257 1448 1934 1275 -284 22
1286B2K10k1j566l14N88o73l12N11J550m29j023J415J44L72K92Q95j33l61O55
$$ 22 232 211 -1355 -1669 -1081 -1754 -2066 -1555 -5 -434 -1457 -42 102 474 766 1661 1528 1167 1822
1305A822n28j400R08p78r08L75p69j12J43j85K14k21j5J592j45m82J490L41L7
$$ 1822 1294 -106 802 24 -884 -509 -1278 -1390 -1247 -1432 -1218 -1439 -1454 138 -7 -489 1001 1342 1379
1324A379p13O38R9n66l10l61N73j138l71n93j5N69o43p77K166j56m81l50J828
$$ 1379 666 1304 1403 837 527 166 739 -399 -770 -1363 -1378 -809 -1452 -2229 -63 -219 -700 -1050 778
1343G78R54p45k4J328o40o53R2j35O10p15j594O74R5l71j234l56J051P87j041
$$ 778 1732 987 963 2291 1651 998 1090 955 1565 850 -744 -70 25 -346 -1580 -1936 -885 -98 -1139
1362a139j04J022J090q72M36j22N82O76m20q1L20q43k96N11j138j44j241M11O93
$$ -1139 -1243 -221 869 -3 433 311 893 1569 1149 1068 1388 545 249 760 -378 -522 -1763 -1352 -659
1381f59n90q5O44O93n50o82J659J123o94K90J15J56k88j3m87o57k55j158Q28n78
$$ -659 -1249 -1334 -690 3 -547 -1229 430 1553 859 1149 1264 1420 1132 1119 632 -25 -280 -1438 -610 -1188
1401a188P07q57j96O38P21q13j70P52O32M65N7O66m36Q09q55L51nk39j217m58
$$ -1188 -481 -1338 -1534 -896 -175 -988 -1158 -406 226 691 748 1414 978 1787 932 1283 1278 1039 -178 -636
1421f36M82k75n93m95j80K10m82J477j24j46P46O98N35r01J136Q52p31l68n77
$$ -636 -154 -429 -1022 -1517 -1697 -1487 -1969 -492 -616 -762 -16 682 1217 316 1452 2304 1573 1205 628
1440F28N02n02p33l04m51m75L73L05m55J271j507n65J294R72j6k50K95P91O95
$$ 628 1130 628 -105 -409 -860 -1335 -962 -657 -1112 159 -1348 -1913 -619 353 337 87 382 1173 1868
1459A868p21o35J363q67p09j123J293q14m95m72L1O42N21j930J204Q79R16j146
$$ 1868 1147 512 1875 1008 299 -824 469 -345 -840 -1312 -1281 -639 -118 -2048 -844 35 951 -195
1477a95O9J617M9j020R82M8r88J69m66m9n93L44m09j030P31q6K82k95l14Q52K30
$$ -195 -126 1491 1540 520 1502 1550 562 731 265 216 -377 -33 -442 -1472 -741 -827 -545 -840 -1154 -302 -72
1498g2k4J027J2o1R07o21j353R62K81r99l52m9J8j2k88o10N17q16m98J70J419
$$ -72 -96 931 943 882 1789 1168 -185 777 1058 59 -293 -342 -324 -336 -624 -1234 -717 -1533 -2031 -1861 -442
1519d42O04q6o61M61J315M01j159L86N47m78l19o82L73k26q48p83J120n26l33
$$ -442 162 76 -585 -124 1191 1592 433 819 1366 888 569 -113 260 34 -814 -1597 -477 -1003 -1336
1538a336R57p00M47n47P78P87l5Q4Q29j57K32l72o12K51j31o74L68m07l43J64
$$ -1336 -379 -1079 -632 -1179 -401 386 351 435 1264 1107 1339 967 355 606 475 -199 169 -238 -581 -417
1558d17j12n84N7O84O4p25J293m31J72J054k4O4j201J820o16l71K90p97L18m19
$$ -417 -529 -1113 -1056 -372 -308 -1033 260 -171 1 1055 1031 1095 -106 1714 1098 727 1017 220 538 119
1578A19q80o93K13K86l72k21J227J47n27J65J331k27P2K68M51j19k90n93N97m36
$$ 119 -761 -1454 -1241 -955 -1327 -1548 -321 -174 -701 -536 795 568 640 908 1359 1240 950 357 954 518
1598E18k20m59j24o28j48q52J060L83j043N0J073O42j40M94K69J036m05m54J115
$$ 518 298 -161 -285 -913 -1061 -1913 -853 -470 -1513 -1463 -390 252 112 606 875 1911 1506 1052 2167
1617B167j550K65k62o58K99l30p38L10q56N6M27m85O02K52P7J714r72M65m86L07
$$ 2167 617 882 620 -38 261 -69 -807 -497 -1353 -1297 -870 -1355 -753 -501 -424 1290 318 783 297 604
1637F04J299j262l32m55J563j284n84L83J50j249l85P52l1k19J92O35k55J031
$$ 604 1903 641 309 -146 1417 133 -451 -68 82 -1167 -1552 -800 -831 -1050 -858 -223 -478 553
1655E53O8m99M74M74l91K50J439j638J50q47j01L46n07j318O97O40r67n0Q57n62
$$ 553 621 122 596 1070 679 929 2368 730 880 33 -68 278 -229 -1547 -850 -210 -1177 -1227 -370 -932
1675i32Q38O97j281J659O90j183N20L54m88P3n03l82j4k95j88J31q80O53k55J38
$$ -932 -94 603 -678 981 1671 488 1008 1362 874 947 444 62 48 -247 -435 -304 -1184 -531 -786 -648
1695f48j019J293q18P26M88L37n92K000p48k50Q2q0N21j248p00J327n43j485n45
$$ -648 -1667 -374 -1192 -466 22 359 -233 1767 1019 769 851 771 1292 44 -656 671 128 -1357 -1902
1714a902R52P31m77n42l8L52N46J04M4O27k53M63O00K13q91M72m56m91M06k41
$$ -1902 -950 -219 -696 -1238 -1276 -924 -378 -274 -230 397 144 607 1207 1420 529 1001 545 54 460 219
1734B19j090K56j86o28N50l95Q10l88Q18M7j20P02K31n4m17O99M57o87n00m81
$$ 219 -871 -615 -801 -1429 -879 -1274 -464 -852 -34 13 -107 595 826 772 355 1054 1511 824 324 -157
1754a57J94l93k03j18j79N86j50o32J07O00K25pn06P66R02j7n63J229j211K97
$$ -157 37 -356 -559 -677 -856 -270 -420 -1052 -945 -345 -120 -127 -633 133 1035 1018 455 1684 473 770
1774G70k42j3K11r85J50j74n69K53n24P67J36q81M74M89N61J24k69m29J516o3
$$ 770 528 515 726 -259 -109 -283 -852 -599 -1123 -356 -220 -1101 -627 -138 423 547 278 -151 1365 1302
1794A302r48K28m31J21q3O7N05j053k82J33j5j34Oo12O34J64K06L72K62MN92k60
$$ 1302 354 582 151 272 189 256 761 -292 -574 -441 -456 -590 -584 -1196 -562 -398 -192 180 442 446 1038 778
1816G78k24N41p57j99L73O30j608k51M4N35q06M5o0J06J121n46k97R94L15m71
$$ 778 554 1095 338 139 512 1142 -466 -717 -673 -138 -944 -899 -959 -853 268 -278 -575 419 734 263
1836B63K60l23L38l44J339r39k40j097L66M87K4j154j17O60n92K32M01ML89j08
$$ 263 523 200 538 194 1533 594 354 -743 -377 110 134 -1020 -1137 -477 -1069 -837 -436 -432 -43 -151
1856a51p61N92Q67L56N5k78j89N58m15l10o02j85K55l47J67l74n7L55J38j3M89
$$ -151 -912 -320 547 903 958 680 491 1049 634 324 -278 -463 -208 -555 -388 -762 -819 -464 -326 -339 150
1877A50n18O94k98J631r81j81M08k82l84k71P12l43m45K97j447R00m86%J49j22
$$ 150 -368 326 28 1659 678 497 905 623 239 -32 680 337 -108 189 -1258 -358 -844 -844 -695 -817
1897h17j7J012j71l46K91p3R08q24N29L24q2p53L79k26M30n64r29M71J62M10j702
$$ -817 -834 178 7 -339 -48 -121 787 -37 492 816 734 -19 360 134 564 0 -929 -458 -296 114 -1588
1918a588N44R16q5J7J15N95n56N50j215J257K21Mq10Q16j34q18j17j37O99q61
$$ -1588 -1044 -128 -213 -196 -81 514 -42 508 -707 550 771 775 -35 781 647 -171 -288 -425 274 -587
1938e87N33k42R5q41O11Q1M26P07l67O34j89k60J62M02j068l59Q24K4o62J35l40
$$ -587 -54 -296 -201 -1042 -431 -350 76 783 416 1050 861 601 763 1165 97 -262 562 586 -76 59 -281
1959b81o57l3L83k91j68Q13j74l2KQ95K78M44o41K50j87K85l30M3k95o40J57o08
$$ -281 -938 -971 -588 -879 -1047 -234 -408 -440 -438 457 735 1179 538 788 601 886 556 599 304 -336 -179 -787
1981g87P3P2j98P62q10L93j71O03J66q8P96m57k28J185k08n53l64L94r1K11j117
$$ -787 -714 -642 -840 -78 -888 -495 -666 -63 103 15 811 354 126 1311 1103 550 186 580 489 700 -417
2002d17k95j84P4L10k78M14p33O2Q59K16k9R78j405J597p87O3J55m38n36J032
$$ -417 -712 -896 -822 -512 -790 -376 -1109 -1047 -188 28 -1 977 -428 1169 382 445 600 162 -374 658
2022F58o70J86j015J48N27n14k61L99P42j85j053J082M10L93j092L69N72N84o95
$$ 658 -12 174 -841 -693 -166 -680 -941 -542 200 15 -1038 44 454 847 -245 124 696 1280 585
2041E85L13M70j225J39r80J118n91Mn55l24P16l35P52R7m18L01jk28O49K66j07
$$ 585 898 1368 143 282 -698 420 -171 -167 -722 -1046 -330 -665 87 184 -234 67 66 -162 487 753 646
2062F46K57l08m19O41o88j34k29n21J043q39l47k99M55N18M40n82j00O50j080
$$ 646 903 595 176 817 129 -5 -234 -755 288 -551 -898 -1197 -742 -224 216 -366 -466 184 -896
2081h96J317L61o55M75j67K32p67R17r30M69L84o07j79k37l16j046J168N41n81
$$ -896 421 782 127 602 435 667 -100 817 -113 356 740 133 -46 -283 -599 -1645 -477 64 -517
2100e17L48K45N7J78j10N80j12k65K53o58K06q4n71N6J10R5J42o41J88R92q05
$$ -517 -169 76 133 311 201 781 669 404 657 -1 205 121 -450 -394 -284 -189 -47 -688 -500 492 -313
2121c13l0j2K13j69R6J72K47K51p3j28P11j139N92k57m58Q5j52O60r03K35k07
$$ -313 -343 -355 -142 -311 -215 -43 204 455 382 254 965 -174 418 161 -297 -212 -364 296 -607 -372 -579
2142e79m16K05N79j26J95k10L06N67j87M32m25L95p07L25K26m18l24K15J40o30
$$ -579 -995 -790 -211 -337 -142 -352 -46 521 334 766 341 736 29 354 580 162 -162 53 193 -437
2162d37o97Q82k4j8l02K81Q31p39J01P44L24m09o0j48L17K93o59J68L07r98j03
$$ -437 -1134 -252 -276 -294 -596 -315 516 -223 -122 622 946 537 477 329 646 939 280 448 755 -243 -346
2183c46j22n3o07O36l66R42n04nL48L29K71k55J52Q9L78k39r79P59O6p94k82Q80
$$ -346 -468 -521 -1128 -492 -858 84 -420 -425 -77 252 523 268 420 509 887 648 -331 428 494 -300 -582 298
2205B98q45m64O92j28N85m86N19K13K00k54k46Q0N93L58K18q08o04j52L90n22
$$ 298 -547 -1011 -319 -447 138 -348 171 384 584 330 84 164 757 1115 1333 525 -79 -231 159 -363
2225c63j90L41J35o28K64q1N15O79r19m07J094q1j33L23l51R98q78n63K95N88
$$ -363 -553 -212 -77 -705 -441 -522 -7 672 -247 -654 440 359 226 549 198 1196 318 -245 50 638
2245F38p28j9J01k47J88j38n08k17Q39m76M29L41k18K45J45o77Q14j9r21n2K49
$$ 638 -90 -109 -8 -255 -67 -205 -713 -930 -91 -567 -138 203 -15 230 375 -302 512 493 -428 -480 -231
2266b31J000l54q10R0K32k22j85n79O62N97j64m27N97k83K42o38J096K49l40r88
$$ -231 769 415 -395 -305 -73 -295 -480 -1059 -397 200 36 -391 206 -77 165 -473 623 872 532 -456
2286d56O71J29j82k77O04l3r65k95O87k09k16j54kM42P38k22k97n16P88N85p66
$$ -456 215 344 162 -115 489 456 -509 -804 -117 -326 -542 -696 -698 -256 482 260 -37 -553 235 820 54
2307E4M40OK10q2j40r53K96o83k49K4j85N61k6K64p00M95Q67k47M63p78M2O56
$$ 54 494 500 710 628 488 -465 -169 -852 -1101 -1077 -1262 -701 -727 -463 -1163 -668 199 -48 415 -363 -321 335
2329C35J48j16O29j4q65k5k07L07k41l34R9Q95p94J40k22K90J48l5J21O3K42l04
$$ 335 483 367 996 982 117 92 -115 192 -49 -383 -284 611 -183 -43 -265 25 173 138 259 322 564 260
2351B60m29M11j84L93q32J45N26n55L00O19o03L78p95L54m48J090j003J23J11
$$ 260 -169 242 58 451 -381 -236 290 -265 35 654 51 429 -366 -12 -460 630 -373 -250 -139
2370a39k20Q75j46k90kP65j258P13L07j136P33n7r66K52m3M83k61l43J45O77r5
$$ -139 -359 516 370 80 78 843 -415 298 605 -531 202 145 -821 -569 -612 -129 -390 -733 -588 89 -6
2391fj10J041n67Q2n45L43N78j51k01m12J09O80p52j89P79j818M98K39N03l85
$$ -6 -116 925 358 440 -105 238 816 665 464 52 161 841 89 -100 679 -1139 -641 -402 101 -284
2411b84k27L06J23p6M35l61N72J32k62J074r75M26k69j199K36L44n0N77j236m61
$$ -284 -511 -205 -82 -158 277 -84 488 620 358 1432 457 883 614 -585 -349 -5 -55 522 -714 -1175
2431a175J167K69j071J315q02j04Q51l50k81O22m58M3N08m9o07M41n20M8k64p85
$$ -1175 -8 261 -810 505 -297 -401 450 100 -181 441 -17 26 534 485 -122 319 -201 -153 -417 -1202
2451a202Q46k74N81oL55l93n64P21n10J59J81P94n17j56n8P37l84q63M12p7K02
$$ -1202 -356 -630 -49 -55 300 -93 -657 64 -446 -287 -106 688 171 15 -43 694 310 -553 -141 -218 -16
2472a6k11n20O15o8M65o05j77R75n16L44l61L45k31n28O31k19P11q07K75m16Q1
$$ -16 -227 -747 -132 -200 265 -340 -517 458 -58 286 -75 270 39 -489 142 -77 634 -173 102 -314 -233
2493b33J47l38J29Q9m92P25N8o84L62O5J73K18J53O34j233N50L94j07l67o84O22
$$ -233 -86 -424 -295 -206 -698 27 85 -599 -237 -172 1 219 372 1006 -227 323 717 610 243 -441 181
2514A81j53K31N73j436PK22K4K42M65p84O97r7n08P0Q15m37M1o5P29m62j31K87
$$ 181 28 259 832 -604 -597 -375 -351 -109 356 -428 269 172 -336 -266 549 112 153 88 817 355 224 511
2536E11J60k70q52K20R26m89l55M97n07M77n13J58j62j98P22j01J8m7K5j2P32
$$ 511 671 401 -451 -231 695 206 -149 348 -159 318 -195 -37 -199 -397 325 224 242 195 220 208 940
2557I40r69l98P30n41J55K03J79o37j72p1J69J52M27k03J37o0N71n62O9k99J47
$$ 940 -29 -427 303 -238 -83 120 299 -338 -510 -581 -412 -260 167 -36 101 41 612 50 119 -180 -33
2578c3m9j13L33j24K61p10k01j04N22n9k28N21o90J296n99O92o02O69k88k11K15
$$ -33 -82 -195 138 14 275 -435 -636 -740 -218 -277 -505 16 -674 622 23 715 113 782 494 283 498
2599D98p83N24l69P63q39N68j072Q46m27l97N23M58o85J55N34p54R1R59o12L48
$$ 498 -285 239 -130 633 -206 362 -710 136 -291 -688 -165 293 -392 -237 297 -457 -366 593 -19 329
2619C29j26N77q05K14k04K75k28K26l22L87j71j109P30j64j04N49L5L95l08r28
$$ 329 203 780 -25 189 -15 260 32 258 -64 323 152 -957 -227 -391 -495 54 89 484 176 -752
2639g52J374l45k35m54P91o75P42l88o56N82L41j043J155j89r2j96k08JO49O1
$$ -752 622 277 42 -412 379 -296 446 58 -598 -16 325 -718 437 248 156 -40 -248 -247 402 463
2659D63k18J44m73M4Q6m1O78o99l83O32q27N39N03l88j186Q13J60P29o09L3j86
$$ 463 245 389 -84 -40 46 5 683 -16 -399 233 -594 -55 448 60 -1126 -313 -153 576 -33 0 -186
2680a86N90q6l61J06L20K39k7n6n18o71n8K14P71n02J67L10m61L15k93j55K39
$$ -186 404 318 -43 63 383 622 595 539 21 -650 -708 -494 277 -225 -58 252 -209 106 -187 -342 -103
2701a03j73P86n36M09p67M27L76J10J43l1q88P46O1j50p32J206r92L67K46m23
$$ -103 -276 510 -26 383 -384 43 419 529 672 641 -247 499 560 410 -322 884 -108 259 505 82
2721H2q23P02l32P99O3k21m6m01J19K41J42n04J14O4L88j00m04o4j84M23m17K5
$$ 82 -741 -39 -371 428 491 270 224 -177 -58 183 325 -179 -65 -1 387 287 -117 -181 -365 58 -359 -334
2743c34Q80l33l12k96L15M54J8o60LK66P21j056M88M18o75o2J00P69q83L83r72
$$ -334 546 213 -99 -395 -80 374 392 -268 -265 1 722 -334 154 572 -103 -165 -65 704 -179 204 -768
2764g68P99n71N99K95k67p45m03J406l17l68J20k1L81q78N17L84l23m2N62n84
$$ -768 31 -540 59 354 87 -658 -1061 345 28 -340 -220 -241 140 -738 -221 163 -160 -202 360 -224
2784b24l24Q90o24M7l3L86r78L42M19K03J98k10M28m43K79O8j18M93j118j64K84
$$ -224 -548 342 -282 -235 -268 118 -860 -518 -99 104 302 92 520 77 356 424 306 799 -319 -483 -199
2805a99J07M45m39N1k39k6J54o93J501p17n15L60J67L5J060p13j168P90j4J55
$$ -199 -92 353 -86 -35 -274 -300 -146 -839 662 -55 -570 -210 -43 -8 1052 339 -829 -39 -53 102
2825A02M32j040J257p19k77O40j019M64K69n70O85M7l06q6l43K46N89l27l33P91
$$ 102 534 -506 751 32 -245 395 -624 -160 109 -461 224 271 -35 -121 -464 -218 371 44 -289 502
2845E02o40J74K59p50M92j18N18J60p92np4O30m22j99K27J88m12P00r53Q50K33
$$ 502 -138 36 295 -455 37 -81 437 597 -195 -200 -274 356 -66 -265 -38 150 -262 438 -515 335 568
2866E68M2l86k76J89l28K64m6o43Q13m5m94K67R9k09Q4k2M86o15k7P00J62m71
$$ 568 610 224 -52 137 -191 73 27 -616 197 152 -342 -75 24 -185 -101 -123 363 -252 -279 421 583 112
2888A12K78j108N35p9j7Q52p82j4J31l72J14P92j80J83m29k37j08P79l49k04n8
$$ 112 390 -718 -183 -262 -279 573 -209 -223 -92 -464 -350 442 262 445 16 -221 -329 450 101 -103 -161
2909a61k38R31q46O23J9M3o88L04J31k55M88q29m1j63O89l03j3K84L38n61N94
$$ -161 -399 532 -314 309 328 371 -317 -13 118 -137 351 -478 -519 -682 7 -296 -309 -25 313 -248 346
2930C46q60J419k53m44q72Q93l65K59L03k54j20J68l5r99Q33M24q31P28J37o69
$$ 346 -514 905 652 208 -664 229 -136 123 426 172 52 220 185 -814 19 443 -388 340 477 -192
2950a92N41l10L85o03L74k44n07Q69l2m07N45n88j41Q50k95j138J038k36j41L05
$$ -192 349 39 424 -179 195 -49 -556 313 281 -126 419 -169 -310 540 245 -893 145 -91 -232 73
2970G3j93N9M09m99O66q04P91l69R7n13R31q53J74o38K18K46L05o33N46j48r65
$$ 73 -120 -61 348 -151 515 -289 502 133 230 -283 648 -205 -31 -669 -451 -205 100 -533 13 -135 -1100
2991a100N62O7K44m02L83L6P69m92L77L90l61o77m62J595q75K61n12J66k16N30
$$ -1100 -538 -471 -227 -629 -246 -210 559 67 444 834 473 -204 -666 929 54 315 -197 -31 -247 283
3011B83n57M52K9p17O11L95n34l52J70m02L89K14K88j45K33l78m79O33o72K20
$$ 283 -274 178 207 -510 101 496 -38 -390 -220 -622 -233 -19 269 124 357 -21 -500 133 -539 -319
3031c19k02l44J032n26M02j40p1NJ60R50j036L17j48j94JM65J2k77L14l9j042
$$ -319 -521 -865 167 -359 43 -97 -168 -163 -3 947 -89 228 80 -114 -113 352 364 87 401 362 -680
3052f80R79j49k70O92n06p17N62O1N51o63J50K08K61l64P5k95n5K29N10r64L29
$$ -680 299 150 -120 572 66 -651 -89 -28 523 -140 10 218 479 115 190 -105 -160 69 579 -385 -56
3073e6O78p51Q06j216J423r61N15j75K18j120J309q66J13k57J047o15l10O00Q95
$$ -56 622 -129 677 -539 884 -77 438 263 481 -639 670 -196 -83 -340 707 92 -218 382 1277
3092A277j625M99k64K98n9R5m3l75o52P49N79p85k1J072q28J43O48n45n04j1L74
$$ 1277 -348 151 -113 185 126 221 178 -197 -849 -100 479 -306 -327 745 -83 60 708 163 -341 -352 22
3113B2K78n20M87J1J85n6l49M41p54K52q35J073k16l94P18k98j81J77L26J48m12
$$ 22 300 -220 267 278 463 407 58 499 -255 -3 -838 235 19 -375 343 45 -136 41 367 515 103
3134A03J54o7j1j51q5o0j9j57j42q7N02L22j131J159l63l44P33j85l85m20l40
$$ 103 257 190 179 28 -57 -117 -136 -293 -435 -522 -20 302 -829 330 -33 -377 356 171 -214 -634 -974
3155i74R52m20P56o99R32l84J1J06r47Q93k39l74j2K79j88K85L55j145j06J040
$$ -974 -22 -442 314 -385 547 163 174 280 -667 226 -13 -387 -399 -120 -308 -23 332 -813 -919 121
3175A21q84Q94n88M95N29o94P31j399Q46M4l0l70MM66J30k77l54P68p68N43m78
$$ 121 -763 131 -457 38 567 -127 604 -795 51 95 65 -305 -301 165 295 18 -336 432 -336 207 -271
3196b71P4L56L82j21o89j02N49Q4L51p02k19M55N8r16M46J346n82n46K19J07p47
$$ -271 -197 159 541 420 -269 -371 178 262 613 -89 -308 147 205 -711 -265 1081 499 -47 172 279 -468
3217d68L17j58L70L39r12O72J39l48l1k39K38Q42o44k07J89N4r85J105o09O86
$$ -468 -151 -309 61 400 -512 160 299 -49 -80 -319 -81 761 117 -90 99 153 -832 273 -336 350
3237C50l11p19Q59l49K3M82q9N01j31l17N7P0l51l45J30k62O99l56j34k02R68
$$ 350 39 -680 179 -170 -147 335 246 747 616 299 356 426 75 -270 -140 -402 297 -59 -193 -395 573
3258E73o00l98j17J246o97l38N11j031Q81K58o4o2J93n12P8Q50j300N06J19r38
$$ 573 -27 -425 -542 704 7 -331 180 -851 30 288 224 162 355 -157 -79 771 -529 -23 96 -842
3278h42O27r6R4M51j69p12J310j155N71k41Q00o21q9L10j88j14R4k14L85K70L1
$$ -842 -215 -311 -217 234 65 -647 663 -492 79 -162 638 17 -72 238 50 -64 30 -184 201 471 502
3299E02K05o03j46LN3N61r61K44Q7l07L35J52l25Q2k28n4R56j43l21l50N69l1
$$ 502 707 104 -42 -39 14 575 -386 -142 -55 -362 -27 125 -200 -118 -346 -400 556 413 92 -258 311 280
3321B80Q6q95l77Q78n29q3Q40j27P9l25k21N44K59K38n42j32M3N60q90Q88l89
$$ 280 366 -529 -906 -28 -557 -640 200 73 152 -173 -394 150 409 647 105 -27 16 576 -314 574 185
3342A85j63J42K32r58K20J40p5J77P99p25j7o42J524l3m97m19J87o20Q24j81M42
$$ 185 22 164 396 -562 -342 -202 -277 -100 699 -26 -43 -685 839 806 309 -110 77 -543 281 100 542
3363E42m35l91N63o54J47N26o14L1K26L52l56k5L25m81l42N97n49J207n26k03
$$ 542 107 -284 279 -375 -228 298 -316 -285 -59 293 -63 -88 237 -244 -586 11 -538 669 143 -60
3383f0Q12q73k88M75n96P81k6L84j274O1J197n44n23J23O66l10n24J353o81m7
$$ -60 752 -121 -409 66 -530 251 225 609 -665 -604 593 49 -474 -351 315 5 -519 834 153 106
3403A06O28n93J06k83L06N2mk42Pj83M54q75N55J10j28m42m98J754m64k26P32
$$ 106 734 141 247 -36 270 322 318 76 83 -100 354 -521 34 144 16 -426 -924 830 366 140 872
3424H72o27j34n0J80m88J15P70j096P47K52n64k77L4k4P53l93j71P41p7p89K58
$$ 872 245 111 61 241 -247 -132 638 -458 289 541 -23 -300 -266 -290 463 70 -101 640 563 -226 32
3445C2K8n14J032n98K95o3n10N77n10K60K16O6n62L07k74j0j93M44J40l05k77
$$ 32 60 -454 578 -20 275 212 -298 279 -231 29 245 311 -251 56 -218 -228 -421 23 163 -142 -419
3466d19N94n73O82L15m68o00J035r55J025o54M75n56L43j6r0m11K46R3n0J61L26
$$ -419 175 -398 284 599 131 -469 566 -389 636 -18 457 -99 244 228 138 -273 -27 66 16 177 503
3487E03n65J37N31l07L57q33M5J16k68M05l38J074j401P0N78O4m44k02O67n41
$$ 503 -62 75 606 299 656 -177 -132 -16 -284 121 -217 857 -544 -474 104 168 -276 -478 189 -352
3507c52L30O95M6r20P0j27L13n39j3O20n01K77K11l22O20j58P7l36L8q54M71P2
$$ -352 -22 673 719 -201 -131 -258 55 -484 -497 123 -378 -101 110 -212 408 250 327 -9 29 -825 -354 -282
3529b82N01p41P02k35k92Q57r01P40q62Q97k72j04l40J52j96R0J00p1N6m51M20
$$ -282 219 -522 180 -55 -347 510 -391 349 -513 384 112 8 -332 -180 -376 -286 -186 -257 -201 -652 -232
3550b32M49n65j78R88j43k0J56M71n30n72K43r72J699j162n07M66L36J87j70N39
$$ -232 217 -348 -526 462 319 299 455 926 396 -176 67 -905 794 -368 -875 -409 -73 114 -56 483
3570D83j75l10q0L52m23O62j020Q07m21K38l05n18N02n48Q89o08M48r54P90p7
$$ 483 308 -2 -82 270 -153 509 -511 296 -125 113 -192 -710 -208 -756 133 -475 -27 -981 -191 -268
3590b68P56k32M8L17o33l90K73J7K45N60m11j89Q03q78n91O4N62J25N0m11K02
$$ -268 488 256 304 621 -12 -402 -129 -112 133 693 282 93 896 18 -573 -509 53 178 228 -183 19
3611A9J72l26L96J89nn14n57P09J02n91K69Q5M09p49N94j74p74N36k16P26N1m65
$$ 19 191 -135 261 450 445 -69 -626 83 185 -406 -137 -52 357 -392 202 28 -746 -210 -426 300 351 -114
3633a14m44J78M32n45O53k77J59m92P01r05N78N57j065N67L36Q44j174L21k75
$$ -114 -558 -380 52 -493 160 -117 42 -450 251 -654 -76 481 -584 -17 319 1163 -11 310 35
3652C5m74M66J78L00r3q56N08l01Q27j392N00N69j72M41j220J082j20J3M8m41
$$ 35 -439 27 205 505 412 -444 64 -237 590 -802 -302 267 95 536 -684 398 278 291 339 -102
3672a02n98P65q15J330n72O76n34q34Q00k5m60L32KL3P85o79p32O8P46J49p23
$$ -102 -700 65 -750 580 8 684 150 -684 116 91 -369 -37 -35 -2 783 104 -628 -560 186 335 -388
3693c88N2N11o64J053L23j011N73q52j60j83O98P65m88l81L88q4l19N41n58j52
$$ -388 -336 175 -489 564 887 -124 449 -403 -563 -746 -48 717 229 -152 236 152 -167 374 -184 -336
3713c36j53L98M07o02N44m43Q7J82K27j109J167k77Q7l02n29J36N51j30l05K16
$$ -336 -489 -91 316 -286 258 -185 -98 84 311 -798 369 92 179 -123 -652 -516 35 -95 -400 -184
3733a84N1M15n10J100p34l39N4j82Q34p55P37j594J616j197O32K35j58n12L30
$$ -184 -133 282 -228 872 138 -201 -147 -329 505 -250 487 -1107 509 -688 -56 179 21 -491 -161
3752a61l05M22k14N50Q3q9j011R83p05J426n71p27Q45K15p68L60J68l53j42K5
$$ -161 -466 -44 -258 292 375 286 -725 258 -447 979 408 -319 526 741 -27 333 501 148 6 31
3772C1k51l61R72o70O87o73P92q99M63K94k32K35L38l89k16k42M29m48m49N40
$$ 31 -220 -581 391 -279 408 -265 527 -372 91 385 153 388 726 337 121 -121 308 -140 -589 -49
3792d9j26m35K17P86n26j75M04n5k14P76j268J027j220N43n3j88P48l48k45Q29
$$ -49 -175 -610 -393 393 -133 -308 96 41 -173 603 -665 362 -858 -315 -368 -556 192 -156 -401 428
3812D28o30k43L73k43M53j90j78K24K09p08J006q83J056q55M09n30J09K72k77
$$ 428 -202 -445 -72 -315 138 -52 -230 -6 203 -505 501 -382 674 -181 228 -302 -193 79 -198
3831a98M92m14Q39n4k13l76N03j268M44J60n44J101j22j31J50o7l42j53J18J08
$$ -198 294 -120 719 665 452 76 579 -689 -245 -85 -629 472 350 219 369 302 -40 -193 -75 33
3851C3m35Q14j56r55J134K46n31J64q00N4K96M56k52M42L9m71K64j38l63k80N65
$$ 33 -402 412 256 -699 435 681 150 314 -486 -432 -136 320 68 510 549 78 342 204 -159 -439 126
3872A26m89L64j67J22j80M76o20R45n07J45k52J50o09K60Q87m77j34m3j053Q12
$$ 126 -363 1 -166 -44 -224 252 -368 577 70 215 -37 113 -496 -236 651 174 40 -3 -1056 -244
3892b44R23j446R11j5L8k63j07J072j171O0R6n90K04k2M83k57J015j063N7Q88
$$ -244 679 -767 144 129 167 -96 -203 869 -302 -242 -146 -736 -532 -554 -71 -328 687 -376 -319 569
3912E69l96L7O82r70o8K96J156j509k55M11MR2o11O30l48N59j10p4j69K93r33
$$ 569 173 210 892 -78 -146 150 1306 -203 -458 -47 -43 49 -562 68 -280 279 169 95 -74 219 -714
3933g14N86J02p9k5O75n43j279J459R0r3k42L29p39K21N86j170O84J14J88k05
$$ -714 -128 -26 -105 -130 545 2 -1277 182 272 179 -63 266 -473 -252 334 -836 -152 -38 150 -55
3953e5J6M4k62J97N36l6p22N43l37j07N47j43r52O07l03J87L53n39P40k04m38
$$ -55 -39 5 -257 -60 476 440 -282 261 -76 -183 364 221 -731 -124 -427 -240 113 -426 314 110 -328
3974c28O86k47j43p8K37j04L62k13j06K08j87M14r43J328q07q76j07J087l14L4
$$ -328 358 111 -32 -110 127 23 385 172 66 274 87 501 -442 886 79 -797 -904 183 -131 -97
3994i7N69j117Q13m37M00n43j87Q81j198k8J394l51J003j930J903j963L26l67
$$ -97 472 -645 168 -269 131 -412 -599 282 -916 -944 450 99 1102 -828 1075 -888 -562 -929
4012i29J114K16L18q36K17l38K36j30K25m79J26k15Q25m37m43OO29o2m92P19m02
$$ -929 185 401 719 -117 100 -238 -2 -132 93 -386 -260 -475 350 -87 -530 -524 105 43 -449 270 -132
4033a32M06k90K21q1J41j56k2K45o79J098r89l87L00J044l69J29P3m81n90P27
$$ -132 274 -16 205 124 265 109 87 332 -347 751 -238 -625 -325 719 350 479 552 71 -519 208
4053B08J36r21K60O43l77J1J37K49o37J57J69n09J71K31o73R06K11k79j65J83
$$ 208 344 -577 -317 326 -51 -40 97 346 -291 -134 35 -474 -303 -72 -745 161 372 93 -72 111
4073A11q03r2N69O13p33Q83l07rp22J86R50m56O82j311N34m27m5L9P41j395J313
$$ 111 -692 -784 -215 398 -335 548 241 232 -490 -304 646 190 872 -439 95 -332 -377 -338 403 -992 321
4094C21k64M59n40J27M07j84k16j75K24n84Q8K66l31K90J13l4m00K22N73o9n70
$$ 321 57 516 -24 103 510 326 110 -65 159 -425 -337 -71 -402 -112 1 -33 -433 -211 362 293 -277
4115b77o94M03L95N70n67o19R91r90q1P91k25J43O38N00j113M67l38l16o16J243
$$ -277 -971 -568 -173 397 -170 -789 202 -788 -869 -78 -303 -160 478 978 -135 332 -6 -322 -938 305
4135C05k68Q7m2j24M84n02m38j37R06K85p67J64m3J7M72j005O59J20Q0J08k34
$$ 305 37 124 82 -42 442 -60 -498 -635 271 556 -211 -47 -90 -73 399 -606 53 173 253 361 127
4156A27o01N28M1m82L76p2P56Qj159J077k68n59R16r37j53P73q90J41P14k6j92
$$ 127 -474 54 95 -387 -11 -83 673 681 -478 599 331 -228 688 -249 -402 371 -519 -378 336 310 118
4177A18O1L60q35k79J253m30J22J64j528O08q5M35Ok3m04j45N2J184n86J76j7
$$ 118 179 539 -296 -575 678 248 370 534 -994 -386 -471 -36 -30 -53 -457 -602 -550 634 48 224 207
4198B07j80j6K68m07K88n67N32M19l74J82N8O43o03L9j60l55K41K15n65n90P96
$$ 207 27 11 279 -128 160 -407 125 544 170 352 410 1053 450 489 329 -26 215 430 -135 -725 71
4219G1J05l98K7J07m80P81K87k39p85P90o20O90l54p08J011r29J11N97j49N89
$$ 71 176 -222 -195 -88 -568 213 500 261 -524 266 -354 336 -18 -726 285 -644 -533 64 -85 504
4239E04L0k50K87J25p27L15j31q9l68J03k11J220j005q9O22L74j218Q87J49k5
$$ 504 534 284 571 696 -31 284 153 64 -304 -201 -412 808 -197 -286 336 710 -508 379 528 503
4259E03K5n87J3L06m16M40q6n71J020r04O53o97o0R1L50k29l41P00K33p42J07
$$ 503 528 -59 -46 260 -156 284 198 -373 647 -257 396 -301 -361 -270 80 -149 -490 210 443 -299 -192
4280a92J87k25j26P43K57m75L45j103P99r30O06Q5N02j046L4J044L6j39n65R53
$$ -192 -5 -230 -356 387 644 169 514 -589 210 -720 -114 -29 473 -573 -539 505 541 402 -163 790
4300G90j415L58M85p43R86j30j64j66K81p70J30p73J601p22O4k20N42q23Q53J80
$$ 790 -625 -267 218 -525 461 331 167 1 282 -488 -358 -1131 470 -252 -188 -408 134 -689 164 344
4320C44q3n52lN3O8J071j12l72j018J076q2o60k33P06N0m88M19l28O9J65N83m72
$$ 344 261 -291 -294 -241 -173 898 786 414 -604 472 390 -270 -503 203 253 -235 184 -144 -75 90 673 201
4342B01p29O94l76k28N74o41J0K69l95L6J487j239K27N58m04o62P84m87K28j29
$$ 201 -528 166 -210 -438 136 -505 -495 -226 -621 -585 902 -337 -110 448 44 -618 166 -321 -93 -222
4362b22J44R7M47k23K20j073N65l28l18L01O97o26M46j52J44l3n01M06K04k77
$$ -222 -78 19 466 243 463 -610 -45 -373 -691 -390 307 -319 127 -25 119 86 -415 -9 195 -82
4382h2k25L37l79N00j50J27k97M8J12m61N43L92j13o17P29n8o6j64k93L73q6K8
$$ -82 -307 30 -349 151 1 128 -169 -121 -9 -470 73 465 352 -265 464 406 340 176 -117 256 170 198
4404A98m01K09k0J91p49J55N17Q23r89j92J05l12M88p87P11l29P8n98O28j80L34
$$ 198 -203 6 -14 177 -572 -417 100 923 -66 -258 -153 -465 23 -764 -53 -382 -304 -902 -274 -454 -120
4425a20M52l5j153M70M79l59L49nk91J58N03q86N03n70L54N75k79k38P5M3l33
$$ -120 332 297 -856 -386 93 -266 83 78 -213 -55 448 -438 65 -505 -151 424 145 -93 -18 25 -308
4446c08O12n04n08O71l26K56n02R31j64M55j020L84k22O54q36N61Q19n68m99J60
$$ -308 304 -200 -708 -37 -363 -107 -609 322 158 613 -407 -23 -245 409 -427 134 953 385 -114 46
4466D6m0j02j08j81O55R1M15j438K84N92l61K73k8p14K80O44k61L77J32j067l77
$$ 46 6 -96 -204 -385 270 361 776 -662 -378 214 -147 126 98 -616 -336 308 47 424 556 -511 -888
4487h88M16N78J65r48L48j76N66J77l18K70j1J40l02l92k50K15Q71p31K99n9n65
$$ -888 -472 106 271 -677 -329 -505 61 238 -80 190 179 319 17 -375 -625 -410 461 -270 29 -30 -595
4508e95Q12j65k28J08o31O99L05n88j08J059k42k19o30j71P43m09L47j86p8Q1
$$ -595 217 52 -176 -68 -699 0 305 -283 -391 668 426 207 -423 -594 149 -260 87 -99 -177 -96
4528i6k97Q28p09Q81m19l42r0M9J05O06q60O56m34k21N71o21L84l5L60k92R5L1
$$ -96 -393 435 -274 607 188 -154 -244 -195 -90 516 -344 312 -122 -343 228 -393 -9 -44 316 24 119 150
4550A50M12o25Pk60L59j81Q17p26o65K43O24n2R8M40q68j8k23Q66n99J90K53k90
$$ 150 562 -63 -56 -316 43 -138 679 -47 -712 -469 155 103 201 641 -227 -245 -468 398 -201 -11 242 -48
4572d8M04j1K29j188O05M75j08l9J28N5k19q7n01l3R05p73L72M40q90O32k97l37
$$ -48 356 345 574 -614 -9 466 358 319 447 502 283 196 -305 -338 567 -206 166 606 -284 348 51 -286
4594b86Q01m58J38J74J9l33k29j04K40n7r2L43O12r70M06L88o21K88j17j06m81
$$ -286 515 57 195 369 388 55 -174 -278 -38 -95 -187 156 768 -202 204 592 -29 259 142 36 -445
4615d45P3L48l92M46J64k48J98o47L39O26m65K16o17R61q07J85L07q12J95K93
$$ -445 -372 -24 -416 30 194 -54 144 -503 -164 462 -3 213 -404 557 -250 -65 242 -570 -375 -82
4635h2N53p30J245o84p8l92j13J86j80k82L12L15p13Q00M23o96P2J00k51o4L0
$$ -82 471 -259 986 302 224 -168 -281 -95 -275 -557 -245 70 -643 157 580 -116 -44 56 -195 -259 -229
4656b29P2M18k11K84q3j78j72L65M76L08j421p8P63p8k88R87o53p22O65n57L14
$$ -229 -157 261 50 334 251 73 -99 266 742 1050 -371 -449 314 236 -52 935 282 -440 225 -332 -18
4677a8J61j90J31J48j94p53J446n21L03j370J072k41j65k69M02L77K29l89n45
$$ -18 143 -47 84 232 38 -715 731 210 513 -857 215 -26 -191 -460 -58 319 548 159 -386
4696c86P28j14o56M67n60Q78K0J9m77Q26q60K88j41k8J13k81O01j13o68O77M0
$$ -386 342 228 -428 39 -521 357 377 396 -81 745 -115 173 32 4 117 -164 437 324 -344 333 373
4717C73o71q8L86N74J08m20k94K11o29L65mP02p80K83M8o26J45K53m5Q18n47n01
$$ 373 -298 -386 0 574 682 262 -32 179 -450 -85 -89 613 -167 116 164 -462 -317 -64 -109 709 162 -339
4739c39K67p59R44K66k3q34M37N50p93P07k59L6k93K17p5k50k10m6P67pm97O86
$$ -339 -72 -831 113 379 356 -478 -41 509 -284 423 164 200 -93 124 49 -201 -411 -457 310 303 -194 492
4761D92J65r28J2L63Q2r8m86k48J038l30k19j28k0J363j089p08O78l90K94p27
$$ 492 657 -271 -259 104 186 88 -398 -646 392 62 -157 -285 -305 1058 -31 -739 -61 -451 -157 -884
4781h84J311m0m48k72Q9R44o3n01k15M25q29Q83l39l82L03o62J25Q1R47o07L26
$$ -884 427 387 -61 -333 -244 700 637 136 -79 346 -483 400 61 -321 -18 -680 -555 -474 473 -134 192
4802A92p43K95M24l62m91L00N78P7m09K20p8K2M60l85m44O98M58j116J85M09J48
$$ 192 -551 -256 168 -194 -685 -385 193 270 -139 81 3 25 485 100 -344 354 812 -304 -119 290 438
4823D38l54L2o83P94J75o12j41Q37m50k46Q1J70L00J66o29l4l19P98j19k29M44
$$ 438 84 116 -567 227 402 -210 -351 486 36 -210 -129 41 341 507 -122 -156 -475 323 204 -25 419
4844D19k38Q64r48p1r9J50k41K81K00m10j20N40l93M33j181O6J181j041R6K65
$$ 419 181 1045 97 26 -73 77 -164 117 317 -93 -213 327 -66 367 -814 -748 433 -608 -512 -247
4864b47M13k72l56L20M53q60O2P89m64M9Q6k12L75o47J337k91l47l91P40r05K26
$$ -247 166 -106 -462 -142 311 -549 -487 302 -162 -113 -27 -239 136 -511 826 535 188 -203 537 -368 -142
4885a42Q53j154oJ14J62l16L44n86J592m95L40n56j29j6k61n15N45J19J26j15
$$ -142 711 -443 -449 -335 -173 -489 -145 -731 861 366 706 150 21 5 -256 -771 -226 -107 19 -96
4905i6N08q20M18q0N97o74N98m77j64L37p6m51J189j137M93o13M04N79j014N86
$$ -96 412 -408 10 -70 527 -147 451 -26 -190 147 71 -380 809 -328 165 -448 -44 535 -479 107
4925A07k71Q38m17l45L48Q3k67l90R04n51%j22O3J00N69r54O93n24l15Q24j88
$$ 107 -164 674 257 -88 260 343 76 -314 590 39 39 -83 -20 80 649 -305 388 -136 -451 373 185
4946A85O27k40l68n53l36K62K01M27l07k55P15n25L80k01J26NN65m33M94p02q10
$$ 185 812 572 204 -349 -685 -423 -222 205 -102 -357 358 -167 213 12 138 143 708 275 769 67 -743
4967g43O18M13j21J40p87K97n0j85N93N30j039q9J83o1P17p78R2O12p46K73J77
$$ -743 -125 288 167 307 -480 -183 -233 -418 175 705 -334 -423 -240 -301 416 -362 -270 342 -404 -131 46
4988D6k43P1P93j98j95o02K88P23n36Om00q7k6R2N90R4p79L34l51L22r37M20P92
$$ 46 -197 -126 667 469 274 -328 -40 683 147 153 -247 -334 -360 -268 322 416 -363 -29 -380 -58 -995 -575 217
5011B17m19M45k93k99L54j30K42k22K92n54J544o67q2l15j15L03J73l9l06j57
$$ 217 -202 243 -50 -349 5 -125 117 -105 187 -367 1177 510 428 113 -2 301 474 435 129 -28
5031b8J17k98K40L71j230L82N39O64p06L08k64M34l17j60M54q02N72l19m14M13
$$ -28 89 -209 31 402 -828 -446 93 757 51 359 95 529 212 52 506 -296 276 -43 -457 -44
5051d4L35j074J246k19J13o72j52J013p71K83M3N12K50j081M37k4q79J69O49R7
$$ -44 291 -783 463 244 357 -315 -467 546 -225 58 101 613 863 -218 219 195 -684 -515 134 231
5071B31j228J017M9j14j0l44N85N55j030R2J47N40p08J08O87n94J57m73Q44q47
$$ 231 -997 20 69 -45 -55 -399 186 741 -289 -197 -50 490 -218 -110 577 -17 140 -333 511 -336
5091c36Q93p00K16r0J49P9q77J583j127l14K7j2J17R86p85L3L67p5k5o28O08o13
$$ -336 557 -143 73 -17 132 211 -666 917 -210 -524 -497 -509 -392 594 -191 -158 209 134 109 -519 89 -524
5113e24J33P20K39p20L51o13P48J51j005J44K17j03Q75l92N65j269O36J88p83
$$ -524 -391 329 568 -152 199 -414 334 485 -520 -376 -159 -262 613 221 786 -483 153 341 -442
5132d42O50k82r2K62m20L38n19O20l12Q14j32j53k23K51M15j449M18J74j64m22
$$ -442 208 -74 -166 96 -324 14 -505 115 -197 617 485 332 109 360 775 -674 -256 -82 -246 -668
5152f68Q54q9l71K00J19R2k01k11N70M4m99J25M03j92k40J16j17N6P36l81m23
$$ -668 186 97 -274 -74 45 137 -64 -275 295 339 -160 -35 368 176 -64 52 -65 -9 727 346 -77
5173g7J33j56l3qL05k07O25m52Nl76O70m89J35m54L07l04M04l96M27m99O02M03
$$ -77 56 -100 -133 -141 164 -43 582 130 135 -241 429 -60 75 -379 -72 -376 28 -368 59 -440 162 565
5195E65j260P5P40N8J23k81m11J055q47l89K44J29K57O13L01j357J150j035N48
$$ 565 -695 -620 120 178 301 20 -391 664 -183 -572 -328 -199 58 671 972 -385 765 -270 278
5214B78j75p42L41O53q19P01o04K67n96R42m82R8J82l13K64P64n69j67M00J51
$$ 278 103 -639 -298 355 -464 237 -367 -100 -696 246 -236 -138 44 -269 -5 759 190 23 423 574
5234E74j178L37N02n67N91J1r34J15k17P39l0L36q39M46l5K5J22k92P73l29q3
$$ 574 -604 -267 235 -332 259 270 -664 -549 -766 -27 -57 279 -560 -114 -149 -124 -2 -294 479 150 67
5255F7r34P71J78j73N23M32j373P13L16n59n92P32j14o72Q4J113k37J25l97L91
$$ 67 -867 -96 82 -91 432 864 -509 204 520 -39 -631 101 -13 -685 -601 512 275 400 3 394
5275C94j86o96N25L95j095N65J42R9l37Q64m90k03j94J18k40L06o1Q54r11L50
$$ 394 208 -488 37 432 -663 -98 44 143 -194 670 180 -23 -217 -99 -339 -33 -94 760 -151 199
5295A99L41K5j79K83l60o26Q72k17m75O88l42K44j049J130q20o02J199K17o18
$$ 199 540 565 386 669 309 -317 555 338 -137 551 209 453 -596 534 -286 -888 311 528 -90
5314i0j29K24J69L34k54o35K41R75n69n68J49K14L40k73J5l85L85L28n19k4m36
$$ -90 -219 5 174 508 254 -381 -140 835 266 -302 -153 61 401 128 143 -242 143 471 -48 -72 -508
5335e08J140m07l14l47Q92n61K75k60Q59j168l25O30n14N55O72j24k66j57Q8p44
$$ -508 632 225 -89 -436 456 -105 170 -90 769 -399 -724 -94 -608 -53 619 495 229 72 160 -584
5355e84L62J57j64k45L42ON2j19L1J97O01m87k5p4N8J50n69j05J57p5J072j016
$$ -584 -222 -65 -229 -474 -132 -126 -74 -193 -162 35 636 149 124 50 108 258 -311 -416 -259 -334 738 -278
5377b78M01M3j40J83p37J40O3K45J03n45l48J222j05l75r1M53K18p39J79j39J30
$$ -278 123 166 26 209 -528 -388 -325 -80 23 -522 -870 352 247 -128 -219 234 452 -287 -108 -247 -117
5398a17J04N5k97J91K22k25j51n80P17N78q14rJ62J9o3l72M10m54J43P6Q29m17
$$ -117 -13 42 -255 -64 158 -67 -218 -798 -81 497 -317 -326 -164 -145 -208 -580 -170 -624 -481 -405 424 7
5420Go6RN15m4p85R82j175M41m9j39j23O96m51Q36p31l77O45pm03k32K19N25j33
$$ 7 -59 -50 465 421 -364 618 -557 -116 -165 -304 -427 269 -182 654 -77 -454 191 184 -219 -451 -232 293 160
5443A60j26O3l28R9J20L92l93J4J66n3o8m23K13P31n58L44k94m66M44k37P20Q2
$$ 160 34 97 -231 -132 -12 380 -13 1 167 114 46 -377 -164 567 9 353 59 -407 37 -200 520 602
5465F02p35N81o59P14m22L55j006M08M95l81n4L5J62j42P98j69k01K83M61j179
$$ 602 -133 448 -211 503 81 436 -570 -162 333 -48 -102 -67 95 -47 751 582 381 664 1125 -54
5485e4K74L40j533J262J36n80O04m26nM11n77J18O67n14L31j66p20j29Q11k74
$$ -54 220 560 -973 289 425 -155 449 23 18 429 -148 -30 637 123 454 288 -432 -561 250 -24
5505b4k01o5Q64j03m28K98j044Q52l73K92N0l5J57P05r39J72j72k37q53J094N9
$$ -24 -225 -290 574 471 43 341 -703 149 -224 68 118 83 240 945 6 178 6 -231 -1084 10 69
5526F9l40J317j492O84K5r50P65l71L16o7k03J013q91m70L61N07l26k46k64j7
$$ 69 -271 1046 -446 238 263 -687 78 -293 23 -44 -247 766 -125 -595 -234 273 -53 -299 -563 -580
5546e80N99p3L10J5k85P0J90o71O48N42k130J737N2l80m95N10K27j150Q09K7L09
$$ -580 19 -54 256 271 -14 56 246 -425 223 765 -1365 372 424 44 -451 59 286 -864 -55 -28 281
5567B81l18J73m35O11m33k81N40j72O1K26m37k16M44N67j63n67M14m48L14k19
$$ 281 -37 136 -299 312 -121 -402 138 -34 27 253 -184 -400 44 611 448 -119 295 -153 161 -58
5587e8L98r9o4L70j103P42J08P9p37L00Kl18N92L17p20M65l27K00l96P63K0o13
$$ -58 340 241 177 547 -556 186 294 373 -364 -64 -62 -380 212 529 -191 274 -53 147 -249 514 534 -79
5609g9N33p57O28k07K02q17K50K42O7l74Q69n78N69o22K98q7Q32j562J081n23
$$ -79 454 -303 325 118 320 -497 -247 -5 62 -312 557 -21 548 -74 224 137 969 -593 488 -35
5629c5k29J07n19Q97n55Q71j82l25l61K87P8o1K45o53q9Q23j174Q30l1j96J52
$$ -35 -264 -157 -676 221 -334 537 355 30 -331 -44 34 -27 218 -435 -524 299 -875 -45 -76 -272 -120
5650a20M23R2q01M05J55q79M42J218p21K79n29j79J222q31m41M07k06k94O77o90
$$ -120 303 395 -406 -1 154 -725 -283 935 214 493 -36 -215 1007 176 -265 142 -64 -358 319 -371
5670c71k16N12mR14o37Q58j209r4N23k22L06K99l29M5k42k84K44k6N44j81o33
$$ -371 -587 -75 -79 835 198 1056 -153 -247 276 54 360 659 330 375 133 -151 93 67 611 430 -203
5691b03J17M56m43K35N80p9r58M63N79j120K47q0P96j77n41L77Q76j155k80L89
$$ -203 -86 370 -73 162 742 663 -295 168 747 -373 -126 -206 590 413 -128 249 1125 -30 -310 79
5711G9l46N75o23L58M01p66O95Km05R56j666Q88O21q01R2o76P6K42N72j74m39
$$ 79 -267 308 -315 43 444 -322 373 375 -30 926 -740 148 769 -32 60 -616 -540 -298 274 100 -339
5732c39K03N70k14M39k05n35l27O54l25p89J081m91L39l26M73L18Q6p91l7J07
$$ -339 -136 434 220 659 454 -81 -408 246 -79 -868 213 -278 61 -265 208 526 612 -179 -216 -109
5752a09lk60O3j48O96q60M50M42n88j09N70J27J56kj111N18m2L7P80l42m33N67
$$ -109 -112 -372 -309 -457 239 -621 -171 271 -317 -426 144 271 427 425 -686 -168 -210 -173 607 265 -168 399
5774C99K72J22j173L53p51L36R49l90j01J65l84m6R35m2j006k90J202j26j312
$$ 399 671 793 -380 -27 -778 -442 507 117 16 181 -203 -249 686 644 -362 -652 550 424 -888
5793h88J397n08n15M33K47j76q0Q21n69m01N22k46l75M26m94J681j379k94J50
$$ -888 509 1 -514 -81 166 -10 -90 731 162 -239 283 37 -338 88 -406 1275 -104 -398 -248
5812b48L34l70M40l34N24n71Q62j98Q9rk72Q7j9j13L14o90N06O3r31O17n95P43
$$ -248 86 -284 156 -178 346 -225 637 439 528 519 247 334 315 202 516 -174 332 395 -536 81 -514 229
5834B29p05N30l72J49j1O50k37J30j62p6l64N22k75K21N7p31M56o53N91l27l00
$$ 229 -476 54 -318 -169 -180 470 233 363 201 125 -239 283 8 229 286 -445 11 -642 -51 -378 -678
5855f78P19k28j42O35m20Q20n42m87K87L39k06R21j246j31M89n58O02J99q1l87
$$ -678 41 -187 -329 306 -114 706 164 -323 -36 303 97 1018 -228 -359 130 -428 174 373 292 -95
5875i5K95p02M4k4l20O13O67j90p36K88M46n69K36L8R8l7k63P7K83R5k33m13J312
$$ -95 200 -502 -458 -482 -802 -189 478 288 -448 -160 286 -283 -47 -9 89 52 -211 -134 149 244 11 -402 910
5898I10p42l6j6m76j35J88O41q49M09K70l33o2O61o02J091j381N06M07p73J23
$$ 910 168 132 116 -360 -495 -307 334 -515 -106 164 -169 -231 430 -172 919 -462 44 451 -322 -199
5918a99o75O33o38Q08K23j23k08M97K11m84K09L05j59l89L80j359P21M55n98L2
$$ -199 -874 -241 -879 -71 152 29 -179 318 529 45 254 559 400 11 391 -968 -247 208 -390 -358
5938c58l65Q21r10J85O84j37p05P44j23N20n21K15nK08l20K37M9p2P8q78R47P5
$$ -358 -723 98 -812 -627 57 -80 -785 -41 -164 356 -165 50 45 253 -67 170 219 147 225 -653 294 369
5960C69J18k41m10K70j4J4l55l19J96K34M74o86O30n14Q13m66l99P4l70R21l24
$$ 369 487 246 -164 106 92 106 -249 -568 -372 -138 336 -350 280 -234 579 113 -286 -212 -582 339 15
5981A5o21O30j97M9N76r36P52r36J198m17P62j220L76n33k57R13N09p64j524J030
$$ 15 -606 24 -173 -124 452 -484 268 -668 530 113 875 -345 31 -502 -759 154 663 -101 -1625 -595
6001e95J193n28K46j26l9l94j82Q14m40R6K1K6m23K3j1M92r6J59r5l55K09r81
$$ -595 598 70 316 190 151 -243 -425 389 -51 45 66 92 -331 -308 -319 173 77 236 141 -214 -5 -986
6023i86P08K31o44J014n67O53l05j99q1J18l4l69O01o0M31K73o58qm19J23n2O39
$$ -986 -278 -47 -691 323 -244 409 104 -95 -176 -58 -92 -461 140 80 511 784 126 118 -301 -178 -230 409
6045D09l95j18K1O63p90M73O0m85O3K68n12M94L9P7k04k95O8K5M94o00M98j21
$$ 409 14 -104 -83 580 -210 263 323 -162 -99 169 -343 151 190 267 63 -232 -164 -139 355 -245 253 132
6067A32L45p29J304j079j06O00n45j85O22m80M01k0n56J64p1M59O1n48j82O02
$$ 132 477 -252 1052 -27 -133 467 -78 -263 359 -121 280 260 -296 -132 -203 256 317 -231 -413 189
6087A89k07M36n99L08j17P09j343M25l18P81q27M15R1k7j92j05q2Q11k44n49O44
$$ 189 -18 418 -181 127 10 719 -624 -199 -517 264 -563 -148 -57 -84 -276 -381 -463 348 104 -445 199
6108A99l14K95J93j12L8j95j8J29m37J352n95j143Q18l39k88p1r2N41J67l2k90
$$ 199 -115 180 373 261 299 104 86 215 -222 1130 535 -608 210 -129 -417 -488 -580 -39 128 96 -194
6129a94K12l26L30k41M75n74M49O26n20m46M75m86l6R34j140O31k19L62K61L6
$$ -194 18 -308 22 -219 256 -318 131 757 237 -209 266 -220 -256 678 -462 169 -50 312 573 609
6149F09k15j85o19O53J73l92N8O0k48M11r1o10O99m91O38n58j18p03N22O72M87
$$ 609 394 209 -410 243 416 24 82 142 -106 305 214 -396 303 -188 450 -108 -226 -929 -407 265 752
6170G52l78r74K20L38m26P91o83L68K96K53l20o04P36q57J125k37L7R0j263N84
$$ 752 374 -600 -380 -42 -468 323 -360 8 304 557 237 -367 369 -488 637 400 437 527 -736 -152
6190a52M11k77l06L45O86r29K07j43m52K5P31r2l36j63J42R1l9K24J22mj48j62
$$ -152 259 -18 -324 21 707 -222 -15 -158 -610 -585 146 54 -282 -445 -303 -212 -251 -27 95 91 -57 -219
6212b19k04J50P27r32P3M96m1o98J383l16l59p66M35O88j025J148o27K35O44o96
$$ -219 -423 -273 454 -478 -405 91 50 -648 735 419 60 -706 -271 417 -608 540 -87 148 792 96
6232I6j94O86k60j39n6j55m06M87n72k22kJ198o37L91pn5P41j460P74J97m92o06
$$ 96 -98 588 328 189 133 -22 -428 59 -513 -735 -737 461 -176 215 208 153 894 -566 208 405 -87 -693
6254f93K40J33O18p43M82o37K70J321p03K53l25m54K74j49R36j396Q20m93J24
$$ -693 -453 -320 298 -445 37 -600 -330 991 288 541 216 -238 36 -113 823 -573 247 -246 -122
6273a22j32P36m19N6j60j99N21J6n23L09l90O04n91P05n46Q5L85k0m71j18N06
$$ -122 -254 482 63 119 -41 -240 281 297 -226 83 -307 297 -294 411 -135 -50 335 315 -156 -274 232
6294B32m86J44j05j97K47j18J08L52K92j587J090K93l18Ok28Q3K92J49o5l22m08
$$ 232 -254 -110 -215 -412 -165 -283 -175 177 469 -1118 -28 265 -53 -47 -275 -192 100 249 184 -138 -546
6315e46N1O97l22P33q51K52n4K76m30P9j55J22k02K53k3N06k2l13J02k5K47l38
$$ -546 -495 202 -120 613 -238 14 -40 236 -194 -115 -270 -148 -350 -97 -120 386 364 51 153 128 375 37
6337C7J03k01q37O62K22l4j47L91r1K31m38m18N65l82K13P2L30l2k82k75J50K08
$$ 37 140 -61 -898 -236 -14 -48 -195 196 105 336 -102 -520 45 -337 -124 -52 278 246 -36 -311 -161 47
6359D7l25P06l90m79J060j156M19P82r38N0L66Q86j204k95N10o20M95l45M04J17
$$ 47 -278 428 38 -441 619 -537 -118 664 -274 -224 142 1028 -176 -471 39 -581 -86 -431 -27 90
6379I0L9J08r60R30j80J72K41l67l3K45P3m36l89M57J41N7Q64p71M13n57K51n19
$$ 90 129 237 -723 207 27 199 440 73 40 285 358 -78 -467 -10 131 188 1052 281 694 137 388 -131
6401a31k56M14N12m79M2n52N36N04k17M35j330O30n86j32Q77m24n34J024m82J101
$$ -131 -387 27 539 60 102 -450 86 590 373 808 -522 108 -478 -610 267 -157 -691 333 -149 952
6421I52o22O4m8k66m18K48O48j060J17O87J77J77l04K75p55j24l27J92M67l29
$$ 952 330 394 346 80 -338 -90 558 -502 -385 302 479 656 352 627 -128 -252 -579 -387 80 -249
6441b49l9M75m64qK94L97p08N11O53r02k66O89m32j78O56p6j35l0j47L67l22m25
$$ -249 -288 187 -277 -285 9 406 -302 209 862 -40 -306 383 -49 -227 429 353 218 188 41 408 86 -339
6463c39R99j011K70K34k73K19j92M50K19m20r9k95L60OK96J69l55OK6l3j0k77
$$ -339 660 -351 -81 153 -120 99 -93 357 576 156 57 -238 122 128 424 593 238 244 270 237 227 -50
6485e0K79N72m82m60Q44q54N62p45P60p97n27Q73N0K33r31j05O13k01R6J13K57
$$ -50 229 801 319 -141 703 -151 411 -334 426 -371 -898 -25 25 258 -673 -778 -165 -366 -270 -157 100
6506A00r2L75L01p70k01M89j06K9J72P2p88R85m07M0O79j229O9O5L26k81N63n87
$$ 100 8 383 684 -86 -287 202 96 125 297 369 -419 566 159 199 878 -351 -282 -217 109 -172 391 -196
6528a96J48M3j19l10j74M37M11l90k3K25K15p8j7l26P75N7j034M56k6M06o1p00
$$ -196 -48 -5 -124 -434 -608 -171 240 -150 -173 52 267 189 172 -154 621 678 -356 100 74 480 419 -281
6550b81L01L46m27q4Q76q84L47J66J1n02ln2K60l95J20p68P05L88l93P58m06K69
$$ -281 20 366 -61 -145 731 -153 194 360 371 -131 -134 -186 74 -321 -201 -969 -264 124 -269 489 83 352
6572C52l60r68P82O55l81j55l76R47j18n70j92J204p89J15r7k64M16n2l24N04
$$ 352 -8 -976 -194 461 80 -75 -451 496 378 -192 -384 820 31 146 49 -215 201 149 -175 329
6592C29n39J028n06p9N3j178N51P69Ln24L31j206J107o15J17M02j18N81o8m74
$$ 329 -210 818 312 233 286 -892 -341 428 431 -93 238 -968 139 -476 -359 43 -75 506 438 -36
6612c6o43J030m43j32L79j91K1N1k17P4o09L8J70O16l71P6O27j53q57M49L97k12
$$ -36 -679 351 -92 -224 155 -36 -15 36 -181 -107 -716 -678 -508 108 -263 -187 440 287 -570 -121 276 64
6634F4k55M45l18KO3j106R83J38J021j078k9k82J6N9J09K63o06O65L56q37R66
$$ 64 -191 254 -64 -62 1 -1105 -122 16 1037 -41 -70 -352 -336 -277 -168 95 -511 154 510 -327 639
6655F39p45O3k53K52J93O02q10l61M41J64j312Q36l11M2K35k53O47K31k56n72
$$ 639 -106 -43 -296 -44 149 751 -59 -420 21 185 -1127 -291 -602 -560 -325 -578 69 300 44 -528
6675e28O13p45L15L51r39M60J43j3Q30N09j486m51J443m74L07m05J78p05O13L2
$$ -528 85 -660 -345 6 -933 -473 -330 -343 487 996 -490 -941 502 28 335 -70 108 -597 16 48
6695D8k77J046o82K62j54j138O48n42J012m48J1o2L94k84J21J1N06o44j4j71N37
$$ 48 -229 817 135 397 243 -895 -247 -789 223 -225 -214 -276 118 -166 -45 -34 472 -172 -186 -357 180
6716A80n66J90J56M33r21J97P15l07j71K79N05j039J243n11J9m83l8J06K28j18
$$ 180 -386 -196 -40 393 -528 -331 384 77 -94 185 690 -349 894 383 402 -81 -119 -13 215 97
6736I7n56k00L88P69K6k44p76P62k06l72K78M25j85k22l29N45n80O61K51j77j48
$$ 97 -459 -659 -271 498 524 280 -496 266 60 -312 -34 391 206 -16 -345 200 -380 281 532 355 207
6757B07J74o82L67Qm30O96l49Q06n56l16O07p55k29P59j49l33J50n97P72k71j23
$$ 207 381 -301 66 74 -356 340 -9 797 241 -75 532 -223 -452 307 158 -175 -25 -622 150 -121 -244
6778b44M58j34k16O56m69o67P71k19l64N07PN11N27q68r35P65p7N09p6r4m98l30
$$ -244 214 80 -136 520 51 -616 155 -64 -428 79 86 597 1124 256 -679 86 9 518 442 348 -150 -480
6800d80J87P14R2o37O85p25O15r25N67m35K86K23q4o8j79P81j60L3o44K83m77
$$ -480 -293 421 513 -124 561 -164 451 -474 93 -342 -56 167 83 15 -164 617 457 490 -154 129 -348
6821c48J169p61n0M16o80N18j71n2L35j239R23K36p13M89r17P07j72O98o77m1
$$ -348 821 60 10 426 -254 264 93 41 376 -863 60 296 -417 72 -845 -138 -310 388 -289 -330
6841c30j77J070q20L55k7K9M18l83m76L83n2j61j68k63J057l62n49j34M91K57
$$ -330 -507 563 -257 98 71 100 518 135 -341 42 -10 -171 -339 -602 455 93 -456 -590 -99 158
6861A58Mm10L25Q71m75L4j004j03K65N3l44R72r56J107n15j53j78N20k3n05N07
$$ 158 162 -248 77 948 473 507 -497 -600 -335 -282 -626 346 -610 497 -18 -171 -349 171 148 -357 150
6882A50J85m77k04N67l73l88k75J276j322K178j662O31m65R05m77K83l68k04j03
$$ 150 335 -142 -346 221 -152 -540 -815 461 -861 1317 -345 286 -179 726 249 532 164 -40 -143
6901a43j04L98N84r71O00l38n5M49j057J011m75O38q2m57k13L52m85o9N16N95
$$ -143 -247 151 735 -236 364 26 -29 420 -637 374 -101 537 455 -2 -215 137 -348 -417 99 694
6921F94o30Lk10R03r50m28O82p7O1n07P60m21K93L7J76l60k43Q48r32O26l37J81
$$ 694 64 67 -143 760 -190 -618 64 -13 48 -459 301 -120 173 210 386 26 -217 631 -301 325 -12 169
6943A69j07R1j152J046j51n44R24r7k36K87q76J043j62K54l97J62j062J122l11
$$ 169 62 153 -999 47 -104 -648 276 179 -57 230 -646 397 235 489 92 254 -808 314 3
6962Cl35J084q36P9L51L07p30M70p06l04K92O78m97N76m50j27K98p87M34L20K20
$$ 3 -332 752 -84 -5 346 653 -77 393 -313 -617 -325 353 -144 432 -18 -145 153 -634 -200 120 340
6983C40j70J0N9R8k45l47P33o14K79Q2o14R37n19K95n05m09J085n19l84P35o09
$$ 340 170 180 239 337 92 -255 478 -136 143 225 -389 548 29 324 -181 -590 495 -24 -408 327 -282
7004b82R76o31l07J066p00N03p20n06N97j9K93q54k6L74N60o8N6J61l52m79J86
$$ -282 694 63 -244 822 122 625 -95 -601 -4 -23 270 -584 -610 -236 324 256 312 473 121 -358 -172
7025a72P03p67o7Q67j230J039k99o11O91P7p87K29j64M79j15j31K97%P1K7K23
$$ -172 531 -236 -303 564 -666 373 74 -537 154 231 -556 -327 -491 -12 -127 -258 39 39 110 137 360
7046C60m71j40r3N72p14N99L20k54o50M72m5J023p8o27K15j315J377j76m06J39
$$ 360 -111 -251 -344 228 -486 113 433 179 -471 1 -44 979 901 274 489 -826 551 375 -31 108
7066A08P31o90o2m9J09M88r81k91O20K92n57q0J08J42k61R17j72k46m47P36M7
$$ 108 839 149 87 38 147 635 -346 -637 -17 275 -282 -362 -254 -112 -373 544 372 126 -321 415 462
7087D62q70M63J33m1l78N83p2m91J2m13K29J48R27r06j25K13L27n7L59k04m94
$$ 462 -408 55 188 147 -231 352 280 -211 -199 -612 -383 -235 692 -214 -339 -126 201 144 503 299 -195
7108a95O55n78K34J07n46N73o82L37P56o73J60k04q83O18M61K14n54N08j78m7
$$ -195 460 -118 116 223 -323 250 -432 -95 661 -12 148 -56 -939 -321 140 354 -200 308 130 83
7128H3J29k47j06n50L53J80Q7L29p71j86M85M93J92q31O71m93L86K85l81K74l78
$$ 83 212 -35 -141 -691 -338 -158 -71 258 -513 -699 -214 279 471 -360 311 -182 204 489 108 382 4
7149Dk46M36j328J218k97j74P44r18J411j203O7O22m12N22q75K70j90N88r0n88
$$ 4 -242 194 -1134 84 -213 -387 357 -561 850 -353 -286 336 -76 446 -429 -159 -349 239 149 -439
7169d39L88n42P07o28o75J176L04n19O1N6M9k57M28O3JL28n81o4K25l05L08p52
$$ -439 -51 -593 114 -514 -1189 -13 291 -228 -167 -111 -62 -319 109 172 173 501 -80 -144 81 -224 84 -668
7191f68O38K53Jq57P73n9p24P12K4M4J2q70J164q54O09J14m18M63l5l52j55M00
$$ -668 -30 223 224 -633 140 81 -643 69 93 137 149 -721 443 -411 198 312 -106 357 322 -30 -185 215
7213B15J1j085Q51K26n60K40J4N23J96j016J366o67q11N84K36q50M64j43J506
$$ 215 226 -859 -8 218 -342 -102 -88 435 631 -385 981 314 -497 87 323 -527 -63 -206 1300
7232A300r25m6n92L29l23q4M77K39n79Q37j317J221m3q9n5m32K47p59J171j62
$$ 1300 375 329 -263 66 -257 -341 136 375 -204 633 -684 537 494 405 350 -82 165 -594 577 415
7252D15l12K16j378J247j70j035J367o20N45M78p68m61K43R21m66j26J23m83K82
$$ 415 103 319 -1059 188 18 -1017 350 -270 275 753 -15 -476 -233 688 222 96 219 -264 18
7271A8M7k41j7P83j127M85J35r1M98o06o3P39j291P78M84j13q31M24j67k77P77
$$ 18 65 -176 -193 590 -537 -52 83 -8 490 -116 -179 560 -731 47 531 418 -413 11 -156 -433 344
7292C44o73N04K07n83j05K02L78o42J40J58M9K18o31J58L65L89m60k88J52O6M53
$$ 344 -329 175 382 -201 -306 -104 274 -368 -228 -70 -21 197 -434 -276 89 478 18 -270 -118 -52 401
7313D01p91Q13k48L13p61N04k62k57L72k82j84Q5K13L10n22l47K42M15L02m4p07
$$ 401 -390 423 175 488 -273 231 -31 -288 84 -198 -382 -297 -84 226 -296 -643 -401 14 316 272 -435
7334d35n5N37p78Q10o37R32o93N93l43k20J53J74k00J70J39o2O11m71R7o67R5
$$ -435 -490 47 -731 79 -558 374 -319 274 -69 -289 -136 38 -162 8 147 85 696 225 322 -345 -250
7355b50j05P37n11N94l26M6J41l00L14o01j04k14J109k57o60P43Q9q64J047j092
$$ -250 -355 382 -129 465 139 185 326 26 340 -261 -365 -579 530 273 -387 356 445 -419 628 -464
7375d64L61j23J84O06K68p39j4l76J160j437J137o49j1M40r61J21Q22j98l64k28
$$ -464 -103 -226 -42 564 832 93 79 -297 863 -574 563 -86 -97 343 -618 -497 325 127 -237 -465
7395d65J524p76l98K37n52K83N88m30m62J503p05l72j99N93j27K78r95M69k62
$$ -465 1059 283 -115 122 -430 -147 441 11 -451 1052 347 -25 -224 369 242 520 -475 -6 -268
7414b68J73l59Q65k77j090P78L76K70l88J31n50j75L74m55N70n24J399j313L79
$$ -268 -95 -454 411 134 -956 -178 198 468 80 211 -339 -514 -140 -595 -25 -549 850 -463 -84
7433h4L25l64O43j16k48m30N07l34j72k51O65L7M1J07j77p28J97J92J83L60k60
$$ -84 241 -123 520 404 156 -274 233 -101 -273 -524 141 178 219 326 149 -579 -382 -190 -7 353 93
7454I3m20J79L42j01K51o10M19k78J80k47M80p53J3J195r01L54M9l25n24M13j06
$$ 93 -327 -148 194 93 344 -266 153 -125 55 -192 288 -465 -452 743 -158 196 245 -80 -604 -191 -297
7475b97l77N55PQ52q1l00J69o20L6j056J018k96J204j122K60l15Q07m75O5j62
$$ -297 -674 -119 -112 740 659 359 528 -92 -56 -1112 -94 -390 814 -308 -48 -363 444 -31 34 -128
7495a28K4M95j438Q92K53K61l47J31m93Q86r54N59R6l64o2k36P80m33k86K28M2
$$ -128 -104 391 -1047 -155 98 359 12 143 -350 536 -418 141 237 -127 -189 -425 355 -78 -364 -136 -94
7516i4N32o12ML34q94k69J392M6m70k79N34K46l27j24l5K05l28l8L15Q6l97P56
$$ -94 438 -174 -170 164 -730 -999 393 439 -31 -310 224 470 143 19 -16 189 -139 -177 138 224 -173 583
7538E83k88N0l86O6J2M82j37j29m03J74N28j33om12n50Q42o4K15p62l88O02n50
$$ 583 295 345 -41 25 37 519 382 253 -150 24 552 419 413 1 -549 293 229 444 -318 -706 -104 -654
7560f54O12L26j86l33j25K61L32L8j98n64J146k27m60N57k92n12M48j140J245
$$ -654 -42 284 98 -235 -360 -99 233 271 73 -491 655 428 -32 525 233 -279 169 -971 274
7579B74j56J35l22K73J04l67m89J226j182P88N19n29n43L30rMm06M49J3K16J81
$$ 274 118 253 -69 204 308 -59 -548 678 -504 284 803 274 -269 61 52 56 -350 99 112 328 509
7600E09j7n7J24o63P33j18j03j29J40o31n66N25k31R12l23Q0p11P11o62P53j23
$$ 509 492 435 559 -104 629 511 408 279 419 -212 -778 -253 -484 428 105 185 -526 185 -477 276 153
7621A53L99n32L64o60K81L32M04n13l03J13l78K69Q16q41m36L48m83J90N41n10
$$ 153 552 20 384 -276 5 337 741 228 -75 38 -340 -71 745 -96 -532 -184 -667 -477 64 -446
7641d46J038K1q16J03L97l92J128j219K34q1j16M53o05J05K72p22P44K91n23O58
$$ -446 592 613 -203 -100 297 -95 1033 -186 48 -33 -149 304 -301 -196 76 -646 98 389 -134 524
7661E24n6Jm57K72m34N63q89m38N79k84P4J120l61n71J264j091L71n71L74k58
$$ 524 468 469 12 284 -150 413 -476 -914 -335 -619 -545 575 214 -357 907 -184 187 -384 -10 -268
7681b68K71K78l88p4O67k90p37R18k50Q8k88o0p6l05N22M63j009N30M13N31j071
$$ -268 3 281 -107 -181 486 196 -541 377 127 215 -73 -133 -209 -514 8 471 -538 -8 405 936 -135
7702a35J02k11N17K98l16k60J16N30o89O26j67p66O97l38L98q44K40L70J32p14
$$ -135 -33 -244 273 571 255 -5 111 641 -48 578 411 -355 342 4 402 -442 -202 168 300 -414
7722d14N67l04K03j6m91Q41l20j47k49oK37M13p95M57m69K27J64K8K68l19J22
$$ -414 153 -151 52 36 -455 386 66 -81 -330 -336 -99 314 -481 -24 -493 -266 -102 -74 194 -125 -3
7743cN64j218P44l83R88l57j129J102n66P53p2n55k23M93O4Q2N8n36l54Q27m02
$$ -3 561 -657 87 -296 692 335 -794 308 -258 495 423 -132 -355 138 202 284 342 -194 -548 279 -123
7764a23j96O56rK30k55p0n80R2J86N43q47M23l88N77L74q39M81j87L63j356M99
$$ -123 -319 337 328 558 303 233 -347 -255 -69 474 -373 50 -338 239 613 -226 255 68 431 -925 -426
7785d26O01J01M21n48k28l03Q72p28M34j9o36P02M08n61J44n9m27L06k39J01K89
$$ -426 175 276 697 149 -79 -382 490 -238 196 177 -459 243 651 90 234 175 -252 54 -185 -84 205
7806B05m92O22l17K20L48l30J55p71P16o43L96L55n25J39J02l91O27r90j1M92
$$ 205 -287 335 18 238 586 256 411 -360 356 -287 109 464 -61 78 180 -211 416 -574 -585 -93
7826i3J47O8K67J95k04k08j6O3l78M21r46N37q8L38l49j76M54k99L19l95L91m24
$$ -93 54 122 389 584 380 172 156 219 -159 262 -684 -147 -235 103 -246 -422 32 -267 52 -343 48 -376
7848c76P9n06J540o22j1J45q34L79l72O48j15N20l82m81J002n77R1k9o89J288
$$ -376 -297 -803 737 115 104 249 -585 -206 -578 70 -45 475 93 -388 614 37 128 99 -590 698
7868F98j04m01Nj033Q54o8L88j96m54M48O23j328L94l40J180m21m54O2N85k48
$$ 698 594 193 198 -835 19 -49 339 143 -311 137 760 -568 -174 -514 666 245 -209 -147 438 190
7888A90j050Q19o97O56k55L31m62k01M15j97O00j96r2J98l2l13k4L11N24r88O60
$$ 190 -860 -41 -738 -82 -337 -6 -468 -669 -254 -451 149 -47 -139 59 27 -286 -310 1 525 -463 197
7909A97m79J44K51p90K28R23K12n17r38M52J124o36k73L38k62k36J29K00P9m41
$$ 197 -282 -138 113 -677 -449 474 686 169 -769 -317 807 171 -102 236 -26 -262 -133 67 146 -295
7929b95l94N34M04On02L05j95L57L49n13J82K18j296M71R71l00L37l3K94j586
$$ -295 -689 -155 249 255 -247 58 -137 220 569 56 238 456 -840 -369 602 302 639 606 900 -686
7949f86O25L19j01L69j29k21M97k59O5n28n98P36j79K77j75J90k92K48J93o3l11
$$ -686 -61 258 157 526 397 176 673 414 479 -49 -647 89 -90 187 12 202 -90 158 351 288 -23
7970b3l27K42L19N25p14N67m03k20l22M69p4N21r79P95k99k9j42k16K4L08r7m30
$$ -23 -350 -108 211 736 22 589 186 -34 -356 113 39 560 -419 376 77 48 -94 -310 -286 22 -75 -505
7992e05L15K4K87J14l10K17M5m19O36l81K0j70j75N98L17k73J45k52j32o30j50
$$ -505 -190 -166 121 235 -75 142 187 -232 404 23 43 -127 -302 296 613 340 485 233 101 -529 -679
8013f79J010o46R9JN56o59O88m92K06r5J93j79L08j64N08j001O12k28L79j36n93
$$ -679 331 -315 -216 -215 341 -318 370 -122 84 -11 182 3 311 147 655 -346 266 38 417 281 -312
8034c12m2Q08n31n9NM10l41j32N95l78n30J82K65m9L30n95Q9k13M17l54O79o40
$$ -312 -354 454 -77 -136 -131 279 -62 -194 401 23 -507 -325 -60 -109 221 -374 -285 -498 -81 -435 244 -396
8056c96L36j05l15N65J10k22n77J265o88O52o68j52O7P8Lm06P57n00J98j99N41
$$ -396 -60 -165 -480 85 195 -27 -604 661 -27 625 -43 -195 -128 -50 -47 -453 304 -196 2 -197 344
8077C44r75O30j64M32o25K84k27j51L56N45k83m49J51J75n82J54Q45J59m88K15
$$ 344 -631 -1 -165 267 -358 -74 -301 -452 -96 449 166 -283 -132 43 -539 -385 460 619 131 346
8097C46L0N2l23J11m96K64P1N4Ol80Q0L44p9r7n56P20P6L16l8K60p53Q57r70Q38
$$ 346 376 428 105 216 -280 -16 55 109 115 -265 -185 159 80 -17 -573 147 223 539 501 761 8 865 -105 733
8121G33o10n93K86L12p30j55J477j330Q68n40Q80J53j552J245o00P5J64M46l09
$$ 733 123 -470 -184 128 -602 -757 720 -610 258 -282 598 751 -801 444 -156 -81 83 529 220
8140B20j17m80l50R32k5q1j128J264n22lP82M74r94K6N02p91n36R71L19O47j582
$$ 220 103 -377 -727 205 180 99 -1029 235 -287 -290 492 966 -28 -2 500 -291 -827 144 463 1110 -472
8161d72L73k22J87j12P63k54j59k43l32L02k92M24k30mQ16l0l90M72o62j10J89
$$ -472 -99 -321 -134 -246 517 263 104 -139 -471 -169 -461 -37 -267 -271 545 515 125 597 -65 -175 14
8182A4K25o20M96k19M11l06M09k30k26
$$ 14 239 -381 115 -104 307 1 410 180 -46
8191d6
$$ Imaginary data points
##PAGE= N=2
##DATA TABLE= (X++(I..I)), XYDATA
0@%%%%%%%%%%%%%%%%%%%j0P4j28J28j28J28j29J82k45K56k62L25l83M20m84N43
$$ 0 0 0 0 0 0 0 0 0 0 0 0 0 0 0 0 0 0 0 0 -10 64 -64 64 -64 64 -65 117 -128 128 -134 191 -192 228 -256 287
35B87o09O94p73Q54r65J082j202J332j471J631j803J988k193K412k659K935l236
$$ 287 -322 372 -401 453 -512 570 -632 700 -771 860 -943 1045 -1148 1264 -1395 1540 -1696
52a696L566l931M338m797N317n914O609p415Q376r542J0991j2863J5362j8918
$$ -1696 1870 -2061 2277 -2520 2797 -3117 3492 -3923 4453 -5089 5902 -6961 8401 -10517
66a0517K4374l3966N5932k25649P9105K91352j50064j61578N0859J85493k6649
$$ -10517 13857 -20109 35823 -189826 -110721 180631 30567 -131011 -80152 105341 78692
77G8692j25293l3664J35328N9720j10739j08046J14836J19662r9444j55517P6561
$$ 78692 -46601 -80265 55063 114783 4044 -104002 10834 130496 31052 -124465 -47904
88d7904J43290m9990j52719K6525J37574K644j30341j6060J18947N2330r3770
$$ -47904 95386 45396 -107323 -80798 56776 59420 -70921 -86981 31966 84296 -9474
99i474o3831P7776R1236n3849j08439L3090J21131j9027j33433j931J21954O427
$$ -9474 -73305 4471 95707 41858 -66581 -33491 87640 68613 -64820 -66751 55203 61630
111F1630j18538k6169R5221M1513p1016n7162N2965P9065k6169q8193J5478J05214
$$ 61630 -56908 -83077 12144 53657 -17359 -74521 -21556 57509 31340 -56853 -41375 63839
123F3839O890j02478j8799R7301K8568q9771m6136O9196M8968n8996o3639L7782
$$ 63839 70729 -31749 -50548 46753 75321 -14450 -60586 8610 57578 -1418 -65057 -27275
135b7275O6224k5272p3054J1109P9810R808p4026j8460Q1238L7287p2243m5679
$$ -27275 38949 13677 -59377 -48268 31542 41350 -32676 -51136 30102 67389 -4854 -50533
147e0533O9829N3711o1886o1224M3058O0849l2132p0961P159O8766Q886p4924
$$ -50533 19296 73007 11121 -50103 -7045 53804 21672 -49289 -42130 26636 35522 -39402
159c9402k6476P6393M2033o9664m7913O9240O1250n3061n9579M2096O5571k4070
$$ -39402 -65878 10515 52548 -17116 -65029 4211 65461 12400 -47179 -5083 60488 36418
171C6418o8188M630O5894P723p0332k9147O1938L6164o1090m8630N2002N5824
$$ 36418 -31770 -27140 38754 46477 -23855 -53002 8936 45100 -15990 -64620 -12618 43206
183D3206m0240n6995L3211O4611j6519n9187Q560O0847Q112n4338k2414M8415
$$ 43206 2966 -54029 -20818 43793 27274 -31913 -23353 37494 45606 -8732 -31146 17269
195A7269L2268m7292m8157L5183N1598l2745n9590K0520N9370j0486n6979J654
$$ 17269 49537 2245 -45912 -10729 40869 8124 -51466 -30946 28424 17938 -39041 -37387
207c7387N6191J4803m4341k2676M1590L8596l1059m5747K3398N2126j7014n8655
$$ -37387 18804 33607 -10734 -33410 8180 46776 15717 -30030 -6632 45494 28480 -30175
219c0175M012N3731O92n5224j4425M5623K2592m0476k8481L1874M0452j9594m2901
$$ -30175 -26163 27568 28260 -26964 -41389 4234 26826 -13650 -42131 -10257 30195 10601 -32300
232c2300J4641N3380k315n2029n066N3799J2314n1619k1849M1754K5295m0284
$$ -32300 -17659 35721 33406 -18623 -23689 30110 42424 -9195 -31044 10710 36005 -4279
244d279l5122K6603L6014j7701m3206Q715M8169M699m7556r580N2486K1089m5503
$$ -4279 -39401 -12798 23216 5515 -37691 -28976 19193 23892 -23664 -33244 19242 40331 -5172
257e172k5144M4311L1825l7140l7552K5356L7788j9326m3403L463M1635K254m4220
$$ -5172 -30316 13995 45820 8680 -28872 -3516 34272 14946 -28457 -24994 16641 18895 -25325
270b5325j3498M3174K2924l8379k7136L7382L6317k6981l4744K3096L7245j1360
$$ -25325 -38823 4351 27275 -11104 -38240 -858 35459 8478 -26266 -3170 34075 22715
282B2715l7832L260L5358K805l7277j6353L0581K0694l1437k8778K4697L2629
$$ 22715 -15117 -11857 23501 26306 -10971 -27324 3257 23951 -7486 -36264 -11567 21062
294B1062j8879l3449J6305L6329n932l1853L505L2328Q926k9387j4816K4461K1295
$$ 21062 2183 -31266 -14961 21368 15436 -16417 -12912 19416 28342 -1045 -15861 8600 29895
307B9895k3614k9815J5260K9035j2338l5733N282L2867l76l0615m185K9076J3760
$$ 29895 6281 -23534 -8274 20761 8423 -27310 -22028 10839 10463 -20152 -24337 4739 18499
320A8499k2207j5453K1083K4053j2909k6130P688L0531m941l3020j925K8995L295
$$ 18499 -3708 -19161 1922 25975 13066 -13064 -5376 25155 20214 -12806 -14731 14264 17559
333A7559l2548j0177K6653J2502k3730j7566J9951K3988j1656k4658Q120L1834
$$ 17559 -14989 -25166 1487 13989 -9741 -27307 -7356 16632 4976 -19682 -11562 20272
345B0272N59l0083l175L2264P123l1405j2671K6475J2388k4747k0032J7032K0091
$$ 20272 20831 -9252 -12427 19837 26960 -4445 -17116 9359 21747 -3000 -23032 -6000 14091
358A4091j3710k4740P331K8006n05k6779l635L0947J1135k6761j0898K6314J6015
$$ 14091 381 -24359 -17028 10978 10473 -16306 -19941 11006 22141 -4620 -15518 10796 26811
371B6811k2155j7923J6342J7703j3751k2679M384K1449k817k4539m644K4720Q216
$$ 26811 4656 -13267 3075 20778 7027 -15652 -11268 10181 7364 -17175 -21819 2901 11117
384A1117k1062j2315K2049J9169j6933j7368J7138K0096q963k1362M781J9767
$$ 11117 -9945 -22260 -211 18958 2025 -15343 1795 21891 12928 -8434 -3653 16114
396A6114r13k0915p693J6174J0681j8469j7344J2954K0516j1962j9146R304K2528
$$ 16114 15201 -5714 -13407 2767 13448 -5021 -22365 -9411 11105 -857 -20003 -10699 11829
409A1829k877j9053J127K0945O042j6713q791J4082J3931j4317j8863P142K0438
$$ 11829 8952 -10101 -8974 11971 18013 1300 -7491 6591 20522 6205 -12658 -5516 14922
422A4922r183k4145K537K3178l76k2216l353K2093Q631j6714j0498J6210J8058
$$ 14922 5739 -18406 -15869 7309 6933 -15283 -18636 3457 12088 -4626 -15124 1086 19144
435A9144j0080j8045O600K2607m284k5000j292K3216K018k5608p546J9943Q578
$$ 19144 9064 -8981 -2381 20226 15942 -9058 -10350 12866 14884 -10724 -18270 1673 10251
448A0251j9149j2313J5713J6127r280j7321P719K2776k73k0805j897K2716N361
$$ 10251 -8898 -21211 -5498 10629 1349 -15972 -8253 14523 14250 -6555 -8452 14264 19625
461A9625k1131q619J8719P554j8897j2574J3318J1525j2456j5110P242J6300j276
$$ 19625 -1506 -10125 8594 16148 -2749 -15323 -2005 9520 -2936 -18046 -10804 5496 4220
474D220j7798M81J9782P040j6639o924J6952J0538j3338j1215J0588J1225q909
$$ 4220 -13578 -13097 6685 13725 -2914 -9838 7114 17652 4314 -6901 3687 14912 6003
487F003j6314L405J3088j513j5497l971J2413Q162j1560r704J2998J2861p870
$$ 6003 -10311 -6906 6182 4669 -10828 -14799 -2386 5776 -5784 -15488 -2490 10371 2501
500B501j1150P828J4816l891j3269L41J3215J597j2887p702R270P918j0315j3126
$$ 2501 -8649 -821 13995 10104 -3165 -2824 10391 11988 -899 -8601 669 8587 -1728 -14854
514a4854P098J3409n963j4282M550J5260M80j2484L5J3319O488j0773p535J0217
$$ -14854 -7756 5653 -310 -14592 -10042 5218 5698 -6786 -6751 6568 13056 2283 -5252 4965
528D965J0437q760j4489M919J3436n467j7330J155J4381P01j4614k863J4226N823
$$ 4965 15402 6642 -7847 -2928 10508 5041 -12289 -11134 3247 3948 -10666 -13529 697 6520
542F520j0475n981J1076J0126n414j0878N277J2298j518j4924m82J4222j057j5991
$$ 6520 -3955 -9936 1140 11266 5852 -5026 251 12549 11031 -3893 -4375 9847 8790 -7201
556g201l055J2514K461j2875n561J0773P364p007p613O724J1988j218j1293J780
$$ -7201 -10256 2258 4719 -8156 -13717 -2944 4420 -2587 -10200 -3476 8512 7294 -3999 -2219
570b219J2677R57j2714k652J1800K822j3286n601Q441M557p624q814N356Q563
$$ -2219 10458 11415 -1299 -3951 7849 10671 -2615 -8216 225 4782 -2842 -11656 -6300 2263
584B263k887p515J61J1430L464q036l880J0969O182q421o380N941P041n245j0214
$$ 2263 -624 -8139 -7978 3452 6916 -1120 -5000 5969 12151 3730 -2650 3291 10332 5087 -5127
599e127J568O802j138q743l154P981M202p140o089P803R810n162q178N651J1129
$$ -5127 -3559 3243 2105 -6638 -9792 -1811 2391 -4749 -10838 -3035 6775 1613 -6565 -914 10215
614A0215k690q903L98R302J424r591n679P396N829q309j0102M263J0617l814j1338
$$ 10215 7525 -1378 -980 8322 9746 155 -5524 1872 7701 -608 -10710 -6447 4170 356 -10982
629a0982K284J3063J071j1925M50J1899L810p881m699P204P194n282j0113K204
$$ -10982 -8698 4365 5436 -6489 -6039 5860 9670 1789 -2910 4294 11488 6206 -3907 -1703
643a703Q646k908j1877R85Q868J103j2685M9Q861M462o961l330O609O875l549
$$ -1703 6943 4035 -7842 -6857 2011 3114 -9571 -9522 -661 3801 -3160 -6490 119 6994 3445
658C445o207L547Q413j412q747l07P529n74r297k640O638K486p929l163M870M836
$$ 3445 -2762 785 9198 7786 -961 -1268 6261 5687 -3610 -6250 388 2874 -5055 -8218 -3348 1488
674A488l353m559L491O344O71m476r00O111L431o156k897M207K908m752m705J966
$$ 1488 -1865 -6424 -2933 3411 4082 -394 -1294 4817 8248 2092 -805 3402 6310 1558 -3147 -1181
690a181K224k828m160N92K912J488l643j246M433L720k204j736L860M494l173
$$ -1181 1043 -1785 -5945 -5353 -2441 -953 -4596 -5842 -1409 2311 107 -1629 2231 6725 3552
705C552l410K770L420k563n028o43L362j76m718k484L089K839m197l570M272N333
$$ 3552 142 2912 6332 3769 -1259 -1902 1460 1284 -3434 -5918 -2829 10 -4187 -7757 -3485 1848
721A848j441n349L728P033k18n457M33M989J150m836l523K280L418m917n531K477
$$ 1848 407 -4942 -1214 5819 5601 144 577 5566 6716 1880 -1643 637 4055 -862 -6393 -3916
737c916M493k400n874K325O774p26n097K681N392P34m145j76M853K461n076k847
$$ -3916 577 -1823 -7697 -5372 1402 676 -4421 -1740 3652 4386 241 65 4918 7379 2303 -544
753e44K815K745m055n117J255M540l445n395K030N833j556l907J75N420K969l149
$$ -544 2271 5016 961 -4156 -2901 1639 -1806 -7201 -5171 662 -894 -4801 -4626 794 3763 614
769F14j822L873L789k483l540O2L891o87m838k212M012k28m230j746L039P99r60
$$ 614 -1208 2665 6454 3971 431 493 4384 3697 -1141 -3353 659 431 -3799 -5545 -2506 -1707 -2667
786b667k057K700K591Q29k034J291L581J135l360j032L051J315n607k021J859
$$ -2667 -4724 -2024 567 1396 -638 653 4234 5369 2009 977 4028 5343 -264 -2285 -426
801d26K382k433n184J716K876J005n351m91N023L891m182j920M626M775l242l483
$$ -426 1956 -477 -5661 -3945 -1069 -64 -5415 -5906 -883 3008 -1174 -3094 1532 6307 3065 -418
817d18K655M193k705m964r8M148N3n439l108L471L514m742l583L789N563k642
$$ -418 2237 6430 3725 -1239 -1337 2811 2864 -2575 -5683 -2212 1302 -3440 -7023 -3234 2329 -313
833c13l655K811O187j276m052J347L942l20m161r91K986J451m618l923K155K831
$$ -313 -3968 -1157 5030 3754 -298 1049 4991 4671 510 -481 2505 3956 -662 -4585 -2430 401
849D01k325m906K919M137m75l363Q10N432Q58l025o18K886K365k261k589R60J485
$$ 401 -1924 -6830 -3911 226 -249 -3612 -2802 2630 3488 463 -155 2731 5096 2835 246 1206 2691
866B691n42m221k27K354j016k370p66K368K73o47q74J857K025P07j060j72K969
$$ 2691 2149 -2072 -2299 55 -961 -3331 -4097 -1729 -1456 -2103 -2977 -1120 905 1612 552 380 3349
883C349J72j74k001O52R84j076k730k31J211j702k609J008J241J61o88L49J306
$$ 3349 3521 3347 1346 1998 2982 1906 -824 -1055 156 -1546 -4155 -3147 -1906 -1745 -2433 -2084 -778
900g78J731p05q44K810J609j128j608J328K168k508k977O29O43q7l576K87R18
$$ -778 953 248 -596 2214 3823 2695 1087 2415 4583 2075 -902 -273 370 283 -3293 -3006 -2088
917b088J70q92q76K158K916k136m75J687L471j520k756K717K298k173k361O89
$$ -2088 -1918 -2810 -3686 -1528 1388 -748 -1223 464 3935 2415 -341 2376 4674 2501 140 829
933H29J785k188k895j59J063L79j795j959L642K064k308j409K729L667k258j573
$$ 829 2614 426 -2469 -2628 -1565 -1186 -2981 -4940 -1298 766 -1542 -2951 -222 3445 1187 -386
949c86K421K746j061l699K16K883m06l725j703J819R98j762k445J169K295r26
$$ -386 2035 4781 3720 21 237 3120 2714 -1011 -2714 -895 103 -1659 -4104 -2935 -640 -1566
965a566j862J052K981O73m32P65R55J238j059j639N37J523j920j987p12O82J19
$$ -1566 -3428 -2376 605 1278 846 1611 2566 3804 2745 1106 1643 3166 1246 -741 -1453 -771 -652
982f52k299k87J284N15j079m46J648K079q69n31J270J664R35j345j091J845Q98
$$ -652 -2951 -3238 -1954 -1439 -2518 -2964 -1316 763 -106 -637 633 2297 3232 1887 796 2641 3539
999C539k739k180P25J602k086j649O93J949j344k064M08K959J368k089r05K755
$$ 3539 800 -1380 -655 947 -1139 -2788 -2095 -146 -1490 -3554 -3146 -187 1181 -908 -1813 942
1015I42K454j289k546K054K904j519l481J207P15j709j954n22J505P56k520o97
$$ 942 3396 2107 -439 1615 4519 3000 -481 726 1441 -268 -2222 -2744 -1239 -483 -3003 -3700
1031c700K315J625j081j086K095K412r50j421J129K245p23k082%J403j178k261
$$ -3700 -1385 240 -841 -1927 168 2580 1630 209 1338 3583 2860 778 778 2181 1003 -1258
1047a258r9K23K63j601p90Q54K146n77j336O65K717o92q37J511J135o76L35n18
$$ -1258 -1357 -1134 -871 -2472 -3262 -2408 -262 -839 -2175 -1510 1207 515 -322 1189 2324 1648 1983 1465
1065A465L86k41o71k282l57O75Q57j484j632J121R15q87N55R80J568k18O05O2
$$ 1465 1851 1610 939 -1343 -1700 -1025 -168 -1652 -3284 -2163 -1248 -2135 -1580 -600 968 750 1355 1417
1083A417J149P40j317p53O54L87k114j393L59Q99r97k345R84R01M7p08L82J484
$$ 1417 2566 3306 1989 1236 1890 2277 163 -1230 -871 28 -969 -3314 -2330 -1429 -1382 -2090 -1708 -224
1101b24O39n83n49J480K050q27j711J953J201j886j398K76J85j184j767O81O04
$$ -224 415 -168 -717 763 2813 1986 275 2228 3429 1543 145 421 606 -578 -2345 -1664 -1060
1118a060m71n73L29K07J473j125R94J171J456j689N0J893P1j600j029J341j76
$$ -1060 -1531 -2104 -1775 -1568 -95 -1220 -226 945 2401 712 762 2655 2726 1126 97 1438 1262
1135A262j662n82o2M83j244n54Q9P66N88j711J685J007R08mJ32Q53Q64j135j114
$$ 1262 -400 -982 -1044 -561 -1805 -2359 -2270 -1504 -916 -2627 -942 65 973 969 1101 1954 2818 1683 569
1154E69R07L78j630n04j88N35q09r11k54K0O04J21j107K04K588kn62N73J466N38
$$ 569 1476 1854 224 -280 -468 67 -742 -1653 -1907 -1887 -1283 -1162 -2269 -2065 523 521 -41 532 1998 2536
1174B536r09j164K69J588j174j286j081J426p68j241j034J622J373k172l43J553
$$ 2536 1627 463 732 2320 1146 -140 -1221 205 -563 -1804 -2838 -1216 157 -2015 -2358 -805
1190h05J734r48l07Q08J638P97j876m33J717m04j067j485J181M40j515j639K32
$$ -805 929 -19 -326 482 2120 2917 1041 608 2325 1921 854 -631 550 990 -525 -2164 -1932
1207a932J433j218j485J289J082J057j081K80K026l16N9k42O83L73o64j834J160
$$ -1932 -499 -1717 -3202 -1913 -831 226 -855 -575 1451 1135 1194 952 1635 2008 1344 -490 670
1224F70O92j946o83M78n0j077p01R04L65J644j079J03P85J746j154N27j5R28k97
$$ 670 1362 -584 -1267 -789 -839 -1916 -2617 -1713 -1348 296 -783 -680 105 1851 697 1224 1209 2137 1840
1243A840j053L71j239k76N25o91l82j144K69O64j303P67P98M82kO68J24L85R1
$$ 1840 787 1158 -81 -357 168 -523 -905 -2049 -1780 -1116 -2419 -1652 -854 -372 -374 294 418 803 894
1262H94R01L59l73n8j659O81n89M2o54l42l32o58l39J134Q3p26L29J113Q21k43
$$ 894 1795 2154 1781 1723 64 745 156 198 -456 -798 -1130 -1788 -2127 -993 -910 -1636 -1307 -194 627 384
1282C84j21N48J203k56j96o99P88r59j040j83P75n45r59j191J154O26j495k03
$$ 384 263 811 2014 1758 1562 863 1651 692 -348 -531 244 -301 -1260 -2451 -1297 -671 -2166 -2369
1300b369K094M06l20l20J663N44l80j68N71J0M12j628l48O59m02j776q64K135
$$ -2369 -275 131 -189 -509 1154 1698 1318 1150 1721 1731 2143 515 167 826 424 -1352 -2216 -81
1318h1n85k148M08J501L71n59J9K077R86r35J51l30J398O1j819J68j55O90j792
$$ -81 -666 -2814 -2406 -905 -534 -1093 -1074 1003 1989 1054 1205 875 2273 2334 515 683 528 1218 -574
1337e74n40K27P04j929M51Q02j79k95p0M48L82Q73N03K0J291n1r03M40q00J68
$$ -574 -1114 -887 -183 -2112 -1661 -859 -1038 -1333 -1403 -955 -573 300 803 823 2114 2063 1160 1600 800 968
1357I68n92K63o61j177o15PO68r07R17N34m40Q1L85J144o28M72J713l40j150M97
$$ 968 376 639 -22 -1199 -1814 -1807 -1139 -2046 -1129 -595 -1035 -954 -569 575 -53 419 2132 1792 642 1139
1377A139l41N52j274l90K32J54J16k079k84J206L29j061K59J134J23n88N88J027
$$ 1139 798 1350 76 -314 -82 72 188 -1891 -2175 -969 -640 -1701 -1442 -308 -185 -773 -185 842
1395H42J56L62q10N99O52j077j096L72M80kj755m49M07P85j788N0J770O66j020
$$ 842 998 1360 550 1149 1801 724 -372 0 480 478 -1277 -1726 -1319 -534 -2322 -2272 -502 164 -856
1414h56N54P97J265k40k40k06J244l26j069n35L37N27j729q4j63O76j794j19R55
$$ -856 -302 495 1760 1520 1280 1074 2318 1992 923 388 725 1252 -477 -561 -724 -48 -1842 -1961 -1006
1433a006M14k76O09L35K4M76N70j01O39p25R8Ql92k77L1n36m13p9l97O79r75j46
$$ -1006 -592 -868 -259 76 100 576 1146 1045 1684 959 1057 1065 673 396 427 -109 -522 -601 -998 -319 -1294 -1440
1455a440M79O20K87l70l54R22R09m13L87l42K63J19l92K70r62J72p92m19m62k69
$$ -1440 -961 -341 -54 -424 -778 144 1053 640 1027 685 948 1067 675 945 -17 155 -637 -1056 -1518 -1787
1475a787o41J096l51j25P57M22N91Q25k76J26N87l16L31m60N52k57p64J9p12q7
$$ -1787 -2428 -1332 -1683 -1808 -1051 -629 -38 787 511 637 1224 908 1239 779 1331 1074 310 329 -383 -470
1495d70m74j95J39n78L9M30J089l72K18j76J508L95l23o98K31R12j458M48K69
$$ -470 -944 -1139 -1000 -1578 -1539 -1109 -20 -392 -174 -350 1158 1553 1230 532 763 1675 217 665 934
1514I34l79j165o36N78N20j06q39J63L77L79o17N56M87k1N51k5Q93n15L68j248
$$ 934 555 -610 -1246 -668 -148 -254 -1093 -930 -553 -174 -791 -235 252 231 782 757 1650 1135 1503 255
1534B55O58n4l74k34k93L66j886Q00n28R58n35q69J052K71J205l43R41l10l39
$$ 255 913 859 485 251 -42 324 -1562 -762 -1290 -332 -867 -1736 -684 -413 792 449 1390 1080 741
1553G41P43J02n84k71L24j147j31j46p7n89k94N61k85K60j38o35J063J372j95
$$ 741 1484 1586 1002 731 1055 -92 -223 -369 -446 -1035 -1329 -768 -1053 -793 -931 -1566 -503 869 674
1572F74m44J11J404l3j484N77K19J64j023n56O20j68q35n92M81N10o10m74Q28
$$ 674 230 341 1745 1712 228 805 1024 1188 165 -391 229 61 -774 -1366 -885 -375 -985 -1459 -631
1591f31L52M06r91J201J082o94l48P2Q30j01n31j74k52J50j210J76j18J45m32
$$ -631 -279 127 -864 337 1419 725 377 449 1279 1178 647 473 221 371 -839 -663 -781 -636 -1068
1610a068j31O64J42J56n05J02J380K63n22O92j24q79J213n77J96j141K91n36L5
$$ -1068 -1199 -535 -393 -237 -742 -640 740 1003 481 1173 1049 170 1383 806 1002 -139 152 -384 -349
1629c49m41N44m44o20O84p01J274L49n80M24R15l13Pj27M99n36l43J82l0l55N2
$$ -349 -790 -246 -690 -1310 -626 -1327 -53 296 -284 140 1055 742 749 622 1121 585 242 424 394 39 91
1650I1o78P73m57q45L96m49K57p4m23J370l18P66m1N61m07L84k41J03k92M22l20
$$ 91 -587 186 -271 -1116 -720 -1169 -912 -986 -1409 -39 -357 409 368 929 522 906 665 768 476 898 578
1671E78j221K70j95j17q00l75N41O64k62L50L50l9J35M44M2Q35q80P43j88l22
$$ 578 -643 -373 -568 -685 -1485 -1860 -1319 -655 -917 -567 -217 -256 -121 323 365 1200 320 1063 875 553
1691E53l73M17n67K36p64J26O0n78o8m36J297j23l60n96J745R4m36k51J355M87
$$ 553 180 597 30 266 -498 -372 -312 -890 -958 -1394 -97 -220 -580 -1176 569 663 227 -24 1331 1818
1711A818j435l77Q18j21l63l63j98p7n10j24J9r6N64j3p69J558j65l57N49R80
$$ 1818 383 6 824 703 340 -23 -221 -298 -808 -932 -913 -1009 -445 -458 -1227 331 166 -191 358 1338
1731A338n05m75O76l59k31m81n9k46J4N3l69p9K35k3l21K46j20J14M93M04J99
$$ 1338 833 358 1034 675 444 -37 -96 -342 -328 -275 -644 -723 -488 -511 -832 -586 -706 -592 -99 305 504
1752E04J59N76p4m03k42M44p48K30o93k78Ql69K11p49K63M95J22J55o0j21O10
$$ 504 663 1239 1165 762 520 964 216 446 -247 -525 -517 -886 -675 -1424 -1161 -666 -544 -389 -449 -570 40
1773D0l23R52L59M0k78k4J45l11K40j287R76r69q58O75m39l51O40n86Q92M65l70
$$ 40 -283 669 1028 1068 790 766 911 600 840 -447 529 -440 -1298 -623 -1062 -1413 -773 -1359 -467 -2 -372
1794c72J11L60Q26N23p41Q77Mj067J25K2n42l30o25K90k00k62K95K00L00l28p99
$$ -372 -261 99 925 1448 707 1584 1588 521 646 668 126 -204 -829 -539 -739 -1001 -706 -506 -206 -534 -1333
1815a333J282L75j47l90R11K30N51j226j69M50J14l69o56M70m44J27o93j88J373
$$ -1333 -51 324 177 -213 698 928 1479 253 84 534 648 279 -377 93 -351 -224 -917 -1105 268
1834B68j397L14J001j21q27N56J59O32N64q20L15k70j69l6K23j92j31o04K08l96
$$ 268 -1129 -815 186 65 -762 -206 -47 585 1149 329 644 374 205 169 392 200 69 -535 -327 -723
1854g23o41O15O54k06kl61O0J032K03o6m08Q9K96L72L27p35K45p34n28P48o04
$$ -723 -1364 -749 -95 -301 -303 -664 -604 428 631 565 157 246 542 914 1241 506 751 17 -511 237 -367
1875c67j9k07n39Q82j55J04L39M58l74K82L95l0M89r27L52o08Q41m88l98j18o78
$$ -367 -386 -593 -1132 -250 -405 -301 38 496 122 404 799 769 1258 331 683 75 916 428 30 -88 -766
1896g66N56K64m96l31m43N32L9k48N57O38m21O17m09O79n2R5k51O62L3m32j136
$$ -766 -210 54 -442 -773 -1216 -684 -645 -893 -336 302 -119 498 89 768 716 811 560 1222 1255 823 -313
1917c13Q40j226J068j090R9N00M12j078L62Q10p86N62L76j42R9k14Q29r7p11j08
$$ -313 527 -699 369 -721 -622 -122 290 -788 -426 384 -402 160 536 394 493 279 1108 1011 300 192
1937A92k2K76n11l28N40n81q02P06jl40J56N41K8L36m93M46Q9L67J59j35o03J33
$$ 192 170 446 -65 -393 147 -434 -1236 -530 -531 -871 -715 -174 -146 190 -303 143 232 599 758 623 20 153
1959A53m49M30l24K52k43o44J87l0N9j75J95L36N56l8m17kM82J035r64qN23j09
$$ 153 -296 134 -190 62 -181 -825 -638 -668 -609 -784 -589 -253 303 265 -152 -154 328 1363 399 391 914 805
1981H05j377Q34q46O02J00j033Q51q47J73L06J33j57J27L24L4O36n24P69L46k5
$$ 805 -572 262 -584 18 118 -915 -64 -911 -738 -432 -299 -456 -329 -5 29 665 141 910 1256 1231
2001A231m87l75K41m39q32N34O18r97O55q44K68J05J38k14K92R85r16L47l17J78
$$ 1231 744 369 610 171 -661 -127 491 -506 149 -695 -427 -322 -184 -398 -106 879 -37 310 -7 171
2021A71J318j206O67n62J06M44j090lq88N35j79N53o61N11j042J138K32l95R04
$$ 171 1489 283 950 388 494 938 -152 -155 -1043 -508 -687 -134 -795 -284 -1326 -188 44 -351 553
2040E53k42k96N35P40r73K27R7P82j122O32p01o92J51k63l13L98m11J005m6j68
$$ 553 311 15 550 1290 317 544 641 1423 301 933 232 -460 -309 -572 -885 -487 -898 107 61 -107
2060a07K91m08L26Mj0O26l06L14j7l20J90n17K94k75o01M92n96K90L6l86j68k17
$$ -107 184 -224 102 106 96 722 416 730 713 393 583 66 360 85 -516 -24 -620 -330 -294 -680 -848 -1065
2082a065R83j24p99P93P35R5r98O90M20m05l56M60O48j40r49J56%n04r37R85M70
$$ -1065 -82 -206 -1005 -212 523 618 -380 310 730 325 -31 429 1077 937 -12 144 144 -360 -1297 -312 158
2103A58n73K7J44L71n5N55r24O11R20n92M15r11M03j18n11o3k10N17j234J321
$$ 158 -415 -388 -244 127 72 627 -297 314 1234 642 1057 146 549 431 -80 -143 -353 164 -1070 251
2123B51j196j03N45j45Q96j59l66P85J29o82P73m2j74J96n18l8o7o87K4j50L14
$$ 251 -945 -1048 -503 -648 248 89 -277 508 637 -45 728 686 512 708 190 152 85 -602 -578 -728 -414
2144d14J40m3j96J03l67J67N54P88j041L38M77q06L97q0K81k41L56r76k17R20
$$ -414 -274 -317 -513 -410 -777 -610 -56 732 -309 29 506 -300 97 17 298 57 413 -563 -780 140
2164A40j82p75R2M17J23q59P41O22m25K46o32J078j85L60n86O7L07j58r99M59
$$ 140 -42 -817 -725 -308 -185 -1044 -303 319 -106 140 -492 586 401 761 175 242 549 391 -608 -149
2184a49J56L97n94j06J65o00M45M08p33K5N99n92M83j52O84j121O99R75q60l0
$$ -149 7 404 -190 -296 -131 -731 -286 122 -611 -586 13 -579 -96 -248 436 -685 14 989 129 99
2204I9P2n4N80o43J45o52l79N82j9J44p24M04N29J21k96K03n9P24l16k5J65k9
$$ 99 171 117 697 54 199 -453 -832 -250 -269 -125 -849 -445 84 205 -91 112 53 777 461 436 601 572
2226E72l3n30o90Q6K15J94L9l6j91o8K98m82P5K97k60O13m69P20l53N52O36q69
$$ 572 539 9 -681 -595 -380 -186 -147 -183 -374 -442 -144 -626 -551 -254 -514 99 -370 350 -3 549 1185 316
2248C16K22l63O62r52j52o09J441p67j83Q52j014K81l25K32K68j31L02N50j139
$$ 316 538 175 837 -115 -267 -876 565 -202 -385 467 -547 -266 -591 -359 -91 -222 80 630 -509
2267e09N47J09Q3J57N4m09N16n27n17L84m66j03j3K7N9P72j85p95P00L75q29J768
$$ -509 38 147 230 387 441 32 548 21 -496 -112 -578 -681 -694 -667 -608 164 -21 -816 -116 259 -570 1198
2289A198l79k07o37Q3j1K06O35m89n44M21m46l59m7n3L74p1j37M00J39k89J25
$$ 1198 819 612 -25 58 47 253 888 399 -145 276 -170 -529 -576 -629 -255 -326 -463 -63 76 -213 -88
2310h8p3P01M23k5o71O5p0l3M1j87m44k48m2N42q0k96Q62l04l5K38L4m00O59k31
$$ -88 -161 540 963 938 267 332 262 229 270 83 -361 -609 -651 -109 -189 -485 377 73 38 276 310 -90 569 338
2334C38J74J18o86K11O5O26k17m87k48m28J95J77l21m51R13l23P21k10mlK46K32
$$ 338 512 630 -56 155 220 846 629 142 -106 -534 -339 -162 -483 -934 -21 -344 377 167 163 160 406 638
2356F38k48l98L9K24j55r33J455k26m09n65K61l13N90p64M99m51J33O63n87Q90
$$ 638 390 -8 31 255 100 -833 622 396 -13 -578 -317 -630 -40 -804 -305 -756 -623 40 -547 343
2376C43l5M7m0n43o6J90O28l3k33p2j29r28J14O87l53J80N41p19J28j59K55k16
$$ 343 308 355 315 -228 -294 -104 524 491 258 186 57 -871 -757 -70 -423 -243 298 -421 -293 -452 -197 -413
2398d13M69L15k46M06m6k42J72n95M46n39kJ25j170M75J017Mj100J056k23K87
$$ -413 56 371 125 531 485 243 415 -180 266 -273 -275 -150 -1320 -845 172 176 -924 132 -91 196
2418A96q4M53r62O01m2p4R39k86l99l64k87M6J48J85k41k24j1J43k49P13p49R52
$$ 196 112 565 -397 204 162 88 1027 741 342 -22 -309 -263 -115 70 -171 -395 -406 -263 -512 201 -548 404
2440D04n50q62J143N58m86L9j30M06p8K60n82oL58q13J013j389K43M78j46n84
$$ 404 -146 -1008 135 693 207 246 116 522 444 704 122 116 474 -339 674 -715 -472 6 -140 -724
2460g24K1M2N03j90K4J53JO51l51P85j059l17P50l06L12k99o07M03n1l76N20p6
$$ -724 -703 -661 -158 -348 -324 -171 -170 481 130 915 -144 -461 289 -17 295 -4 -611 -208 -259 -635 -115 -191
2482a91l52Q05j09k41j8l38O68K80q93L18J412j283Q9M50m43L63k93r83M19J52
$$ -191 -543 262 153 -88 -106 -444 224 504 -389 -71 1341 58 147 597 154 517 224 -759 -340 -188
2502a88j54l3J1M96l41M27j16j45m13O39o55Q93M24q03J67o73J26Q34j81m50M71
$$ -188 -342 -375 -364 132 -209 218 102 -43 -456 183 -472 421 845 42 209 -464 -338 496 315 -135 336
2523C36j347Q00o23N40r4J05L55j02J42M74q63K35O9J99K7j34l29K69j19k5l10
$$ 336 -1011 -211 -834 -294 -388 -283 72 -30 112 586 -277 -42 27 226 253 119 -210 59 -60 -85 -395
2544c95M21J07o1p0j79k29O06m86N5M61j29q9M12K9m9O88j059q71J227k80J0j088
$$ -395 26 133 72 2 -177 -406 200 -286 -231 230 101 12 424 453 404 1092 33 -838 389 109 119 -969
$$ [...]
8191C45
##END NTUPLES=NMR FID
##END=
