##TITLE=1H_DE-35EXT2
 D2O
 8 sc, 
 6.3.2024
##JCAMPDX= 6.0         $$ Bruker NMR JCAMP-DX V2.0
##DATA TYPE= NMR FID
##DATA CLASS= NTUPLES
##ORIGIN= UXNMR, Bruker Analytische Messtechnik GmbH
##OWNER= root
$$ XWIN-NMR		Version 3.5
$$ Wed Mar  6 17:45:29 2024 Russian Standard Time (UT+4h)  she@DPX200
##.OBSERVE FREQUENCY= 200.1313
##.OBSERVE NUCLEUS= ^1H
##.DELAY= (6, 6)
##.ACQUISITION MODE= SIMULTANEOUS
##.ACQUISITION SCHEME= undefined
##.AVERAGES= 8
##.DIGITISER RES= 18
##SPECTROMETER/DATA SYSTEM= spect
##.PULSE SEQUENCE= zg30
##.SOLVENT NAME= D2O
##.SHIFT REFERENCE= (INTERNAL, D2O, 0, 15.7039)
##AUDIT TRAIL= $$ (NUMBER, WHEN, WHO, WHERE, WHAT)
$$ ##TITLE= Audit trail, XWIN-NMR		Version 3.5
$$ ##JCAMPDX= 5.01
$$ ##ORIGIN= Bruker BioSpin GmbH
$$ ##OWNER= she
$$ F:/spectra/data/she/nmr/H-F/1/audita.txt
$$ ##AUDIT TRAIL=  $$ (NUMBER, WHEN, WHO, WHERE, WHAT)
(   1,<2024-03-06 17:44:13.78 +0400>,<she>,<DPX200>,
      <created by zg, POWCHK disabled, PULCHK disabled
       configuration hash MD5:
       00 E9 B6 7A A2 85 ED C7 34 08 36 98 17 FE 4E 26
       data hash MD5: 16K
       70 4F 38 7F 35 38 B8 3E 91 8A B6 AB D6 6D 8C D2>)
$$ ##END=
$$ 
$$ hash MD5
$$ 3E E0 EC 23 87 4C F0 AB 89 4D 1D 90 2B D6 17 7F
##$RELAX= 
##$RELAX= 
##$RELAX= 
##$RELAX= 
##$RELAX= 
##$RELAX= 
$$ Bruker specific parameters
$$ --------------------------
##$DU= <F:/spectra>
##$EXPNO= 1
##$NAME= <H-F>
##$PROCNO= 1
##$TYPE= <nmr>
##$USER= <she>
##$AMP= (0..31)
100 100 100 100 100 100 100 100 100 100 100 100 100 100 100 100 100 100 
100 100 100 100 100 100 100 100 100 100 100 100 100 100 
##$AQSEQ= 0
##$AQ_mod= 1
##$AUNM= <au_zg>
##$AUTOPOS= <>
##$BF1= 200.13
##$BF2= 200.13
##$BF3= 200.13
##$BF4= 200.13
##$BF5= 200.13
##$BF6= 200.13
##$BF7= 200.13
##$BF8= 200.13
##$BYTORDA= 1
##$CFDGTYP= 0
##$CFRGTYP= 5
##$CHEMSTR= <none>
##$CNST= (0..31)
1 1 145 1 1 1 1 1 1 1 1 1 1 1 1 1 1 1 1 1 1 1 1 1 1 1 1 1 1 1 1 1 
##$CPDPRG= <>
##$CPDPRG1= <>
##$CPDPRG2= <>
##$CPDPRG3= <>
##$CPDPRG4= <mlev>
##$CPDPRG5= <mlev>
##$CPDPRG6= <mlev>
##$CPDPRG7= <mlev>
##$CPDPRG8= <mlev>
##$CPDPRGB= <>
##$CPDPRGT= <>
##$D= (0..31)
0 1.2 0 0 0 0 0 0 0 0.06 0 0.03 0 0 0 0 0.0002 0 0 0 0 0 0 0 0 0 0 0 0 
0 0 0 
##$DATE= 1709732653
##$DBL= (0..7)
120 120 120 120 120 120 120 120 
##$DBP= (0..7)
150 150 150 150 150 150 150 150 
##$DBP07= 0
##$DBPNAM0= <>
##$DBPNAM1= <>
##$DBPNAM2= <>
##$DBPNAM3= <>
##$DBPNAM4= <>
##$DBPNAM5= <>
##$DBPNAM6= <>
##$DBPNAM7= <>
##$DBPOAL= (0..7)
0.5 0.5 0.5 0.5 0.5 0.5 0.5 0.5 
##$DBPOFFS= (0..7)
0 0 0 0 0 0 0 0 
##$DE= 6
##$DECBNUC= <off>
##$DECIM= 32
##$DECNUC= <off>
##$DECSTAT= 4
##$DIGMOD= 1
##$DIGTYP= 9
##$DL= (0..7)
0 120 120 120 120 120 120 120 
##$DP= (0..7)
150 150 150 150 150 150 150 150 
##$DP07= 0
##$DPNAME0= <>
##$DPNAME1= <>
##$DPNAME2= <>
##$DPNAME3= <>
##$DPNAME4= <>
##$DPNAME5= <>
##$DPNAME6= <>
##$DPNAME7= <>
##$DPOAL= (0..7)
0.5 0.5 0.5 0.5 0.5 0.5 0.5 0.5 
##$DPOFFS= (0..7)
0 0 0 0 0 0 0 0 
##$DQDMODE= 0
##$DR= 18
##$DS= 0
##$DSLIST= <SSSSSSSSSSSSSSS>
##$DSPFIRM= 0
$$ [...]
##$SUBNAM2= <"">
##$SUBNAM3= <"">
##$SUBNAM4= <"">
##$SUBNAM5= <"">
##$SUBNAM6= <"">
##$SUBNAM7= <"">
##$SUBNAM8= <"">
##$SUBNAM9= <"">
##$SW= 18.0517328524113
##$SWIBOX= (0..15)
0 0 2 0 0 0 0 0 0 0 0 0 0 0 0 0 
##$SW_h= 3612.71676300578
##$TD= 16384
##$TD0= 1
##$TE= 0
##$TE2= 300
##$TE3= 300
##$TEG= 300
##$TL= (0..7)
0 120 120 120 120 120 120 120 
##$TP= (0..7)
150 150 150 150 150 150 150 150 
##$TP07= 0
##$TPNAME0= <>
##$TPNAME1= <>
##$TPNAME2= <>
##$TPNAME3= <>
##$TPNAME4= <>
##$TPNAME5= <>
##$TPNAME6= <>
##$TPNAME7= <>
##$TPOAL= (0..7)
0.5 0.5 0.5 0.5 0.5 0.5 0.5 0.5 
##$TPOFFS= (0..7)
0 0 0 0 0 0 0 0 
##$TUNHIN= 0
##$TUNHOUT= 0
##$TUNXOUT= 0
##$USERA1= <user>
##$USERA2= <user>
##$USERA3= <user>
##$USERA4= <user>
##$USERA5= <user>
##$V9= 5
##$VALIST= <valist>
##$VCLIST= <CCCCCCCCCCCCCCC>
##$VD= 0
##$VDLIST= <DDDDDDDDDDDDDDD>
##$VPLIST= <PPPPPPPPPPPPPPP>
##$VTLIST= <TTTTTTTTTTTTTTT>
##$WBST= 1024
##$WBSW= 4
##$XGAIN= (0..3)
0 0 0 0 
##$XL= 0
##$YL= 0
##$YMAX_a= 285623
##$YMIN_a= -275978
##$ZGOPTNS= <>
##$ZL1= 120
##$ZL2= 120
##$ZL3= 120
##$ZL4= 120
##$ABSF1= 10
##$ABSF2= 0
##$ABSG= 5
##$ABSL= 3
##$ALPHA= 0
##$AQORDER= 0
##$ASSFAC= 0
##$ASSFACI= 0
##$ASSFACX= 0
##$ASSWID= 0
##$AUNMP= <proc_1d>
##$AZFE= 0.1
##$AZFW= 0.1
##$BCFW= 1
##$BC_mod= 2
##$BYTORDP= 1
##$COROFFS= 0
##$CY= 11.3945322036743
##$DATMOD= 1
##$DC= 2
##$DFILT= <>
##$DTYPP= 0
##$F1P= 15.7292609196834
##$F2P= 12.9074282941183
##$FCOR= 0.5
##$FTSIZE= 0
##$FT_mod= 4
##$GAMMA= 1
##$GB= 0.15
##$INTBC= 1
##$INTSCL= 1
##$ISEN= 128
##$LB= 0.24
##$LEV0= 0
##$LPBIN= 0
##$MAXI= 10000
##$MC2= 0
##$MEAN= 0
##$ME_mod= 0
##$MI= 1.114404
##$NCOEF= 0
##$NC_proc= 0
##$NLEV= 6
##$NOISF1= 3.799351
##$NOISF2= 2.8
##$NSP= 1
##$NTH_PI= 0
##$NZP= 0
##$OFFSET= 15.70392
##$PC= 1
##$PHC0= -24951.33
##$PHC1= 17.38731
##$PH_mod= 1
##$PKNL= yes
##$PPARMOD= 0
##$PSCAL= 0
##$PSIGN= 0
##$REVERSE= no
##$SF= 200.130013532006
##$SI= 16384
##$SIGF1= 3
##$SIGF2= 2
##$SINO= 400
##$SIOLD= 16384
##$SREGLST= <1H.CDCl3>
##$SSB= 0
##$STSI= 0
##$STSR= 0
##$SW_p= 3612.71676300578
##$SYMM= 0
##$S_DEV= 0
##$TDeff= 0
##$TDoff= 0
##$TI= <>
##$TILT= no
##$TM1= 0
##$TM2= 0
##$TOPLEV= 0
##$USERP1= <user>
##$USERP2= <user>
##$USERP3= <user>
##$USERP4= <user>
##$USERP5= <user>
##$WDW= 1
##$XDIM= 8192
##$YMAX_p= 0
##$YMIN_p= 0
$$ End of Bruker specific parameters
$$ ---------------------------------
##NTUPLES= NMR FID
##VAR_NAME=  TIME,          FID/REAL,        FID/IMAG
##SYMBOL=    X,             R,               I
##VAR_TYPE=  INDEPENDENT,   DEPENDENT,       DEPENDENT
##VAR_FORM=  AFFN,          ASDF,            ASDF
##VAR_DIM=   8192,          8192,            8192
##UNITS=     SECONDS,       ARBITRARY UNITS, ARBITRARY UNITS
##FACTOR=    0.0002768,     1,               1
##FIRST=     0,             0,               0
##LAST=      2.2672688,     0,               0
##MIN=       0,             -275978,         0
##MAX=       2.2672688,     285623,          0
$$ Real data points
##PAGE= N=1
##DATA TABLE= (X++(R..R)), XYDATA
0 0 0 0 0 0 0 0 0 0 0 0 0 0 0 0 0 0 0 0 8 -8 8 -8 8 -8 8 -16 16 -16 21 -24 25 -29 32 -37 42 -46 53 -59 67 -71
40 -71 79 -88 97 -111 120 -132 146 -162 178 -194 216 -237 261 -288 319 -354 396 -445 502 -570 656
61 656 -763 906 -1099 1377 -1820 2601 -4253 9194 -54807 -275978 -220860 -118945 -139248 -69203
75 -69203 165907 285623 179771 44601 133 -61607 -191055 -249413 -120775 60290 114308
86 114308 113137 190374 205968 26366 -151830 -155389 -132873 -170398 -102208 89462 192981 157079
98 157079 112870 72294 -34932 -158498 -190410 -122980 -33085 34632 106581 180709 169348 53797
110 53797 -45175 -79763 -136678 -187727 -109998 33836 91635 106991 158894 144131 5336 -115965
122 -115965 -136328 -132130 -124588 -42275 95816 179255 160081 93470 33236 -44370 -153181 -199471
134 -199471 -115190 -3016 41090 92171 176706 160069 20446 -79057 -93402 -126773 -157347
145 -157347 -74386 72119 142354 133795 120051 86311 -16655 -140549 -177585 -116748 -48947
156 -48947 -1903 83709 175216 151964 35810 -34465 -59828 -124496 -163966 -78085 47158 91383
168 91383 101137 132425 112929 2288 -104942 -129449 -109481 -92366 -43573 63230 149611 132818
180 132818 63084 22162 -26253 -120075 -162050 -84897 9230 42997 83194 145475 126821 16119
192 16119 -68134 -88352 -106889 -121427 -64646 45737 113240 107238 85514 65179 -2815 -105318
204 -105318 -140893 -86755 -32610 -1352 68541 145438 126597 35030 -24842 -54426 -108211 -137373
216 -137373 -75069 24349 74502 86387 102912 90858 11088 -81634 -108421 -84945 -67431 -33765
228 -33765 52973 126473 111792 54731 21341 -23302 -102153 -135391 -79645 -7782 28425 68560
240 68560 116173 105476 23894 -48477 -72616 -86059 -97134 -54552 38115 98066 91899 74431
252 74431 60435 -660 -90876 -120071 -78225 -39683 -12493 50966 117628 106554 36708 -11370
264 -11370 -37204 -83570 -114618 -68162 18822 63501 70894 89522 88253 17492 -71022 -94858
276 -94858 -75760 -68291 -44119 34275 104625 97264 51387 24686 -9051 -76329 -114629 -73848
288 -73848 -7815 25968 53902 97499 101000 32861 -41093 -65843 -74847 -90719 -63676 18346
300 18346 80619 81460 66796 57884 10934 -67447 -102416 -72613 -35385 -10114 41060 100331 100012
313 100012 42072 -7332 -34816 -74325 -104934 -71897 2434 49652 63446 79866 80752 24027
325 24027 -52452 -81064 -68997 -59881 -37611 28096 91241 91570 52048 23909 -8827 -68418 -106077
338 -106077 -74733 -15729 18134 45422 85964 92479 34816 -30409 -55009 -65232 -79626 -56111
350 -56111 16261 72567 75871 63142 52859 9854 -60843 -94799 -72204 -39340 -13361 33798
362 33798 87580 91314 42428 -2809 -29047 -64065 -92002 -64115 2922 46409 58981 74247
374 74247 74547 21905 -48917 -75657 -66494 -59976 -38325 23330 80877 81978 48919 24636 -5392
387 -5392 -60169 -94515 -65669 -11693 18291 42122 80395 86654 29940 -31428 -50951 -60537 -77636
400 -77636 -55817 13839 65502 66509 56639 50256 12448 -52585 -84885 -62641 -30495 -10476 27496
413 27496 80197 87777 38777 -6998 -25858 -56473 -88743 -65237 1004 41737 50255 65581
425 65581 69897 24098 -40640 -67216 -58698 -50230 -33100 17671 71841 78043 44917 19354 -2800
438 -2800 -50176 -88447 -66553 -14287 12261 32823 71046 81076 32652 -22828 -42847 -53666
450 -53666 -68625 -49884 8288 56912 63842 52636 43504 14198 -43272 -79948 -61795 -29235
462 -29235 -13734 17343 70020 80944 37455 -221 -15288 -47146 -79269 -59683 -4242 32305
474 32305 46799 61737 63955 26537 -31483 -63556 -59096 -48211 -34986 7913 63639 74034
486 74034 42194 20966 4172 -41838 -79323 -58794 -15057 6603 28221 64540 72903 33766
498 33766 -13793 -38615 -52362 -64093 -52108 -3065 48652 61913 49711 43500 21212 -35591
510 -35591 -73907 -55862 -27637 -16319 15183 64621 73006 36046 5020 -14017 -44864 -70791
522 -70791 -57778 -14745 23922 43227 55095 60709 35570 -20448 -57951 -54623 -46411 -38790 3641
535 3641 60244 69800 42508 25873 4757 -42622 -74404 -56694 -21922 2108 28806 58922
547 58922 66800 37685 -6651 -34586 -46052 -57551 -52118 -6780 44704 55761 46691 47011 23268
560 23268 -35396 -70154 -54566 -33074 -19635 16363 60964 67432 37273 6482 -14955 -39514
572 -39514 -61587 -54410 -13004 26350 37544 44238 56383 35203 -21051 -51973 -44798 -43428 -41511
585 -41511 -38 51966 60832 41705 28185 6586 -33999 -63837 -56127 -24251 4957 25766
597 25766 47986 61699 39622 -6965 -33481 -38116 -50804 -51834 -10130 37374 46945 42718 45290
610 45290 24440 -24786 -56397 -52014 -36861 -19335 12491 49241 63737 43972 9376 -15565
622 -15565 -35102 -58103 -56889 -15907 24076 34134 42755 54621 32208 -17182 -42998 -41491 -42501
635 -42501 -36207 416 41321 54012 43204 26863 5361 -27048 -56992 -56603 -26108 3229 20373
648 20373 43159 61039 38733 -5779 -27856 -34347 -48953 -46218 -7779 30977 41486 40659 39577
661 39577 20005 -18552 -48051 -49933 -34091 -16988 5946 39656 59757 42450 9944 -8983
673 -8983 -27529 -53732 -53305 -16216 17020 29097 41817 50883 29508 -12104 -37533 -41521 -40743
686 -40743 -32054 -3075 33759 50667 41039 24108 8576 -19798 -51526 -52585 -23391 -692 14165
699 14165 40069 56846 36398 -1264 -22361 -33229 -46804 -43860 -11245 25474 40299 39457 36292
712 36292 21347 -13283 -45049 -46967 -30045 -16531 1924 35106 55415 39134 11022 -5808
724 -5808 -24365 -48843 -49866 -19279 12165 26893 38301 45976 30746 -5817 -33861 -39980 -36541
737 -36541 -30606 -6721 29857 48212 38476 22827 9389 -17658 -46872 -48323 -24166 -3069 13009
750 13009 35998 50946 35587 2858 -18902 -30518 -42181 -41039 -13537 21041 36703 36387 34411
763 34411 22441 -10742 -41597 -43527 -29148 -18059 302 32246 50961 36956 12307 -3100
775 -3100 -21323 -44467 -46711 -19359 10000 23623 33944 43578 31651 -4235 -31848 -36202 -33965
788 -33965 -30950 -9076 27408 45500 35761 22000 10867 -14389 -43537 -46495 -23459 -2388 11139
801 11139 30911 47371 35685 2995 -19012 -27475 -37011 -39208 -15599 19497 34969 32735 30859
814 30859 21894 -7290 -37114 -40780 -27065 -15716 -1039 26785 45958 35585 12315 -3312
826 -3312 -18008 -38021 -42875 -20696 7477 21413 29761 38665 30263 94 -26565 -32821 -31289
839 -31289 -28638 -10649 21162 40159 34488 22376 11363 -10426 -37531 -43140 -24843 -5595 8464
852 8464 27699 44037 34858 6755 -14782 -24638 -35508 -38402 -17098 15434 31213 31811 31351 22704
866 22704 -5571 -33820 -38689 -27385 -17510 -1967 25231 43304 34619 13310 -1708 -16820 -36595
879 -36595 -41580 -20465 6413 19422 27839 37192 29570 -318 -25224 -30380 -29201 -27600 -10499
892 -10499 20091 36990 31649 20741 11245 -8684 -33878 -39864 -23109 -4945 6812 23250 39754
905 39754 33429 6793 -13051 -20436 -30989 -36027 -17473 12421 27412 28313 29312 22480 -2247 -28686
919 -28686 -35413 -26404 -16942 -3929 19861 38698 33778 13979 -380 -12969 -31507 -39660 -21708
932 -21708 3745 16314 24914 35309 29652 2828 -21009 -27934 -29074 -27059 -11602 15676 33857
945 33857 31482 21133 11053 -6879 -30142 -38458 -23312 -5390 5461 20884 37459 31931 7446
958 7446 -10405 -18421 -29699 -34185 -16961 9771 24570 27525 28293 20931 -417 -25361 -33963 -25780
972 -25780 -15159 -4043 16899 36080 32057 12537 322 -10404 -29002 -36479 -19764 1918
984 1918 13392 22749 32274 26601 4744 -16265 -25845 -27355 -24832 -12382 11350 30954 30563 19919
998 19919 11212 -3964 -27253 -36339 -22104 -5965 3491 19190 34381 28776 8388 -7212 -17343
1011 -17343 -27569 -30053 -16790 5196 21808 26379 25040 19998 2627 -21959 -32148 -24042 -15631
1024 -15631 -6744 15283 34232 29646 13505 2517 -10242 -28027 -32733 -18713 -698 12480
1036 12480 22217 28383 24373 6764 -14284 -24488 -24098 -22443 -14218 8954 28412 27793 18734 12918
1050 12918 -1984 -25367 -32943 -21618 -8921 2409 19137 31590 27301 10727 -6523 -17723
1062 -17723 -24813 -26968 -17765 3923 21241 23189 21994 20236 3932 -20119 -28351 -21802 -16861 -7426
1076 -7426 13517 29871 27508 15909 3929 -9880 -24665 -30098 -20942 -2628 12834 20752 25464
1089 25464 24547 7814 -14481 -22632 -21199 -21518 -13838 8497 24941 24049 18762 13416 -1962 -21320
1103 -21320 -28639 -22004 -10386 2348 15979 27490 27439 12759 -5607 -16189 -21953 -26735 -18775
1116 -18775 3599 19223 21069 21271 19899 3614 -17477 -24408 -21157 -16375 -6644 10885 25199
1129 25199 26218 16514 3976 -7850 -20312 -28852 -22337 -3314 11140 17382 24358 24990 8146
1142 8146 -12474 -20254 -21127 -21883 -12575 7576 21993 23191 18898 11564 -1851 -18013 -26874 -21940
1156 -21940 -9393 2164 12895 24763 26974 12763 -4775 -13334 -19870 -26244 -17779 2763 16586
1169 16586 19753 21742 18329 2934 -15073 -23214 -20932 -14906 -5674 8616 22829 25388 14830
1182 14830 3073 -5623 -17655 -27209 -20808 -3073 8483 14586 22957 24020 8344 -9593 -17726
1195 -17726 -20114 -20604 -12481 4846 19655 23180 17991 10395 96 -15354 -26297 -21468 -8351
1208 -8351 858 10519 23114 25631 12226 -3250 -11520 -18659 -24247 -17201 108 14175 19404 20469
1222 20469 17059 4638 -12226 -22407 -20900 -14134 -6049 7140 21799 24650 14390 3859 -4814
1235 -4814 -16994 -25657 -19171 -3961 7126 14200 21673 21562 9033 -7519 -16507 -18834 -19067 -12771
1249 -12771 3013 18084 21590 16377 10990 1339 -14116 -24508 -19811 -8843 -509 9193 21603
1262 21603 24013 12154 -1752 -10124 -16940 -22733 -16783 -1066 12747 17602 18475 16658 6448 -10668
1276 -10668 -20799 -19277 -13761 -7401 5292 20007 22942 14232 4644 -3788 -15076 -23836 -18770 -5030
1290 -5030 6282 12978 19493 20494 9625 -6614 -15733 -17191 -17991 -12913 1842 16648 20200 15787
1304 15787 10998 2280 -12436 -22534 -18672 -8930 -1068 8055 19324 22444 12339 -1025 -9239
1317 -9239 -15427 -20803 -16970 -2275 11201 15960 17291 16479 7188 -8951 -19282 -18015 -13382 -7709
1331 -7709 4121 17724 21884 14339 5386 -2741 -13341 -22060 -18800 -5817 5196 11918 18492 19980
1345 19980 10255 -5012 -14209 -16725 -17352 -12610 778 14816 19022 15787 10737 2360 -11348 -20649
1359 -20649 -17949 -9432 -1324 7356 17694 20970 12126 130 -8050 -14244 -19493 -15589 -2643 9767
1373 9767 14577 15917 15577 6863 -7741 -17189 -16561 -12955 -7960 3120 15888 19889 13680 5666 -1950
1388 -1950 -11515 -19727 -17685 -6303 3958 10338 16185 18801 10763 -3790 -12667 -14806 -15922 -12960
1402 -12960 -670 12996 17526 15003 10738 3420 -9064 -18477 -17708 -10058 -1601 6298 15403 19613
1416 19613 12994 952 -7529 -12903 -17777 -15712 -3989 8155 13675 15680 15181 7158 -5862 -14904
1430 -14904 -16453 -13462 -7398 2795 13933 18491 14190 6221 -1451 -10300 -18188 -16862 -6866 2871
1444 2871 9102 15250 17933 10361 -2458 -10533 -13961 -15655 -12200 -1262 10671 15679 14865 11012
1458 11012 3518 -7446 -16918 -17210 -9932 -2129 4662 14194 18989 12698 1379 -5660 -11284 -17167
1472 -17167 -15190 -4271 6621 12163 15169 14441 7285 -3909 -13406 -15986 -12815 -7333 869 11971
1486 11971 18153 14437 6045 -478 -8690 -17185 -16719 -6999 2230 8384 14382 16722 9988 -1106 -9645
1501 -9645 -13650 -14892 -11348 -2186 8614 15180 14642 10029 4156 -5401 -15935 -17071 -9817 -3006 3627
1516 3627 12979 17822 12411 2451 -4735 -11388 -16051 -13894 -4739 5244 11865 14352 12973 7358 -2367
1531 -2367 -12309 -15239 -11586 -7352 -380 10715 16765 13032 6388 709 -8237 -16027 -15528 -7664 462
1546 462 7853 14081 15192 9901 354 -8930 -13506 -13196 -10229 -3148 7821 14388 12554 9209 4512
1561 4512 -5086 -14047 -14979 -9252 -3998 3101 12316 16085 11628 3682 -3883 -10557 -14725 -13345 -6166
1576 -6166 4141 11763 12724 11647 8211 -2242 -12282 -13598 -10258 -7318 -668 10075 15210 11765
1590 11765 6747 864 -7382 -13805 -14320 -8450 262 7197 12102 13786 10744 907 -8875 -12241 -11918
1605 -11918 -10845 -3880 7880 13412 11583 9208 4659 -4469 -12547 -13474 -9503 -4014 3279 10125 13859
1620 13859 11871 4432 -3981 -9367 -12548 -13284 -6779 3856 10258 11402 12240 8514 -1843 -10646 -12438
1635 -12438 -10589 -7962 -482 8700 12996 11705 6852 395 -6516 -12089 -13584 -8627 -395 6025 10145
1650 10145 13709 11282 1199 -7176 -10462 -11791 -11459 -3874 6530 11677 11531 9386 4846 -3769 -11392
1665 -11392 -13379 -9848 -3493 2551 8941 13759 12105 3821 -3270 -7557 -11542 -13413 -6649 3451
1679 3451 8818 10462 11835 8233 -1150 -9593 -11931 -10818 -7624 -672 7137 13109 12105 6780 714
1694 714 -4983 -11415 -13677 -8036 333 5271 9045 12932 10416 1287 -6485 -9714 -11223 -10339 -3924
1709 -3924 5312 10835 11571 9252 4578 -2421 -10249 -13327 -9410 -3425 1867 7931 12984 11458 3776
1724 3776 -2843 -7048 -11270 -12271 -6115 2446 7836 10414 10868 7820 -88 -8281 -11403 -10311 -6834
1739 -6834 -1495 6276 12303 11550 6309 1150 -4468 -10786 -12883 -7853 -348 4488 8813 12280 9606
1754 9606 1989 -5244 -8931 -10459 -9924 -4068 4168 10083 10727 8385 4393 -2218 -9505 -12087 -8632
1769 -8632 -3744 1216 7453 12347 10522 4163 -1980 -6356 -10347 -11100 -6054 1569 7096 9640 9991
1784 9991 7053 381 -7217 -10553 -9386 -6557 -1815 5716 11263 10918 6266 1451 -3808 -9855 -11611
1799 -11611 -7328 -1101 3991 8177 10893 9042 2242 -4501 -8024 -9725 -9082 -4305 3624 9311 10065
1814 10065 8186 4770 -1242 -8394 -11023 -8565 -4250 917 6583 10972 10057 4549 -1360 -5716 -9509
1829 -9509 -10254 -6078 776 6609 8718 9406 7219 1009 -6485 -9848 -8792 -6404 -2039 4483 9830
1844 9830 9948 6133 1773 -3246 -8774 -11106 -7508 -1693 3306 7275 10054 9078 3094 -3408 -7803
1859 -7803 -9009 -8524 -4398 2350 8124 9579 7928 4822 -775 -7456 -10291 -8461 -4439 662 5664
1874 5664 10077 9706 4885 -582 -5133 -8646 -9891 -6344 155 5719 8239 8920 7269 1319 -5566
1889 -5566 -9088 -8792 -6438 -2403 4012 9231 9676 6621 2284 -2704 -7989 -10113 -7696 -2317 2897
1904 2897 6634 9326 8448 3233 -3179 -7194 -8354 -8039 -4817 2071 7383 8968 7451 4710 -494
1919 -494 -6522 -9502 -8309 -4445 296 5103 9182 9403 5364 -636 -4810 -7894 -9173 -6552 -180
1934 -180 5506 7629 8482 6768 1690 -4780 -8236 -8418 -6437 -2453 3168 8000 9216 6485 2165 -2423
1950 -2423 -6757 -9443 -7728 -2020 2517 6322 8934 8400 3502 -2846 -6533 -7944 -8038 -4465 1608 6670
1966 6670 8593 7135 4160 -499 -5700 -8786 -7999 -4329 138 4243 8018 8996 5082 -197 -4016
1981 -4016 -7257 -8516 -6135 -219 4483 6767 7829 6405 1755 -3862 -7184 -7837 -5844 -2339 2596
1996 2596 7060 8487 6166 2085 -1446 -5948 -9099 -7192 -2114 1812 5237 8351 7862 3413 -1911
2011 -1911 -5472 -7715 -7373 -4208 933 5667 8146 7117 3759 427 -4707 -8380 -7581 -3875 -835
2026 -835 3317 7716 8509 4654 241 -3111 -6594 -8469 -6067 -713 3727 6812 7649 6124 2334 -3231
2042 -3231 -7256 -7625 -5211 -2865 1523 6844 8338 5440 2105 -996 -5486 -8491 -6968 -2701 1213
2057 1213 4708 7388 7299 3923 -1169 -5332 -7093 -6890 -4534 259 5701 7644 6098 4078 1177 -4290
2073 -4290 -8396 -6725 -3784 -693 3112 7293 7839 4589 678 -2945 -6490 -7352 -5996 -1710 3366
2088 3366 6328 6635 5867 2914 -3095 -6866 -7040 -4912 -3312 1328 6731 7595 5467 2572 -887 -5290
2104 -5290 -7335 -6238 -3011 1220 4503 6401 6592 4614 -649 -5031 -6251 -6163 -4771 -281 4863 6641
2120 6641 5945 4469 1043 -4001 -7065 -6658 -4333 -993 3146 6279 7019 5094 1433 -3075 -5815 -6912
2136 -6912 -5883 -1666 3152 5445 5868 5913 2967 -2527 -5978 -6210 -5408 -3197 1468 5807 6947 5349
2152 5349 2822 -847 -4420 -7085 -6250 -3065 1092 4166 6175 6721 3987 -1216 -4474 -5513 -6077 -4937
2168 -4937 76 4467 5764 5424 4610 1275 -3446 -6240 -6202 -4191 -1096 2690 5650 6871 4855 668
2184 668 -2321 -4510 -6439 -5812 -1574 3085 4455 5475 5679 2952 -1959 -5062 -5706 -5250 -2700 933
2200 933 4786 6801 5395 2513 -429 -3730 -6311 -6447 -2796 646 3326 5533 6153 3872 -760 -3642
2216 -3642 -5234 -5573 -4267 -336 3638 5830 5749 4098 1346 -2788 -5908 -6318 -3937 -1221 1676 4942
2232 4942 6733 4869 797 -2075 -4451 -6009 -5630 -1868 2000 4367 5649 5228 2919 -1484 -4509
2247 -4509 -5744 -4840 -2679 263 4339 6324 5290 2606 -209 -3245 -5979 -6091 -3036 578 2864
2262 2864 5086 5999 3839 -24 -3269 -5008 -5347 -4319 -983 2979 5330 5277 3942 1676 -2148 -5157
2278 -5157 -5838 -4121 -1354 1456 4678 5961 4638 1457 -1673 -3993 -5596 -5116 -2061 1698 4317
2293 4317 5218 4928 2781 -1160 -4169 -5530 -4651 -2882 265 4155 5976 5236 2562 170 -2855 -5334
2309 -5334 -5463 -3021 182 2687 4831 5541 3755 356 -3168 -4575 -4938 -3908 -1063 2633 4928 5207
2325 5207 3671 1603 -1606 -5168 -5652 -3871 -1497 1495 4047 5676 4665 1491 -1505 -3714 -5165
2340 -5165 -4702 -2483 1473 3794 4881 4503 2883 -634 -3737 -5078 -4384 -2791 -358 3091 5013 4744
2356 4744 2440 163 -2766 -4726 -5006 -3009 -197 2463 4202 5140 3969 903 -2501 -4285 -4859 -4033
2372 -4033 -1314 2061 4582 4890 3609 1659 -1777 -4245 -5116 -3812 -1451 1244 3740 5469 4233
2387 4233 2037 -1000 -3299 -4827 -4767 -2320 1091 3354 4170 4162 2920 -282 -3408 -4417 -4112 -2743 -329
2404 -329 3018 4924 5004 2657 343 -1997 -4419 -4987 -3141 -231 2209 3737 4803 3998 1028 -2283
2420 -2283 -3747 -4194 -3528 -1644 2105 4173 4400 3486 1455 -928 -3859 -4816 -3704 -1333 746 3113
2436 3113 4627 4206 1701 -1025 -2924 -4098 -4437 -2652 1018 3011 4146 4002 2895 182 -2987 -4380
2452 -4380 -4010 -2730 -532 2325 4345 4196 2726 220 -1829 -4113 -4624 -3081 -415 1885 3318 4525
2468 4525 3635 949 -1894 -3340 -4029 -3809 -1609 1705 3794 3999 3546 1652 -913 -3360 -4326 -3499 -1562
2485 -1562 475 2368 4295 4240 1580 -655 -2249 -3912 -4351 -2502 578 2610 3844 4115 2916 321
2501 321 -2499 -4089 -4176 -2542 -538 1884 4149 4422 2545 403 -1550 -3636 -4767 -2853 -203 1355
2517 1355 2959 4057 3390 684 -1530 -2977 -3774 -3426 -1446 1258 3321 4084 3019 1978 -284 -2916
2533 -2916 -4324 -3390 -1322 98 2402 4218 3590 1498 -708 -2231 -3639 -4385 -2245 324 2207 3280
2549 3280 3828 2585 582 -2402 -3853 -3577 -2492 -1056 1520 4044 4012 2257 777 -838 -3356 -4465
2565 -4465 -2775 -530 1095 2846 3935 3586 1279 -1085 -2809 -3497 -3236 -1794 860 3201 3532 2929
2581 2929 1837 -121 -2941 -4143 -2936 -1535 212 2078 4185 3545 1832 -319 -1999 -3187 -3676
2596 -3676 -2378 -160 2306 3338 3290 2736 746 -1958 -3546 -3101 -2365 -1109 1339 3646 3770 2408
2612 2408 859 -925 -3229 -3751 -2615 -1012 1130 2675 3326 3272 1418 -1136 -2958 -3299 -2761 -1855 502
2629 502 2839 3211 2624 1849 26 -2499 -3564 -2928 -1766 -223 1863 3413 3696 1837 137 -1774
2645 -1774 -2925 -3495 -2534 -281 1961 3031 2875 2670 1072 -1512 -3162 -3041 -2300 -1031 968 2786
2661 2786 3266 2435 1149 -1009 -2487 -3626 -3126 -1092 794 2487 3143 3108 1666 -745 -2440 -2877 -2843
2678 -2843 -1854 423 2333 3023 2866 2185 75 -2136 -3197 -2966 -1933 -413 1753 3082 3160 2378 39
2695 39 -1708 -2503 -3217 -2529 -430 1754 2634 2896 2713 1031 -1523 -2549 -3072 -2453 -1117 942 2609
2712 2609 3110 2198 972 -552 -2015 -3077 -2824 -1151 781 1955 2869 3159 1611 -561 -2007 -2412
2728 -2412 -2947 -1780 107 2029 3059 2877 1764 278 -1704 -2906 -2914 -1832 -398 1207 2584 3091
2744 3091 1984 147 -1327 -2324 -2834 -2632 -570 1361 2365 2985 2256 752 -1421 -2570 -3050 -2416 -1255
2761 -1255 480 2373 3114 2389 965 -513 -1845 -3024 -2771 -1269 523 1486 2733 2980 1762 -362
2777 -362 -2115 -2751 -2885 -1753 -200 1829 2867 2316 1818 277 -1141 -2785 -2952 -1872 -563 1053
2793 1053 2370 2918 1961 354 -925 -2031 -2775 -2594 -659 980 1748 2437 2659 1091 -768 -2217 -2778
2810 -2778 -1961 -1362 397 1962 2816 2327 936 -151 -1432 -3071 -2720 -1337 267 1530 2131 2683 1489
2827 1489 -179 -1413 -2363 -2600 -2037 -530 1348 2716 2342 1767 586 -1306 -2312 -2701 -1830 -671 838
2844 838 2244 2830 2171 506 -878 -2027 -2628 -2440 -1123 746 1908 2374 2299 1229 -645 -1845 -2326
2861 -2326 -1843 -1134 130 1866 2678 2050 1165 84 -1595 -2660 -2327 -1162 187 1173 2208 2551 1647
2878 1647 11 -1756 -2095 -2350 -1987 -640 1277 2188 2233 1716 633 -793 -2427 -2272 -1804 -735 566
2895 566 1958 2723 1737 461 -515 -1321 -2439 -2309 -735 852 1621 2203 2388 1352 -449 -2070 -2306
2912 -2306 -2085 -1442 -246 1619 2309 1923 1051 -61 -1271 -2392 -2558 -1403 -20 1269 1777 2422 1821
2929 1821 149 -972 -1913 -2046 -1850 -398 762 2397 1960 1565 938 -681 -1912 -2324 -1461 -690 559
2946 559 1477 2654 1931 590 -494 -1321 -1866 -2304 -822 553 1235 1678 1966 1507 -212 -1629 -2061 -1803
2964 -1803 -1484 -450 1450 1936 1647 1408 155 -1214 -2437 -2092 -1601 -82 910 1897 2433 1465 34
2981 34 -964 -1574 -2024 -2072 -384 813 1781 1844 1639 697 -544 -2087 -2234 -1780 -642 381 1309 2197 1933
3000 1933 788 -336 -1105 -2274 -2276 -929 519 1141 1662 2023 1416 -36 -1355 -1716 -1719 -1318 -125 1153
3018 1153 2117 1933 1131 381 -840 -1721 -2110 -1252 -223 448 1584 2240 1399 278 -1018 -1473 -2032 -1806
3036 -1806 -620 917 1669 1778 1582 597 -467 -1679 -2154 -1701 -547 208 1368 1971 1660 468 51
3053 51 -1142 -2027 -1951 -1107 249 1170 1750 1727 1276 66 -1309 -1789 -1934 -1136 -406 1017 2114 2085 1059
3072 1059 279 -670 -1778 -1780 -1212 -31 463 1288 1841 1646 205 -896 -1247 -1710 -1490 -757 500 1362 1875
3091 1875 1345 851 -78 -1436 -2032 -1565 -636 -149 1117 1933 1669 916 -146 -844 -1811 -1743 -1161 -115 1072
3110 1072 1418 1687 1496 50 -937 -1623 -1695 -1255 -388 1009 1631 1597 1145 326 -667 -1494 -1948 -1464 -343
3129 -343 207 1442 1914 1574 529 -454 -1473 -1393 -1508 -986 335 1151 1595 1417 993 141 -1106 -1578 -1436
3148 -1436 -823 -189 820 1820 1556 810 77 -664 -1405 -1534 -1071 127 1083 1394 1591 1350 275 -844
3166 -844 -1418 -1567 -1256 -822 636 1492 1471 928 641 -431 -1448 -1798 -1300 -379 191 1167 1415 1517 385
3185 385 -429 -1250 -1239 -1546 -1054 481 1124 1715 1300 1043 183 -1000 -1767 -1263 -992 -66 904 1663 1841 861
3205 861 -90 -694 -1185 -1800 -1210 -76 680 1128 1474 1132 223 -945 -1360 -1504 -1510 -231 647 1122 1663 1121
3225 1121 674 -132 -971 -1506 -1279 -334 417 921 1668 1607 754 -35 -1001 -1321 -1359 -806 5 761 1340 1199
3245 1199 1123 24 -860 -1359 -1229 -787 -309 417 1418 1439 850 26 -521 -1060 -1559 -887 -153 581 1254 1411
3265 1411 1101 578 -696 -1287 -1182 -1290 -451 462 1415 1207 882 748 11 -722 -1494 -1242 -453 2 680
3284 680 1531 1524 600 -29 -545 -966 -1482 -1038 -275 833 1200 1166 725 257 -591 -1423 -1146 -852 -348 655
3304 655 1240 1359 963 -70 -306 -917 -1399 -1156 -231 524 584 1353 1446 366 -572 -1221 -1138 -1127 -767 361
3324 361 1147 1314 1075 538 -123 -921 -1277 -1148 -555 -65 490 1410 1506 805 71 -316 -1024 -1375 -1036 -47
3344 -47 872 924 891 952 308 -756 -1275 -1522 -883 -448 314 1064 1233 984 232 -147 -537 -1078 -1209 -549 396
3365 396 515 1193 1258 406 -265 -862 -778 -837 -662 199 930 1259 808 483 115 -527 -1325 -838 -529 88 280
3386 280 1080 1140 672 93 -428 -814 -1366 -927 -419 453 822 1053 1073 421 -677 -1119 -1112 -657 -514 3 954
3407 954 1231 965 588 -174 -842 -1215 -951 -405 236 484 891 1053 538 -239 -682 -1094 -948 -839 -327 850
3427 850 940 870 728 219 -502 -1327 -1047 -673 -189 311 1160 1230 635 13 -365 -741 -1078 -1085 -228 479 687 1192
3449 1192 804 391 -479 -987 -1110 -1031 -598 183 678 1191 800 392 -210 -588 -1045 -1021 -471 184 412 746
3469 746 1096 470 -119 -787 -545 -1042 -977 168 724 885 737 647 357 -412 -1085 -1212 -611 -354 261 977
3489 977 1039 657 381 -391 -543 -877 -951 -208 264 612 1026 785 517 -199 -801 -884 -906 -382 58 498 933
3510 933 865 344 22 -283 -1010 -1169 -499 153 334 597 1004 823 -66 -376 -755 -677 -565 -147 399 964 1141
3531 1141 513 -30 -320 -794 -946 -422 -78 275 707 1016 907 283 -302 -617 -1069 -838 -349 227 748 970
3551 970 513 682 78 -528 -1168 -734 -454 -133 301 883 959 475 34 -259 -781 -947 -583 -101 293 590
3571 590 1376 736 146 -470 -1072 -939 -583 -197 395 702 750 525 268 -253 -485 -993 -653 -381 15 539
3591 539 921 836 301 -58 -673 -840 -879 -447 200 606 532 595 695 177 -607 -632 -784 -444 -243 376 787 711
3613 711 509 227 -507 -869 -698 -583 194 124 317 925 1018 123 -423 -519 -629 -671 -282 278 526 906 428
3634 428 476 -197 -588 -849 -604 -303 78 501 814 957 146 -288 -498 -443 -897 -120 215 355 781 545 478
3655 478 133 -372 -771 -517 -552 -259 420 852 817 578 392 -71 -622 -1043 -682 -199 34 613 894 1050 390
3676 390 -63 -455 -600 -704 -424 192 745 743 680 506 -11 -465 -512 -509 -583 -70 318 609 672 450 -6 -291 -388
3699 -388 -900 -627 39 290 532 537 834 99 -426 -566 -839 -501 -140 136 456 661 442 467 -155 -468 -1000
3720 -1000 -601 -130 146 390 636 768 389 -260 -397 -435 -432 -480 -65 358 530 288 522 130 -474 -612 -380
3741 -380 -303 -377 298 488 516 558 151 -160 -399 -665 -372 -247 335 405 557 621 372 -201 -646 -711 -690 -92 248
3764 248 442 731 403 279 157 -149 -934 -338 -222 -19 194 600 721 380 48 -162 -391 -321 -633 32
3784 32 320 561 648 510 257 30 -498 -574 -480 -287 -24 362 849 448 76 -12 -733 -429 -377 -166 204 351
3806 351 593 479 348 -68 -688 -548 -423 -56 -103 240 691 342 645 -37 -328 -811 -268 -363 -24 69 531
3827 531 585 520 -114 -422 -255 -652 -458 -274 167 435 437 347 164 -155 -517 -352 -395 -218 -104 277 701 324
3849 324 287 -417 -133 -629 -691 -189 100 245 473 397 392 198 -474 -601 -521 -257 -170 452 487 486 370 -150 -38
3872 -38 -546 -642 -312 7 309 556 583 559 59 -87 -463 -729 -616 -307 -20 242 235 706 226 -269 -479 -432
3894 -432 -228 -493 187 155 566 473 -64 98 57 -502 -364 -166 -59 189 296 681 338 181 -465 -423 -430 -435 -378
3917 -378 228 269 523 -41 296 111 -622 -320 -635 -262 -291 584 399 397 98 -121 -262 -493 -608 -109 214
3938 214 142 217 439 335 146 -269 -593 -340 -230 22 308 706 460 -241 243 -220 -396 -563 -178 -196 -141
3959 -141 635 421 379 310 -269 -463 -325 -328 -62 4 294 413 491 132 -104 -210 -368 -337 -216 147 117 379 635
3982 635 71 144 -312 -296 -279 39 -47 102 436 441 128 65 -380 -78 -525 -207 2 82 390 16 245 -134 93
4005 93 -475 -542 -344 -359 131 122 686 348 62 -118 -481 -407 -130 -244 120 297 323 575 175 4 -195 -381
4027 -381 -382 73 39 61 579 420 284 59 -390 -521 -499 -294 4 355 456 468 315 -388 -232 -417 -577 -355
4049 -355 -261 30 306 189 158 -10 -97 -244 -218 -327 -345 -5 24 140 365 227 -120 -429 -224 -361 -128 -85
4071 -85 255 315 413 331 107 -122 -224 -317 -244 -51 211 232 626 301 209 140 -348 -168 -455 -87 -11 162 97 304
4095 304 332 175 -215 -217 -154 -312 -163 388 526 300 118 -144 -346 -91 -268 -434 136 3 547 270 320 -1
4117 -1 -301 -367 -177 -108 -181 129 324 386 496 153 75 -391 -429 -275 -135 57 191 475 162 104 -40 -339 -511
4140 -511 -447 -501 75 177 438 276 265 -37 -237 -193 -535 -246 -148 181 298 412 -9 -42 -204 -315 -231 -130
4162 -130 -94 -187 272 127 352 -60 -349 -105 -298 -296 66 39 182 171 290 173 -31 -363 -520 -63 -171 205
4184 205 261 373 289 -7 -3 -493 -352 -399 -184 76 117 245 279 131 -65 -121 -388 -226 -367 -171 200 409 355
4207 355 349 60 -171 -125 -269 -216 -65 118 349 440 82 189 -8 -207 -412 -491 -213 127 176 195 341 313 -5
4230 -5 -276 -415 -224 -14 -20 185 359 557 57 70 -173 -213 -45 -314 -8 322 389 321 370 455 -211 -136 -374 -268
4254 -268 -178 145 198 302 229 123 -74 -182 -315 -419 -121 163 267 222 175 93 109 -329 -357 -102 -122 -125 395 503
4278 503 345 116 -113 -152 -130 -443 -430 -89 -44 124 383 395 9 -123 -549 -531 -235 -173 184 159 450 292 94
4301 94 40 -279 -381 -284 -65 47 278 281 205 498 116 -77 -498 -292 89 -11 157 91 538 164 329 -45
4323 -45 -247 -298 -336 98 58 238 394 141 -44 -315 -380 -220 -83 -69 -109 289 194 119 226 56 -396 -268 -259 9
4347 9 -18 633 506 237 149 -236 -180 -235 -187 -224 -103 167 403 158 292 137 -293 -165 -278 -295 -95 324 386
4370 386 252 184 182 -158 -273 -194 -243 -146 220 78 78 116 -10 11 -551 -519 -251 -237 156 366 230 340 158 -196
4394 -196 -297 -286 -277 -386 178 75 90 142 92 90 -180 -360 -340 -191 34 194 187 396 267 360 -6 -314 -270 -28
4418 -28 -249 229 201 258 276 -206 -242 -310 -628 -499 -72 76 226 133 554 22 -147 -217 -311 -168 -64 -172 340
4441 340 547 295 285 153 -43 -482 -434 -75 -91 286 349 470 86 180 -345 -236 -468 -339 -229 151 316 475
4463 475 265 77 -262 -392 -301 -449 -222 19 248 339 307 38 -92 53 -242 -352 -250 -60 166 341 186
4484 186 200 2 -197 -375 -286 25 159 287 349 321 420 20 -387 -440 -64 -79 115 223 187 160 91 200 -227
4507 -227 -210 -34 -330 9 311 116 263 438 163 -171 -8 -201 -211 -162 -108 177 406 106 495 -68 37
4528 37 -547 -492 -255 307 205 413 221 15 75 -472 -219 -410 -175 -25 200 413 222 378 390 -11 -376
4549 -376 -529 -362 -51 124 40 431 518 -136 -112 -99 -363 -504 -52 105 443 402 110 -120 89 -219 -344 -302
4571 -302 -26 -198 96 372 325 405 -104 -219 -101 -393 -43 0 18 235 195 203 -62 -70 -296 -102 -562 -27 213
4594 213 217 492 304 -148 -99 -247 -443 -429 -143 -37 174 605 365 18 -48 -223 -573 -321 -105 19 377 198
4616 198 402 131 -69 -557 -420 -396 -76 8 211 283 272 285 -16 -174 -251 -670 -253 -116 129 225 367 540
4638 540 83 101 -253 -321 -427 -143 365 403 340 275 263 197 -289 -262 -303 -217 259 52 345 351 -25 -71 -260 -307 -357
4663 -357 -69 -73 145 265 511 206 -16 -231 -655 -488 -270 97 223 563 304 106 -40 8 -329 -185 -119
4684 -119 -213 16 295 326 427 -11 -426 -181 -453 -223 200 58 223 309 111 214 209 -100 -273 -530 -48 -33
4706 -33 145 178 609 176 213 123 -234 -456 -393 6 80 282 201 291 125 -402 -274 -298 -307 86 30 241 581 312
4730 312 -39 33 -255 -331 -362 -75 -6 353 234 291 152 -125 -245 -370 -178 -342 44 91 385 411 190 176 -115
4753 -115 -374 -340 -142 37 148 377 318 211 -277 -124 -225 -285 -254 -108 230 353 278 235 196 -172 -389 -198
4775 -198 -283 -142 108 39 392 404 -192 13 -53 -76 -273 -27 24 93 379 208 245 -231 -184 -356 -106 -360 157
4798 157 128 207 178 -154 -62 -323 -406 -294 12 80 252 275 208 298 46 -33 -314 -412 -280 -277 289 14 489 268
4822 268 164 -80 -439 -351 -40 -86 29 208 323 251 385 -18 -269 -390 -103 -14 -40 321 140 171 268 -20
4844 -20 -203 -215 -232 -341 17 444 357 316 137 25 -366 -236 -193 -314 46 39 59 351 203 290 -37 -277 -321 -445
4868 -445 10 259 118 304 320 126 -148 -260 -338 -393 4 -11 8 531 231 244 150 -208 5 -454 -162 -1
4890 -1 257 278 302 153 14 -69 -284 -377 -227 -217 109 223 369 419 161 31 -204 -192 -76 -188 86 302 415
4913 415 305 -67 -65 -170 -537 -414 -153 189 130 562 317 77 108 -106 -194 -279 31 -29 290 339 342 119 238
4936 238 -15 32 -387 21 -198 119 120 181 376 -91 -197 -434 -312 -203 147 256 251 456 65 -125 -270 -268 -241
4959 -241 -314 -208 203 174 445 232 241 323 -211 -192 -374 -29 155 350 399 182 406 -33 -52 -349 -239 -65 97
4982 97 191 264 262 64 -81 -301 -320 -553 -196 -148 -102 263 116 318 -297 -106 -130 -245 -256 -50 304 157 142 294
5006 294 294 -252 -260 -512 -176 -292 -71 252 292 93 -13 2 -248 -130 -207 -413 -90 122 144 293 334 -155 -187
5029 -187 -444 -186 -322 20 172 212 -70 17 148 -118 -187 -405 -468 -109 246 227 488 150 89 -202 -494 -396
5051 -396 -192 -53 -118 451 337 214 -59 -250 -257 -284 -115 -161 60 171 409 310 300 -11 -78 -484 -441 -70 58
5074 58 386 152 296 103 -444 -103 -396 -405 -228 -129 268 240 436 317 178 -73 -530 -181 -173 67 143 135 530
5097 530 256 -33 -173 -286 -174 -330 -246 91 171 95 308 163 -22 -324 -221 -231 59 -44 57 456 -80
5118 -80 182 25 -111 -270 -256 -377 -10 150 81 438 -12 64 -235 -361 -248 -219 -247 -7 204 646 -11 12
5140 12 -142 -227 -436 -250 63 -174 89 301 455 -18 -9 -143 -207 -183 -198 -33 9 252 289 136 61 -123 -344
5163 -344 -235 -275 -130 315 311 118 181 226 -115 -279 -368 -8 -9 -78 218 383 61 -66 178 -441 -134 -187 -6
5186 -6 134 225 515 42 241 -79 -23 -406 -429 -45 25 323 317 285 70 71 -193 -104 -134 -357 122 111 239 238 134
5211 134 -169 -335 -280 -263 -110 189 134 326 307 265 45 -222 -259 -274 -500 30 152 111 77 54 174 -48 -146 -226
5235 -226 -173 -98 263 447 359 256 149 -42 -217 -306 -287 -96 -8 74 400 169 44 -42 -165 -73 -134 -338 -8
5258 -8 179 109 285 341 -2 -94 -286 -279 -205 80 97 382 120 288 64 -85 -226 -360 -118 -117 170 189 325 -67
5282 -67 -79 -2 -15 -200 -454 -64 106 346 120 181 86 66 -114 -274 -102 77 75 191 369 356 99 174 -271 -125
5306 -125 -109 -44 151 185 72 394 -108 104 -125 -357 -284 -116 -71 424 358 124 322 -29 -33 -341 -503 -361 -7
5329 -7 190 217 104 118 36 5 -104 -340 -72 1 -52 50 299 -54 160 -90 -159 -324 -456 -163 266 352 372 144
5353 144 71 67 -114 -506 -361 -48 -63 45 301 344 326 1 -76 -257 -209 -167 -103 2 374 290 244 -124 -208 -268 -285
5378 -285 -162 -42 -57 293 326 176 173 -168 -301 -133 -44 -32 262 195 222 394 44 220 -109 -137 -90 -217 -47
5401 -47 184 374 318 77 8 -144 -155 -362 -446 -75 -15 94 222 335 144 -30 -171 -276 -182 -176 282 309 251 451
5425 451 -5 48 -182 -510 -22 -262 112 234 148 173 -37 -96 -356 -452 -96 -43 176 228 287 421 126 -40 -3
5448 -3 -312 -305 -295 21 224 103 186 32 132 -138 42 -200 -112 -183 171 217 221 332 109 15 -285 -39 -255 -19
5472 -19 -81 256 411 146 -34 -129 -218 -113 -229 -387 -118 74 303 115 67 -7 -78 -362 -159 -55 -85 145 161
5495 161 296 129 -173 -106 -270 -423 -18 54 -31 -44 228 297 -136 -117 -233 -208 -24 4 336 274 214 92 -40
5518 -40 -89 0 -222 -34 -76 -3 154 486 309 240 -4 -137 -184 -435 -184 173 -125 218 446 43 -55 -119 -398
5541 -398 26 -36 7 -68 263 335 -46 44 -12 -87 -213 -238 -71 119 225 351 309 -87 -14 -141 -273 -177 -22 136
5565 136 96 127 386 155 -127 -227 -215 -187 -9 92 177 249 213 136 -73 -293 -288 -272 -206 -100 175 205 435 84
5589 84 230 -241 -25 -309 -141 83 357 262 -82 112 145 -70 -288 -229 -180 184 199 322 312 51 82 -85 -203
5612 -203 -123 -380 13 -223 345 116 242 -119 -10 -60 -139 -158 -72 -49 310 204 175 132 79 36 -273 -272 -167 363
5636 363 113 166 183 50 57 -46 -211 -126 -55 -77 202 -18 12 -84 190 -231 -133 -89 -354 -114 -116 245 237 230 -61 -121
5662 -121 -33 37 -343 -3 -128 198 234 434 403 -9 -239 -128 83 -152 -38 160 163 87 104 -329 -229 -336 -164
5685 -164 -17 -229 252 201 266 88 82 80 -176 -279 -222 13 90 160 37 7 6 -102 -199 -353 -556 4 38 162 206
5710 206 220 143 38 -257 38 -359 -149 -116 22 244 8 172 -59 67 -221 -93 19 41 213 603 287
5731 287 27 -60 -254 -475 -72 115 -169 184 219 144 213 24 -322 -157 -128 -279 -64 96 367 20 308 155
5753 155 81 -74 -261 -161 -125 60 183 92 243 -8 180 -178 -292 -226 -109 -76 178 318 237 143 106 -94 -70
5776 -70 -255 -105 -121 212 202 -157 -25 14 216 -115 -599 -72 111 -23 130 42 11 -76 -18 101 -160 -112 -32
5799 -32 144 64 142 122 194 26 -72 -155 -96 -270 97 22 353 279 92 23 -165 -133 -355 -280 -196 68 302 204 176
5824 176 356 100 -109 -512 -211 -215 72 35 84 142 86 -96 -226 -216 -215 57 48 95 209 15 0 -197 -297 -125
5848 -125 -335 21 -49 142 297 82 217 75 -3 -369 -175 -121 152 206 -81 -116 228 196 50 -197 -323 -179
5870 -179 8 30 88 145 327 87 -2 -340 -385 -94 -209 9 259 288 98 -22 -225 -247 -94 -98 250 199 -64
5893 -64 78 344 316 133 -370 -20 -97 -217 -22 6 261 49 -184 -18 -79 -473 -240 -212 -188 43 -124 72
5915 72 348 -20 -203 -80 -360 -135 45 28 242 230 365 176 -68 -89 -175 -77 -23 -16 127 185 111 93 164 -312
5939 -312 -14 -134 -127 92 50 140 228 292 -192 -34 -36 -252 22 199 -52 253 119 73 -4 -80 -93 -222 -426 -120
5963 -120 -160 121 338 31 61 -83 -75 -258 -264 -241 -44 17 -17 161 118 -152 -253 -67 -281 -140 -66 256 111 285
5987 285 241 110 -205 -361 4 -46 -112 171 164 98 450 -71 -155 -37 -188 -340 -180 137 132 194 34 -73 -169 -118
6011 -118 -192 -192 -77 -100 234 121 246 247 88 12 -174 -262 -14 -130 58 71 -71 2 69 -47 108 -251 50 -31
6035 -31 77 334 217 368 -23 -199 -149 -340 -67 99 -30 242 60 -53 -46 -148 -260 -94 -153 119 74 -106
6057 -106 133 185 138 54 -138 -277 -219 110 -108 230 122 245 208 -34 -158 -125 -274 -248 33 226 233 309 316 30
6081 30 -271 -207 -332 -169 -172 228 331 20 -55 132 -127 -39 -367 -166 112 23 110 211 -21 106 2 -99 -360
6104 -360 49 -131 -134 104 230 127 -100 -37 -142 -138 -136 -184 -122 139 184 137 -19 -164 -192 -265 -78 -40 -45 87 186 372
6130 372 -151 153 29 -152 -255 -258 -2 -82 -63 -49 140 160 -51 -205 -263 -113 12 184 101 298 227 116 -52
6153 -52 -65 -213 -120 -282 -78 103 318 227 150 -120 -308 46 -106 -229 11 -75 87 307 43 40 7 -337 -421
6176 -421 107 37 136 87 185 215 80 -132 -191 -221 -46 -56 239 152 327 -2 -66 20 -116 -108 10 -126 101 255
6200 255 358 28 204 191 -360 -144 -56 -18 -50 247 164 267 -14 -224 47 -101 -217 18 29 60 279 162
6222 162 59 116 -135 -123 -145 -30 -44 -231 110 287 -129 -121 -139 61 -48 -110 122 219 215 83 -74 -44 -111 -73 -91
6247 -91 -238 -27 -8 -64 273 62 170 70 -2 -234 -56 -46 3 18 135 129 142 -161 -301 -276 -34 -307 -20 129
6271 129 123 -50 195 108 88 -193 -13 -30 -143 67 189 307 257 240 39 -249 -57 -242 -95 -32 250 67 149
6294 149 240 -11 -226 44 -13 -82 107 99 14 198 297 11 14 -15 -96 -80 -97 67 -93 177 143 -201 -131 -154 -331
6319 -331 -101 -205 -4 194 108 -1 -76 -99 18 -58 -83 64 65 198 17 96 -194 -103 163 -80 -302 5 70
6342 70 -54 -61 190 97 -83 -130 -219 -260 -50 -137 116 93 208 228 -252 -172 -226 -136 -57 -6 97 451 147 54 -90
6367 -90 -125 -324 -15 -321 -203 -17 230 71 106 77 -364 -103 -113 -1 -38 20 322 300 57 145 38 -103 -291
6390 -291 -60 -227 -89 33 280 256 135 -180 -46 -234 -183 90 194 -51 283 113 5 53 -53 2 -30 -73
6412 -73 98 -18 249 146 47 25 -218 -217 -274 -89 -125 198 219 323 -45 -12 -97 5 121 -1 -124 66 305
6435 305 -79 84 248 80 -238 -293 -6 -192 -26 116 211 265 2 -254 -243 -42 -46 -20 44 -169 24 309 -81
6458 -81 48 -260 -74 76 -74 0 53 192 208 -106 86 69 -30 9 -251 -181 -37 0 2 -3 94 -18 -131 -348 -192
6483 -192 -55 -118 -106 76 71 42 123 -213 -253 -284 202 127 160 24 159 -128 -94 66 -273 -300 -114 7 144 17
6507 17 156 291 76 240 -72 -62 -99 125 57 163 160 29 99 35 233 -277 -59 144 278 176 221 170 -65
6530 -65 138 -136 -27 -256 -128 -55 -171 304 208 161 -80 -82 -98 -207 -1 231 195 194 199 196 -51 -143 17 -186 -133
6555 -133 -26 -70 58 147 256 -76 -338 -89 -6 -159 64 -52 220 38 161 76 -145 -173 -20 -13 -152 -31
6577 -31 288 279 169 51 -114 -1 44 -204 -321 -33 63 -26 342 83 -21 -1 -79 -196 -158 214 -185 301 169
6600 169 -2 -91 -23 1 -1 -404 -166 -4 -162 441 47 195 188 -27 -369 -243 -122 -107 182 103 -68 80 38
6623 38 -82 -231 -212 -126 31 19 119 76 130 -66 67 -161 -75 -42 205 197 271 50 143 89 94 20 -57 -36 -113 -82 85
6650 85 4 10 184 75 -167 -124 -188 -81 81 -101 208 223 -11 -138 11 -206 -203 -24 233 106 -46 0 312
6673 312 201 -265 -148 -74 -71 -130 175 217 150 21 -98 -26 -27 -93 -232 -120 -135 51 229 115 -66 -30 -409 -155
6697 -155 -299 -191 -39 145 261 -39 64 -131 -187 -437 -26 -40 -328 15 100 -147 100 100 -55 -51 -90 -168 180
6720 180 290 105 80 209 18 -206 -113 -20 -193 -29 39 122 -19 -32 33 122 -177 65 53 9 177 -168 311
6743 311 24 218 18 -257 -58 -289 -242 54 226 128 -101 -35 -75 -103 -73 -71 127 58 267 581 118 223 -283
6766 -283 -152 -64 -118 18 -90 64 -2 268 -68 160 -86 234 -300 -84 58 -14 244 202 116 75 -40 -29 29
6789 29 -49 -154 43 117 121 167 161 -115 -88 -172 -94 -25 -10 100 26 222 -58 341 -137 -234 -175 -76 -43 -222 124 178
6815 178 81 30 -285 -89 229 -191 -107 82 290 315 46 221 -58 -293 171 110 -140 -300 112 100 -20 -66
6837 -66 -225 -138 -141 -259 -70 152 -45 250 -29 -33 -217 -84 -71 -211 332 30 215 233 -79 -154 -21 -65 -199
6860 -199 -505 -257 86 -237 148 31 217 -66 -244 -8 12 38 109 -210 27 290 40 207 -42 5 -81 5
6882 5 42 52 190 275 153 -76 13 76 1 107 270 218 30 174 181 -7 -149 -136 -15 -405 54 152 -42 160
6906 160 45 272 33 -93 -17 -200 -32 132 -14 37 43 131 13 -59 -158 -189 -88 98 -196 28 320 145 48
6929 48 -208 304 17 49 -109 101 -31 172 -16 -87 42 -157 -68 24 -170 -191 117 221 86 -29 -12 -117
6951 -117 55 28 51 -74 166 135 -87 206 287 -66 7 -201 26 -125 113 114 142 -20 52 -107 -211 -83 -170
6974 -170 -97 107 158 199 62 235 -87 -108 -125 -58 -63 -17 -50 -74 64 64 -126 -63 -183 -91 -128 143 292 154 151 67
7000 67 89 83 -19 -192 -235 11 48 314 84 85 15 -48 -207 -305 156 1 33 -127 79 -72 35 -275 -96 -251
7024 -251 118 11 -73 140 322 111 -231 50 -151 -274 -42 170 -20 -100 272 273 -96 -264 -78 -291 161
7045 161 48 -99 296 78 303 -140 -18 -118 -173 20 29 74 11 119 225 104 135 -364 -44 -326 -217 100
7067 100 197 70 364 281 -42 -33 -122 -115 -204 18 -88 120 -34 194 -54 -75 -215 -41 -110 -27 47 -144 165 212
7091 212 79 -47 -254 -329 -258 -8 -3 190 180 -69 113 19 -177 -103 -43 -133 144 -52 60 39 187 351 -109
7114 -109 -156 -78 -125 99 -54 81 144 253 126 175 -211 -45 207 -20 -41 -182 -15 259 -120 -21 45 14 -237
7137 -237 -327 44 155 -17 307 -46 -135 -269 -185 -74 41 -108 119 -34 303 237 -94 -37 -57 15 -243 -35
7159 -35 196 106 -18 211 116 62 138 -131 -102 -124 -7 184 -62 88 145 -72 115 -43 85 45 64 119 66 6
7183 6 41 29 -49 -100 -53 -2 -26 155 13 148 183 96 -162 86 -141 -224 -2 93 175 12 -36 23 25 196 -194 4
7209 4 164 158 162 96 -40 -60 -150 41 -28 -84 -22 -37 183 160 222 36 -59 -214 100 -59 40 126 108 117 49 55 150 -84
7237 -84 -5 52 -197 36 -149 -8 248 -34 166 259 -170 13 -324 -142 211 236 71 171 -20 58 -2 -141
7259 -141 219 -74 151 56 215 93 107 47 -145 -127 130 -15 75 -195 253 52 119 -100 14 -214 -357 -248
7281 -248 2 169 81 3 -3 117 25 -256 -156 111 1 99 389 20 67 -47 -99 137 -20 132 -170 193 200
7304 200 161 -63 -124 -23 -179 -207 -237 -150 -28 213 93 -45 -72 -6 -11 -213 74 -22 248 -67 296 50 85 160
7328 160 -23 -263 -342 -46 -281 180 113 109 63 97 58 -54 22 187 48 299 128 235 80 213 172 -102 -156
7351 -156 8 95 41 139 236 129 223 45 -217 -81 -86 100 137 137 78 208 84 82 -103 -102 -177 -101 -133 -41 215 110
7377 110 20 -54 81 -59 -191 -268 48 50 80 279 142 17 -165 -338 -245 -191 -74 59 288 54 50 -26 -57 -403
7401 -403 -7 109 -331 19 -63 182 263 3 -106 -97 10 -8 -5 18 -49 29 103 146 33 170 -3 -2 -25 104 205
7426 205 153 258 110 181 -120 -123 -162 -166 -209 38 22 98 194 -18 40 35 -107 32 88 67 -212 67 -49 -63 -59 37 -299
7453 -299 -410 -121 -99 129 182 153 26 -304 90 -227 -279 -3 -18 204 218 122 -16 -1 -217 -141 -142 95 31 -169
7477 -169 31 225 -86 -35 -154 -12 253 -20 -224 36 194 128 75 136 -119 59 -234 -80 20 102 258 202
7499 202 -20 -185 63 -168 -94 13 -72 109 11 84 8 219 12 241 -152 -161 83 12 -169 105 -94 262 170
7522 170 -14 -94 -216 176 187 78 204 177 -204 150 183 26 -6 -33 -60 376 -13 111 -69 162 49 -179
7544 -179 -172 -49 -71 -10 289 232 119 -259 -115 114 -223 -61 109 -25 2 51 156 -134 -179 -124 -7 19 -101
7567 -101 -3 80 285 244 173 -83 -124 -256 -166 -183 -5 -52 170 80 253 66 -15 -441 10 67 20 95 224 112
7591 112 129 160 142 -103 -56 11 38 171 271 231 8 -103 -10 156 60 -46 -52 -161 354 29 145 -31 86 -75
7615 -75 -97 133 238 -2 -2 78 -16 72 7 81 156 -106 -35 -93 41 -4 117 90 24 -23 -113 57 8 -33 224 253 -51
7642 -51 37 -112 -93 -137 -4 -116 -153 71 25 88 -120 46 -60 115 -110 -226 -32 -282 33 97 -66 59 194
7665 194 -82 -331 56 94 23 121 73 162 157 29 -93 -99 -75 -143 72 191 203 247 97 -24 -26 -25 137 -147 -108 55
7691 55 449 66 94 287 -210 22 -252 -100 -168 -27 218 69 176 15 199 17 -128 -89 -249 193 -152
7712 -152 221 305 -102 -17 -19 -69 31 2 -98 11 -117 164 137 349 196 11 -267 -242 18 37 -12 -265 178
7735 178 125 -149 230 -251 -4 110 -148 33 285 142 130 160 -245 -356 -18 235 -118 65 -67 198 37
7756 37 87 -174 -283 -133 -113 64 -49 239 162 -142 -234 -227 -123 -9 -335 8 99 26 -179 161 234 126 -78
7779 -78 -236 -175 -121 -204 68 94 47 214 -157 -88 -146 -124 -47 86 44 123 307 151 -8 -88 -12 101 -113 -41 133
7804 133 -33 69 -132 -37 -12 -308 -48 -114 79 86 182 41 74 -140 -257 -183 -111 130 -59 105 -37 102 122
7827 122 -42 46 -44 -2 -245 23 159 -82 203 -21 76 -87 21 21 -109 -14 -24 99 98 -189 128 -163 -151 126
7851 126 -44 44 -22 -57 275 41 200 -72 -251 -154 -113 -132 -26 -172 -101 186 118 -20 174 42 -102 -32 89
7874 89 30 46 206 -92 84 -313 -188 -197 -151 -76 -19 -65 235 274 115 43 -168 11 -117 -139 -49 127 132 174 159 -66
7900 -66 -136 -173 72 -213 -55 -55 128 279 -90 -128 -217 -94 -287 -96 -42 -83 -33 5 193 -95 -14 -162 0 25
7924 25 -31 -59 70 149 206 92 2 -204 -229 -461 -163 82 46 238 -12 -29 47 -122 -198 -128 -31 -56 108 214 -4
7949 -4 188 68 188 -175 -147 -47 -151 -201 305 181 119 111 74 -345 32 -130 -101 60 373 61 20 246 -46
7972 -46 -294 -25 -20 -225 -91 -57 155 354 22 108 -160 -426 -230 -152 106 -200 195 167 -26 9 -27 -131 -71
7995 -71 -70 -165 -56 161 173 226 -108 -59 -192 -151 -312 -195 284 32 223 35 -175 -229 -30 45 -151 -160 34 137
8019 137 90 130 -91 -72 -396 -136 -325 -101 -123 -195 225 154 42 169 -153 26 -47 192 -1 63 66 66 312 36
8043 36 -238 -98 57 -95 295 287 35 -56 242 87 48 -105 -151 -77 -29 60 50 295 -4 137 -99 -17 116 -97
8067 -97 -42 2 -60 -107 -6 79 134 -41 -92 44 131 -37 -82 -69 203 52 350 -75 -231 27 -221 103 15 23 46
8092 46 132 56 -103 -158 134 38 34 -47 -79 114 94 45 -237 -29 65 108 135 -23 251 100 178 -87 224 -235 -127
8117 -127 -69 -46 126 489 12 36 -107 80 -198 25 73 129 293 89 431 328 -16 71 -132 179 105 -168
8139 -168 133 -198 162 5 -15 91 29 33 -6 102 -32 -102 -73 79 190 188 9 -226 27 -107 38 -184 -1
8162 -1 13 300 -30 2 18 -17 -265 -153 -22 296 407 152 32 -12 -51 -270 -8 -122 -77 -283 174 -30 40
8185 40 234 232 30 -93 -191 112
8191A12
$$ Imaginary data points
##PAGE= N=2
##DATA TABLE= (X++(I..I)), XYDATA
0 0 0 0 0 0 0 0 0 0 0 0 0 -8 8 -8 8 -16 16 -24 24 -32 35 -43 49 -64 72 -81 97 -112 129 -149 169 -193 219
33 219 -249 281 -317 357 -398 446 -500 556 -615 685 -757 838 -924 1020 -1125 1243 -1367
50 -1367 1506 -1659 1828 -2021 2231 -2471 2742 -3055 3419 -3847 4363 -4996 5794 -6838 8265
65 8265 -10349 13695 -19946 35723 -166846 -218795 69395 65880 127612 255140 270028 31611
77 31611 -147987 -175996 -148667 -176622 -118261 63737 236513 213617 108708 69170 23421
88 23421 -157967 -275848 -178019 -32887 3452 78643 218637 230249 77831 -46394 -97497
99 -97497 -153994 -190202 -116826 25688 131642 156516 143479 115041 29154 -109838 -181196 -142412
111 -142412 -96229 -64206 46458 175241 172249 89393 50293 -6814 -134438 -197818 -122336
122 -122336 -24903 30701 103456 180079 165420 52386 -64980 -120355 -139749 -152070 -104668
133 -104668 32120 146445 142736 104512 97150 26863 -119025 -178070 -110354 -52663 -25516 66180
145 66180 173554 164620 63973 -13697 -61598 -127930 -172569 -118948 6689 94678 110915 122343
157 122343 127450 42416 -94432 -140371 -99011 -81315 -60571 46375 151190 136155 65845
168 65845 33409 -12394 -108705 -162364 -110325 -23210 28883 70512 128421 142069 59433 -48432
180 -48432 -87998 -91227 -114492 -92039 22557 117854 110936 82220 78256 19743 -95490 -145277
192 -145277 -101028 -52399 -21646 45352 127746 137201 66584 -4101 -39537 -84143 -131869 -104375
204 -104375 -1021 72715 83259 98376 111006 42149 -72218 -116909 -95548 -83787 -60167
215 -60167 27982 117965 124034 74483 36389 -4260 -78057 -132293 -101718 -24014 26026 57243
227 57243 106486 123783 53959 -39615 -77062 -87227 -109497 -86089 9861 91436 100325 86085
239 86085 76426 23613 -69300 -119430 -94372 -50728 -18276 38222 110153 123122 60251 -3879
251 -3879 -37200 -80746 -125230 -97143 -6217 57151 72797 93896 104577 43606 -53454 -95476
263 -95476 -82795 -74210 -54580 20136 103060 112256 65292 30255 -2550 -71735 -126861 -98282
275 -98282 -23947 19863 47559 96601 116496 55344 -29512 -64386 -72519 -90868 -75906 3231
287 3231 80666 91794 71738 60598 22902 -58199 -113211 -92550 -45367 -15906 27491 93742
299 93742 114553 61191 -266 -29923 -63482 -102467 -85264 -9256 50640 66413 77953 84885
311 84885 37740 -45235 -88714 -79334 -66078 -47507 12723 85270 100326 63133 30011 530
323 530 -55309 -102785 -83973 -22907 17785 41992 79715 96479 47657 -25185 -59412 -66697 -80138
336 -80138 -68518 -2068 66771 80438 64396 55624 25630 -43230 -91731 -77136 -38893 -15482
348 -15482 21002 77880 96684 52372 -113 -26368 -56509 -90695 -78543 -14323 39196 56569
360 56569 69450 77606 40286 -30251 -71006 -66935 -57224 -43630 6509 70290 86232 55548 27674
373 27674 2695 -48409 -93182 -78401 -25958 9120 33589 72363 89964 48585 -14498 -45005
385 -45005 -55463 -72051 -64393 -5570 56614 69687 56418 52607 26477 -39429 -86797 -71995
397 -71995 -38316 -21313 13930 71938 92051 51647 6082 -16368 -46044 -81874 -74297 -16595
409 -16595 34125 49258 59943 72076 43097 -26472 -69761 -63722 -53935 -47352 -1563 65770 84450
422 84450 54912 30096 9315 -39185 -84545 -74907 -27549 7518 30132 62767 82183 49839
434 49839 -11427 -45885 -53186 -66197 -65173 -13123 51338 67640 55084 53348 31900 -30967 -78262
447 -78262 -68649 -39585 -21028 12397 63830 84040 52107 7168 -19881 -44542 -74872 -73374
459 -73374 -21262 32398 47290 54296 69066 45922 -20326 -61381 -56031 -50816 -46880 -3359 57234
472 57234 75382 53358 30755 6495 -37024 -77261 -74327 -31829 7734 29484 56518 78803
484 78803 52332 -8093 -41250 -45120 -59612 -61590 -12392 45535 57776 49514 49391 27793 -27421
497 -27421 -67874 -65162 -41805 -20432 10211 54371 79397 55814 9954 -16965 -35875 -67379
509 -67379 -70905 -20348 29635 39926 48142 64227 40293 -19252 -52953 -51584 -49632 -42440 -4587
522 -4587 44936 66910 54599 31488 9473 -24816 -65511 -72265 -33890 3946 21516 49191
534 49191 75548 50409 -6285 -35303 -43125 -60464 -58376 -11658 36990 51773 51239 48124 25684
547 25684 -18819 -56534 -60990 -40531 -19666 3842 44281 73431 52722 10472 -10024 -30492
559 -30492 -66298 -69492 -20920 22623 34741 49642 63221 38051 -13920 -45729 -49286 -45329 -36171
572 -36171 -7456 37767 62265 47532 23308 11151 -16368 -60127 -66838 -28463 512 11757
584 11757 42224 70833 48833 713 -24953 -37303 -54671 -54096 -17900 27030 49144 47876 40443
597 40443 25969 -10002 -52264 -59967 -35833 -18229 -2875 36358 67645 49896 14887 -2270
609 -2270 -23831 -57970 -62583 -26938 10332 30274 47016 56607 39563 -2146 -40890 -52238 -45099
622 -45099 -36153 -12522 33400 62088 48068 25198 13720 -15308 -56071 -60211 -28532 -4890
634 -4890 10934 41180 61537 44268 7185 -20822 -37778 -49918 -49820 -22454 21536 47943 46184
647 46184 39417 29285 -7062 -49904 -55480 -33691 -20309 -2569 36049 60275 44138 15598
659 15598 -2755 -24631 -50432 -54436 -28098 7048 29416 40884 49488 40470 2873 -36181 -45615
672 -45615 -39717 -36984 -15297 29228 54892 43543 27182 14087 -15808 -50289 -54516 -30284 -6233
685 -6233 12580 36435 53615 43551 10171 -19305 -32493 -42580 -47395 -23586 18830 41546
697 41546 39177 37967 29651 -5694 -44066 -49501 -33967 -21722 -2766 31502 54299 44492 17519
710 17519 -2847 -21192 -43604 -51886 -28710 7042 25974 34118 44577 38935 3486 -32223 -40157
723 -40157 -36787 -35222 -15822 23638 48061 42396 27582 14005 -11252 -42176 -51528 -32184 -6630
736 -6630 10949 30260 49003 42663 10911 -17538 -28812 -38831 -44315 -23061 15142 36193 36922
749 36922 36265 27947 -2829 -36296 -45123 -33802 -21282 -4267 25505 48575 42628 18467 -908
762 -908 -17367 -39673 -49570 -28192 4676 22090 31147 42852 37704 4893 -27208 -35696 -34511
775 -34511 -33889 -16775 19601 43970 39721 25710 14753 -7198 -38589 -49479 -30719 -6944 7387
788 7387 26396 47053 42479 11213 -15532 -25465 -35690 -42288 -23979 12553 34032 34481 32818
801 32818 26710 445 -33294 -44057 -31650 -18823 -5729 20733 45534 41651 17153 -1379
813 -1379 -14462 -34752 -45705 -27927 3223 20484 28147 37804 35273 7473 -23639 -33620 -31733
826 -31733 -29776 -16604 14510 38856 37477 24656 14050 -4127 -32152 -44867 -30466 -8890
838 -8890 5407 22268 41417 39605 13703 -11066 -22799 -32773 -39483 -24473 7758 29389 32583
851 32583 32012 26973 3209 -28091 -40594 -31260 -20233 -7572 17958 41819 40014 19013 1851
864 1851 -12548 -33143 -44344 -28141 798 17372 27069 37431 34301 8204 -21049 -31456 -30944
877 -30944 -29263 -16860 12958 36892 35538 23464 13804 -3199 -30534 -42704 -28204 -7984 4304
890 4304 20403 39132 37235 12823 -10159 -20408 -29473 -35863 -23327 6255 26872 29291 27929
903 27929 25171 4957 -25180 -37096 -27953 -18423 -9112 14093 37624 36900 17809 3086 -9239
916 -9239 -28516 -40284 -27083 -1913 14649 23634 32937 32488 11072 -16638 -28939 -28008 -27669 -18564
930 -18564 8619 32799 33282 23129 15371 -236 -26465 -39337 -28430 -10803 1989 18410 35705
943 35705 35668 15138 -7468 -19422 -27768 -33838 -23877 3329 24957 27680 26369 24661 6418 -22011
957 -22011 -33992 -26763 -19098 -9512 12645 34109 34435 18943 4521 -8819 -26336 -36834 -27136
970 -27136 -3698 14058 22197 29457 31158 11807 -15841 -26587 -25195 -25955 -17992 7438 29096
983 29096 29547 22061 15304 61 -22869 -34313 -27246 -12251 2019 16058 30571 33949 17149
996 17149 -5671 -17817 -24586 -32064 -24220 2530 22592 24845 25372 23954 6144 -19571 -29755
1009 -29755 -25529 -19333 -8448 10986 28609 31801 20324 4871 -7747 -21569 -33827 -27862 -5029
1022 -5029 12053 19062 28384 30999 11819 -13528 -23135 -24498 -26234 -16095 6972 24980 27538
1035 27538 22469 13614 -866 -18797 -30994 -27201 -11628 1632 12483 27220 33014 16497 -4454
1048 -4454 -13826 -22056 -31482 -23480 782 18208 23177 26096 22649 5791 -15856 -27426 -26289 -17738
1062 -17738 -6644 8168 25438 30992 19107 3724 -5443 -18434 -31938 -25816 -4986 8801
1074 8801 15988 26763 28952 11547 -9234 -20009 -24598 -24944 -15426 3520 21771 28299 22179 11925
1088 11925 977 -16169 -30156 -25921 -9595 451 10428 25728 30128 14918 -2475 -11110 -20665
1101 -20665 -28456 -21402 -1654 14369 22017 24337 20811 7993 -11709 -26091 -25829 -16472 -7979 5562
1115 5562 24462 30100 17486 4393 -3650 -17504 -29393 -23468 -5920 6407 15093 24280 25362
1128 25362 12939 -5614 -18637 -23106 -22229 -15746 44 19618 27399 20656 12717 3494 -14498
1141 -14498 -29059 -24625 -10563 -970 9872 24581 27565 14554 -404 -10982 -19927 -24954 -19878
1154 -19878 -3809 12733 21261 21720 19142 9649 -9619 -24393 -23748 -15975 -9525 4361 22804 27516
1168 27516 17321 6088 -3101 -16904 -27179 -21886 -6850 5704 14928 22119 22967 12753 -4919
1181 -4919 -17585 -20032 -19800 -16181 -1223 18280 23884 18194 13153 4826 -13018 -26295 -22910 -11689
1195 -11689 -2167 8725 21677 25894 16185 473 -10867 -17732 -22946 -20653 -5150 12719 19387
1208 19387 19140 18352 10315 -8497 -22438 -21644 -15686 -9702 3483 20108 25493 18068 6870 -2899
1222 -2899 -15031 -24263 -21997 -8419 5444 13901 20202 22783 13679 -4428 -16612 -18740 -19064 -15589
1236 -15589 -775 16448 22111 18062 13181 4251 -11452 -23451 -21855 -11808 -2511 7417 19388
1249 19388 24768 16164 776 -9270 -15439 -21789 -20112 -4766 11279 17228 18093 18493 10142 -7325
1263 -7325 -19979 -20152 -14878 -9412 2122 17443 23852 17232 7097 -1810 -12096 -22439 -21684 -8366
1277 -8366 4295 11651 18286 22009 13548 -3116 -14707 -17398 -18329 -15194 -2088 14459 20738 17344
1291 17344 12692 4687 -9212 -21663 -21126 -11432 -2816 6086 17562 23330 15453 1416 -7765 -14113
1305 -14113 -20101 -19043 -5702 9302 15519 16892 17222 9861 -5720 -18143 -19362 -14518 -9277 866
1319 866 15493 22347 16631 7225 -458 -10446 -20953 -20827 -9161 3077 10235 16517 20872 13767
1333 13767 -1316 -13093 -16147 -17320 -15023 -3445 11955 19387 17032 12463 5233 -7397 -19894
1346 -19894 -20458 -12211 -3403 5098 15700 21919 15601 2738 -6339 -13047 -19106 -18032 -6295 7890
1360 7890 14632 16634 16803 9975 -4533 -16141 -17833 -14089 -9455 10 13615 20710 16180 7687
1374 7687 369 -9273 -19223 -19438 -9051 2064 8694 15448 19461 13305 -424 -10958 -14870 -16317
1388 -16317 -14469 -4186 10079 17368 15782 11820 5889 -5611 -17862 -19534 -11557 -3686 3575 13787
1402 13787 20886 15658 3585 -5488 -11841 -17653 -17704 -7446 5768 13674 15765 15316 10102 -2460
1416 -2460 -14606 -17675 -14034 -9169 -600 11798 19408 15890 8009 732 -8469 -17433 -18399 -9826 409
1431 409 8643 15044 17776 12839 991 -9765 -14842 -15792 -13330 -4408 8882 16486 15239 11757 5909
1446 5909 -5259 -16290 -17810 -11279 -4833 2732 12931 18709 14431 4636 -4357 -11087 -16559 -16087
1460 -16087 -8131 4746 12605 14364 14585 10212 -1536 -13629 -15848 -12927 -9342 -1565 10724 17371
1474 17371 14822 8298 1335 -7517 -15409 -16952 -10250 -461 7576 13133 16409 13221 2311 -9033
1488 -9033 -13563 -14248 -13376 -5232 7550 14907 14326 11320 6077 -4463 -14066 -16317 -11680 -4911 3020
1503 3020 11077 16422 14512 5773 -3971 -9892 -14063 -15891 -8900 3392 11069 13211 13833 10391 -808
1518 -808 -11762 -14760 -12895 -9421 -1536 9085 15315 14532 8408 1038 -6720 -13191 -15994 -10712 -827
1533 -827 6512 11165 15045 13294 2570 -7521 -11732 -13545 -13329 -5568 6191 13071 13953 11991 5902
1548 5902 -3607 -12431 -15472 -12444 -4606 2530 9481 15084 14268 5497 -3571 -8220 -12826 -15344 -8448
1563 -8448 2905 9137 12022 14083 10103 -184 -9529 -13720 -13378 -9425 -1803 7468 14405 14911 8564
1578 8564 942 -5190 -12627 -16223 -9896 -330 6041 10077 15054 12753 2360 -6131 -10564 -13110 -12403
1593 -12403 -5537 4345 11425 13885 11115 5409 -1924 -10719 -15882 -11995 -4027 1694 8529 15047 14078
1608 14078 4922 -2555 -7781 -12868 -14291 -7516 1824 8388 12012 12685 8756 1029 -7693 -13259 -12698
1623 -12698 -7978 -2433 5732 14161 14540 7618 1646 -4103 -12201 -15818 -9413 -1313 4280 10158 13997
1638 13997 11319 2832 -4661 -10275 -12280 -10992 -5469 3253 11081 12979 9914 5897 -835 -10357 -14644
1653 -14644 -10600 -4571 355 7770 14699 13222 5421 -1401 -7038 -12161 -13168 -7797 1054 8025 11262
1668 11262 11753 9031 1720 -7739 -12610 -10915 -7650 -3470 5301 13159 13045 7150 2480 -3577 -11103
1683 -11103 -14143 -9382 -1890 4310 9524 12734 10990 3717 -4743 -10001 -10969 -10177 -6236 2864 10572
1698 10572 11703 8851 6051 -158 -9324 -13052 -10103 -5073 -4 6856 12741 12384 6241 -798 -6594
1713 -6594 -10883 -12603 -8298 170 7420 9958 10403 8998 2325 -6967 -11431 -10068 -7794 -3690 4761
1728 4761 11635 11963 7666 3083 -3059 -9775 -13064 -9323 -2647 3466 7945 11641 10974 4316 -4165
1743 -4165 -8905 -10235 -10167 -6342 2267 9766 11092 9139 6022 87 -8117 -11870 -10134 -5253 -333
1758 -333 6047 11072 11712 5955 -688 -5596 -9358 -11647 -8487 -349 6908 9366 10352 8763 2539 -6014
1774 -6014 -10397 -9964 -8012 -3550 3752 10175 11281 7721 2826 -2422 -8536 -12008 -9308 -2793 3202
1789 3202 7433 10849 10786 4373 -3079 -7966 -9404 -9832 -6273 1832 8250 10307 8906 5938 166 -7657
1805 -7657 -11382 -9846 -5163 -537 5296 10530 11411 6315 -132 -5127 -8799 -11106 -8194 -735 5600
1820 5600 8894 9835 8495 2590 -5281 -9775 -9711 -7555 -3284 3328 9464 11105 7556 2916 -2149 -7858
1836 -7858 -11390 -9070 -2853 2652 6404 10031 9783 4570 -2504 -7291 -8856 -9191 -6148 911 7570
1851 7570 9566 8417 5457 478 -5984 -10481 -9565 -4957 -662 4852 9535 10533 6222 365 -4322
1866 -4322 -7927 -9931 -7488 -1077 4785 8347 9199 7824 2559 -4187 -8607 -9221 -7344 -3266 2698
1881 2698 8282 10187 7438 2949 -1467 -6986 -10105 -8625 -3066 2239 6137 9199 9226 4543 -1823
1896 -1823 -6266 -8585 -8629 -5783 407 6336 9136 8240 5398 812 -5086 -9548 -8859 -5091 -893 3778
1912 3778 8394 9560 5943 654 -3778 -7455 -9270 -7430 -1604 3778 7519 8582 7449 3351 -2928
1927 -2928 -8204 -8851 -6664 -3323 1521 7188 9660 7179 3038 -852 -6028 -9271 -8243 -3508 1283
1942 1283 5493 8663 8786 4843 -930 -5891 -7787 -8030 -5796 -529 5828 8877 7872 5416 1405
1957 1405 -4388 -8944 -8635 -5152 -1188 3289 8124 8986 5894 1345 -3452 -6928 -8460 -7161 -2205
1972 -2205 3682 7382 7818 6770 3670 -2411 -7558 -8128 -6419 -3746 1121 6881 8660 6893 3525
1987 3525 -909 -5558 -8505 -7736 -3930 1127 5236 7539 8070 5252 -324 -5585 -7065 -7239 -6002 -777
2003 -777 5372 7933 7027 5514 1921 -4063 -8105 -7784 -5475 -1715 2990 7299 8543 6431 1382 -3177
2019 -3177 -5955 -7842 -7121 -2572 3442 6044 7046 7120 3900 -2195 -6542 -7213 -6476 -3928 1079 6088
2035 6088 8182 6775 3479 -558 -4840 -7796 -8174 -4057 1155 4549 6765 7851 5286 -742 -5032
2050 -5032 -6294 -7069 -5876 -931 4749 6942 6808 5416 1611 -3347 -7167 -7824 -5416 -1271 2619 5971
2066 5971 8092 6252 1184 -2808 -5036 -7305 -7443 -2183 3099 5443 6506 6684 3371 -1936 -5643
2081 -5643 -7013 -6230 -3752 455 5259 7808 6771 3216 -393 -4014 -7554 -7704 -3963 1137 3419
2096 3419 6144 7777 4799 -609 -4166 -5999 -7103 -5374 -953 3790 6419 6681 4796 1523 -2312
2111 -2312 -6336 -7409 -5053 -1171 1827 5476 7814 6075 1352 -2230 -4876 -6992 -6577 -2619 2118
2126 2118 4887 6479 6354 3442 -1467 -5118 -6641 -6026 -3454 98 4545 6965 6349 3189 247 -3461
2142 -3461 -7150 -7524 -3759 382 2947 6304 7647 4691 42 -3224 -5603 -6675 -5265 -1366 3246
2157 3246 6073 6320 4588 1996 -2012 -6240 -6990 -4604 -1884 1006 5067 7267 5317 1578 -1315
2172 -1315 -4268 -6594 -6151 -2561 1504 4667 6125 5987 3714 -533 -4856 -6588 -5274 -3534 -505
2187 -505 4205 6944 5891 3044 730 -2810 -6558 -6492 -3669 -163 2900 5267 6525 4621 965 -3307
2203 -3307 -5492 -5789 -4906 -1952 2667 5913 5573 4280 2263 -1642 -5876 -6323 -4483 -1981 963 4816
2219 4816 6692 5493 2062 -1256 -3961 -6184 -5800 -3232 1219 4346 5260 5348 3781 -120 -4331 -6100
2235 -6100 -5043 -3468 -576 3933 6270 5625 3256 612 -2865 -5676 -6073 -3895 -345 2876 4927
2250 4927 5786 4775 881 -3002 -4834 -5092 -4683 -2062 2433 5073 5553 4446 2029 -1226 -5061 -5799
2266 -5799 -4725 -2051 862 4254 5987 5239 2329 -1155 -3636 -5334 -5497 -2883 804 3864 5096
2281 5096 5206 3589 -115 -3826 -5481 -4886 -3476 -269 3011 5720 5412 3360 696 -2194 -5212 -5968
2297 -5968 -4012 -615 2122 4510 5485 4324 1036 -2508 -4391 -5053 -4485 -2205 1964 4512 5082 4159
2313 4159 2029 -912 -4289 -5784 -4400 -1926 876 3638 5665 5249 2428 -840 -3083 -4948 -5486
2328 -5486 -3069 718 3556 4503 4947 3311 271 -3391 -4966 -4763 -3304 -716 2523 5072 5186 3048
2344 3048 885 -2149 -4479 -5545 -3981 -683 1738 4051 5139 4251 1563 -2085 -3950 -4801 -4354 -2125
2360 -2125 1437 4203 4804 4366 2260 -718 -3661 -5378 -4274 -2170 307 3278 5132 4913 2441 -544
2376 -544 -2985 -4492 -4963 -3045 447 2903 4154 4346 3497 464 -3074 -4482 -4618 -3136 -1128 2157
2392 2157 4650 4771 3308 891 -1616 -4174 -5229 -3764 -614 1357 3458 4914 4438 1502 -1601
2407 -1601 -3823 -4422 -4059 -2274 1214 3776 4544 3462 2055 -193 -3518 -4971 -4129 -2103 230 2381
2423 2381 4856 4422 2272 -362 -2550 -4459 -4599 -3043 152 2822 4157 4018 3257 686 -2455 -4483
2439 -4483 -4195 -2911 -1218 1882 4698 4840 2953 919 -1203 -3722 -4751 -3867 -1155 1328 3239 4598
2455 4598 4091 1695 -1394 -3226 -4284 -3701 -2238 867 3335 4256 3480 2289 -111 -2917 -4682 -3850
2471 -3850 -2040 -238 2280 4378 4314 2334 265 -2092 -3917 -4286 -2858 -308 2449 3860 3961 3024
2487 3024 911 -2275 -3980 -3774 -3034 -1569 1433 3884 4214 2916 1183 -1093 -3307 -4645 -3396 -1327
2503 -1327 1116 2914 4050 3897 1973 -1170 -3343 -3641 -3369 -2313 233 3185 3935 3145 2259 365
2519 365 -2675 -4392 -3826 -2226 -399 2105 4024 4245 2411 -97 -2021 -2968 -3942 -3137 -460 2350
2535 2350 3057 3575 3375 1062 -2199 -3653 -3439 -2955 -1207 1130 3439 3844 2976 1347 -779 -3087 -3985
2552 -3985 -3618 -1485 881 2505 3535 3869 1861 -1026 -2607 -2964 -3634 -2637 762 2759 3438 3127 2356
2569 2356 178 -2305 -3824 -3324 -2430 -209 1563 3464 4143 2396 -44 -1538 -3130 -3826 -3226 -282
2585 -282 1989 2624 3455 3293 1163 -1466 -3151 -3395 -2800 -1333 1037 2993 3752 2872 1453 -659 -2375
2602 -2375 -3780 -3504 -1336 815 2055 3194 3673 1707 -785 -2242 -3010 -3337 -2323 102 2277 3136
2618 3136 3131 2076 323 -2084 -3566 -3338 -2130 -473 1296 3149 3680 2543 109 -1160 -2579 -3616
2634 -3616 -3074 -402 1546 2519 3472 3040 1114 -1126 -3036 -3434 -2751 -1394 599 2579 3821 2707
2650 2707 1123 -499 -2004 -3670 -3166 -1085 673 1706 3187 3520 1944 -367 -2207 -2820 -3303 -2260
2666 -2260 -196 1793 3398 3059 2056 430 -1507 -3274 -3274 -1828 -414 1101 2713 3503 2395 503
2682 503 -1421 -2403 -3359 -2680 -664 1071 2559 3137 2885 1364 -703 -2733 -3107 -2569 -1433 274 2578
2699 2578 3646 2655 1044 52 -1999 -3272 -3099 -1443 382 1705 2739 3144 1925 41 -2051 -2902
2715 -2902 -2995 -2283 -429 1761 3029 2654 2247 679 -1107 -2949 -3160 -1930 -391 779 2852 3436 2677
2732 2677 784 -813 -2341 -3086 -2627 -984 932 2453 2808 2681 1558 -363 -2348 -2742 -2492 -1668 94
2749 94 2069 3261 2682 1329 46 -1664 -3031 -3079 -1794 280 1545 2745 2986 2305 343 -2009 -2556
2766 -2556 -2474 -2022 -736 1605 2494 2564 2208 934 -892 -2577 -2800 -1964 -894 488 2271 3107 2258 731
2784 731 -700 -2047 -2616 -2614 -1410 873 2027 2687 2424 1611 -225 -2145 -2670 -2156 -1489 -83 1894 2998
2802 2998 2686 1424 113 -1611 -2481 -2777 -1823 87 1230 2396 2659 2024 482 -1500 -2260 -2570 -2148
2819 -2148 -988 1292 2466 2825 1973 1012 -877 -2194 -2973 -1806 -978 724 1873 2733 2340 835 -548
2836 -548 -1722 -2519 -2518 -1446 666 1861 2656 2640 1634 -277 -1848 -2625 -2280 -1598 -252 1363 2667 2731
2854 2731 1544 394 -1348 -2324 -2844 -1580 -308 877 2166 2739 1941 565 -1393 -1877 -2340 -2343 -790
2871 -790 1077 2028 2380 1840 957 -601 -1805 -2526 -2179 -755 186 1639 2676 2396 822 -213 -1535
2888 -1535 -2264 -2801 -1096 458 1690 2144 2457 1619 -307 -1819 -2147 -1827 -1586 -396 1366 2404 2576
2905 2576 1396 202 -758 -2217 -2376 -1856 -256 687 1643 2383 2111 425 -1035 -1762 -2388 -2245 -893
2922 -893 902 2134 2055 1763 1125 -286 -1885 -2471 -1828 -972 312 1676 2287 2177 853 -64 -1018 -2144
2940 -2144 -2238 -1388 315 1592 2028 2324 1722 95 -1418 -2073 -2029 -1518 -467 877 2385 2093 1239 642
2958 642 -403 -2111 -2516 -1830 -225 808 1596 2300 2071 727 -724 -1476 -2190 -2011 -1141 815 1791 2027
2976 2027 1624 1262 -9 -1820 -2243 -1946 -923 162 1264 2267 2016 802 -61 -1233 -1739 -2257 -1567
2993 -1567 -13 1003 1733 1760 1567 334 -1271 -2090 -1740 -1564 -645 794 1984 1929 1215 619 -415 -1862
3011 -1862 -2176 -1367 -496 563 1646 2043 2003 424 -492 -1404 -1708 -1855 -1244 458 1698 1993 1714 1259
3029 1259 -4 -1478 -1928 -1892 -1016 -125 1072 2331 1863 1232 270 -946 -1924 -2169 -1258 -8 958 1527
3047 1527 1915 1614 430 -1185 -1427 -1739 -1406 -626 859 1752 1991 1344 590 -344 -1639 -2316 -1675 -626
3065 -626 505 1315 1991 2082 933 -460 -1282 -1516 -1731 -954 463 1292 1635 1765 1015 330 -1412 -1818 -1636
3084 -1636 -1258 21 1065 1860 2021 1247 42 -688 -1357 -2014 -1578 -262 959 1608 1722 1731 568 -788
3102 -788 -1494 -1925 -1657 -759 484 1551 1729 1418 663 -201 -1547 -1760 -1394 -575 348 923 1923 1789 663
3121 663 -556 -932 -1636 -1672 -1307 244 1212 1510 1604 1000 -124 -1149 -1635 -1916 -830 -303 489 1713 2027
3140 2027 1160 292 -909 -1400 -1887 -1196 -213 673 1125 1736 1678 540 -871 -1370 -1572 -1278 -555 278 1644
3159 1644 1950 1178 425 -71 -974 -2076 -1608 -647 15 719 1724 1758 841 -361 -1012 -1447 -1609 -888 -4
3178 -4 1023 1514 1437 1193 201 -839 -1774 -1593 -1298 -206 712 1630 1504 1041 302 -543 -1155 -1724 -1494 -495
3198 -495 511 1217 1443 1387 635 -456 -1096 -1340 -1302 -712 229 1491 1290 1188 548 -83 -955 -1460 -1582 -729
3218 -729 -102 791 1671 1749 859 -13 -663 -1373 -1468 -1223 -310 1098 1598 1164 1251 462 -737 -1679 -1335 -734
3238 -734 -480 346 1271 1477 1020 195 -359 -1046 -1473 -1380 -366 632 1178 1277 1218 502 -237 -972 -1290 -996 -931
3259 -931 157 1178 1456 1416 808 247 -839 -1203 -1366 -681 -199 493 1211 1371 876 -109 -621 -1117 -1198 -1507
3279 -1507 -489 558 1243 1008 1088 384 -513 -1312 -1318 -1033 -434 311 1158 1655 1328 630 -212 -881 -1483 -1327
3299 -1327 -289 463 738 1261 1098 692 -434 -881 -1185 -1369 -843 60 1045 1216 1063 920 29 -687 -1430
3318 -1430 -1265 -551 180 444 1229 1506 984 21 -704 -871 -1292 -1121 35 572 1233 1255 866 533 -356 -987
3338 -987 -1158 -936 -585 135 886 1305 761 358 -166 -753 -1241 -1420 -455 170 878 1109 1056 954 -126 -833
3358 -833 -929 -1017 -735 -443 731 1029 1065 598 71 -170 -1174 -1258 -752 -287 152 956 1481 1029 175 -247 -733
3379 -733 -1251 -1129 12 350 830 1162 1156 853 -348 -1030 -1017 -782 -533 16 982 894 952 488 -179 -576 -1104
3400 -1104 -1180 -584 -33 606 1117 1185 526 -215 -746 -952 -764 -751 -159 550 941 940 523 133 -324 -1245 -1107
3421 -1107 -374 -245 384 877 1020 1001 266 -443 -740 -787 -1030 -499 421 951 989 918 664 -402 -684 -1164 -1092
3442 -1092 -672 89 727 1162 884 566 -63 -442 -1002 -1413 -608 122 458 693 973 985 -126 -523 -990 -728
3462 -728 -875 -438 539 948 988 648 343 -299 -961 -1159 -592 -440 558 843 1057 1075 264 -227 -481 -892 -1066
3483 -1066 -301 95 734 954 983 554 -19 -454 -811 -739 -684 -181 551 1145 978 598 166 -488 -1115 -983 -574
3504 -574 129 368 769 1084 820 180 -695 -665 -943 -707 -459 468 894 842 573 419 -392 -878 -954 -515 -541
3525 -541 210 561 1027 838 273 -182 -813 -888 -764 -537 391 631 1188 956 777 143 -749 -812 -680 -710 -221
3546 -221 245 851 986 430 265 -437 -959 -1123 -735 -126 327 429 694 801 206 -515 -441 -771 -1021 -281
3566 -281 241 569 617 567 448 29 -516 -1025 -847 -551 225 280 721 1076 479 -76 -417 -670 -917 -705 142
3587 142 840 785 826 661 215 -637 -686 -769 -657 -391 402 829 909 664 35 -142 -424 -724 -568 -307 120 435
3609 435 703 872 358 -195 -626 -600 -649 -439 97 650 646 691 304 49 -479 -785 -689 -520 -18 403 784 1004
3631 1004 670 -290 -451 -856 -818 -668 -91 491 355 789 856 176 -354 -569 -798 -765 -411 117 477 700 528
3652 528 394 213 -492 -963 -700 -2 41 453 515 905 166 -53 -558 -498 -511 -404 -89 453 543 560 391 188
3674 188 -230 -650 -560 -373 -172 215 642 774 451 175 -273 -648 -835 -961 -75 387 647 562 404 287 -152
3695 -152 -479 -830 -649 -374 48 690 568 416 368 176 -597 -749 -651 -403 193 526 460 930 340 54 -311
3716 -311 -399 -383 -383 -143 408 672 595 506 328 -334 -856 -594 -390 -259 168 656 824 734 297 -25 -565 -909
3738 -909 -650 -334 333 309 630 690 402 -181 -785 -638 -507 -484 -141 617 240 572 339 139 -255 -686 -627
3759 -627 -501 -183 165 538 822 320 -147 -448 -414 -527 -846 -180 220 376 531 739 653 -64 -508 -485 -590
3780 -590 -235 135 600 588 423 239 -190 -351 -563 -496 -157 -45 340 493 558 532 71 -229 -479 -544 -613 -151
3802 -151 499 412 537 430 72 -151 -669 -651 -405 78 388 359 352 572 -71 -195 -285 -767 -684 -293 158 337
3824 337 392 509 286 -15 -475 -673 -363 -118 -21 439 496 336 229 -74 -235 -469 -665 -201 182 440 186
3845 186 560 369 -11 -192 -471 -446 -287 -218 260 751 475 501 410 -281 -215 -626 -313 -103 243 197 502 548
3867 548 181 -10 -321 -386 -498 -288 254 384 486 559 321 -126 -123 -477 -443 -334 168 357 398 797 123 155
3889 155 -204 -371 -746 -399 -213 495 411 261 456 137 -130 -241 -506 -444 -122 226 158 407 265 182 60
3910 60 -291 -537 -628 -216 -97 335 402 477 286 -29 -327 -277 -379 -557 106 331 348 221 476 -120 -266 -195
3932 -195 -555 -244 74 201 417 351 453 7 -195 -487 -420 -276 -56 150 219 569 423 197 -97 -225 -404
3953 -404 -445 -187 127 429 475 358 344 394 -180 -437 -271 -170 8 418 481 285 298 -57 -255 -126 -544 -295
3975 -295 -105 315 350 450 246 36 -316 -170 -407 -545 -325 379 608 366 231 176 -80 -370 -531 -196 -272
3996 -272 -222 517 390 178 152 -3 -204 -348 -358 -413 158 421 543 509 193 -8 -227 -497 -343 -301 -9 196
4018 196 222 415 297 -57 -307 -486 -527 -358 -139 35 47 458 158 217 -153 -260 -405 -271 -153 -231 424 424
4040 424 436 34 75 -140 -503 -519 -210 222 248 252 549 431 84 -370 -174 -454 -204 291 268 245 515 435 279
4063 279 -40 -234 -501 -365 75 315 328 442 116 63 -276 -161 -474 -267 146 258 187 368 300 369 52 -133
4085 -133 -244 -500 -487 -139 -14 396 333 132 -42 -382 -482 -286 -165 57 -143 256 462 360 28 -63 -10
4106 -10 -229 -154 -299 168 327 337 195 169 -240 -202 -295 -296 -228 144 40 482 110 73 73 -284 -568 -497 -208 242
4130 242 298 419 286 222 131 -264 -415 -422 -191 47 -46 258 345 295 338 122 -383 -514 69 -56 23 293 361 491
4154 491 62 -20 -124 -372 -431 -161 6 474 597 312 220 91 -159 -467 -359 -390 -5 -22 451 289 238 -79
4176 -79 -231 -465 -276 -242 -188 149 180 338 462 -70 1 -394 -387 -338 -88 27 183 411 80 65 49 -305 -597
4199 -597 -439 -235 19 311 311 381 166 -132 -162 -307 -402 -265 -251 189 384 324 292 -26 -210 -519 -489 -93 -84 61
4223 61 342 159 145 237 56 -365 -556 -173 212 329 122 241 402 -221 -158 -260 -109 -69 -271 -235 342 272
4245 272 494 130 105 -210 -219 -329 -482 39 71 264 318 159 84 -173 -190 -310 -422 120 290 293 173 382 207
4268 207 -106 -315 -149 -47 -166 6 361 270 180 -61 -164 -399 -10 -149 165 180 85 117 667 270 -199 -313
4290 -313 -44 -501 -379 3 242 443 309 67 105 -479 -385 -42 -319 -89 92 202 394 82 -23 -329 9
4311 9 -324 -365 -363 194 197 286 192 237 47 -359 -108 -353 -72 6 417 416 286 24 -38 -173 -348 -450 -336 128 242
4336 242 408 230 240 -138 -189 -312 -254 -336 -151 135 260 282 182 139 172 -259 -320 -281 -95 -32 503 207 184 24
4360 24 -163 -436 -269 -414 -260 183 390 285 252 64 -86 -239 -357 -338 -345 9 270 412 195 113 -65 45
4382 45 -413 -495 58 -7 -9 494 326 372 -52 -392 -124 -422 -174 14 193 344 305 432 249 -57 -419 -247
4404 -247 -383 25 89 312 408 312 136 -89 -480 -519 -559 -344 -155 -31 152 421 405 133 -119 -550 -137 -408
4426 -408 -130 80 450 442 69 20 -136 -209 -397 -85 -72 125 327 202 295 -52 7 -501 -406 -203 -143 -43 423
4449 423 307 305 176 -22 -536 -245 -222 114 211 118 513 186 332 -269 -279 -369 -395 -318 -9 183 213 250 280 -115
4473 -115 -74 -367 -433 -153 141 194 97 442 227 157 -168 -215 -224 -248 104 93 381 280 343 9 -309 -136 -201 -261
4497 -261 -179 150 107 163 162 -65 171 -17 -102 -336 49 -69 213 271 339 159 136 7 -321 -444 -372 135 319
4520 319 387 291 249 95 -251 -46 -98 -374 54 -69 309 199 34 31 -2 -382 -223 -212 58 -83 606 467 329
4543 329 38 -238 -236 -341 -337 -111 107 94 546 564 278 229 -462 -148 -246 11 157 235 480 -7 293 -407 -97
4566 -97 -305 -292 -354 -58 108 371 479 317 112 -47 -438 -442 -329 1 -142 317 272 152 6 -105 -168 -435
4588 -435 -304 -158 160 397 324 394 27 -41 -255 -449 -239 -410 275 282 287 166 340 -72 -316 -258 -238 -346 -171
4611 -171 138 229 351 242 59 -104 -246 -251 -287 -161 -2 414 435 407 87 -185 -205 -187 -254 -280 120 371 181
4634 181 351 358 -156 -123 -188 -215 -69 94 321 346 222 334 -50 -149 -45 -472 63 38 200 508 223 285 152
4657 152 -236 -351 -416 -166 -65 150 252 260 249 240 -134 -326 -237 -81 -325 39 275 416 261 122 157 -117 -149
4680 -149 -371 -88 24 216 439 367 229 -277 -341 -251 -243 -424 265 99 338 347 522 -163 -101 -309 -238 -436 -170
4703 -170 151 355 74 217 284 -145 -51 -440 -204 -72 96 438 401 189 352 -67 -183 -165 -90 -137 141 180
4725 180 381 460 76 -69 -421 -385 -442 -322 -3 191 353 230 255 31 -137 -154 -278 -206 -105 339 58 456
4747 456 393 -62 18 -68 -313 -306 -116 133 15 211 400 184 -154 -327 -445 -209 -239 41 433 424 188 170 -279
4770 -279 -325 -531 -341 -44 50 222 572 299 95 93 -195 -216 -281 -455 414 173 48 504 246 17 12 -337 -156
4793 -156 -201 -208 -135 16 395 146 289 -138 -479 -294 -471 -249 192 137 234 122 157 -76 -65 -412 -14 -171 173
4816 173 -72 287 193 78 127 -211 -351 -174 -328 -13 153 254 260 107 30 -235 -452 -282 -338 115 33 167
4838 167 427 233 244 -27 -465 -354 -278 -32 119 272 249 175 432 26 -151 -250 -306 -257 -68 144 194 366 194
4861 194 -54 -69 -261 -461 -337 -82 34 431 559 245 -129 -137 -149 -248 -36 128 347 181 319 241 29 -57
4883 -57 -283 -452 -271 179 146 589 309 270 38 -190 -262 -235 -326 6 200 324 267 277 172 75 -213 -139 -332
4906 -332 -322 -186 115 207 230 37 5 -310 -91 -169 -327 124 160 281 190 197 9 -320 -318 -429 -400 -12 556 341
4930 341 286 188 100 -252 -303 -118 -266 -93 77 392 311 246 15 -143 -482 -281 -73 5 -39 222 465 302 186
4953 186 -181 -129 -170 -167 -114 126 217 355 439 220 153 -166 -224 -256 -245 -41 376 227 284 89 53 -84 -306 -452
4977 -452 -64 58 45 -15 445 309 2 -241 -120 -252 -323 -112 29 223 276 460 155 25 -205 -302 -243 -174
4999 -174 105 259 268 384 302 -23 -1 -340 -162 -99 -182 135 342 247 509 71 -182 -203 -167 -442 -187 293 414
5022 414 171 241 52 -194 -176 -509 -338 -88 58 284 163 183 -21 -152 -126 -478 -216 -157 -2 115 196 350
5044 350 228 -1 61 -278 -270 -70 27 136 167 622 388 31 -81 -304 -295 -114 -62 227 421 441 17 29 -110
5067 -110 -279 -217 -29 -133 145 276 262 190 26 130 -205 -159 -142 -135 121 190 323 279 -32 -46 -165 -236 -467 13
5091 13 109 129 219 130 155 -115 -174 -197 -233 36 -65 135 283 162 67 -81 -365 -400 -15 -223 -188 -51 329 189
5115 189 358 -88 165 -84 -445 91 -167 25 478 193 441 -159 -104 -69 -490 -234 -63 -121 -72 388 286
5136 286 230 -40 -378 -115 -192 -101 91 95 398 387 95 -136 45 -262 -216 -209 -345 -25 571 410 90 51 85 -108
5160 -108 -208 -471 -106 237 249 376 324 215 -176 -103 -124 -252 -118 -66 468 255 221 274 -189 -290 -59 -262
5182 -262 -118 -73 20 333 -57 149 -67 -7 -299 -171 -327 -176 136 378 153 149 120 -244 -588 -189 -258 59
5204 59 335 514 354 375 101 -376 10 -430 -327 39 145 464 201 198 84 -184 -316 -281 -285 -153 -53 62
5226 62 211 359 113 75 -406 -183 -351 36 -39 -54 35 263 200 -155 -190 -209 -83 -223 83 282 411 96 286
5249 286 -137 -230 -386 -59 -157 -54 -133 402 454 432 133 130 -33 -234 -29 -41 158 112 203 314 -83 55 -174
5272 -174 -97 -360 -177 135 81 348 212 153 6 -114 -235 -419 -171 85 27 484 624 117 35 -150 -267 -251
5294 -251 -86 -214 146 177 223 125 151 -312 -316 23 -490 -82 -45 221 318 162 14 -51 92 -398 -336 25 103 187
5318 187 194 100 260 -41 -7 -187 -199 -63 97 215 131 289 157 79 -64 -285 -179 -100 -11 100 248 258 307 202
5342 202 55 -85 -121 -429 170 214 316 367 -57 161 -206 -327 -148 -60 -47 -197 174 222 145 35 78 -248 -312
5365 -312 -192 -174 312 99 527 126 154 203 118 -407 -272 -188 64 264 200 316 70 197 -97 -303 -219 -187 -29
5388 -29 194 296 6 265 -45 11 71 -143 -198 -186 50 314 363 193 -83 9 -230 -354 -215 -199 327 125 540
5411 540 283 -35 -76 12 -408 -388 -191 328 315 114 215 165 -54 43 -147 -475 -246 -165 386 498 226 510
5433 510 218 -228 -222 -113 -321 -69 -45 88 181 321 -18 -149 -234 -352 -79 -193 180 244 117 136 -74 105
5455 105 -46 -374 -38 -430 15 213 381 204 56 30 -166 -326 5 -236 71 -27 -105 78 178 215 -112
5476 -112 -318 -333 -165 4 293 50 56 76 114 63 -12 -130 -179 -169 282 229 29 277 5 -342 -226 -334 -198
5499 -198 89 -60 280 312 278 5 79 -138 -122 -294 -263 27 -76 340 87 -49 -78 86 -175 -248 15 112 185
5522 185 84 374 364 -128 -170 -282 -77 -58 -44 240 193 179 209 22 -118 -342 -156 -249 8 -78 -2 122 278
5545 278 199 25 -66 -5 -270 -342 81 -97 281 424 -126 48 -53 -230 -102 -83 160 25 377 256 102 -66
5567 -66 -279 58 -51 -259 64 7 84 209 5 -75 -209 -248 -269 -149 -110 136 55 382 289 47 -157 -240 -386
5590 -386 -394 -58 10 315 177 91 26 56 -255 -164 -275 -432 24 -2 191 196 322 68 -157 175 -64 -419 78
5613 78 33 259 42 28 15 -30 -200 -453 64 -53 116 164 96 157 75 -329 -293 -212 -134 -172 343 518 312 83
5637 83 8 -111 -219 -32 -234 -39 85 99 250 109 43 -192 -60 -209 -527 -175 -14 36 473 235 5 -27
5659 -27 -390 -59 -304 -205 -115 64 351 175 310 147 -194 -157 -251 -94 -100 -95 -5 437 484 68 33 -221 -147 -129 68
5684 68 172 -67 8 217 -143 98 -231 -324 -189 85 133 298 131 276 108 -17 -176 -142 -340 -470 -58 -170
5706 -170 378 161 22 -59 91 -314 -159 -137 5 1 157 -5 131 182 -136 -87 -123 56 152 -20 159 274 207
5729 207 109 34 -161 -297 -266 -231 219 235 312 262 -13 -226 -212 -125 -158 -74 -219 240 153 389 324 26 -76 -251
5753 -251 -341 -269 -25 163 201 159 244 -65 -224 -129 -177 -353 -89 -43 218 172 318 -12 50 -93 -266 -430 -13
5776 -13 12 344 142 416 84 -158 -113 -139 -191 -95 -66 133 268 241 342 -76 -256 -267 -273 -260 -64 32 5 32 57
5801 57 -41 -16 -205 -214 14 43 285 90 284 353 135 -180 -293 -291 -233 117 -148 458 130 18 253 -10 -55 -313
5825 -313 -16 5 6 167 269 84 220 -136 -184 -35 -152 -245 -7 84 382 271 365 -194 -223 -215 -353 -241 -247 159
5849 159 64 189 1 285 -198 -7 -109 -38 -5 -228 179 276 47 -100 -247 -344 -174 -166 -22 -28 138 149 295
5872 295 -4 -9 -252 -339 1 -244 10 245 269 166 -92 109 140 -127 -173 -327 -175 260 131 351 -67 -27
5894 -27 13 -167 -264 -226 -230 -48 491 182 73 90 54 -500 -59 -410 94 14 167 165 451 -374 92 -103 -333 -217
5918 -217 31 44 -113 151 303 110 -56 -190 -302 -231 -52 -15 330 225 116 248 -136 -149 -161 -217 -11 129
5940 129 279 43 142 23 -10 -17 -56 -210 -116 -192 250 241 87 277 60 -3 130 41 3 -285 454 151 44 106
5964 106 -1 -183 -112 -216 -195 33 -201 111 42 355 47 52 36 -170 -366 92 40 37 232 431 20 128 43
5987 43 -73 -298 -57 87 71 84 183 -123 -63 -90 -186 24 -212 160 156 -18 26 29 -103 -131 -203 -336 -146 -138 26
6012 26 34 154 142 88 -118 219 -20 -148 -201 -50 280 137 52 27 95 -23 -23 -318 -45 -235 -38 72 74 172 36
6037 36 -3 -283 -167 -145 -202 156 -3 105 427 5 -60 -174 -429 -475 22 111 -122 262 51 144 -90 -107 -93
6060 -93 108 -283 -96 27 130 92 -127 59 -222 42 -223 -168 -200 68 123 199 130 24 60 -370 -283 -118 -3
6083 -3 -26 203 21 99 93 -2 -228 16 -107 11 28 150 276 20 -151 123 -65 -201 -197 -207 114 156 324 78
6107 78 105 -81 -161 -129 -328 -306 66 159 280 199 224 44 -392 -228 -239 -185 -91 107 65 165 171 -60 -151 -420 -40
6132 -40 -115 -166 -79 50 93 91 106 24 -173 -341 -236 -188 135 61 222 -30 107 27 20 -212 -132 -155 -214 38 295 173
6158 173 -77 209 -120 -102 -98 -131 73 437 230 191 155 145 92 -80 -203 26 -88 157 46 249 71 -30 72
6181 72 -248 -182 -118 -32 -76 -175 -112 228 87 106 55 -210 -59 -158 -90 107 93 -136 381 -74 -86 33 -199 -241 118
6206 118 49 106 490 91 43 -5 -226 -390 -60 -226 203 178 67 381 210 -51 -370 -94 -215 -154 -101 203
6228 203 443 -48 158 -127 -232 -176 89 -159 27 286 159 373 33 -141 -158 -248 -59 -120 6 105 218 198
6250 198 83 215 -160 -85 -128 41 -220 -144 80 47 69 280 -122 76 -332 25 -108 49 37 -48 -112 173 29
6273 29 73 -177 -262 129 91 239 70 139 174 91 -187 -151 67 -172 35 87 259 314 64 -88 -217 -181 -152 82
6297 82 -366 173 106 135 62 -5 80 -9 -204 11 123 19 -60 472 -194 27 165 -214 -249 -81 -309 30 104
6320 104 108 202 39 -71 -32 -291 1 9 -92 -173 376 283 -35 23 -30 -87 -257 -124 -68 -126 -3 246 63 -65
6344 -65 182 -172 -363 -98 -53 28 399 90 455 10 -33 -214 -213 -1 -227 39 96 -104 146 -78 21 -120 -81
6367 -81 -134 -102 -148 211 26 97 87 -227 -219 -226 -256 -283 75 51 77 184 63 76 -104 -394 -182 -125 97 55 328 36
6393 36 125 21 -129 -215 -338 -59 38 -75 44 497 98 98 -175 -20 -145 -7 -89 291 163 22 -100 144
6415 144 181 -230 -73 -224 114 -154 -14 72 111 268 68 -241 -20 -189 -2 -46 219 282 159 32 -3 -27
6437 -27 -75 94 -378 50 -165 146 -19 321 -124 87 -162 -277 -123 22 204 25 131 176 317 -188 -106
6458 -106 -363 -199 25 148 -57 292 145 -57 119 -68 -177 -75 182 43 73 27 281 106 266 24 -53
6479 -53 -11 -188 -147 136 112 214 238 164 42 206 -186 -322 -260 143 -62 99 114 -168 66 -37 -212 -239 133
6502 133 -75 132 203 291 22 161 52 -460 -94 -20 -77 -4 171 258 -33 62 -122 28 -52 -245 -42 195 197
6525 197 272 -228 91 -271 -177 -8 -139 325 265 -24 133 91 343 -140 -18 -114 -516 -43 19 -116 176 137
6547 137 -12 29 2 -183 95 -127 199 -127 103 181 258 59 -21 -229 -302 -183 120 157 289 280 -106 120 -160
6570 -160 -170 14 52 2 141 92 1 -151 37 -99 -26 -189 -3 -137 155 319 229 10 -113 -43 78 -204 -204
6593 -204 -17 -82 58 -137 185 120 12 -200 -395 -239 78 -100 -23 -65 -55 -92 -1 -210 -334 -73 -145 58 155
6616 155 362 86 -7 192 -38 -114 -371 5 3 102 214 201 113 -42 -34 -239 63 -224 3 -70 9 69 279 149
6640 149 -97 -2 -92 -367 -185 -220 26 165 198 -28 208 36 -307 -291 110 340 91 9 253 261 17 83 -2
6663 -2 -187 -33 -70 167 208 -23 101 130 -126 -92 -181 63 -51 57 40 356 149 165 -32 -143 -137 -163 -212 182
6687 182 37 141 304 -150 275 -198 -479 100 -39 2 117 4 42 163 149 -28 -113 8 -32 6 120 -90
6709 -90 -9 247 -108 -10 -156 -126 229 1 13 126 48 46 -44 -8 21 21 -45 -50 80 74 72 -6 56 56 -70 -181 -52 27
6737 27 69 76 291 124 117 94 -316 -238 -199 122 -42 253 -36 -95 50 211 -402 -174 -142 -118 -144 150 231 235 102
6762 102 110 168 68 -78 -241 -215 157 30 73 66 147 -137 -171 79 -56 138 -88 17 80 239 -214 117 -55
6785 -55 -140 -161 -124 150 -62 274 306 295 87 -308 -151 -104 -201 145 -135 -103 160 291 173 89 30 -36 48 26 246
6810 246 -112 350 227 51 -88 -96 121 -51 13 1 -63 165 -14 219 189 -144 -186 -159 64 218 -19 -10 233
6833 233 72 239 -85 -174 -14 -177 -42 -1 318 158 60 5 -227 -191 -162 -46 -85 -72 242 -26 102 32 -14
6856 -14 113 -83 -123 -46 -232 112 268 46 -96 -10 -22 -188 118 -50 240 -121 224 49 120 -176 138 195
6878 195 -67 15 51 291 -230 91 -1 12 93 12 -325 18 68 235 -173 -75 200 42 -118 -49 21 -250 -156 47
6902 47 141 308 129 -10 43 -67 99 253 -36 -129 254 -84 -94 -47 61 -169 -241 91 -59 -164 78 95 61
6925 61 100 27 135 -1 -267 -51 56 -206 -103 282 -156 35 -253 54 -267 -251 -123 -47 179 235 -5 -22
6947 -22 -164 -183 -151 -139 -36 99 73 3 -176 85 -62 -261 -306 -265 -85 391 49 52 -97 103 119 -174 -253 -145
6971 -145 -198 -66 163 -131 79 -43 150 61 87 -136 -65 213 -76 134 -240 141 -297 -163 -108 -196 79 120
6993 120 -179 71 54 -4 -34 -65 114 -121 89 78 -152 41 259 159 43 -97 11 -304 4 -84 153 173
7015 173 211 220 60 -56 -249 -214 -13 -108 -243 176 180 47 169 21 -78 -137 -173 -284 80 32 169 101 -298 238
7039 238 66 -225 62 183 167 -35 122 153 127 127 -38 -202 -211 -256 -67 40 -147 86 20 180 43 -72 -113
7062 -113 -318 -363 -341 -147 -5 241 293 37 -96 -274 -234 -363 -123 134 119 118 -95 -69 -14 -130 -210 -6 98
7085 98 -107 159 1 -1 -141 -4 145 -118 -286 -73 137 54 409 -175 153 -47 -39 32 108 -190 -74 -15 147
7108 147 313 126 -109 -79 -94 -97 -96 -90 45 -15 -12 97 -120 -25 -132 -20 -84 17 124 178 186 72 58 -72 -54 10
7134 10 -177 -119 -24 295 -84 37 -140 191 -129 -97 -172 10 37 123 147 217 64 81 -60 -93 -369 124 -198 -137
7158 -137 140 35 136 -132 88 -123 -381 -54 -77 -93 53 -67 -17 18 -61 -277 -77 156 131 47 277 9
7180 9 -184 78 70 -302 -277 25 -82 130 -2 -28 8 50 -18 29 -227 -191 115 13 -23 106 219 31 449 -10
7204 -10 -54 -230 76 -96 -35 22 61 -35 44 -107 -231 -238 -244 260 28 9 68 52 262 -305 -77 -241 -16 -97 -37
7229 -37 205 170 59 122 -138 -120 -323 -138 -27 317 272 15 129 236 -155 -220 -212 -82 -15 -99 98 274 38
7252 38 -88 128 -208 -9 -267 48 -171 205 107 -100 178 155 -224 -79 70 -167 -73 284 130 118 37 128
7274 128 82 -6 -141 120 190 11 -156 181 -24 132 -135 255 -216 -153 187 264 214 207 28 444 11 0 54
7297 54 -73 -121 147 -24 171 -23 164 109 -380 -120 -163 -6 -97 68 239 127 9 90 34 -15 -372 -4 -103
7320 -103 -180 34 -41 80 68 -2 104 -180 -94 -212 33 312 103 61 -35 -252 -3 -171 -128 35 3 78 334
7343 334 179 -28 -143 18 -180 -120 81 -71 302 286 59 126 -140 -153 -322 10 70 -36 -164 100 -44 117
7365 117 0 -22 -135 -132 -9 -40 86 33 218 -35 198 75 -37 -184 -213 -102 18 160 -22 147 -152 -198
7387 -198 38 -96 -414 -156 -160 -27 356 163 163 148 35 -351 -50 -128 71 64 210 -36 74 164 -112 -45 -259
7410 -259 29 14 -99 115 116 -76 137 280 -114 -30 -114 -148 170 -19 174 -12 302 97 0 -125 -136 -153 105
7433 105 93 113 369 275 24 -262 -16 -112 161 -26 98 299 189 -46 113 -17 -47 -220 -236 -140 104 26 218
7456 218 156 212 -196 -36 -189 -62 -50 82 11 -2 151 -68 -310 -262 -63 -223 65 48 -112 63 321 -95
7478 -95 115 103 -79 -161 -3 119 -154 142 140 178 -124 -304 -130 116 -203 123 116 195 127 96 46 -144 -18 -110
7502 -110 -115 94 47 185 186 162 -75 200 -267 57 -17 130 72 49 140 167 0 116 -135 -1 -137 -122 -123 17 -16
7527 -16 186 136 86 -101 -292 -33 -9 -23 106 49 -8 73 87 -130 64 -48 -2 130 236 429 61 191 2
7550 2 -72 -94 -75 -76 -72 40 182 232 157 -81 -28 -20 -34 23 -231 92 143 94 85 -111 -39 -199 -83 25 67 232 116
7577 116 -1 130 45 -134 -64 -100 -162 -81 -295 31 156 204 141 -83 -85 -98 71 -70 -161 223 368 319 77 -124
7601 -124 -42 -55 -104 -164 86 90 198 34 -153 101 -6 -24 9 -119 -106 313 63 158 417 34 -129 -476 -235
7624 -235 -64 -98 58 75 148 83 -3 -71 -105 -151 -206 -192 18 210 -13 183 -12 -34 3 -177 -147 -86 217 107 184
7649 184 -92 88 131 -107 -51 17 -105 -2 10 -11 312 138 56 -106 -91 139 -60 -27 246 269 80 36 156
7672 156 10 -204 -209 -38 -148 108 -263 70 179 127 -85 50 -206 -83 -26 -65 100 -26 166 222 -61 -61 89
7695 89 -172 -35 -21 8 -19 180 -108 131 -12 -130 -132 51 105 81 228 -52 410 280 -10 -174 -113 -76 85
7718 85 123 0 4 156 135 178 -215 49 -89 -76 -126 113 161 45 82 35 -167 -256 -68 -177 -144 -185 94 181 -41
7743 -41 251 91 -76 6 22 18 62 146 2 185 -64 -49 20 -41 -213 -89 -74 -131 271 141 -70 -166 68 -100
7767 -100 -326 -69 -174 -35 132 208 155 73 -92 -156 104 -122 -8 -120 307 58 -24 66 -119 -11 -134 23
7789 23 21 66 -34 259 34 -104 129 -236 -117 -195 -29 -96 73 -80 -85 203 121 -203 -41 -25 -229 10 165
7812 165 189 23 -1 78 -86 -149 -283 -208 50 8 44 19 144 41 20 62 -42 -99 17 220 -24 5 216 20
7836 20 -221 -257 -127 113 50 22 345 103 263 130 -113 -133 -1 -138 -106 -109 16 244 -46 -21 -177 -57 98
7859 98 -121 -85 98 158 176 102 -174 -30 -86 47 -31 19 82 206 329 -50 76 -283 -49 -84 -19 21 -80 196
7883 196 -23 91 184 192 -52 107 29 47 259 78 76 56 182 -15 -237 -40 -135 -42 134 267 133 276 210 -99
7907 -99 -139 -96 -358 -74 -29 134 -31 33 28 65 185 3 79 -91 -111 -31 -16 195 189 131 5 27 -158 -175 -37 18
7933 18 11 272 97 9 -51 -246 167 -33 -164 -101 -129 282 120 15 -41 7 -119 -192 109 65 38 87 77 265 9
7958 9 -118 -91 22 -66 -92 291 77 -113 -6 153 -167 -150 -261 -124 -121 78 82 -32 144 151 6 139 -24 -312
7982 -312 221 -160 155 66 -44 137 112 260 -13 8 -5 -38 140 132 -12 51 128 307 -100 77 -206 -54 10
8005 10 46 172 96 -125 130 -232 -190 -195 122 34 -4 -67 -6 55 -41 -126 119 -184 -75 5 28 183 92 43 -28 -147
8031 -147 -102 -378 -241 205 -193 97 -29 134 149 -14 -42 76 -74 12 116 192 17 102 -230 181 8 118
8053 118 -12 -20 -183 -104 -43 44 297 -74 -171 -157 -192 28 21 -119 1 333 -40 275 -189 -97 -318 -9 -98 126
8077 126 -248 -120 27 -22 -145 -137 -282 -75 -55 93 163 -51 84 -117 -29 -185 21 87 89 -60 181 70 14
8100 14 246 -45 -233 -34 -149 -259 -70 23 -23 108 24 -288 -253 38 -98 33 -15 293 164 179 168 -107 -17
8123 -17 -128 -61 52 128 6 163 -24 -67 -129 38 -320 -50 -17 267 17 -174 217 -73 -7 -120 182 68
8145 68 -92 -154 134 -22 36 132 21 180 -118 -68 -298 -69 121 62 116 157 64 16 -20 -122 30 -28 167 361
8169 361 158 124 -47 -180 -45 -31 -311 -149 -188 38 53 38 163 163 106 -101 205 6 -59 -32 -35 6
8191F
##END NTUPLES=NMR FID
##END=
