##TITLE=1H_DE-34_K
 DMSO-d6
 8 sc, 
 2.11.2024
##JCAMPDX= 6.0         $$ Bruker NMR JCAMP-DX V2.0
##DATA TYPE= NMR FID
##DATA CLASS= NTUPLES
##ORIGIN= UXNMR, Bruker Analytische Messtechnik GmbH
##OWNER= root
$$ XWIN-NMR		Version 3.5
$$ Sat Nov  2 14:59:19 2024 Russian Standard Time (UT+4h)  she@DPX200
##.OBSERVE FREQUENCY= 200.1318
##.OBSERVE NUCLEUS= ^1H
##.DELAY= (6, 6)
##.ACQUISITION MODE= SIMULTANEOUS
##.ACQUISITION SCHEME= undefined
##.AVERAGES= 8
##.DIGITISER RES= 18
##SPECTROMETER/DATA SYSTEM= spect
##.PULSE SEQUENCE= zg30
##.SOLVENT NAME= D2O
##.SHIFT REFERENCE= (INTERNAL, D2O, 0, 15.7039)
##AUDIT TRAIL= $$ (NUMBER, WHEN, WHO, WHERE, WHAT)
$$ ##TITLE= Audit trail, XWIN-NMR		Version 3.5
$$ ##JCAMPDX= 5.01
$$ ##ORIGIN= Bruker BioSpin GmbH
$$ ##OWNER= she
$$ F:/spectra/data/she/nmr/H-F/1/audita.txt
$$ ##AUDIT TRAIL=  $$ (NUMBER, WHEN, WHO, WHERE, WHAT)
(   1,<2024-11-02 14:58:26.42 +0400>,<she>,<DPX200>,
      <created by zg, POWCHK disabled, PULCHK disabled
       configuration hash MD5:
       00 E9 B6 7A A2 85 ED C7 34 08 36 98 17 FE 4E 26
       data hash MD5: 16K
       AC 25 8F DF B4 23 63 47 54 94 84 1F 5E 3D F4 17>)
$$ ##END=
$$ 
$$ hash MD5
$$ 06 8F 94 46 61 2C 18 4E BA 24 1A 58 B4 7C A9 C1
##$RELAX= 
##$RELAX= 
##$RELAX= 
##$RELAX= 
##$RELAX= 
##$RELAX= 
$$ Bruker specific parameters
$$ --------------------------
##$DU= <F:/spectra>
##$EXPNO= 1
##$NAME= <H-F>
##$PROCNO= 1
##$TYPE= <nmr>
##$USER= <she>
##$AMP= (0..31)
100 100 100 100 100 100 100 100 100 100 100 100 100 100 100 100 100 100 
100 100 100 100 100 100 100 100 100 100 100 100 100 100 
##$AQSEQ= 0
##$AQ_mod= 1
##$AUNM= <au_zg>
##$AUTOPOS= <>
##$BF1= 200.13
##$BF2= 200.13
##$BF3= 200.13
##$BF4= 200.13
##$BF5= 200.13
##$BF6= 200.13
##$BF7= 200.13
##$BF8= 200.13
##$BYTORDA= 1
##$CFDGTYP= 0
##$CFRGTYP= 5
##$CHEMSTR= <none>
##$CNST= (0..31)
1 1 145 1 1 1 1 1 1 1 1 1 1 1 1 1 1 1 1 1 1 1 1 1 1 1 1 1 1 1 1 1 
##$CPDPRG= <>
##$CPDPRG1= <>
##$CPDPRG2= <>
##$CPDPRG3= <>
##$CPDPRG4= <mlev>
##$CPDPRG5= <mlev>
##$CPDPRG6= <mlev>
##$CPDPRG7= <mlev>
##$CPDPRG8= <mlev>
##$CPDPRGB= <>
##$CPDPRGT= <>
##$D= (0..31)
0 1.2 0 0 0 0 0 0 0 0.06 0 0.03 0 0 0 0 0.0002 0 0 0 0 0 0 0 0 0 0 0 0 
0 0 0 
##$DATE= 1730545105
##$DBL= (0..7)
120 120 120 120 120 120 120 120 
##$DBP= (0..7)
150 150 150 150 150 150 150 150 
##$DBP07= 0
##$DBPNAM0= <>
##$DBPNAM1= <>
##$DBPNAM2= <>
##$DBPNAM3= <>
##$DBPNAM4= <>
##$DBPNAM5= <>
##$DBPNAM6= <>
##$DBPNAM7= <>
##$DBPOAL= (0..7)
0.5 0.5 0.5 0.5 0.5 0.5 0.5 0.5 
##$DBPOFFS= (0..7)
0 0 0 0 0 0 0 0 
##$DE= 6
##$DECBNUC= <off>
##$DECIM= 24
##$DECNUC= <off>
##$DECSTAT= 4
##$DIGMOD= 1
##$DIGTYP= 9
##$DL= (0..7)
0 120 120 120 120 120 120 120 
##$DP= (0..7)
150 150 150 150 150 150 150 150 
##$DP07= 0
##$DPNAME0= <>
##$DPNAME1= <>
##$DPNAME2= <>
##$DPNAME3= <>
##$DPNAME4= <>
##$DPNAME5= <>
##$DPNAME6= <>
##$DPNAME7= <>
##$DPOAL= (0..7)
0.5 0.5 0.5 0.5 0.5 0.5 0.5 0.5 
##$DPOFFS= (0..7)
0 0 0 0 0 0 0 0 
##$DQDMODE= 0
##$DR= 18
##$DS= 0
##$DSLIST= <SSSSSSSSSSSSSSS>
$$ [...]
##$SUBNAM2= <"">
##$SUBNAM3= <"">
##$SUBNAM4= <"">
##$SUBNAM5= <"">
##$SUBNAM6= <"">
##$SUBNAM7= <"">
##$SUBNAM8= <"">
##$SUBNAM9= <"">
##$SW= 24.0689170037331
##$SWIBOX= (0..15)
0 0 2 0 0 0 0 0 0 0 0 0 0 0 0 0 
##$SW_h= 4816.95568400771
##$TD= 16384
##$TD0= 1
##$TE= 0
##$TE2= 300
##$TE3= 300
##$TEG= 300
##$TL= (0..7)
0 120 120 120 120 120 120 120 
##$TP= (0..7)
150 150 150 150 150 150 150 150 
##$TP07= 0
##$TPNAME0= <>
##$TPNAME1= <>
##$TPNAME2= <>
##$TPNAME3= <>
##$TPNAME4= <>
##$TPNAME5= <>
##$TPNAME6= <>
##$TPNAME7= <>
##$TPOAL= (0..7)
0.5 0.5 0.5 0.5 0.5 0.5 0.5 0.5 
##$TPOFFS= (0..7)
0 0 0 0 0 0 0 0 
##$TUNHIN= 0
##$TUNHOUT= 0
##$TUNXOUT= 0
##$USERA1= <user>
##$USERA2= <user>
##$USERA3= <user>
##$USERA4= <user>
##$USERA5= <user>
##$V9= 5
##$VALIST= <valist>
##$VCLIST= <CCCCCCCCCCCCCCC>
##$VD= 0
##$VDLIST= <DDDDDDDDDDDDDDD>
##$VPLIST= <PPPPPPPPPPPPPPP>
##$VTLIST= <TTTTTTTTTTTTTTT>
##$WBST= 1024
##$WBSW= 4
##$XGAIN= (0..3)
0 0 0 0 
##$XL= 0
##$YL= 0
##$YMAX_a= 374137
##$YMIN_a= -196532
##$ZGOPTNS= <>
##$ZL1= 120
##$ZL2= 120
##$ZL3= 120
##$ZL4= 120
##$ABSF1= 10
##$ABSF2= 0
##$ABSG= 5
##$ABSL= 3
##$ALPHA= 0
##$AQORDER= 0
##$ASSFAC= 0
##$ASSFACI= 0
##$ASSFACX= 0
##$ASSWID= 0
##$AUNMP= <proc_1d>
##$AZFE= 0.1
##$AZFW= 0.1
##$BCFW= 1
##$BC_mod= 2
##$BYTORDP= 1
##$COROFFS= 0
##$CY= 11.3945322036743
##$DATMOD= 1
##$DC= 2
##$DFILT= <>
##$DTYPP= 0
##$F1P= 15.6554695791079
##$F2P= 12.8336369535428
##$FCOR= 0.5
##$FTSIZE= 0
##$FT_mod= 4
##$GAMMA= 1
##$GB= 0.15
##$INTBC= 1
##$INTSCL= 1
##$ISEN= 128
##$LB= 0.24
##$LEV0= 0
##$LPBIN= 0
##$MAXI= 10000
##$MC2= 0
##$MEAN= 0
##$ME_mod= 0
##$MI= 1.114404
##$NCOEF= 0
##$NC_proc= 0
##$NLEV= 6
##$NOISF1= 3.799351
##$NOISF2= 2.8
##$NSP= 1
##$NTH_PI= 0
##$NZP= 0
##$OFFSET= 15.70392
##$PC= 1
##$PHC0= -26355.38
##$PHC1= 18.18743
##$PH_mod= 1
##$PKNL= yes
##$PPARMOD= 0
##$PSCAL= 0
##$PSIGN= 0
##$REVERSE= no
##$SF= 200.130013532006
##$SI= 16384
##$SIGF1= 3
##$SIGF2= 2
##$SINO= 400
##$SIOLD= 16384
##$SREGLST= <1H.CDCl3>
##$SSB= 0
##$STSI= 0
##$STSR= 0
##$SW_p= 3612.71676300578
##$SYMM= 0
##$S_DEV= 0
##$TDeff= 0
##$TDoff= 0
##$TI= <>
##$TILT= no
##$TM1= 0
##$TM2= 0
##$TOPLEV= 0
##$USERP1= <user>
##$USERP2= <user>
##$USERP3= <user>
##$USERP4= <user>
##$USERP5= <user>
##$WDW= 1
##$XDIM= 8192
##$YMAX_p= 0
##$YMIN_p= 0
$$ End of Bruker specific parameters
$$ ---------------------------------
##NTUPLES= NMR FID
##VAR_NAME=  TIME,          FID/REAL,        FID/IMAG
##SYMBOL=    X,             R,               I
##VAR_TYPE=  INDEPENDENT,   DEPENDENT,       DEPENDENT
##VAR_FORM=  AFFN,          ASDF,            ASDF
##VAR_DIM=   8192,          8192,            8192
##UNITS=     SECONDS,       ARBITRARY UNITS, ARBITRARY UNITS
##FACTOR=    0.0002076,     1,               1
##FIRST=     0,             0,               0
##LAST=      1.7004516,     0,               0
##MIN=       0,             -196532,         0
##MAX=       1.7004516,     374137,          0
$$ Real data points
##PAGE= N=1
##DATA TABLE= (X++(R..R)), XYDATA
$$ [...]
1923a52K8J95l12q0O54K49j73q86J07J57K57O3k98o2J84m2L30K49k16m05J10K62
1945B19K32j61l87k23o2J6K15K41K79k44m5m9K30L67l17k42j25k23K81n6J56l59
1967b57J17K55K6R5J26l61j01o8J3L5K45P6q54M29M82j79K2J41l43L3K88Q5P1
1990C76o40j46q7o5O18J64o94L67K32N0L75k50j48l47O2L43J42m52k14r5K83j04
2012b30M42k95J96j24q0L57o5j9l56l65N6O75j09L2k06q6K81K37j36j4k38R0j10
2035f7l04M79J30o95L87m14O06l20N25M4o78M35p8P7o7l16l93K55K49J45o4o3
2057a27Q9J40J66k54J13K67l88nK7j9K25l44l06L89J76K98j51l58j32N48k05K2
2079A71j69p0l31J44K69L35j39l83K23p2J72K87j28j87o10L09j29N07k19J07m76
$$ y = [-152, -124, 71, -241, -321, 333, 582, 409, -477, -370, -213, 44, 107, -191, -253, -69, -111, 219, 468, 252, -153, -43, 219, 451, 290, -97, -320, -382, -366, -151, 90, 369, 125, 80, 31, 261, 628, 311, 69, -56, -279, 2, -54, 102, -257, -140, 115, 141, 236, 362, 1, -100, -168, -155, -120, 125, 201, -653, -224, 258, 79, 101, 242, -101, -68, 220, 305, 376, -264, -410, -497, -562, 56, 220, -474, -107, 125, 175, 550, 300, 152, -195, -133, 210, 352, -100, -314, -409, -126, -230, 212, -83, 113, -11, -91, 266, 201, 182, -174, -539, -483, 192, 83, 115, -91, -177, 104, 341, 205, 191, -47, 43, -67, -371, 108, 238, -457, -70, -484, 122, -198, 327, 371, -307, 128, 50, 127, 60, -256, -649, -394, -145, 0, -64, -127, -38, 102, 268, 14, 127, 394, 6, 1, 28, 9, 234, -110, -416, -27, 149, 447, 296, -62, -194, 354, 149, 171, 2, -68, -399, -255, 14, 349, 210, -173, 50, -22, 150, 437, 309, 122, -488, -179, -308, 199, -20, 87, -389]
2100c89K00K52m6N07l63k65JK00J99p4j34m18p9J60K81r4J16n3n1N42Kk07j31
2123A56l78P2k58N32k13O1j91J61K36J4P3J16m93J69k40L05N7l39m61M2M05L30
2145A56O7j23j67p2j30Q28j56n84j08K73o4L07m36K78n6M9n6J36J37k57L32l08
2167D6j8ln3q2l44M80k13K40p0j15K4j12J90K79p8L5j02o4K63j40j12l35k1k7
2191c32O52j90M1j51n9k00L00L6K05o60Q5K02j34L80R4K5l50M6J41MJ46j25J11
2214B67l49n7KK84j74j61K96r3K41j74j64J93l16J36n8J83K89o59L49J38Q5Jm91
2237b32K80j10J81N0P6j05l32J91k11j52M80j85j75K19M04n66K87m5o2l44J52
2258a99J39J17J08o49J24M13k54J55K73oj60p5K31r1j59k48K70OJ29R9k78R6j31
$$ y = [-389, -189, 63, 17, 524, 161, -104, -103, 97, 296, 222, 88, -330, -409, -249, 32, -62, 54, 1, -50, 492, 494, 287, 156, -222, -150, -408, 124, -89, -28, -219, -58, 178, 192, 265, 381, -112, 57, -183, 122, 179, -160, -621, -579, -174, 156, 223, 100, -67, -139, -269, 559, 403, -181, -289, -16, -80, 227, -209, 69, 13, 62, 6, 142, 279, 22, 354, 46, 28, 25, -28, -110, -454, 26, -187, 53, -17, -132, -108, -220, -30, 249, 171, 206, 104, 40, 303, 163, 51, -284, -305, -332, 320, 130, 171, 20, -39, -239, 61, 97, 302, -358, -273, -71, -205, 175, 269, 294, -56, -10, 131, 135, 281, 156, 267, -82, -139, -137, 147, -27, -188, 108, 15, 256, 82, -82, 111, -205, -69, -127, 56, 345, -314, 35, 173, 258, 259, -232, 48, -62, 119, 169, 245, 140, -192, -1, -212, -364, 116, -69, -244, -25, 379, -187, 100, 55, -7, -351, -199, -60, 57, 165, -484, -360, 53, -201, -46, 227, 221, 61, -14, 217, 126, -33, -281, -11, -5, 124, 223, -55, 41, -90]
2281i0K91p8K12k65j91J26k31J62O8j36L54o87L07J37L10k7J37n00l86L55L48
2302B16n46K84k0m9k00M61j62jj48l4M78r1J95l00l51L4K14J13l44K19k20J37
2324a15J86R5Rl8j24j64R8K04j21P0j93l01M92q5k6k48k2P66l28j72J29M2j49
2347En2J97j50p4K06j07j48K82k22N21m08k94J56rM6K12k10k91J90R9J38L80n81
2370a14M6R7J56K53Q9k53m87J52K63m22P07p24k7J15K48J82j26l7q2O8l3m08M24
2393H7k47j73J63M44j57K61n74N16l52r7M83j36l33K78l38K58l37k7P1L78m80
2414c12O35R7l37p3K18n61M56p2J34O1l19l4L31J93k57j90K08k80L68M4k68K62
2436C04o20K26R4L1K81k74M2l60K18J28l9k7%j70L8J94k97N24n71J17J76k4J71
$$ y = [-90, 201, 123, 335, 70, -121, 5, -226, -64, 4, -132, 222, -465, -158, -21, 289, 262, 399, -101, -487, -132, 216, -330, -46, -66, -115, -315, 146, -16, -17, -165, -199, 279, 188, 383, 83, -268, -234, -20, 93, -251, -32, -252, -115, 71, 166, 175, 137, 13, -151, -53, 151, 30, 100, -93, -394, 98, 13, -13, -261, -283, 483, 155, -17, 112, 154, 5, -47, 150, 0, -74, 132, 25, -123, 159, -63, 458, 50, -244, -88, -97, -51, 161, -49, -340, -150, -51, 87, 467, -114, -68, 29, 185, 438, 527, 274, -213, -61, 202, -220, 487, -237, -264, -149, 99, 281, 155, 118, 36, 104, 71, -337, 87, -160, -333, -170, 274, 117, 378, -196, 320, -32, -129, 354, 218, -115, 163, -175, 83, -254, -281, -210, 168, -312, 323, 420, 83, 10, 228, -333, 123, 51, 185, 246, -73, -107, 224, 417, 160, -30, 178, -102, 266, 310, 42, 304, -316, -90, 4, 35, 316, 42, 84, -276, -58, 70, 31, 4, 4, -166, -128, 66, -231, 293, -278, -161, 15, -9, 162]
2459A62o6K31m80K06P5Q8j41J0m25k1K24J51J31M1l5q7L16m55RP9J09j04K02k08
2483A2k58Q8J01K45k4j96O5J19l20J54K84j6m70R3n0j21J62K90L16m01k54L16
2505A35p8P5l40L39l61P6N14l79J40j87k48L96K65J13m49q2j22j49M89R2k7l69
2527a57J9L6M4J55m5j63M8N3J62J26j49k13l23J53L53p4L5mk27J38N2k52J29J86
2551H2J96J57l10k32L39l70j34K42k59Q66l12k57j48L55l4K16k82k47o8J64M2
2572FP1Nk54J64r7j54K93J11j60O4N4lJ64n16R3O7K10n7J88K8n52R4M13k29O2
2597F5QL2m23K06J4k3Q8K39m5j20J05M59n75n6jl82K81j56K65l03L69n6j04K54
2621A41L1p9j50J72r6J53j11j02j11p6L0J92j52l4K29j75K74J26n9k21q5M9K44
$$ y = [162, 96, 327, -153, 53, 128, 216, 75, 85, -340, -361, -137, 14, 145, 186, 151, 64, 380, -75, -66, 13, 122, 18, 220, 12, -246, -158, -57, 188, 164, -32, 33, 152, -168, -14, 270, 254, -216, -123, -173, -294, -132, 158, 474, 73, -181, 135, 57, 132, -208, 131, -230, -154, 360, -19, 121, -66, -314, 82, 347, 460, 11, -71, -193, -342, 147, 239, 212, -157, -138, -102, -58, 97, 52, -111, -63, -10, 152, 278, 129, -84, -407, -254, 99, 25, 60, 56, -171, -33, 19, -233, -104, 82, 278, 435, 125, -107, 232, -138, -272, -30, -289, 577, 265, 8, -140, 215, 181, 397, 115, -132, -200, -36, 6, 77, 82, -172, -8, -105, -259, 34, 145, -15, 49, 103, 100, 264, -252, -159, -92, 118, 61, 249, 277, -275, -181, 232, 3, 65, 73, 105, -318, -112, -98, -121, -33, 206, 161, 41, 146, 605, 30, -26, -27, -409, -128, -284, -19, -322, 47, -9, -113, 141, 172, 93, -57, 115, 19, 172, 61, -41, -152, -228, -198, -6, -158, -192, 37, -138, 136, 262, 203, -18, -103, -54, 190]
2644A90l32Q7J17k47K61j37K29J74k27j34J23j05J38Mj41jm27M21j44m2J04j08
2666a97J75L26j64j38J53n04j3J79N40j57k59K24j80K50l5k07O3j26K31R3j55
2687I9M5Ol31K84L50l8l37m31M57N7k05N38j98k90k13L95m31K78J2q3o7k11K82
2710c2O6M13m06J58m41MO14m49q9l1J19P4j06J54k93K45pm3L32n7k60j0lr2J6
2735a24j42J94J74l10J32J64L1p0m1j04J22j87J13j48K56n54N24K24l62M12k23
2756H1j0n8m3J66j25k90l7N1o8L22M8j37K30j77K41K11k02q5l32L9m1L76j94K63
2780B29n33N38J22k13J01m05K53P3J34k96l6j39K41J75l36J03K97n4l27O1K35
2801B23Q6n59L25l66O1l5L30%l25m9K01J44N6J24m63L40P5k87K00k48R6J96l66
$$ y = [190, -142, -55, 62, -185, 76, -61, 168, 342, 115, -19, 104, -1, 137, 141, 0, -1, -428, -7, -151, -193, -89, -197, -22, 304, 140, 2, 155, -349, -362, -183, 357, 200, -59, 165, -15, 235, 200, -7, 56, -70, 161, 254, 99, 144, 150, -181, 103, 453, 415, 78, -353, 104, 161, -44, 494, 296, 6, -207, 188, -243, 35, 47, -36, -103, -314, -32, 34, 447, 41, 199, -242, -238, 376, -73, -162, -193, -74, 0, -106, 48, -245, 0, -7, -50, 282, 225, -35, -45, -48, -140, -124, -266, -72, 102, -208, -76, 88, 119, 49, 8, -96, 26, -161, -48, -196, 60, -494, 30, 254, -108, 304, 81, 71, 13, -30, 136, 11, -279, -316, -265, -333, -11, 37, -100, 130, -47, 194, 405, 203, 118, -214, -175, -216, 160, -34, 229, -304, 234, 356, 143, 244, -161, 92, 165, 299, 3, -33, -172, 69, 244, -92, 11, 308, 254, -73, -12, 223, 309, -250, 75, -291, -230, -265, 65, 65, -260, -309, -108, 36, 92, 216, -247, 93, 168, -119, 81, -167, -71, 125, -241]
2824b41J18J20L21l53K29j39L46n02L01p3l60J89j45O7J81j10J24L3k17K19p0
2845C8J39l07Q9P6j51L5k40O0K29n8K77j14p4K51k93J46j17Q1k96J62J56j0j63
2868h4o2K17J11j3jk44n3L10K3m45K1M48k24k25M3k0K24L8J93M3l16K26j22j86
2892i8J60o2j86Q2rj29L61j67j26L34r4j21N68m62J53j32n3p3m7r5l6l4J90K07
2916A31J61k30K5p1L0K24j70k90o2L05pj56j22K69l16N29qj79J17j65P3j66K27
2939A49K4l09J53J47j75n9n3K83l81L31k5J64K7l83j6o6L23j13k5L6p5J27R8j46
2963C6K53j6l31J99m14N75m04o8l0M7O3P1M7J26l47Q1M36k05J17R3l32j78J51
2986c0K09l58K53k52PJ67n6N0M68j64m98K24J0j12j61N0J93P7l36O81m17K38l78
$$ y = [-241, -123, -3, 318, -35, 194, 55, 401, -101, 200, 127, -233, -44, -189, -122, 59, -51, 73, 106, -111, 108, 38, 177, -130, -41, 35, -116, -81, -321, -261, -32, -90, 187, 73, -1, 250, -43, 103, -14, 67, -229, -67, 89, 79, -84, -146, 71, 182, 169, 168, -76, -129, 181, 204, -241, -220, 228, 4, -221, -178, -198, 26, 64, 257, 300, -16, 210, 88, -98, 62, 0, -186, -104, -113, -242, 119, -48, -174, 160, 66, -55, 513, 51, 204, 72, 19, -54, -101, -196, -232, -266, -76, 131, 292, 62, 87, 16, 46, 270, 100, -190, -252, 53, 46, -110, -232, 37, -279, 250, 242, 63, 180, 15, 88, -78, 149, 173, -136, 17, 164, -11, -70, -123, 160, -221, 110, 85, 249, 276, -107, -123, -189, 134, 21, -4, 32, -43, 84, 182, 36, 289, 273, -58, 141, -273, 302, -102, -170, -200, -153, -90, -19, 28, 154, -193, -112, 324, 119, 236, 329, -3, -181, -30, 179, -179, 74, -178, -171, -4, -60, -10, 458, 294, -204, 20, 30, -82, -243, -193, 0, 77, -259, 422, 5, 243, -135]
3009a35J44K40l59L45j54j15j15K8M3J77m1kp1K81m40l5M65l40oP7l18J77O8p9
3033a65j57N29m6r6J57l91J83l00N21k19k22R1J6J22j78J85q0q0M3O13n43J81
3055A64m12J80j53J29LJ23K11m08K08j5J04k1k43q4K1M75m71L10j94j42J37M5
3077c3J18J84m72M49p6k97K18j37N2m04M02J96pk08l8J24J74l48K42K27k09m25
3099b68K44j57J87k50L47k45j71N60k91j18K74j51K82k37j78M96m63j7k55M14
3119CP1j2j82J61J21k14J19J01J57m02k13L56O8j05P4l12M0P5p7K55k26O6q7M7
3143a16j22L78q2j10q6k41N95N5j54l57M48j81J3k38L23J51k70j26P1K27j0Ll84
3166b13K31K33ro3j52o7Q8j9J14k5j15L0n64N15P9k44J26N0K03l60P7j93J02Q1
$$ y = [-135, 9, 249, -110, 235, 81, -34, -149, -121, -78, 99, 58, 56, -15, 266, -174, -209, 256, -84, -90, -13, -331, -154, -86, -165, -322, 207, 161, 65, 222, -169, 14, -286, 235, 16, -206, -115, -99, 23, -155, 30, -50, -130, -87, 526, -17, 164, -248, -68, -221, -92, -89, 34, 245, -163, 45, 30, 134, 113, -130, -214, -193, 282, -189, 121, -73, -215, -78, -33, 85, 269, -203, 246, 170, -127, 91, -46, 6, -398, 4, 200, 193, -15, -53, 71, 245, -103, 139, 366, 157, -268, -24, -181, 6, -244, 103, -142, -313, 247, -44, -162, 112, -39, 243, 6, -172, 324, -139, -156, -411, 3, 74, 62, -120, 41, 162, -52, 67, 168, 325, -77, -290, 66, 134, 29, 103, -209, -169, -94, -171, 84, -142, -76, -163, -116, -238, 140, 58, -52, -138, -379, 216, 271, 117, -240, 208, 27, 40, -198, 125, 276, 6, -120, -49, 178, 168, 171, -213, 18, 251, 242, 179, 27, -40, 48, 29, 143, 118, 3, 33, -531, -16, 63, -181, -55, -5, 198, -162, -85, -278, -176, -95]
3190i5j9j78K52J89k58J39p3O4L39m84j20R0K06K83k67m7o9j71K64j83K4M1L53
3213B80k65J2K99m15Q6j15J85m3n5j38j23M88k08J5k4N8l3ON9o8j70K08K5j85
3237a21j55N9M25o3j91k94L19R7k6K13m57K55k72M58L59q12Q2L00N2n7k70J01
3259BL74l45q2j47J27KK90j98j7j36R7J39J37p0L9o9J37m7m8m26J35k17K61K44
3283A82j30k7j12K66o4j23J32m02L16j77M31l96J17L3l38L32Q7J32k26K43l90
3304a14L03K02k53m62M86k04J15j88r1R4L05k72j32K19K46n5j50R2q3J18k93Q9
3326b8J23j72L13o26L46L09j67J13k53K60l7l36j52J97k8J21j4J98k44J42j01
3347c6k5Q9JK34m49J78k9K2M1m6j72K98o5L2k2l64N4K56l2j01R5m4k23K86mJ04
$$ y = [-95, -114, -292, -40, 149, -109, 30, -43, 21, 360, -124, -244, -154, 52, 335, 68, 21, -48, -219, 45, -138, -114, -73, 280, 15, 27, 326, -89, -3, -118, 67, 24, -31, -169, -292, 196, -12, 3, -21, 37, 4, 10, 69, 1, -169, 39, 64, -121, -276, -217, 208, 145, -46, -340, -21, 76, 50, 263, -194, 61, -211, 247, 606, -206, -124, 176, 228, 171, -99, 2, 376, 31, -51, -198, -71, -69, 221, 23, 6, -130, -33, 106, 243, 173, 212, 143, 280, 233, 185, -241, -106, -323, -62, 182, 52, 25, -87, 179, 115, -8, 124, -278, 38, -139, 292, -104, 13, 46, -292, 40, 127, 259, 33, 276, -114, 189, 391, 138, -324, 162, -42, 73, -115, -206, -112, 193, -79, -211, 8, 254, 199, 49, 141, 58, 176, -117, -28, 95, -77, 236, -390, -44, 265, 98, 211, -42, 218, 181, -155, -307, -110, -138, -17, -31, 167, -77, 65, -36, -61, 28, 29, 263, -186, -8, -37, -15, 26, -20, -192, 106, 41, 73, 51, -313, -259, -3, -35, -136, -41, -85, -308, -22, -26, 78]
3373G8L60n00J6K93j83j28M3j86K89n5k2Q9p9K14j49K7j99J13lm8m5L76n10L54
3397A45k19J09j36J8J04J9N9k9j2J2L5ql5k19J91J17m03L59R0m59J88J45mj70
3421a03K05j98L32l02j26L11j90j81N91l43k58J72L69l57PP9l23J39J64k1J3k08
3443b28j7N53k49mL0k95J48L05L4k41j61J51P8j28P0j24K37q1N2L7J07k22k42
3466a90K23m9k10J93n4k05L38k85J02j5l7p7K7K96k8k84J73n4M3K33L4k06M2j5
3490ep0J30K9j2l22J98P3J34j91j69K58J04n2j25K39l39J54O7l5J63l55k5K04
3513E3k89M10j73j53O6M26k69J00l5l70K19J05k80K27K37m06M0K47m01N4K19j81
3535a54l0J42K03j66L4j18J07j92J39j4j99J16L77K27k85j50j85J45M8j10L74
$$ y = [78, 438, -62, -46, 247, 64, -64, -21, -207, 82, 27, 5, 94, 15, 229, 80, 107, -92, 21, 18, -30, -75, 301, -209, 145, -74, 35, -101, -83, 21, 40, 99, 70, 58, 70, 105, 97, 62, -157, 34, 151, -252, 107, 197, -262, -74, 71, 67, -103, 102, -96, 236, -66, -192, 119, -71, -252, 339, -4, -262, -90, 279, -78, -71, 8, -315, -176, -12, -33, -20, -228, -245, 308, 59, 55, 85, -210, -62, 243, 277, 36, -125, 26, 104, -24, 46, -78, 159, 78, 130, 167, 274, 52, -190, 33, -16, -226, -33, -87, -292, 46, -239, -137, -152, -189, -266, -239, 57, 29, -255, -82, -136, -93, 140, 174, -32, 10, -5, -75, 55, 84, 72, -250, -52, 21, 155, -36, -205, 53, 157, 105, -20, 219, -120, 34, 101, 66, 229, -126, -151, 53, -236, 174, 1, -152, -86, 340, 71, 171, 136, -234, -15, 90, -190, 37, 274, -132, -92, 155, -246, -192, 27, -154, -184, -42, 161, -5, 29, -89, 18, -174, -35, -49, -248, -132, 245, 472, 187, 37, -148, -3, 45, -65, 309]
3556C09l07j03j07K88N0j9J61l23J99j59N7j90K8P2rK05j57J08p1k03p2J92J7
3579c4J8j71j0J84l11M84l69j13K25M1K31J71p11K26K99k24R6J85j51j54J69J33
3601B14l90L87k54j42J78J61k61p9J87m5J14K45k64j87L0p7K14k68K64l8o32N53
3623i0J02j76M04l68L90m8k92L98k89O5n2j50N3k38o2M34j31j81r0N32k29M9J87
3646B18k01j7l81O04M3j14j46q0J65J05J05l08k55L09p5K22o55O60j71n29N86
3667H5k10l8j44M60l20mj07P8K69m0J05o7j72K24j15k99L06o4n6N9l4N25n07j04
3691a70J61m9L1K9K84j21j22J78M6k93J96j13j98Rp1L09l58J82J90j71J86k22
3713h7K18k57M04n9l10k3K16k22L83k99K30j57k93J42M66k08k75K13K53m07Q3
$$ y = [309, 2, -101, -208, 80, 130, 111, 272, -51, 148, -11, 46, -144, -116, -44, -53, 152, -5, 103, 32, -171, -243, -51, -34, -16, -187, -197, -13, -324, 160, -209, -322, -97, -56, 175, 346, -365, -139, 160, -64, 32, 217, 66, -88, 81, 214, -176, 211, -43, -185, -7, 154, -107, -186, 1, -44, 70, 315, 51, -136, -106, -183, 31, -237, 27, -11, -643, -90, 12, -164, 240, -128, 262, 214, -78, 320, 31, 96, 44, -106, -53, -291, -353, 81, -50, -231, -321, 211, -18, 31, 218, 17, 0, -381, 223, 266, 152, 6, -74, 91, 196, 301, -7, -262, 47, -28, 194, -461, 199, 28, -501, 85, -125, -163, -307, 153, -167, -171, -278, -200, 69, 29, 134, 67, -105, 119, 4, -295, 11, -53, -109, -50, -84, 441, -66, -170, -9, -58, -27, 2, 286, 165, 43, 221, 267, -26, 170, 57, -141, -132, -203, 106, -252, -70, 120, -51, 135, -87, 131, -126, 278, 219, -91, -114, 102, -120, 263, -36, 194, 37, -256, -114, 352, 144, -131, 82, 335, -72, 11]
3734A1N2J31k17k14J48J27K9J63m38o8J50J75k73N50l70j95K54K35k68k03K02
3755a9nR4j36M8k69M06l9l19M23m02R3J84L18k75k53K21n5j1Nj39J76M6Q2r1o9
3780A4R6k68J63L4q9L01Q0j29j6j47j17J99O7R9J01l21m2m5J48q4j79j13L25k12
3804a35J71o9N6L79m77K5k9o6K15j36J55Q1K74n82K20L14p4n33r0K62n2J01L7
3827D7j0J79j02P2K0j75J59j03j24M37k17k51N2k38K15j63J59L2L10J7j72n9l99
3850c14J88K55j82O1k7o4K23o0k5K3j78M1m0k42N58k91J56P2l46N37k12l1k37
3873a35Q6J43j20j2O4p7j63L31J84k78Q6k91M91j43l65L05k63K99l22L70l43k78
3895d31K00J81o2p7N0O6N2J50r2j31J97Q4k87K03k72K89j47K7m6J07L40m61J74
$$ y = [11, 63, 194, -23, -237, -89, 38, 67, 230, -208, -276, -126, 49, -224, 326, -44, -239, 15, 250, -18, -221, -19, -24, 70, -66, -18, -287, 119, 80, -239, 184, -218, -125, 59, 377, 102, -151, 70, 15, 4, 9, -130, 46, 92, 174, 83, 14, 110, -158, 5, 39, -50, 251, 331, 202, 186, 39, -78, 121, 188, 287, 388, 67, 25, -20, 128, 44, -135, -248, 77, -135, 36, -33, 23, 402, -75, -50, -79, -145, 70, -66, 89, 170, 444, -138, 82, 396, 322, -211, -301, -39, -91, 10, 47, 37, 216, 114, 186, 206, 31, 190, 87, -37, 400, 183, -68, -16, -254, -39, -202, -43, -11, 299, 316, 144, 85, -314, -126, 129, -53, 8, -19, -83, 140, 80, 55, 78, -100, -59, -99, -341, 217, -74, 82, 154, -192, 345, 133, 102, -135, -49, 94, -26, -38, 26, -51, -214, 117, 301, 23, 109, -182, 309, 166, -199, 106, -157, 142, -180, 190, -153, -431, -231, -50, -112, -189, -139, -73, -21, 129, 37, -94, 103, 187, -100, 103, -169, 120, -27, 0, -46, 61, 401, -60, 114]
3918A14k42r4K06J9j74J63k3N7J32j96J62r2p5k4r7J75K36j9l23Lm8M27j6K1r3
3943A99k69J57m4K09j36o8j5M5p8N5J79l34q4j21L52L07j12j24j57j73J4J04%
3966i4P0J3j9l3j28J99J6J45P9l7n6j64M1k38L04r2N3l68P5J92J96j24k17K54
3990F7K57m0l37l9L01k25K3J34k44P3R4q8n08O29j07lM9J88k93O1K7j89m8J4N6
4015a48J29K5j80J99J04K0k26L2q7j2J66KJ97l71L54l33L36l6j04Q2k77K1K25
4038A18om2m99N70k35R2L88l39J55o0j31r0J22K00m8j46M5j05L1L0O6l91M59k32
4062d8j36K10Q5j68L94l29k65K13r8j39L15p8j8j0O1m6J4k17J51J94J27k06O2
4085F8l97K76k11k58M56j83K38J56m66K70j50J53k3j2k54K83K14j84j63J09r9
$$ y = [114, -128, -222, -16, 3, -171, -8, -31, 26, 158, -38, 124, 32, -43, -67, -164, 11, 247, 228, -95, -92, -140, 287, 271, 292, 199, -70, 87, 43, 252, 116, 48, 33, 78, 0, 55, 234, -100, -184, -305, 47, 354, 242, 118, -39, -212, -198, -94, -94, -24, -11, -30, -63, -191, 8, 24, 169, 248, 211, 155, -9, 32, -206, 98, 6, 59, -309, -234, -42, 154, 30, -187, 67, 324, 284, -53, -92, 209, -16, 7, 141, -103, -30, 64, -24, -532, 97, -10, -13, 36, 224, -69, -8, 19, -170, -218, -204, -148, -19, 6, -174, 25, 129, 149, -77, -45, -132, -144, 22, 24, 221, -150, 204, -129, 207, 171, 67, 149, -128, -107, 118, 112, 70, -429, 141, -94, -2, 386, 47, 202, 142, 11, -79, 43, 243, 195, 49, 94, -11, 20, 50, 116, -275, 184, -48, -184, 26, 111, -57, 337, 8, -257, -44, -142, -281, 34, -44, -62, -72, -11, -57, -43, -260, -109, 85, 212, 6, 68, -329, -53, -264, -522, -66, -249, -11, 145, -321, -51, -201, -48, -71, -83, -337, -54, 160, -24, -187, -78, -177]
4106a77J36L6J20J3r0q9j92K4K43j97Q3J73l57K63Q2k80K06q5N5K4M6j40J27L
4130B7l2K26j94j04J2%K76r4r4J87k02K0j28n0J28J83q7l5j87J29k4pk0m2L41
4155B29k15j40L35l09o3R4j48J32r0J59L76n49L32k43n2l9L72n34L49N0k95L00
4177E1k19j2K45j38M2O8j3P7j46k9K19o85P70k7k52L01k73j59K86J59m44q7J8
4200b48L33j04K44q9J86l44N13j11q19O10l2J40j75k14p5J33J19j2M4l04Q4p8
4222a99J71J24k15O5J23k2q1M3k9P7k73J40j45J80o6k9K6q8J44k50O32o13K91
4245Fk5K67j54l4k53M40l80K64m4k92J48K49j91j11j5n0J22k1M7L23l77j07M1
4268a47J38k64M8L84P7l03J88j89K02k13J9K6J34k09J54K70l66N0k2j64P2J57
$$ y = [-177, -41, -5, 115, 128, 38, -51, -243, -219, 24, -173, -90, 83, -274, -11, 71, -209, -3, -88, -33, -9, 37, -103, 24, 27, -5, 221, 27, -77, -65, -65, 211, 117, 23, 210, 8, 28, -100, -150, -22, 161, 74, 39, -148, -19, -43, -50, -70, -112, 229, 14, -126, 209, -100, -163, -69, -217, -85, -175, -16, 360, -189, 143, -100, -152, -191, 181, -353, -4, 46, -249, 51, -168, -180, 65, -73, -31, 37, 24, 101, -45, -74, 145, -540, 230, 203, -49, 252, -21, -180, 106, 265, -179, -266, -248, 85, -19, 225, 136, 322, -22, 491, 380, -439, 171, 139, 279, 104, -110, -185, -52, 67, 55, 99, -205, -121, -199, -28, 96, -119, -54, 69, 47, -34, 9, -20, 57, -216, -76, -221, -41, -107, -136, -110, -198, -54, -304, 328, -285, 6, -19, 248, 94, 60, -193, 247, -133, 131, 87, -205, -57, 192, 1, -110, -125, -175, -53, -74, -27, 296, -81, -188, -147, -9, -273, -225, 159, 236, -67, 121, -68, 134, -79, -60, -34, 100, -109, 45, 315, -51, -1, -23, -187, -115, 42]
4290D2j84K26q9J05l28L65J3j97K49j00k97J74k70o4L04k78K24O5J72j07J87k07
4312EN5j81L01q1j76Q2k8k7J18n4q9m4K11J34l71M07k0l38K30k91M42j25k37P
4336g0O1j9r7J49j68O12n65J61L25j84l31R1qQ4n8m9NR7j64Q0L99k17m7K23o14
4361c04L18P3k72J52Q0L03l42K87r2l09j05L46l83L64m9n9L9r8j3R6k05L00K10
4384C37l56n8O4L00l18MJ39k67J04Np2L57j53m1p7J62O5k88L73m54M7J68j58j28
4408b45N10J07l56j50J98k68N41l09K4L01l73q2L93p8m63K23J32m6K57q8k8o1
4430A39k55j28K99j79p1j8L16j11j42P4P0j1p4M6J58K09n92m7L34R8J25j59k61
4453a80L58l06R0q6p9K46J17o3l42J98P0j48l7LR7r1J90p8P7j66J23J69J9q9k51
$$ y = [42, -142, 84, -5, 100, -228, 137, 150, -47, 202, 102, -195, -21, -291, -355, -51, -329, -105, -40, 132, 25, 212, 5, 60, -121, 180, 99, -77, 5, -23, -50, 68, 14, -75, -119, 92, 226, -145, 262, 242, -96, 134, -157, 285, 160, -77, -70, -9, -28, -125, 24, -144, 468, -97, 64, 389, 205, -126, -35, -43, 41, -17, -66, -61, 36, -128, -48, 351, 134, 87, 310, -304, 14, 87, -185, -33, 47, 350, 8, 295, 203, -106, -211, 135, -248, 116, 67, 8, 47, -51, -64, 32, -173, 127, 337, -19, -77, -13, 287, -31, -27, 112, -155, -51, -46, -118, 239, 86, 45, -32, 130, 195, -93, 280, -174, -127, 41, -117, -245, 265, 372, 16, -134, 64, -204, 337, 28, 52, 353, -20, -102, 291, 213, -250, -27, 105, 59, 316, 228, 200, 139, -116, -244, 55, -124, -195, -213, 103, -8, -150, -76, -6, -17, -91, -45, 113, 322, -270, -317, 17, 115, 240, 81, -180, 178, -128, -38, -124, -203, 43, 160, 97, -245, -47, 23, -125, -162, -159, -62, -153, 37, -41, 36, -130, -7, 162, 181, 92, -159]
4478a59K47l26L5M15j28L7j09m8J40j61j40K92J76j03l16L34l53J44K97j71j61
4499e8j2J17lj96j81M85J66k46p2J38o2l00K28J37j28n2k20J44o6L04p4P3k45
4522a23KJ38J27k20k04N4K33L71n20M13k33J70lO8m71M71q4m44M08J44n52K96
4544D1J57j87j71J59n8J41Q0j75j96M51k72J44j39m4l28M60j69J64k00K65k60
4565a37m8L56k73k00K81J60k08m9l7M51l65K19r6j46K57j04n5j90K06l0o5J23
4587E0k77L77j54M71j69k80K10m00K06Q7j65oK36l7k11l3Q8m2j10L24j36K10p9
4610A60o7j62K42o9J75l73K11j00m04M18j07J97k5j35k57L84j57K06J5l4l47K22
4632gj67K40K7k50L42j57K37k23J7K2m69M07j94P1o4j31K35J30R7k53j1M55l02
$$ y = [-159, 88, -238, -203, 212, 84, 121, 12, -36, 104, -57, -197, 95, 271, 168, -148, 186, -167, -23, 274, 103, -58, -70, 47, 44, -152, -333, 152, 318, 72, 0, 138, 76, -224, 4, 141, 13, -39, -259, -115, -181, 123, 49, 122, -123, -121, 17, 144, -76, -280, -226, 7, 378, -142, 271, 38, 208, 205, 273, -198, 273, 189, -255, 153, 297, -255, 41, 198, 11, -160, -1, -59, 82, 162, -13, -209, 242, -30, 114, -25, -69, -397, 63, -106, 58, -142, 123, -137, -185, 171, -102, -302, -21, 139, -69, -118, -155, 296, -69, 150, 54, -92, 165, 61, 6, -184, 22, -8, -73, 50, -227, 150, -4, 467, 298, 18, 228, -172, 34, 121, -44, -50, 186, 149, -62, -95, -7, -49, -159, 165, 29, 239, 160, 93, -69, 173, 104, 279, -94, 117, 17, -387, 31, -76, 121, 96, -39, -296, 88, -69, 137, 152, 118, -229, -7, -174, 66, 93, -157, 185, 28, 265, 42, 59, 81, -388, 19, -175, -104, -168, -299, -64, 66, 163, -90, -101, 354, 52]
4655E2j30L53m85M17k52M5j98K82m8j17K88m62j02O41l00K21P0k58MJ7r5q9J77
4678C1j07L24k51oK77l94K30k74M44m60L23j18k61L65l74n0J89K76k40j44L61
4699A41k23k73N36o4J90m04R6PJ39J8J86m0jk19q5q3L93k03j57J03O2Q0m32N5
4723a78K51k48M20j82R7k90P39o37j84K86j0j2p7O9l91K75Jk8J11l1J00r7q4r1
4747a91K26r1L33j70m6j93P4K18j43O9Q5K64m52K3J54k61L5J65r4O8k5k4k58j16
4771c50M07k7L93n39J25L01o5o3k2l01k5Q6L01l58R1pj17K66l62L56j07J83k47
4794h1O3j6P7j86l7N5j5K16p3P4k2J06n08L50k4L55n97L34J06l91J58o4M09J04
4818C93k48j40j20r3K68L49o52J51o8m0J54J5j51j16J95J99M0k69L61l6l57J50
$$ y = [52, -78, 275, -210, 207, -45, 0, -198, 84, 36, -81, 207, -255, -357, 284, -16, 205, 275, 17, 21, 38, -57, -146, 31, -76, 248, -3, -9, 268, -126, 104, -170, 274, -186, 137, 19, -242, 123, -251, -301, -112, 164, -76, -220, 141, -82, -355, 181, 117, 307, -97, -1, 6, 145, 163, 349, 309, 308, 89, 4, -79, 314, 111, -46, 57, 119, 199, -233, -178, 73, -175, 245, 63, 160, -130, 609, -28, -212, 74, 64, 52, -25, 44, -347, -72, -71, -99, 12, -19, 81, -16, -100, -191, 35, -56, 277, 107, 61, -132, -58, 160, 17, 86, 171, 435, -17, 6, 160, -101, -66, 99, 5, 73, 48, 24, -234, -350, 57, 30, 423, -116, 9, 310, 245, 182, 160, -141, -166, -80, 221, -137, -46, -53, -170, 96, -266, 90, -17, 166, -81, -18, -34, 43, -143, -180, -125, -140, 76, 3, 77, 55, 161, -347, 3, -21, 334, -263, 71, 177, -214, -56, -120, 289, 393, 145, 5, -115, -208, 60, 409, -243, -92, -160, -200, -46, -31, -182, -298, -103, 96, 136, -133, 228, 192, -165, -15]
4840a5n5N29k71j89k8k46L66l26K31K22M9k89J50q4J1J9n9m36L84J59n4j20J51
4863I9j7l20N0M6L36m14K46K52m19J6k59L91K5m1lp4l1J56k42L10j85Q8j97N21
4887C34m81j7K11k50L72n37L12N6n7J7J80k88k77M91Q2P4n28L80O2l11j1N11k73
4910E2j8k53N4K96k43M85l71J96n7k04M5L23l33j68K65O8j69L4J69o5j47r5p0
4933b06K72j7P6k68M2L34k07k04J13K18j91K3K6k13K83l76M52n4k07J81j31l57
4955d11K47K09k01LO9j11J85N9l4q9mj40M24o7K5r9p9K84m08K69N9l23N38l64
4979D1k9J24l01J10p8J85J41r8l7J71k41k08L89n5P8K11m65J36Ok50j1J44n4n9
5003a50J15M84n26K1NL99m75K22l00K99M2R2J90n49j91M01Ql16m2L83k00M7K79
$$ y = [-15, -70, 459, 188, -1, -29, -275, 91, -235, -4, 218, 267, -22, 128, 44, 55, 74, 15, -421, -37, 122, 68, -52, 99, 82, -238, -188, -142, 194, -220, 26, 278, -141, -125, -384, 7, 32, -9, -12, -86, -117, 39, -203, 107, -78, 10, -187, 334, -147, -164, 47, -203, 169, -368, -56, 0, -57, -40, 140, -148, -425, 66, 148, 222, -306, 74, 136, -175, -186, 325, 52, 34, -219, -165, 131, -112, 373, 2, 198, 141, -63, -18, 305, -28, -196, 69, 137, -32, 2, 171, 106, -41, -136, -206, 66, 49, 125, -143, -101, 233, 26, -178, -65, 153, -38, -15, 11, -202, 81, -295, 157, 103, -104, 77, -54, -411, -164, 45, -156, -153, -84, -195, -10, 49, 15, -74, -78, -218, 206, 139, 164, 65, -14, 270, -138, 131, 190, -133, 405, 41, 12, 136, -165, -55, -133, 52, 193, 95, 58, 229, -12, -220, 169, 114, 192, 403, -62, 74, 80, -170, -181, -37, -91, -150, -35, 449, -77, -56, -51, 348, -127, 95, -205, 94, 136, 228, 418, -131, -322, 79, 87, -229, -271, 112, -88, -41, 238]
5026B38j73j00k49N7R8R7M51m35m7K18N4k73j4j35M9qJ40K03m22K66L6j07J32
5049G6qj50j61K22m1p0K48k78K76n5l16K33p9j16K34L48j86j86J17Q7j38J19l2
5072A44n4l7K6l12K37P7l3j31%J01J13n2L0M10p01M6J42l3k76M31j93J63k75L47
5096A70j46M36n47M62o04N64k27Lj9j10L13l15Q0k40K80k55L6J81r7K23Pj90j04
5119i9l9Q7j52l7O44l46p4j73L13oj07m2R3J16k57j35O5J78j03k28M25j52J54
5142A25Q6l80R4l14J09K50Q2J22n30N05k43r3K75n4P0k71R9j9J86j86J24N6l13
5165b20P1M96m29L83n82oM64J1rn8R9k24Kl3L14j25k44J92PJ92l34j35J40r8J28
5190BK04l85J85J86l68K9j4N3q1K95J58l83L15k44l57M65r2O24n89Q6o2j68L33
$$ y = [238, 65, -35, -284, -227, -129, -32, 419, -16, -63, 155, 209, -64, -78, -213, -164, -172, -32, 171, -251, 15, 51, -56, 76, 68, -82, -243, -21, -62, -132, 116, -162, 114, 59, -257, -24, -103, -219, 15, 363, 177, -9, 108, 195, 57, 176, 144, 90, 53, 79, -233, 4, 81, 48, -83, -83, 18, 131, 79, 109, 519, -182, -136, 6, -27, -303, 128, -65, 98, -177, 170, 24, 460, -87, 375, -229, 335, 108, 111, 92, -18, 295, -20, 60, -180, 100, -155, -119, 62, -35, 188, 195, 5, -99, -138, -51, -203, -240, 404, 58, -16, -189, 124, 118, 11, -31, 62, 178, -79, -214, -149, 29, -74, -302, 123, -29, 125, 211, -169, -75, -389, -280, -30, 52, 174, -356, 149, -94, -187, 88, 34, 104, -167, -68, -87, 99, -87, 37, 93, -220, -149, 347, -82, 301, -281, -287, 177, 188, 179, 121, 220, -4, -2, -35, 279, 154, -90, 102, 109, 301, -33, -168, -28, -126, 2, 206, -179, 6, 192, -176, -147, -161, -108, -189, 106, 264, -119, 196, -48, -405, 60, -32, 592, 3, 89, 27, -141, 192]
5213A92l28L0P8J01l13K83J55j79M6l33M53r8LL3m2J27j66K29m46J28J65j10L91
5236C99m40O5J01R9j71j54M7k6l6J72k45K75l1J15L10l42L8j43k01K60k27K43
5258A08j12K05Kk25O2R2j64N11p12J29K3J63J27j76k28J54L94l40p2M79k65m12
5280b57K02M0J65j03L04n52M47j95j9J84j49Q6k05m2J49M6J87J1l08R2K28n04
5302a93j55M14j11q4L25n40J23J24J70K6Lj88k0R3J18j66k56M75j36j6Q7L4lk97
5326a73m5M49k11l31M29k25R5L14k56J78k34k73O46j51m08j82J18P8K06j57KJ69
5348C8l4mLO5j17J34m2pJ82k94k1J2J4J16J6J81l87J33j70J99J22l1K33L2m76
5373a03j06K34q2J47J76l23J29J57k13M9j03j1M08o22oP8nK47m4k07rN78m09j30
$$ y = [192, -136, -106, -28, 73, -240, 43, 198, 19, 65, -268, 185, 87, 90, 123, 81, 208, 42, 271, -175, -47, 118, 8, 399, -41, 24, 125, 224, 53, -101, -54, -80, -116, 56, -189, 86, 55, 170, 480, 138, 176, 33, -168, 92, -135, 108, -4, 201, 203, -22, 40, 132, -32, 479, -233, -104, -81, 82, 209, 33, -195, -41, 353, 13, -59, 420, 155, -257, -55, -15, 150, 47, 351, -201, 246, 51, 32, 216, 67, 153, -52, -94, 55, 101, 288, 299, -9, 83, 311, -193, -348, 66, -45, -129, 196, -344, -221, -97, 73, 99, 102, -86, -106, -13, 105, -61, -317, 158, 22, 6, 93, 127, 124, -173, -218, 231, 20, -311, 118, -107, -12, 302, 46, 224, -10, -283, 363, 212, -196, -378, -260, -182, 24, -133, -131, 38, 4, 0, 3, 68, -49, 85, 43, 36, 218, -76, -97, -85, -71, 45, 61, 242, -145, -12, -182, 17, 139, 108, 341, 373, -103, -209, 25, -57, 90, 266, -57, 72, 229, 16, 65, -38, -49, 359, -263, -269, -191, -196, 51, 7, -200, -209, 369, -40, -170]
5397a70L20J3n3J6j52N9K7J59n08M70j54k21Q6K41k80J8K09k24J87j99K42k39
5419a53J97l08L61j53n9L21l43L36j52k26Q7O7P4R0J55k56J59J56J05o09K06K2
5441G7N1n5K37l84Pj9K01k10m8N0R3L1J65q6J29k32K8k75K77Rj13J91l62J83o7
5466a22J36k19J90k02N3J7J46m42K23K85r6N8j48k2j33L00j45J62N9l8nJ85q1
5489A61j09J0k96K25p9JJ37P7l80J91n3nK86l27J05L1J08j67J09m7k13J13J60
5512C8J5k93K64J53j41K45j39J17l83J3J13J3P4j66L67j85N1n6j85Q0k47K58j61
5535a55J19q8n8J73J20m4k01J66j39K24k9%p4J08k22R7l7j74K7j08J37o6K72q8
5559d0k79M58J06l99k2J72j93J24Kj55K34M03o02J52J81j38j28K4L74k70k99N32
$$ y = [-170, 150, 163, 110, 126, -26, 33, 60, 219, -289, 181, 27, -194, -108, 133, -147, -129, 80, -144, 43, -156, 86, -153, 44, -264, 97, -56, -115, 206, -137, 199, 47, -179, -92, -25, 49, 139, 294, 38, 197, 353, 458, -151, 55, 77, 128, 73, 310, -74, -67, -86, 115, -95, -143, -93, 0, 31, 196, 110, 239, 7, 35, -240, 37, 46, -67, 124, -238, -55, -122, 14, -205, -15, -217, -164, -147, -1, -443, -220, 65, -31, 27, -121, -143, -276, 24, -121, 41, 100, 62, 57, 242, 161, 52, 62, -234, -9, -88, -87, 50, 127, -253, -62, -115, -120, 166, -161, -56, -25, 83, -84, 25, -22, -235, -122, 38, 53, -240, 24, 177, 36, 281, 142, 259, -124, -111, 2, 15, 89, -77, 290, 105, 156, 100, -85, -5, -252, 6, -155, -36, -124, -182, -9, 111, 67, -134, 32, -107, 117, 88, 88, 14, 122, -100, -3, -40, -214, -187, -295, -158, -224, 48, -40, -319, 139, 245, -154, -176, -4, -197, -73, -71, -226, 8, 411, -191, -39, 142, 4, -124, -100, 274, 4, -295, 237]
5581B37k55k77L09r6J03L0J6j86M48j34k13L6J30j4n6L1l54K89L6J42J15j43k54
5604f0K8j64l0J51K7P4J19l52K41K85n31L32QQ2j35l35J55M1J28q1P9L3l38K50
5628GqJ82j18q5K32k65O8j02K25k8nm12J28L11M1n5q0N1k16J92K07k57k49L7K68
5653F9p8K05j53l40N4N44o20L68P4l4j72K52k66K78K34l66j0J7J89pRl74J81k56
5677b02L04J7j31k8l9MK6j90J49L57j73l9j04L02m45M86l16J30j18J50Po2j93
5700a08L82l15p5M80o7k48J22j06J73J02k57j42l9L86j73j20J95J62k15j17J86
5721B06j82o9k34K32K14k87k47K57n4J00J4NL92l52J5o1j66k69K37J06J69j33
5743a07J40j72J55L9M6J03K57J7m98J67Q9k80Q8k3k38Q0J09j08m5N71j86m44L
$$ y = [237, -18, -295, 14, -82, 21, 51, 67, -119, 329, 195, -18, 18, 148, 134, 78, 109, -245, 44, 80, 222, 337, 194, -60, -32, -196, -226, -75, -48, 26, 145, -207, 34, 319, -212, 120, 128, 210, 75, -260, -105, -64, 64, -17, 62, 95, -243, 7, -1, 181, 63, -22, 210, -55, 13, -89, 136, 108, 103, -309, -181, 130, 171, 116, 36, 87, -129, 63, 270, 13, -236, -199, 69, -9, 196, 43, -297, -243, 301, -319, 49, 123, 89, -83, 169, -97, 181, 415, 49, 39, 56, 245, 238, 247, -127, 54, -202, 102, 119, -12, -40, -79, -75, -49, -239, -90, 267, 94, 55, -49, 253, -192, 294, -22, 108, -10, 140, 147, 85, -108, 274, -41, -116, 364, 297, 49, 171, 65, 238, 340, 83, -59, -98, 288, 115, -5, 190, 352, 137, 20, 206, 24, -45, -279, -47, 167, -120, -367, -110, -164, -64, -50, -45, 347, -5, 10, -51, -217, -486, -249, -143, 26, -107, 33, -139, 16, 55, 101, 204, 461, 478, -20, 147, 236, -44, 44, 21, -217, -137, -28, -136, -181, 390, 204, -240, -237]
5766b37L62Mk86R6J81JO0j10PL92l63k81q0J80k3o2J86j86L61J12p6l54n4J77
5790GN1j63J6J08j53l1K48o1L3k77O4K59M1l44L55j83P4J42O4q1j14j28j27J84
5814a6L4j53K97j31j90L16k01k7L86M8n59oM24O9n26N29k51j84J99m00L20k4J69
5837A23l33K60K28k66L21k60j03j88K87l22M65l32mL50k43K47o10N28j99JJ85
5858A35J8P4q1Mj62p5J27k41J97J3j85L8K8M68m54Q2J35j26J35j37l17K74P7J66
5882A93j85r7R7M2j9ON3j06J16r5K5j76J56O9k09K11M8l60J66j40J92J05J53k58
5906a3J49j69oJ22j3j82L12o0m45J03j3J26k09L60J32m54j61O49m64K30jL3J15
5929A41j10k31j41M20j84J49k25N3J89O5q6q2R7J01k32j0K8P2K82o2k15k11K63
$$ y = [-237, 125, 129, -157, -61, 120, 121, 181, 71, 78, 470, 107, -174, -254, -74, -97, -159, 27, -159, 202, 314, 238, -116, -170, 7, 58, -105, -89, 19, -134, -165, 83, 22, 55, -222, -158, 101, 142, -202, 153, -30, 44, 186, 250, 169, 55, -73, -200, -16, 18, -135, 162, 31, -159, 157, -44, -71, 315, 363, -196, -202, 222, 291, -235, 294, 43, -141, 58, -342, -22, -46, 123, -210, 50, 278, 12, 333, 73, -30, -218, 69, -253, 212, -120, -124, 226, -17, 230, -380, 148, -51, -50, 135, 153, 227, 146, 150, -12, -87, 40, -201, -4, 9, -176, -138, -110, 358, -96, -14, 121, -5, 130, -7, -324, -50, 27, 193, 8, -89, 8, 50, 31, 37, 90, -16, 100, 5, 30, -146, 10, 79, -130, 81, 129, -231, -65, -205, -13, 92, 245, -13, 136, -33, -39, 83, 70, -112, 200, 140, -305, -202, -215, -89, -298, 62, 194, -260, -421, 228, -236, -6, -7, 26, 141, 31, -200, -341, 79, -105, 44, -181, -128, 61, 126, 40, -42, 55, 156, -76, -86, -58, 14, 296, 234, 19, -192, 71]
5952G1L8Q8J81k68k25l9J50K99m31P2L49n36L25M0J07j95O0j85J78r4l20N06k23
5975e2J21J0o3O7j65LL0q6N1j52M87m46J78M72p44M13J67k68p71P56K0jq6K85
5999B26k01M1J11j52K0q6k18J30O6K6K4K51l24L9k07M55l22N4j73L75j49J56j84
6022d2MQ8j48k4K13k42N2J62K07m8K2M6k2l71j27J02N2j7J41k70J38J40K10l76
6046a10J02j18J06j5l8lK3l83K98M68J8k38m19K15J90K3j33O1J56L5j46J15k39
6069c2r7K67j44n0J9L35l21LL72j90l66M96k20m15K74ol1O61p05J72K2q7O8k0
6093EJ84j80K3q2j21L95m0m78K60j76M66j13l19J03q9M98Jl35pm05M50j2K00m96
6117b68L09m3l10J39K87l0jj07j0k0N3j24J35K1j96L36k87L64j84k60N46o2k15
$$ y = [71, 109, 197, 378, 110, -115, -154, -4, 295, -136, -64, 285, -251, 74, 114, 221, 26, 86, -99, 79, -15, -335, 171, -52, 69, 79, 16, 83, -82, -79, -49, -135, -84, -236, 251, -195, -17, 455, -289, 124, 291, 23, -748, 8, 28, 27, -59, 226, 25, 66, 177, 25, 45, -41, -259, -129, -63, -37, -13, 238, -86, -47, -254, 201, -121, -67, -240, 135, -14, 142, -42, -38, 50, -98, -122, 91, -151, -99, 63, 270, 222, 244, 290, 268, -103, -230, -128, -76, -93, 48, -222, -84, 56, 266, -110, -8, -126, -20, -35, -73, -76, -53, -436, -138, 330, 348, 110, -309, -94, 96, 119, -14, 47, 203, 238, 92, 207, -32, -129, 138, -6, -56, -37, 298, -23, -20, 352, 162, -204, 292, 72, -343, -69, -75, -106, 555, -150, 22, 44, -43, 25, 5, 189, 9, 32, -50, -171, 224, 184, -294, -34, -210, 256, 143, -176, -73, -162, 336, 337, 2, -5, -410, 40, 28, 228, -268, 41, -2, -312, -173, 114, 84, 83, -24, -34, -54, -1, -125, 10, 31, -165, 171, -116, 248, 64, -196, 350, 288, 73]
6140G3p9M4m23J31M80k09J01p0k41J28pJ83N3l02l4k09M41k56l5J69L1k02K20
6163a3K97k99j40L40l19o8J42q7L00m30P3j60J73R%j60n2N32k26l70Q24j86j84
6186dj06J04j94J63P4J48j61j78o8K9L78l98J11Q9K5J07R3l77N57m32M8q9n9J12
6210b8k69J44L42l93L64m56K09K20j26j98K68L0K4k71N7K99l5l74L17J49k70J04
6232A07p9P6k89M04k59n04N01l3L2j44K40P4P3m27J67J73l43L57k16P0p3J86k25
6255a32L00l32K39Pj45M0j10J75k7j31L05J8l88L60j9L8J18l41p9M0k7P2L04m66
6279a81j67L44J49l14L40j66q9m0R7J43n6j39p8l0M4k56K64K45J30m3m81L58R9
6302A73J2j36j26j20K75M8k68M52k52m16J88J64K9o4P6j38L17l20R3k17K46j77
$$ y = [73, -6, 38, -385, -254, 226, 17, 118, 48, -193, -65, -72, 111, 164, -138, -172, -381, 60, -196, -231, -62, -31, -233, -13, 284, -15, -155, 185, -134, -202, -60, -147, 153, -277, -204, -364, -191, -182, -182, -342, -394, 138, -88, -458, 366, 180, -4, -110, -6, -200, -37, 37, 185, 24, -154, -222, -193, 185, -213, -102, -13, 12, 119, 212, -165, 392, -40, 8, -81, -140, -28, -297, -153, 189, -204, 160, -296, -87, 133, 7, -191, 77, 107, 131, -140, -83, 216, 181, -193, 124, 273, 3, 107, 28, 104, -185, 219, -40, -544, -43, -76, -44, -188, 52, 126, 199, -228, -61, 112, -231, 126, -90, -20, -93, 93, -132, 168, -164, 75, 82, -63, -23, -133, 42, 15, -116, 189, 207, -181, 179, 160, 198, 316, -25, -104, -64, -91, -19, 285, -181, -348, -4, 145, -169, 171, 5, -84, -124, -27, 116, 60, -79, -157, -187, -143, -399, -135, 110, 240, 197, -284, 74, 173, 185, 49, -77, -197, 78, 126, -142, 310, 58, -358, -170, -6, 23, -41, 35, -103, 214, -106, -13, -230, 16, -161]
6324a61O9J96p8O3j7m4j44r4K92l70L08M5K20j47k82J13O5j30J91l79L03k08r1
6347b80K89K19O8p02L77k68N24j57j07j47K15j06j32l9J75J67k99J37K92j34K70
6368C62k58p6o2l03K58J0P3L5j61J09j30J52JJ41l68J86j58k85M37J30m5M0j48
6391f0j8j29M80l09Q4l0J81k87P6K85k01k19j65L32J52j32k10Q2j29m8M07N5l85
6414a88J05r8N14m11L05j37o9%J76j50Q2k75j13K93k29R4j31K60k2j00l62O25
6436A69m51J68m5J32L7J75j60J44j99J11K06k47o3K10l08j91L79n7J5J39j14m3
6458Gk56M74Lm80L49p9q8K1j37J80j13J44K78l04P0R6j03k3M4k13J6L2j2OJ33
6483D5k9K06q8R8m9n05M02J40k58R4k17J46K72lk31J12j45l5p4M34l02K9q8l0
$$ y = [-161, -92, 104, 26, 89, 72, 28, -116, -210, 82, -288, 20, 65, 285, 138, -144, -31, 34, -96, 95, -284, 19, -189, -280, 9, 228, 296, -406, -29, -297, 227, 70, -37, -184, 31, -75, -207, -246, -71, 96, -203, -66, 226, 92, 362, 104, 28, -34, -337, -79, -69, 4, 39, -122, -13, -143, 9, 10, 151, -217, -31, -189, -474, -37, 93, 48, 88, -60, -78, -207, 273, -36, 48, 18, 199, -88, -12, 273, 72, -147, -312, 20, 172, 40, -170, -88, -217, -265, 142, 197, -188, -83, -181, 333, -78, 227, 90, 21, 21, 197, 47, 129, -146, -259, 34, -195, -101, -232, 28, 6, -94, -456, 169, -282, -114, -159, -27, 10, 185, 25, 169, -30, 81, 287, 40, -23, 187, -121, -312, 67, 10, 25, 164, 50, 7, -249, 225, 228, -252, 97, 18, -70, -49, -186, -6, -119, 25, 303, -1, 69, 165, 62, 39, 83, -130, -114, -82, -94, -88, 45, 16, 222, 134, 232, 183, -322, 80, 220, -38, 56, -161, -15, 257, 254, 23, 135, -10, -45, -119, 315, 13, 42, -46, -76]
6507g6M1P9J74j63N3j95J31J20q6q6N3j15r8R7J3K3j40J59m5k8P6L2j49J48J24
6532A42J59k26j4j03N6J64m18O1J89J64l58K28J96l35l5R7OK80r4k98N9K76j69
6555B7l1M2Q9k68P2K86o3q4j60k64N04p4j16J92l29K42Q4o9l22K46L72m86j13
6578b23K16%n1J77j56K97q9j77pl8KK80l04L6J40j84K29N1k00j41J71J28k42J03
6602A8k37m4J35j61K46m9j33Q9k79J72J42R5j62M70l98j84K02J27N6j50Q1j25
6624h9J03J9M3l21K78J57k07J5MR3J15O6k84n2k8K46j68j44L43Kq8L66l26n1J76
6649B68j12j79J73j57l1j1K16m42K42K32j90K77l71J1J0j0o0L67k65M2R0j52K07
6672A55l57l4J52j11K90L26l74l51N67n0n23O19l04L3O4j13j86L0O2J38L40k31
$$ y = [-76, -35, 44, 218, 55, 108, -87, 44, 164, 78, -8, 45, -70, -168, -71, -58, -35, -175, -16, -61, -89, -13, 19, -130, 18, 142, 301, 75, 61, -42, 14, 178, -240, -179, 10, 174, -184, 44, 240, -95, -130, -33, -27, 253, 159, -139, -80, 196, 27, -4, 38, 127, -141, -69, 217, 154, 70, -90, -354, 150, 76, -40, 152, -177, 65, 149, 80, -242, 4, 376, -110, -223, -7, -7, -58, 119, -37, 260, 171, -6, -13, -51, -49, 231, -73, -37, 103, -81, 148, 199, -1, -142, 29, 157, -85, 18, -219, -263, -128, -289, -43, -92, -225, -136, -415, -243, -101, -6, -168, 302, -96, -280, -78, 49, 105, -45, 36, -89, 14, 33, 76, -245, 33, 190, -17, -2, 2, 95, 210, 276, -8, -60, -88, 158, -10, -154, 189, 191, 103, 469, 143, 92, 268, 156, -23, 150, -7, -38, -49, 167, -275, -33, 199, 9, 286, -85, -74, -64, -74, -134, 233, -32, 10, 100, -52, 155, -202, -236, -84, -195, 95, 421, 47, -304, 263, 213, -310, 309, 5, 38, 102, -11, -197, -167, -105, 33, 373, 142]
6694A42K00k57l16L57O8j03j19m00K96J88J15l68K81j40j04N63j85j76q9J1k3
6715e9J82O6j55k75J39L67l60N0K02K8J8O5l31O6n3R0mL05l10J08P9k36k1N8o8
6740d9J47P0l18K69o9j92L46k62K3K76j24J23n14L31j92N34m91L22j74k21J57
6761hk36J02J88l12N10L4r4j06M7k33Q8o2l0q6M21M5o25O57k93J75j62L8j55J22
6785B5J02%J6j89L5M3m7j69j16K83j95L12J44k23k9j34J37j9j45kN2K71k32K58
6809A78l49L34p6k16J40j2p0r2K86J57l19k9L0M76m03N6k99qK52k15K77j95J03
6832FL71n72q3L32R1k14P3K43j75M3j33n3L0J57r9j12K10p8n5pm15N62Q8l6k70
6857i6J01j51N0L9J52P8J01j83j32J61%Kj57J83l90K31R7j08j1L42j50j14p2%
$$ y = [142, 342, 85, -231, 126, 194, 91, -28, -428, -132, 56, 171, -197, 84, -56, -160, 403, 218, 42, -47, -36, -59, 123, 189, 34, -241, -102, 265, -95, -45, 157, 185, 203, 268, -63, 3, -50, 40, 36, 341, 31, 139, 218, -18, -39, 19, -49, 98, 168, -150, 119, 50, -142, 204, -58, -35, 241, 117, 240, -274, 57, -135, 399, -92, 230, 56, -165, -8, -244, -142, 46, -266, 244, 278, 184, 78, 125, -108, -20, -82, -112, -198, 223, 268, -357, 300, 7, 182, 20, 58, -97, 25, 127, 127, 143, -46, -11, 32, -15, -184, -300, -17, -212, 100, 244, 21, -8, -142, -5, -24, -169, -171, -119, 152, -80, 178, -171, 163, 87, -129, 11, -1, -71, -163, 123, 280, -39, -68, -38, 438, 35, 91, -208, -216, 36, -179, 98, -97, 6, 377, -195, -278, 54, 145, -69, 4, 247, 72, 115, -18, -71, -41, 116, 17, -95, 115, 37, -18, -25, -440, 122, 210, 174, -96, 5, -146, -96, -57, 95, 173, 274, 91, -41, 120, 120, 122, -35, 148, -242, -11, 86, -22, -33, 309, 159, 45, -27, -27]
6881b7K38r0J0j10r7K02j98M15l69L85l85r4K0mK77k11K10k23J36L4L1j17k05
6904a72M23o16N39j61J18p0j23q6L12m6k30J84j06Q9k45K51J37n0k29L92l53R4
6926E2N9m57L48k5M79l64pk07J08J1l85N91J12m16J35k50Q1J3L1j10J5K12o5J12
6950G3r9JM87m12o9L8K41j95j97K87m19J34J90n1J3J32k20J26j35J73K54k60k00
6973a08J19O0m2N8j40N3J9l50K29J85l43J44K09l15N72m17N2n9J0K79l61J03M7
6996DL34l97K47j57J68j04j49M3Q0j7m9K81l99K71M6k28J43oj00n6j03M52J7j48
7020A73j19J39j19n4L15n76M38j94l18K62K29l56M06k40J70J62k70l71K30J19
7040B6O7K67n80N0K89k89L95m23LL93m6k14K28j48j72r3R0L31l61K82j7J00j79
$$ y = [-27, 211, 121, 131, 21, -76, 126, -72, 343, -26, 359, -26, -120, -100, -104, 173, -38, 172, -51, 85, 119, 150, 33, -172, 251, -365, 174, 13, 131, 61, -62, -148, 164, 118, -112, 72, -34, 55, -190, 61, 198, 148, -81, 311, -42, 52, 111, -346, 2, -23, 456, 92, 85, -122, -14, -3, -388, 203, 315, -101, 34, -216, -135, -122, -91, -201, -186, 26, -39, 73, -26, -25, 462, 50, -19, 19, 260, 65, -132, 155, -264, -130, 60, 9, 22, 154, -66, 60, -75, 98, 352, 92, -108, 11, 71, 29, 87, -53, 0, 19, -331, -102, 83, -260, -116, 93, -222, 350, -67, -15, -74, -64, 215, -146, -43, 4, 338, -59, 188, 31, 199, 95, -54, -11, 69, 52, 3, 284, -115, 156, 202, -26, 117, 111, 11, -45, -148, 304, 321, 173, 54, 193, 74, 20, 335, -241, 197, 3, -315, -53, 176, -180, 226, -14, 156, 318, 48, -323, -93, 26, 93, 360, -220, -170, 119, -170, 225, -198, -195, 198, 152, -62, 166, 18, -154, -247, -157, 174, -187, 95, 78, 178, -1]
7063ap6L1M2L7k90J92K01j54K80k17j19J89j93J03o6M0j76J76j22l5J0M12j85
7086G9M1j61j97L9L19l8j20mL98n77J69J20j90N39o57K14k3R6m4R3j92J29M7K2
7110A02K03k54j65K11r5j75J51nj49J11j1M03k05J56j43j00L25l24j2j69J82l37
7132c00L62m79M10j60N7q0L28j84j44l1K34k0q4k03L53k48j68O19n72L11k6M30
7154D05m21ql14Q6J13J62j35K12k42q9J77k01L55J59j20L7j78j81R1Q9l57M39
7176G9j73J53k33jM6K65j46J4j42J21K60k79L29l66J95m28K91j03J86q6K0m52
7198d50M38K20j84k10rJ5M35k26j44J76o1J25l39Q6M14j29k81J15L4n3o9J45j79
7221a31K65l43K96O0l55o0M72k21K28l63K29l8O7k34M17j24j2o9r5j69q9L95j58
$$ y = [-1, -77, -46, -4, 33, -257, -65, 136, -18, 262, 45, -74, 115, -78, 25, -41, -1, -177, -1, -123, -158, -148, 264, 79, 120, -41, -238, -199, 120, 82, -38, -42, 356, -221, -52, 68, -122, 417, -240, -26, -49, 47, 3, 96, -96, 33, 80, 102, 305, 51, -114, 97, 2, -173, -22, -27, -176, -65, -76, 327, 122, 278, 135, 35, 360, 36, 24, -145, 37, -300, 62, -417, -7, -167, -110, -190, 138, -46, -190, -221, 13, -7, -91, -294, 59, -189, -357, 262, -310, 1, -25, 405, -16, -24, -338, -252, -139, 23, -112, 100, -142, -231, -54, -255, 100, 259, 139, 176, -2, -183, -92, -3, -360, 79, -94, 59, -174, -175, -129, 136, -10, 4, -138, -17, 243, -36, 293, -73, 122, -306, -15, -118, 68, -18, 2, -450, -12, 208, 24, -186, -195, -180, 255, 29, -115, 61, 0, 125, -214, -128, 286, 157, -124, -9, 25, -28, -97, 48, -131, 134, -209, 87, 147, -208, -268, 204, -17, 211, -152, 77, 39, 106, -128, 289, 165, 153, 84, -11, -180, -269, 126, -32]
7244c2J92J05MM6j63k19J07L5k94K79k8k7L0K69m13p1K59j2J03l66L04j59J71
7267A20j41J13q9O8k97L87J19m57K57nL3k91N9K33n4R5j88k86N79K4n5p1j65j1
7291b3K22j44M9l23L08k22M38j63k70M81m18L99k82k23J6Q1J58k9J34r5n2L6k95
7314b17j1K52j43K4K58J19j40j31k58M18l12N5J00Ql2K1Q6k90K27j00l32N80p2
7337A10p7P2k57K54J0j94j4Q7j89L17J39l98PK88O5l42K69j13O8k97L08j51r4
7360a32J77r1J78l5k14P6J63Ok3J46k83k35K60l12J15K73j37M0qJ50l31L76j08
7383E1p2J13J23l5j57M4j66L08k68J59j6k58P5pk8N9K65o4K08L8l53o0r0J62R6
7408A27J83k20o4l1j35J20l33K77J72J9l07J46R5M6p9K51k61q5L13m83K18j8L6
$$ y = [-32, 160, 265, 269, 315, 152, -67, 40, 75, -219, 60, 32, 5, 35, 304, -109, -180, 79, 67, 170, -196, 108, -51, 120, -21, 92, 3, 71, -226, 161, 280, -177, 80, 75, 108, -183, -124, 109, 55, 150, -38, -324, 255, 279, 224, 153, -12, -23, 199, 55, 104, -219, 89, -133, 305, 142, -128, 353, -65, 334, 52, -171, -155, -74, 84, 55, 189, 94, 42, 78, -217, -228, 24, -119, -95, 163, 282, 142, 11, -247, 171, -141, -86, 14, 22, -10, 11, 97, -193, 34, -66, -398, 182, 110, 33, 105, -152, 102, 112, -82, -96, -9, -198, 119, 258, -140, -133, 155, 220, -122, 147, 34, 102, -195, 113, -38, -132, 45, -46, 132, 97, -117, -41, 122, 128, 105, 251, -32, -267, -7, -319, -204, 69, -68, -28, -36, 114, -217, 159, 51, -21, 92, 215, 180, 23, 67, -99, 209, -59, 100, 84, -174, -99, -106, -134, -75, 190, 126, 334, 372, 19, -41, -131, 31, 127, 310, 90, 26, -5, -140, -20, -353, -76, 96, 115, -192, -46, 49, 95, 16, 267, 6, -79, 234, -249, -31, -49, -13]
7431a3K60n60L61k46P03m23L17k20j83k3O7j72K29J53k3L3j89k14k12K30K13J12
7453B00n08L53l22M36j06L4j45rK85J36j67l16K17k37L06J43l46J65L4k01J32
7474H4l7k49J85K00k43J63J55k71j4k06M09N9j51J98n11L37o2R4j49K7j11K3j40
7497b10J32M5j17K99l36L21j62J08J15k70P0m62N16k0j73J76n7L16l56j00K5J05
7519c5j16K86K35k17j52N5K87p3j91l8M6J6R4n26J56j22M62l43N2P7N4j20K7o
7543i2J13J42k11P2J70l39J16j14M78n41L6m2m0Q31p16n0K44p7L93k75o0O2L95
7566D95k07m28K45n8N8O5l59K46j14l8j21J90J32r4J30nl17K24M7j67N17q77M82
7589D6k17K11M6J9q0J10ll93M87k21l4j06j12J62K19k20K74j47J33k23J13k92
$$ y = [-13, 247, -313, 48, -198, 505, 82, 399, 179, -4, -27, 40, -132, 97, 250, 227, 260, 71, -143, -355, -125, 88, 200, -308, 45, -277, 159, 53, 87, -58, -67, 218, 354, 187, -129, 88, -149, 157, 300, -46, 119, 153, -48, 84, 47, -202, -17, 183, -60, 103, 258, -13, -27, -233, 176, 235, 84, 282, -229, 108, 46, 140, -9, 18, -93, -70, -210, -78, -33, -150, 149, -187, 134, -28, 80, 195, -75, -5, -467, 49, 29, -144, 32, -25, 291, -65, -165, -140, -35, -151, 135, 370, 153, 1, 56, 343, 270, 79, 41, 87, 103, 197, -329, -173, -295, 167, -176, -124, -47, 7, -113, -86, -92, 21, 163, -48, 24, 194, -145, -29, -143, 335, -206, -170, -212, -252, 579, -137, -187, 57, -20, 373, 98, 38, 100, 495, 288, -140, 105, 47, 105, 170, -189, 57, -57, -95, -216, -26, 106, 12, 142, 137, -180, 44, 91, -76, 441, -436, 46, -171, 40, 86, 105, 25, 135, 132, -261, 226, 5, -29, -135, -247, -85, 134, -86, 188, 41, 174, -49, 64, -228]
7611b28L61j3k03Q4J99o6k03j3J05j89M66j76Ml14P7K58j98J81pp0k4k72N00k42
7635A7r9J36j02J43K9j92n2R3P6k01L15P0q1j90L94k74m9j58L6J54l13M32j78
7658FJ90j3k18O1k30J19R1n0O8r5rj05n1m7J09J86k44P5J05N0j8P0k5l37L32l1
7684a1k20L11m6k71M62l12o6L38q5k56K97Q7n56M06l0k44K64J63k86m0o1M76l46
7707b6p7n1k1j10P4L0J53o1o5J22K32k72K44j22J01k70L1K50k44O7k96K8M18j18
7731A7p3M17l48Q8k42N51l86j03K3Q4j12%q4jL3K26l07r7L57J3m2M3l8j32J4J74
7757G5K49l17o3l26L47J17j65l62K85J14k25L57M6k78Rk27L30k9m41O19k15M25
7779C25k90j27K8j8J78j21j58q1L78j43j0l3L5J47k39P6k26L52J22l29K10l5l29
$$ y = [-228, 133, 120, -83, 1, 200, 134, -69, -82, 23, -166, 300, 124, 128, -186, -109, 149, -49, 132, 125, 55, 31, -241, 259, 17, -82, 54, -48, 95, 124, -68, -120, -27, 49, -152, 163, 233, 152, -38, 356, 82, 33, -125, -89, 65, -248, 184, 6, 196, 183, -35, 26, -204, -85, 6, -44, 24, -71, -80, -185, -236, -283, -174, 12, -232, -157, -52, -2, -20, 50, 25, -312, 20, -11, -231, 80, 34, -237, 225, -87, -153, 185, 100, -156, 141, 228, -328, 78, 48, -196, 68, 231, -55, -95, -156, 320, -26, -103, -154, -175, -285, -211, -181, -28, -89, -154, -32, 200, -72, 172, 50, 151, -119, -88, 162, -82, -15, -311, -283, 135, 17, -56, 361, 13, 101, -141, 410, 24, -79, -56, 28, -84, -84, -168, -169, -136, 90, -217, -314, 43, 56, 14, 57, 19, -113, -99, 75, 324, 7, -56, -382, -35, 82, -83, -445, -160, -46, -271, 86, 132, -146, -137, -364, -34, -63, -504, 115, -100, 325, 35, -92, -64, -82, 96, -25, -183, -264, 114, -29, -39, -72, -37, 110, -129, -53, -279, 73, 195, -134, 76, 41, -288]
7802b88L60m0j54J46K93j8j52j3j37K34j63k96N65l32k01L81n03J68L81o28N81
7823A84pk17J23J57m11R9K28r5Pm7j75O6P9r7L51k06R1r4O4j5j32p9J78N7O2l56
7849a85m0N60k26j8K0k54k55L32q2l4L69n38J19N56l99J41j35k29M58M0j81J26
7871A45j72J60o0p4L5O0J32q0n5l69K42k85M39m30M21l2k76K2L35j32k46J89q2
7894a13J86j67K06R5k94K54l0l41K98p1L86r14O21l79J37M24k91K5K89k83m8J06
7916I6qj72L1J45j8j6Pn37O03j80K98n95M73l8J12l20l4L19j83m7K60l09L96k6
7940B57l73J60J6M37m62J83j49L7r3l9j55M07r5k17J97o8Oj23n9K30k08K6p3K69
7964A11O2j91k49K09j89L48m15K98M7l20L55O3J73n44K79Q1J52j57K3m69O25k59
$$ y = [-288, 72, 32, -122, 24, 317, 299, 147, 134, -3, 231, 68, -228, 337, 5, -196, 185, -318, -150, 231, -397, 184, 177, -40, 83, 240, -171, -72, 156, 61, 68, 21, -154, -88, -9, -106, 245, 39, 130, 36, 100, 85, -47, -126, 52, 109, 171, -185, -225, 335, 109, 91, 111, -143, -398, -66, -148, -182, 187, -351, -232, 324, -75, 66, -69, -298, 160, 200, 19, 145, -27, 133, 73, -1, 34, 94, 226, 146, 91, -278, -36, -321, 118, -312, 109, 77, -199, -177, 158, 26, -220, -31, -113, 73, -94, 112, 207, -87, 167, 137, -204, 94, 23, 409, -505, 116, -263, -126, 298, 7, 32, 321, 38, -10, 96, 88, -84, -53, 92, 74, 58, 65, -472, 131, -49, 249, -346, 127, 89, 201, -119, -153, 166, -17, -64, 196, -113, 283, 257, -116, 44, 60, 497, 35, 218, 69, 106, 13, -26, -181, 226, 131, -86, 111, 43, 49, -74, -133, 97, -111, -85, -158, 111, 173, -18, -267, -58, -247, 101, -314, -16, 31, -289, 66, 129, 302, -242, 37, 118, 270, 113, 136, -333, 292, 33]
7986C3R7L71l54m56N68l83J04l37M30k28J08r1K19Q9r6kJ07l0l61K68L6k84j44
8009c36M37k86J80o8r6K29j48n4L8J51m70M01K67K6K09l91j61J15n1j10q6O3N9
8032h2K32m2K33n80K78k45L43Q1j93pj15K97l78M73j64q6k1j45L8K05k49L49p4
8055A48l83L79k81L4m7J62R4K72m71P6L17k72p6L24j94N4j69J5R2k1n0pk80J98
8079h6K54j97J22k37J05R2k12K08q6J28m76L52M2J1j3q9l19M48J05m19L45k79
8101b01O03o31K03J63n1P7j32J14j51N1pR0q8m2K53k53J05l45K89j32j2j32R3
8124a36Q7Q0m9j67J81K54k78k49J84N04m01k31J77J38J03l20P6l2M2K0K1j50j33
8147b79L38m3k02K29M8j17k85L56q3k0j6K48l56K91k78P1J79p3Q2j26k33L37J24
$$ y = [33, 130, 501, 147, -309, 259, -124, -20, -357, 73, -155, -47, -138, 81, 170, 74, 72, 179, 149, -212, 56, 92, -192, -336, 101, -185, -5, -73, -169, 60, -88, -142, -104, 47, -423, -22, 245, 271, 480, 89, -72, 43, -8, -118, -204, -141, -82, 150, 108, 341, -239, 39, -206, 137, 218, 25, 18, -97, 200, -178, 295, 131, 45, 24, -121, -83, 122, -127, 222, 148, -235, 144, -137, -103, -150, 12, 106, 378, -93, -17, 300, 28, -48, 276, 82, 136, -33, -18, 74, 53, 3, -4, -284, -86, 168, -29, 93, -144, -39, 53, -159, 49, -37, 91, -385, -33, 9, 20, 7, -82, -401, 47, 152, -267, 78, -201, 402, -229, -26, 137, 86, 163, 31, 145, -6, 45, 38, 128, 40, -2, 251, -2, 103, -242, 47, -85, -97, -229, -136, -49, 31, -18, -185, -4, 250, -28, -277, -93, 411, 10, -221, -44, 94, 197, -123, -47, -79, -37, -17, 4, -146, -279, 59, 16, -186, 43, 91, -26, -311, 45, -38, -58, -74, 174, -182, 109, -169, -98, 81, 8, 90, -36, -269, 68, 192]
8170A92n9qk26K40m28K99j82j95K85q9J29P9J68k12K16q2k14P1j92J94J30
$$ y = [192, 133, 125, -101, 139, -289, 10, -172, -367, -82, -171, -42, 37, 205, -7, 209, 127, -87, -16, -208, -14, 116]
8191A16
$$ Imaginary data points
##PAGE= N=2
##DATA TABLE= (X++(I..I)), XYDATA
0@%%%%KkQj6J6k4L2m0M8n6P2q8J04j23J47j76K08k40K78l21L68m23M84n51O24
29C31p04P94q94J002j121J255j399J555j728J918k129K360k610K888l201L547
45A864l932M365m856N423o077O843p759Q875j0269J2071j4504J7984k3424L3198
59A9802n6222K05544K05013k74883o4161q08l0929j07156l0598j2315l230P14
71a49229R4400J15189O3156j9673m0310m1614L4511Q3751r716j47518r3862J2425
83i8490P954l0214J6764M7571J1108M027J01911J43319K6338r6767q7959m9770
95d208m7196k7153o166m4532m5895N0013J13061P4390L7712K3368k2111n5427
107D5856o717M6728j2423j11248q8424N957K7022J3495L9519L6701j2925P870
$$ y = [0, 0, 0, 0, 0, 2, 0, 8, -8, 8, -16, 16, -24, 24, -32, 40, -48, 56, -67, 80, -96, 112, -128, 150, -171, 197, -226, 258, -293, 331, -373, 421, -473, 529, -592, 663, -736, 819, -909, 1009, -1120, 1240, -1370, 1518, -1683, 1864, -2068, 2297, -2559, 2864, -3213, 3630, -4129, 4746, -5523, 6548, -7956, 10028, -13396, 19802, -36420, 169124, 374137, 99254, 35093, 34285, 3356, -103800, -134398, -146713, -149943, -149229, -54829, 60360, 123516, 103843, 63533, 21919, 56430, 140181, 130465, -17053, -110915, -98490, -90536, -120750, -103986, -56415, -45307, -41280, 60631, 203950, 230288, 133521, 45562, -4208, -51404, -78557, -84723, -129255, -175150, -125137, -12076, 62314, 100026, 123394, 101283, 45856, 39139, 85867, 73444, -37804, -126228, -120271, -93249, -79754, -40235, -3534, -16459, -8589]
119h589Q7709P9654j0260n6308n8003o3822m5535N227J5508m0144m7762M2345
131i9980R8368O0323L2544K8101k2661n7565p014L0449k8250q6561n6506l071
143a11823J5131L4768N7262K8240j8859P896O6736M3776k4196m1235m2352o1207
155d5863l5819K3644K0343l3706k8684L9631O7059M4925L5609J8229l1801m9707
167B3860j195K0514l1763o7207l5477m608O466M1731O3528J9104k1785J0206N0324
180G3698K2534k2721l0627m2742n8153k3718L2272K1303k5962j4463L6327M5427
192A3175L2568L6704J2518m2449m5317M203J2886l0502m5045k0247p671M733M5675
205b8769N7393Q363k1104J1897L4921O973j7470k0988m1239n2829q634L3706J4751
$$ y = [-8589, 79120, 158774, 148514, 92206, 34203, -29619, -75154, -69927, -54419, -94563, -142325, -99980, -1612, 58711, 91255, 119356, 96695, 39130, 32116, 62565, 34315, -52246, -108752, -111823, -96692, -61924, -4662, 23578, 4719, 12615, 79351, 123127, 98931, 57696, 15344, -45863, -81682, -58038, -37695, -71401, -100085, -60454, 6605, 51530, 87139, 105368, 73567, 23860, 22665, 43179, 11416, -55791, -91268, -95876, -89410, -47679, 15849, 34953, 13168, 23374, 73698, 96232, 73511, 42884, 142, -58011, -81729, -49457, -28154, -54116, -68579, -32252, 13175, 45743, 82447, 94965, 52516, 7199, 11402, 24288, -6214, -51259, -71506, -79177, -74444, -28769, 28624, 36987, 15883, 27780, 62701, 69674, 52204, 31216, -10023, -62852, -71486, -37780, -23029]
218b3029j8512j590K9483K8877K8295L4086R61m5369l6944O281O152k5384k8292
231d4985j2329j0428P578M9205M8204J25j8665R996K0715M80j0287j6456m2411
244a9258m5815J196L4474J2071j1958M456K0850J7593K7611L2198p920m7290k9227
257a1019O429J265j7899j4047j0343j2809J1836N0302L8700o345j5856O967Q598
270C5779l479k487j3679m3111l6709J0339L1476R214l371O650J0920J0777K6963
283C9282K7096j5090m3746k2676M197j406r538l707j0507j4218J6848M7344K8949
296D2828p675j2182j54j003k006K444j3046m0852k8261J4452K8165J0009K778
309d503P015J025O588K7595K1433j9129l9586j9035K88p55L96K062j2065j3674
$$ y = [-23029, -41541, -43131, -13648, 15229, 43524, 77610, 78571, 33202, -3742, 2539, 8691, -16693, -44985, -57314, -67742, -60164, -10959, 37245, 37370, 18705, 28701, 49416, 49896, 39609, 23153, -19258, -65073, -63877, -29403, -17332, -29290, -24834, -3984, 13609, 41220, 73418, 65498, 18208, -11019, -4590, -3325, -21224, -35271, -45614, -58423, -46587, 3715, 42415, 36070, 20214, 27181, 35779, 32300, 29813, 16134, -26977, -63686, -53347, -21871, -12657, -16028, -9378, 1542, 12319, 39282, 66378, 51288, 7542, -15134, -10937, -12343, -21881, -25588, -36095, -50313, -33465, 13879, 42828, 35153, 22971, 22817, 21814, 19808, 22252, 9206, -31646, -59907, -45455, -17290, -7281, -4503, 2512, 3537, 10125, 37720, 59153, 40024, 438, -18597, -18309, -19064, -18668, -16606, -28671, -42345]
323d2345J9105M3130K1961p655j0397o427q315Q07Q030j4263l7325j9341J4677
336c8358K3630J3036Q783L771o457L945K5751J5566k0075l2894j6516m096k65
349b4179R033N942j2841j1276J9374L5422J6656m298r677j2178j2090K849R614
362A2351j2689l1443j3422J2928J9378J5271J3217M71j1761K852K2528J0237j8477
375B1441k6687j5500p568K487J4821P562j2402r131J7857K7794J3001j119q624
388B3932j7947j3971N718R897j1452k3846r375J0172J5641J7779J5129l134j4459
401D084J942J7735N877j5069j9340j5818r683M840J7986P890j0527o199J4835
414a447K0111J0272J503r168j9962j3422O106Q985r154j6668n624O202J2888J8939
$$ y = [-42345, -23240, 19890, 41851, 34196, 23799, 17372, 9057, 9864, 17894, 3631, -33694, -53035, -38358, -14728, -1692, 7091, 10862, 4405, 8350, 34101, 49667, 29592, -3302, -19818, -23914, -24179, -15146, -9204, -22045, -33321, -13947, 21475, 38131, 33833, 24156, 11978, -112, 2737, 12351, -338, -31781, -45203, -32275, -12897, 2374, 15591, 16062, 4301, 7153, 29681, 39918, 21441, -5246, -20746, -28314, -25827, -11006, -3444, -15846, -24977, -7120, 20674, 33675, 32556, 23932, 5985, -7986, -2268, 7629, -3823, -27669, -37044, -26872, -11231, 6548, 21677, 18543, 4084, 6026, 23761, 29638, 14569, -4771, -20589, -30272, -25432, -7446, 444, -10083, -16282, -1447, 18664, 28936, 30439, 21271, 1309, -12113, -6007, 2978, -6176, -22844, -28468, -22266, -9378, 9561]
428I561J4576n347j3983M38J2453L277j1591j4354j4866j0355P306J8565P235
441B915q580l213J1094J3512R144K815r968k0738j2008O484P807o585j1055l590
455b1966L547J1513J9232J2558p307j2826k27Q097M90p142j0836j4520r234R174
469a9447J8099N676n588k129P168R092P867L815j0593j9879r705O330N635l550
483g209n921k746J411J0296J8210J0183p927j1768j270M182Q1m143q484j3861
497a8966p042J0303J6366N236l825j263L749N849P843K925j1443j8156p200N560
511a0064M959r55k887k923J70J0644J6792O945q514j0346k058Q95N70j304p657
526e733j2700m496J0421J4928M587k147j629J107L528P445K208j1545j5478n865
$$ y = [9561, 24137, 18790, 4807, 5245, 17698, 20975, 9384, -4970, -19836, -30191, -22885, -4320, 2915, -5665, -8878, 2216, 15728, 24872, 27687, 17719, -3019, -15027, -8543, -736, -7321, -18376, -21966, -18419, -6906, 12326, 24884, 17577, 4751, 4524, 12621, 13111, 5969, -4867, -19387, -28621, -19447, -1348, 4328, -1260, -3389, 3779, 12871, 20738, 24553, 13960, -5919, -15624, -9294, -3659, -7209, -13130, -15876, -14465, -4169, 14041, 24224, 16297, 4529, 3259, 7441, 7522, 3379, -5105, -18966, -26008, -15705, 661, 5897, 2072, 809, 4558, 10407, 18250, 21175, 9732, -8424, -15624, -10064, -5105, -6060, -8947, -11870, -11700, -1056, 15736, 22681, 14167, 3821, 1763, 2658, 3228, 1924, -5733, -18433, -22929, -12508, 2420, 7007, 4860, 3231, 4338, 7866, 15311, 17519, 5974, -9504, -15369]
540a5369M480M694K119j125l004n05J0033J3847M928p620r296l855n60J738k2
555D83o307j0878k591J0528J2301M718p53k547j813L483O471K48j0520j3617m055
570a4849L694N676L614l22l582j022R500J2568K955p659r096m974q82L305J618
585E44o561r437m74R634J0847N335P8m369l975K438O760j59j0324j0988m268L380
601a1539O543N630l4m096p42Q152J0057J896o410r085n838j188L978K556m813
616d933p582j09Q345R626N840p00n219m551J468N526k94q425r626l590K945P019
632d260O868J94m283r86O497Q266J689n722q624p015j101M877L704m173o173j46
648a0388P029R198N920k73o827n911J536M952o0o829p928m059K735P728P097P91
$$ y = [-15369, -10889, -6195, -4076, -5201, -8205, -8710, 1323, 15170, 20098, 12478, 3182, -673, -1233, 505, 483, -5824, -16702, -19293, -8765, 3536, 8254, 7501, 4954, 3141, 6624, 13095, 13343, 2823, -10794, -14849, -11155, -5479, -1865, -2187, -5769, -6791, 2709, 15277, 18232, 10573, 1477, -3497, -4379, -1074, 544, -6017, -15454, -15928, -6294, 4553, 9888, 9966, 5597, 1622, 4060, 10820, 10661, 337, -10651, -14919, -11539, -4996, 634, 600, -3496, -4238, 3914, 13971, 15867, 9457, 372, -5466, -6654, -2676, -120, -4933, -12515, -12624, -4279, 5347, 11187, 10487, 5268, 717, 2185, 7711, 7417, -1008, -10634, -14224, -11279, -4260, 2608, 2802, -1481, -2467, 4030, 12296, 13985, 8263, -361, -7376, -8477, -3600, 104, -4069, -10242, -10388, -3359, 5839, 11759, 11486, 4659, -1252, 284, 5236, 5176, -1653, -9581, -13640, -10905, -3177, 3920, 4711]
664D711m308j437M589O572J442m542q146p355j106N748L524k512m428m86N457
679b277Q105N679M8o909o222L16L593M97m523o615m262K556P983P207Q46m159
695A863j411K393N291J570l441q320p237n35N175M742j431l504p53L733P380N970
711A1485o51o875o157m95K839J399k846n668m053K066P681P433J048l875k287
726A044J118L355K445k953p417o817l32N265L811L78k259j610L094O252M877n89
742I662o068n905j156K321J293j985m074l010J348P185O120J415l246k643K09
757A466K702J916k441o471n794l74M512M315J221j814j743K236N201M385j039
772H278n458n316j727J893J654n76l739k715J656O038N952J152k552l206p79K414
$$ y = [4711, 403, -1034, 3555, 10127, 11569, 7027, -1119, -8474, -9580, -3832, -308, -2820, -7248, -7734, -2277, 5828, 11507, 11555, 4646, -1576, -1260, 2333, 2830, -1693, -8308, -12570, -10014, -2031, 5176, 6022, 1863, 452, 2845, 8136, 9706, 6265, -2055, -9292, -9827, -4652, 90, -1341, -4845, -5598, -1865, 5515, 11485, 10834, 3959, -2198, -2693, 146, 1545, -1301, -6969, -11022, -8956, -1275, 6158, 7206, 3331, 1044, 2162, 5517, 7962, 5009, -2408, -9225, -9557, -4292, -481, -103, -2362, -3972, -878, 5374, 10251, 9662, 3594, -2311, -3467, -1146, 147, -1838, -5912, -8922, -7574, -389, 5731, 7146, 3900, 1257, 1466, 4168, 6084, 3643, -2828, -8622, -8996, -4484, -169, 1052, -762, -2505, -269, 4932, 9317, 8278, 2820, -2496, -4223, -2330, -676, -1252, -4991, -7706, -6050, -12, 5940, 7092, 4540, 1334, 555, 2969]
788B969J567k080n423n101k66L937M228J313o33j725J452M676L430r17n398m675
804b646k011J403K292k56k857k195J611M923N398J271k222l677j017K054J158
819C229j306m981m569K14L301M358K122j401j430R46L586L225r49m349n246j716
835d966J345K361L32k207k301J416N340L941J588k407l585j466J222K264j658
850A219m046m095J41L423M200J820j036j572M25L031K690m99m463m897j689J483
866c865K470N85j371k006J569L735M169J144k139l702j666J243J265q82l781k917
882f149j42L322M200K206r66j515J5K406J897q99l810m470j652J648K909P48j377
899a629j535J535K976M080R25k496l581k048R82J556m55l004l121J04L315M285
$$ y = [2969, 4536, 2456, -2967, -8068, -8334, -4397, -169, 1144, 511, -1214, 238, 4914, 8344, 7427, 2029, -2646, -4657, -3254, -962, -1218, -4075, -6270, -4659, 264, 5662, 6933, 4711, 1034, 17, 2071, 3229, 1923, -3058, -7627, -7413, -4112, 246, 2368, 967, -463, 483, 4069, 7294, 6345, 1996, -3250, -4966, -3621, -1260, -928, -3135, -5436, -4020, 1320, 5261, 6849, 4442, 857, -609, 613, 2877, 1219, -2827, -6922, -6781, -3358, 842, 2662, 1626, 54, 479, 3510, 6200, 5701, 1238, -3659, -5348, -3865, -1395, -810, -2181, -4187, -2618, 1117, 5286, 6430, 4291, 589, -1077, 166, 1431, 549, -3232, -6149, -6291, -2969, 1231, 3437, 2471, 956, 971, 3377, 5274, 4375, 565, -3905, -5557, -3909, -1000, -252, -1629, -3164, -1629, 1347, 5427, 6352, 3856, 275, -1773, -791, 765, 310, -2694, -5815, -5711, -2396, 1889]
915A889J905q04j910o34K270J826j000l378m062j722J384K996J454p22j625O05
931a528L353L132J268k503l824j731K12J452n8k120k392j06K456M519J935m42
947C623j993j304J385J446j08l432l218j769J289K979J385k83j105L30K239L339
963D803O24k217l579k529N49J193J147j550k485j49K280M458J869n56k458j410
979a0M89J809k83k278l689j305J290K897K640q82j138J64J908K334P04k033l378
996g61k200k58J892O35o14j742l00K170L211K554q22j984j790j16J333K07k089
1013f74k446j966J385K624K528K22j167n05J240J932R11j751l236k168l2J306
1029a797J081J30j350n47J781K855K267m94k206k075l24J286M38j460k962j199
$$ y = [1889, 3794, 2990, 1080, 446, 2716, 4542, 3542, 164, -3898, -5620, -4236, -1240, 214, -508, -2133, -1528, 1825, 4957, 6225, 3722, -102, -1833, -1621, -169, -227, -2347, -4739, -4845, -2389, 2130, 4065, 3623, 1630, 326, 1711, 3157, 3049, -383, -3601, -5370, -4081, -1102, 283, 0, -1105, -775, 1464, 4803, 5427, 3210, -369, -2898, -2349, -1156, -9, -1559, -4044, -4193, -1913, 2545, 4414, 3858, 1400, -10, 479, 2288, 2005, -273, -3962, -5267, -3977, -1080, 1560, 678, -460, -296, 1612, 3946, 4650, 2617, -761, -2961, -3219, -1327, -692, -1306, -3048, -3348, -1178, 2033, 4587, 3765, 1781, -9, -125, 1208, 1415, -674, -3120, -5086, -3701, -1077, 1451, 1673, 506, 1, 1241, 3173, 4084, 2333, -903, -3071, -3103, -1797, -716, -586, -1936, -2483, -702, 2153, 4420, 3926, 1720, -355, -679, 607, 1045, -415, -3377, -4576]
1045d576J328K629K245L50p75p00N16J540R18j713k854k120m91J903J209M02j245
1062a434m98J909K372J854p50k211j748l56J45J040j413j125j406R26K379K431
1078B115L20j146q67L23J334N53j576k493j614k34J544J425K12m56k92Q33K239
1095B220J370l60k154j615n30L02Q33q32j498q62J206J903J680Q84p22r71l66
1112D88J018K52p75k129k052O3J397J641O47n39r69J450J496J142Q7k121j739
1129f43r29O39P61l92j159j093P54K161J866O36j240p30n03Q97K25m56k012j689
1147b907K34R99J563O27l25m83O49J238Q94K9j516k172o12O16O11m5o46q20P38
1166a328J594J807K14o30q80n15K63L23l56j938j193k71J928J112Q09n08l17o0
$$ y = [-4576, -3248, -619, 1626, 1976, 1201, 501, 1017, 2557, 3475, 1762, -1092, -3212, -3703, -1800, -591, -189, -1434, -1932, -23, 2349, 4203, 3453, 1242, -506, -862, -717, 323, -1090, -2215, -3621, -2695, -316, 2115, 2435, 1289, 422, 745, 2079, 2632, 1056, -1437, -3051, -3285, -1741, -316, -104, -560, -852, -19, 2220, 3590, 3230, 1076, -539, -1069, -767, 66, -766, -2264, -3126, -1920, -17, 1663, 2547, 1825, 854, 488, 1506, 1758, 983, -1146, -3198, -3135, -1738, -97, 550, 11, -958, 492, 1988, 3130, 3217, 1096, -643, -1572, -933, -172, -564, -1723, -2816, -2062, 99, 1965, 2601, 1361, 631, 128, 1025, 1250, 794, -1218, -2907, -2673, -1674, -111, 516, 191, -292, 357, 1595, 2489, 2518, 1002, -1170, -1782, -1166, -555, -600, -1246, -2066, -1328, 266, 2073, 2287, 1657, 777, 262, 525, 848, 492, -1446, -2639, -2910, -982, 130, 939, 431, 114, 54]
1184E4J513O89Q8j705j768r45P37J015n6p15l67L95J512J684K45m46j505l66L10
1203C69k8J00j669j225o2R87K074O95n79n78JJ298R31j51j683j727o58J93J060
1222f52N70n75n65N39J418J249L35q79j281n18M36M30k91j211q08n07J263J495
1240D48R36j06r72Q9O08P01q7j462j433o73K56R87Q32n28l37L17R23J400O94j077
1260A516j586l57p6M19j26o47q23m05J181J504P82q4n91o43P25M03K17j195j318
1279a104j302P00R87O59r0n41L30R55J295N62q42j440p35k8L04J45o87o62m76
1298a970Q81J886O35j52m76n20K14N30k34j026r34r19K56J196N37J58k20K89K90
1317D21J081M83p01j160r62m54R71n0k37o01l37P24J593P99o1o16l22l61O31k21
$$ y = [54, 1567, 2256, 2344, 639, -1129, -2074, -1337, -322, -378, -1093, -1460, -1065, 447, 2131, 2376, 1930, 425, 59, 369, 341, 441, -1228, -2453, -2515, -1528, 546, 1241, 662, 84, 85, 1383, 2314, 2163, 480, -1247, -1905, -1712, -652, -82, -657, -1222, -683, 735, 1984, 2319, 1440, 159, -359, 77, 507, 216, -995, -1803, -2310, -1047, 448, 1384, 1278, 306, 395, 1003, 1704, 1617, 155, -1278, -1951, -1695, -708, 124, -404, -741, -424, 499, 1899, 2593, 1516, -70, -427, -503, -84, -210, -857, -1680, -2085, -904, 600, 1382, 1298, 707, 64, 789, 1192, 1409, 214, -1104, -2406, -1706, -719, -60, -150, -691, -361, 594, 1889, 2451, 1609, 169, -566, -594, -290, -145, -832, -1494, -1970, -1089, 797, 1432, 1280, 804, 284, 498, 1028, 794, -232, -1166, -2085, -1829, -633, -96, 62, -158, 131, 421, 1502, 1985, 1284, 124, -838, -1292, -321, -371, -608, -1209, -1546, -822, 771, 1570, 1509, 893, 571, 210, 841, 620]
1337F20q31q10q61K90R61P55J60o4l11L09R22N44n07j278p33l27M38L84l21m37
1357a097k90O83J411P95R6q02l25n44L94l58j59r92m83J67J091N46N99m34q1M67
1377F84N88L81l91j015j474M5L37K52M7j89l82J014N71Q18R6m77r29PL10m66j53
1398c26o21p32O13M18J159K91k63m27R2Q08K07K1j624q08J35L28L11M2j48K43
1418b81J69J234K38j76m18j062J75K09l03n20l46l86L18J010R19K76j33m84K26
1437F65K74K48p20j032o42l67P78K44O44l28J06M84N50O45l44m85j130j19k5N33
1457b1o15j59l85M18P68Q59Q9n8p47J75L41k16m22n83o25j7M62L98L22J79n1K14
1479C26L80O53l93n98q00m23M92J65j08j49o27K52N81R98L50m08l24k5k6N1l0
$$ y = [620, -211, -1021, -1882, -1592, -631, 124, 284, 220, -91, 218, 1140, 1684, 1177, -101, -834, -1161, -723, -339, -660, -1097, -1387, -704, 707, 1502, 1598, 796, 471, -73, 321, -37, -196, -1188, -1671, -1504, -413, 133, 732, 298, 217, 684, 1272, 1653, 1262, 247, -1227, -1182, -845, -593, -546, -735, -1117, -103, 468, 1286, 1382, 905, -24, -17, 293, -173, -326, -947, -1679, -1066, -648, 511, 802, 539, 112, 204, 1012, 1219, 1240, -384, -1192, -1057, -729, -418, -376, -524, -281, -112, 1122, 1360, 1184, 766, -296, -121, 88, -215, -735, -1081, -1467, -1149, -139, 780, 1056, 923, 439, 665, 939, 1187, 467, -565, -1207, -1574, -796, -552, 92, -236, -130, 354, 904, 1549, 1205, 720, -410, -529, -554, -21, -636, -795, -1180, -762, 6, 865, 954, 896, 149, 324, 665, 449, 27, -556, -1181, -1198, -736, -338, -16, 163, 112, 326, 706, 1359, 966, 368, -432, -855, -363, -198, -306, -455, -1082, -830, -249, 749, 1099, 691, 367, 342, 316, 367, 337]
1500C37j102n12J99L97R92j60j03q1K53N72N02J1p71q95o48J19O93J21o54j10
1520h40L98N31O53K70K25j131k98R2L53k22n27m55o22J107M56L87K03k10m06N80
1540E44J98L95j002m50o06jM41K42j08j19J79N44M53L78o25k56k02k37L02j89
1560a19m74k7k4K35O21L47J08n26j00M45L54k75n18q16j55l9N98M33o7m75K72
1581b02Q08K21L96n42p35j24N7O4j6j93l81k01Q55n7P60K91p69p9K09L84m97j27
1603A22p73k58P3O97k58M41j37K10K20L84K52j56p07m93k8J99N1m54j74J83O4
1624e42Q92L02K89o61k62J09L96k85j28n97n03K25L19O18j66P1p1J49M55L93n27
1645D76m23o43q3K86Q4k59L5j98L42P36O4K02l09k14j5J84Q0N5p45n57K78M74
$$ y = [337, -765, -1277, -1078, -681, 311, 151, 48, -33, 220, 792, 1294, 1305, 534, -361, -1009, -890, -197, -76, -730, -840, -442, 89, 742, 1012, 1237, 106, -192, -100, 253, 31, -496, -951, -1573, -466, -10, 377, 580, 370, -36, 544, 742, 1137, 135, -315, -921, -922, -481, -239, -347, -466, -287, 257, 710, 1088, 463, 207, 5, -232, 70, -119, -593, -620, -644, -409, 212, 559, 667, 141, 41, 486, 840, 565, 47, -769, -924, -963, -365, 68, 1, -474, -202, 606, 827, 1223, 681, -54, -178, -121, -57, -73, -266, -647, -848, 7, -50, 710, 1001, 232, 153, 362, 746, 249, 122, -651, -909, -836, -139, -397, 44, -93, 117, 337, 721, 973, 817, 110, -383, -411, -212, -161, -615, -789, -606, -542, 350, 652, 941, 280, 18, 127, 523, 238, 110, -487, -990, -765, -446, 172, 6, 77, 6, 155, 610, 1003, 476, 53, -590, -673, -387, -303, -562, -527, -725, -383, 353, 417, 619, 310, 96, 81, 265, 345, 400, -345, -902, -624, -150]
1667a50L14N66n54l35Q59j67J18m39l25m22k3L76L1J70l71p1M97L84N7k55P0k84
1689D6j73K37q8k23P7o92J75Q19l9K37k67J01M8J82L39k80m20m86p0N6K59J60
1711bl90J06J23K94M52J95o91j30nm8j6J17m92J19K58j16N05K26k27kk62K06M96
1734G16n95n22J81o89M32L13K25k08k32N13J1N10m7K0m12k45K35r5l92N3m06K77
1756c57J31K52N92j41n15M0L84J86n31l40j60l2K44M11R4j44k24j58L97L91j26
1777C94J20p09J08l97K47J54j63k86L51K06M52J1l85K63k31l7M0k8j81j6l05R2
1799c00Q8N15q1n86J83L04K38J71j57m11k25l4L21Q8k33J11p7J71j48N34n8k87
1821A27j53k7K72P6n35j45K8P7M70n0o2K10k79L4M14p3L2m29l26L00rj68k5k9
$$ y = [-150, 164, 730, 176, -159, 700, 533, 651, 212, -113, -535, -558, -182, -151, 19, -352, -423, 74, 458, 515, 260, 330, 46, -127, 110, 22, -201, -124, -816, -641, 178, 139, 376, 109, 210, 258, 440, 779, 499, 79, -407, -477, -421, -162, -2, -392, -286, -163, 131, 583, 778, 87, -43, -48, -96, -112, 5, -487, -368, -110, -226, 279, 505, 278, 276, 14, 220, 716, 121, -401, -220, -909, -477, -164, 61, -147, -379, 134, 145, 655, 608, 628, 216, -29, 206, 111, -281, -228, -634, -357, -226, 26, 618, 477, -38, 2, 386, 572, 41, -299, -459, -491, -247, 164, 258, 114, -110, -268, 129, 520, 394, 514, -195, -87, -484, -237, -83, -246, -532, -181, 25, 477, 488, 103, 366, 135, 98, 138, 110, -71, -87, -392, -300, -212, 303, 222, -364, -181, 123, 361, 532, 375, -36, -261, -295, 26, 114, -119, -8, -85, 86, -62, 472, 414, 127, -26, -53, 219, 295, -240, -385, -357, -280, 190, 140, 78, 288, 9, 43, 457, 384, 416, -13, -339, -39, -48, -216, -241, -270]
1845b70k08M64N57q0J10o16M61m45K8K15kn13m01J30M75N94m42k31J13L03J48
1866C90L4n25P7m04J72J54K34l40j71j42K18Q42k46R0k46j45J89k13J8k17n0k88
1888e69N02M09M7k23R3k5j7j88K75k86J36n40o5K17J4K52k73K79Qr5O90o1n96
1911a6p0j05K2L33j09m36k49M21L22K63j34l26K94k15rL85n00P0n70K70M67j48
1933d0L88l73j81J65M72J4R1n32k40J12j97L31j37m56jJ78J02N85m9N4j51k09
1955g4R2J91Lm09Lr5J16L12l14J90kj96L42M06k47j71m75J99k92L10K77p54J58
1978d30J56L33O43J04k84k74m80M21l02M9l1k50J36m6M26J9l74J78K57k94L12
1999B69P8m13k91J97R3j79P9K57k95n1L13L07j35J39k36j23j53K90K12m97N1k41
$$ y = [-270, -478, -14, 543, 463, 573, -43, 418, -27, 1, 216, 214, -299, -700, -570, -95, 499, 57, -174, -61, 242, 390, 424, -101, -24, -428, -256, -102, 132, -208, -379, -521, -303, 539, 293, 383, 137, -8, 181, -32, -14, -231, -281, -569, -67, 342, 389, 166, 259, 234, 217, 29, 304, 18, 154, -386, -451, -234, -220, 32, -241, 38, 46, -49, 641, 580, -16, -86, -191, -169, 164, 55, -381, -630, -209, 113, 376, 242, -84, 210, -5, -14, 371, -129, -59, -629, -359, 108, -40, 348, -25, -206, -41, 431, 445, 536, 4, -236, -124, -321, 10, -127, -583, -584, -406, -304, 281, 232, 286, 135, -74, 18, 209, 212, -197, -194, -289, -173, 139, -175, 15, 13, -183, 159, 565, 318, 147, -328, -129, -421, -111, 166, -588, -430, -274, 59, 702, 806, 522, 248, -232, 189, -113, -64, -95, -345, -209, -255, 171, 190, -184, -6, 251, -43, 269, 347, -66, -357, -160, -67, -246, -167, 90, -205, -256, 57, 364, 229, 368, 132, 9, -144, 146, 358, -139, -88, -329]
2021c29L22R1L03o6m48K41J50J27l4k22j69k85J90N7J88m27J28M8K47J83m3l5
2043B17k04m13L44n9K54j95j83M44l80L85J83l32j20J65j35K16k65M04l97R8l14
2064b87K42K2J14m24J88J99L55j07j2n44J65K43l68L44l67l4L17n77M67L88j07
2085B17N0k75j48j82P43k62r7m08K05k12O03m47J89j58L12Q7K61n67J5L2On2j09
2108a97J79j70j50j38M14N05l51m11K17K02K38j85o4j18k65P9L06j10M53o87K22
2129c1L8l9M41R7n57L4j43O0j18k06J51J39J08j79N23k04K04k55J63K80m21r1
2151fj2j61O2K24j2P3j60J08q4l1K85k99p9k60M96k99J00J04p5j31J40jL45L1
2175C58l14r7k38N44k50M71p40KQ7p9L79J98k04m0k20nO10m53k12P9L13m94J75
$$ y = [-329, -7, 84, 387, 321, -127, 114, 264, 391, 357, 135, -34, -319, -129, -72, 116, -311, -183, -135, 112, 295, 252, 217, 13, -400, -56, -115, 139, -56, -239, 205, -175, 210, 393, 61, -59, 106, -29, 187, -78, 326, -71, 27, -287, -45, -23, 91, -333, -145, 54, 409, 302, 290, -254, -89, 154, -214, 130, -237, -271, 46, -531, -64, 324, 217, 267, -8, -156, -338, 405, 143, 46, -362, -157, -369, 234, -213, -24, -182, 130, 217, 478, -89, -74, -42, -36, -88, -197, -18, -188, -338, -476, -62, 443, 92, -319, -102, 100, 338, 153, 89, -29, -294, -215, 91, -19, 434, -253, -31, 7, -32, 409, 506, -51, -17, -160, -100, -218, -424, -273, -134, -26, -205, 318, 114, 318, 63, 226, 506, 85, -6, -18, -179, -117, 107, 95, 168, 8, 116, 32, 1, 286, -13, -92, -352, 144, -155, -55, 49, -26, -157, -17, -18, 327, 358, 44, -53, -291, 253, 3, 474, -266, -264, -177, -256, 123, 321, 117, 77, -143, -148, 462, 9, -203, -124, 189, -305, -130]
2198a30k58j93L91k00N62j66L10l40k77P8M84j31k7j30j87k83N61j12J5K88j76
2219G9k48K81K29l67O8l99M86j82OJ92m88K52k31L70ROK38p6m03N01m60J62k10
2242a85Q5k20K20J31J23o7q5j44PO24m73N0j01o6K56k33p8K72l12J30L66m67P3
2265i4L71l2m38j1K88R0q5j17k95L83j75J91L8k23J2K78j06o2J35m56L70l19K34
2288b3J93j89j76K73j68M82nj17j12k77J05j33J0Kj31n0J53J50J91j17k28J17
2310e0J39K03k42K03k60%l4K06r4J38l71K2J75L98j05l8m63P3j7L61l11J32P9
2333A44l37Q5O62n48J95J01n26N29k43K18m52Q7k53J76L00j67J37o3J11j60K79
2354B75j76M93o56j86r6J14O0J92l65K93o1L33M0j68j95J34R5j59N4j31K02m47
$$ y = [-130, -388, -581, -190, -390, 172, 6, 316, -24, -301, -223, 261, 130, 103, -27, -214, -497, 64, -48, -33, 255, 79, -169, 112, 341, -26, 42, -357, 129, -53, -47, 145, -343, -91, -322, 48, 57, 63, 301, 225, -178, 323, -137, 25, -185, -100, -320, -100, 31, 154, 87, 2, -142, -135, 489, 16, 66, -35, -101, 155, -78, -156, 116, -196, -66, 300, -167, -94, 277, 245, -193, -204, 84, 174, 89, -28, -323, 60, -115, 76, 114, -109, -97, 181, 75, 13, 148, -308, 62, -257, -23, 170, -19, -195, 78, -90, 392, 387, 270, 158, -119, -14, -147, -137, -135, -266, -316, -163, -13, 178, 61, -167, -50, 89, 292, 50, 253, -7, -7, -41, 165, 71, 209, -162, -140, 35, 433, 328, 290, -173, -100, -117, 244, -67, 65, 144, -193, -108, 554, 6, 201, 302, -224, 305, 62, 280, -172, -85, -338, -162, 138, -29, 108, 45, 156, -4, 275, 99, 592, -64, -250, -346, -232, -172, 20, -345, -52, -113, 220, 260, 92, -103, 31, 126, -33, 21, -110, 92, -355]
2376c55P0M56l09O4M2j51K70l47L5L76l31l69M12L59j08k45J80j85J36JP9k5l23
2399b68Q3Qjj26n8J65n0K43M74o77l5L01j71J86j25K24L5m10K6j53L64l97M44
2422H2j71q6r2K99K41k29K49o78J87J31J99k74J80m22N24m84N47J03n28J32J09
2443A9K23n76L39o4k99K37j80N42j31J04j98mK55q5rj54j66j07L19k56L45o8n23
2466d37O44l44N87j96n4n2j54J97k48L73m03j33J10J22K5J48l12OJ66J07K72l50
2488G4Q8n55L94p9L05k16j43m64L85K85J96l0P5m08M05l2m76L28l95K0J26J84
2510F7k29L10r1j21J59J69N65l94n25j46L43m08J35J61J45l98m5M26M8k2j47j12
2532a10K39j66J66Ml95j69J41L68k9r9k22M66q9l11K42J53k89r1k49M62J36n4
$$ y = [-355, -285, 171, -138, -74, -32, -183, 87, -260, -225, 151, -180, -549, -137, 222, 114, -131, 49, -136, 0, 1, 80, 55, -268, -185, -177, -178, -304, -362, -197, -247, -4, 470, -207, -242, 59, -112, 74, -51, 173, 208, -202, -176, -329, 35, -362, 82, -89, -175, -267, 32, 273, 44, 293, -385, -198, -67, 132, -142, 38, -384, 140, -344, 203, 306, -222, -90, 19, 242, -334, 5, -59, -358, -121, -301, 241, 110, 214, 16, 12, 267, 182, 173, 19, -147, -254, 65, -191, 154, 86, -437, 207, -137, 450, 254, 200, 148, -6, 191, -57, 316, -87, -220, -110, 12, 37, 185, -127, -121, 45, 152, 424, 74, 162, -393, 1, -78, 227, 11, -132, -596, -211, 74, 270, 240, 315, -93, 312, 280, -196, 132, -263, -243, -117, 67, -162, 148, 57, -64, 95, 264, 829, 435, -90, -236, 107, -301, -166, -5, 140, -258, -303, 123, 171, 149, 2, -110, 129, -37, 129, 133, -262, -431, -290, 78, 49, -50, -272, 194, 105, -206, 36, 189, -100, -191, -440, 22, 158, 104]
2554A04n28K98j47j26M88K53q0k95N9P6Q9O9l35K95m42L38k18K02j45N1k33NK82
2577F0K84J55o62q3M01k41j35K99k26M9K22M0O5k76M0j14j70K96j18l29J69L35
2599F1K11l05j7K08n74N69J5L85m01l14J07k24J30L24j39l73K15%L90l79M07k20
2621G6J21k22k3J22j10l0K6L8M0j66M08m01J13n0r3L58r4K0m84J95J62RJ00J07
2645B22l59J97L9J20j65j60P3J14j35j71K55k11j31K40Q1Q4L0K77j98j47j37M2
2667d0OJ76j59m2J67l6k44J57l18J43O27j07j75k48L18j09r6K0o7J65l06M9L63
2690B44j16M39m78J23k8k33L00k03j61lj97J75J61nN3J18J2j22J61k52J38L0n4
2713A02j07k3j64J33p0K0J75p2k2N57n71R3N6n0k3J29m05M8Q2L42k60l2N6l57
$$ y = [104, -424, -126, -273, -399, 89, 342, 262, -33, 26, 102, 191, 260, -75, 220, -222, 116, -102, 100, -45, 6, -227, -222, 60, 344, 499, -163, -246, 155, -86, -221, 78, -148, -99, 123, 163, 228, -48, -8, -122, -292, 4, -114, -443, -274, 61, 272, -33, -50, 158, -416, 153, 168, 553, 152, -162, -55, -279, -149, 175, 36, -337, -122, -122, 268, -111, 296, 76, 197, -25, -48, 74, -36, -66, -40, -2, 38, -128, 280, -121, -8, -58, -151, 207, 113, 133, -351, -156, 6, 15, 115, 222, -137, 60, 99, 219, 54, -106, -33, 81, -54, -225, 30, -181, -312, -72, 9, 93, 123, 400, 202, 55, -82, -40, -34, 142, -17, -59, 108, 72, -172, -15, -333, -190, 437, 330, 155, -93, 225, 116, 20, 40, -27, 138, -168, -119, 244, 128, 567, 89, 212, 184, -49, 251, 48, -113, -116, -313, -138, 23, 18, 71, 189, 201, 79, 240, -12, 126, 156, 102, -5, -28, -192, -59, -129, -109, 66, -6, -28, 529, -42, 51, 107, 57, 34, 163, -242, -194, -112, 230, -30, -62, -6, -363]
2737c63M48J28k29J2lL9j83N1K57k55J89j17J59J57J51m00J02k92K90j08k35J57
2759d5J16O2m03J13L66k09k50M90R9j98O3k17J78Q4m17J69l2L40o79L00J13J08
2781A51M29r49M67N1k79O6K3K22j1m92J25J70j7r3K70l3o4J99k13J03k89K62r9
2804aL10k02j74O7J58l33K11K92j71J23m17K13n7j50J91k93j5J30J57k55L27j11
2826@L88j60j32r7J07kk23k02J17M48j95j37qJ7N78k70k0p8k04J24j8jJ8k55L13
2851A08j98j2R1l05N37j49Q8K16j93n73N51n49L22L43p69M57J59P8j4l41N15j47
2873B15m93R2j87J71L67k47j7l41M35J36j32L0l52N30J32m8m16J52J3l09K0O1
2895a88K4L75k13r8o9M58O4j02k04k75L78k62n6M81m00j26J90M6K0J59J7r9K8
$$ y = [-363, 85, 213, -16, -4, -7, 32, -151, -100, 157, -98, 91, -26, 133, 290, 441, 41, 143, -149, 141, 33, -202, -45, 71, 133, -270, -157, 209, 0, -250, 240, 339, 141, 204, -13, 165, 249, -168, 1, -31, 309, -370, -70, 43, 151, 580, -369, 98, 149, -130, -64, -41, 181, 170, -322, -197, -27, -44, -137, 133, 100, 36, 235, 22, 125, -164, 98, -1, 309, 107, -67, 0, 158, -175, 36, 328, 157, 280, -137, 76, 19, -131, 60, -233, -248, -118, 39, -216, 111, 0, 388, 228, 96, -1, 106, 104, -119, -321, -204, 244, 49, -88, -96, -79, 499, 229, 209, 131, -73, 51, 33, 32, 50, -205, 108, -90, -102, -11, -316, 221, 72, 160, 376, 183, -390, 161, -388, -66, 277, -492, -35, 124, 202, 188, -153, 362, 215, -278, -186, -373, -202, 165, -82, -99, -440, -5, 131, -1, 29, -323, 207, 339, 291, -125, 27, 40, -269, -249, -188, -164, 211, -2, -100, -169, 289, 353, 251, 47, -228, 150, -112, -168, 313, -87, -213, -23, 23, 43, 202, 219, 120, 148]
2918A48k60J80O7k45k91M55j03J26j63K07P0l01J13Q6j4K0m6m34J75M21j01l36
2940b26k73L41K17K80l30M3R7J47k55J00J0l18Q9J90j39p8K30o5Ol2L06l5n7j29
2964A19j08k93j57O65M2j03k30j33oJ04K50k65L90l43M5Q4j72P7m17M30J09o1
2986B7N0J63j30j20O3J5L7k54K9k34L50N3j84J96J27k55M7K58r6O5o54M92j15
3009g0n8K45m43N30k0l23L8M44m48J57k17M57j71J16j69l03K53K51k95l8Q5l49
3031c28N46l42N5J0J05j39P2Pj86J43o0J56k81QK92Q3j84o3R5K06O5k29j46P6
3055c9j69K85q1K01l02L60l59L43r0J61k63k80J03L22l61L80l63j18n5J98M02
3076B75r4o9l85K91J36p2l4j62Q5kl93K29R3L54J51k91j9n0j67J20K62k15k12
$$ y = [148, -112, 68, 135, -110, -401, 54, -49, 77, -86, 121, 191, -110, 3, 89, 75, 95, 49, -385, -210, 211, 110, -226, -499, -158, 59, 339, 9, 52, 149, 296, 41, 141, 151, -167, -78, 112, -27, -105, 125, 60, 66, 34, 340, 305, 248, 119, 11, -282, -439, 226, 268, 165, -65, -198, -204, -100, 150, -115, 275, -68, -23, 61, -111, -34, -451, -21, 88, 27, 77, 240, 110, -10, 53, 68, 105, -149, -120, -354, -4, 49, -135, 61, 188, -67, -20, 238, 142, 207, -447, 45, -70, -128, 117, -326, 204, 184, -139, -101, 343, -105, 52, -165, 292, 121, 237, 68, -235, 18, 269, -26, -64, 21, -328, 218, -124, -69, -59, 46, -93, -21, -14, -200, -57, -117, 39, -242, -234, 58, 141, -43, -106, -11, 195, 260, 31, -115, -39, -208, 77, -4, 197, -105, 255, -104, 239, 149, 310, 47, -233, -130, 192, -169, 211, -152, -270, -325, -127, 275, 181, 112, -273, 18, 154, 82, 48, -114, -29, -31, -424, -195, -102, 252, 403, 112, 93, 43, -124, -4, 258, 43, -169]
3099a69J60r3L56k06J07P6K7l01J56o2l38O5K45R1k54j53K66L1j33L32j74l8j35
3122a44K44qQ2l55M47l97J14L30m05L59J64m35j38N96o39M34K58l98m1Lj55N9
3144b5j59J79j48Q8K98n4K8m00J63q8J20M06l73J39j60o9p3J38j45N5p6L51J10
3167C05Q3k41K00m45N1L4K7M1k88K97m80N27j72K69k06L1L2l17J91Q3j62L30m34
3190b44L97K7j0K2j33j47Q4j21K12l23K5K02r7J21l04L42j62K35l7j6nk23Q9j08
3214a74q3M3J86o0Q9j81J79n5N7J14n8J69j67m7L2Q9l72L03j23M5R8J19j93j08
3238i8N1N3K30P7l33K5M9k12J44K1J00Q2k28K81k04l64N52J04o13L21k59M08J17
3261C04m70Q1L24k34l97L97Nn1j80K48m8k8M7j14K80k87K5L3L8k5J67k00J94j44
$$ y = [-169, -9, -102, 254, 48, 155, 231, 258, -43, 113, 51, -287, -222, 23, 114, -140, -293, -27, 4, -129, 203, 29, -9, -144, 100, 92, 174, -181, 266, -131, -17, 313, -92, 267, 431, -4, -142, 454, -185, 249, 507, 109, 68, 71, -84, -25, -184, -5, -153, -65, 233, 179, 207, -193, -30, -118, 2, 408, 35, 174, 14, -55, -128, 10, -135, -80, -156, 195, 305, 388, 147, 347, -98, -47, -13, 14, 55, -233, 64, -416, 111, -61, 208, 2, 33, 65, -252, -61, 22, -140, 190, -244, 153, 180, 170, 192, 59, -88, -4, -125, 87, -236, -211, -9, -106, 15, -289, 53, -109, 126, 89, 73, 68, -155, -66, -174, -257, -214, -28, -88, 1, -180, -1, -56, 1, 115, 57, 226, 59, 12, 44, 133, -239, 64, -59, -14, 84, 203, 10, -98, -47, 6, 236, 313, -20, 5, 54, -158, -14, 7, 107, 189, -39, 242, 38, -326, 226, 330, -283, 38, -221, 187, 304, -166, -85, 239, 5, -392, 5, 10, -41, -221, 27, -21, -49, -2, -116, 164, -123, -98, -65, -27, -52, 115, -85, 109, -35]
3285c5Jj84L29k38J6J13o7J47j09k70L23J67k28K64k31J47j9k66k06L33o4K53
3307A76k52JJ7K50q8M1K0j43O6o9K22q0M6O6l65O3L25pk74Q7m58L90M2r4L57n73
3333b34L00j20M3q4J54K2l84L60J25k59J53J14Q4j73j16J12o1k21kK14J66P0j82
3356H1L7j9j51k37J2L13l45J98J51K75m26o1K45o2L11k10j26l2J65l75K99l07
3378b64J00K57k09k9J35K84p60O21k1j28J67j94K00j49J26k56J88J43j50j5Kr5
3400d7k29N36j40l92K67R5k96J09j40L96j50K11J25q3j51j36J49m5J02l71J86
3421dl90L07l15L39rK2J68j51M7K25j8M9p8k92l9J6J83j01q2J55P9M4k15j89L14
3446F5k55J7M10k08K59j04n51O13j08o9J42m11M84p1m57J39O6m4N5O6l6J98j11
$$ y = [-35, -34, -218, 111, -127, -111, 2, -65, 82, -27, -297, 26, 193, -35, 229, -2, 145, 126, -140, -346, -13, -77, 176, -76, -75, -58, 192, 104, 145, 165, 22, 88, 19, 241, 161, 207, 273, -92, -29, 296, 289, 15, 102, -356, 34, 76, -18, 339, -234, 66, -54, -11, -95, 59, 81, -303, 57, 182, -77, 76, 190, 274, 101, -15, 97, 36, -185, -187, 27, 193, 263, 81, 118, 99, -52, -289, -277, 36, -309, -111, 40, 315, -111, -172, 73, 11, 322, 112, -14, -46, 119, -256, 43, -264, -164, 93, -116, -145, -10, 274, -486, 135, 114, -14, 153, -41, 159, 10, 136, -120, 68, 211, 61, 46, 48, -47, -276, 260, 120, -272, -5, 90, -206, -97, -237, 159, 9, 220, 345, 262, 111, -25, 124, 79, 181, -190, -4, -394, -87, -402, -63, -72, -50, 118, -33, 14, 239, 221, 270, 192, -100, -139, -123, 60, -41, -123, 32, 111, 155, -60, -249, 65, -190, -173, 237, 29, 288, 184, -367, 246, 138, 69, 211, -200, 284, 213, -244, -105, -39, -83, -28, 38, 2, 200, 89]
3469H9o1J07l11K03R8j31J18k70M98n58K99q5K2K14P2n4j93j25K09k67Q5J56N0
3492A65j04J41k13L19m21J50r6j57j09J72K29K03o4q6j99j87L22j57M85k81j31
3513a9K55j12j31K63n00K36j15j43M77k51J15P8l20O6J95K86o05J48K33j91qq1
3535a24Q0J55q8L7L6k1n4k76rJ68J62m7J12j34r4J63p7k97J80K4K41l66L12j67
3559h4K50k52J0l06L55p3n7K72l14J31K1j8j37L37J9n7L1j54K36j40j65K50k89
3582a34J57J4R7l78M96k4l84J25M6p2K3J53l20L10K02l91K54o9j86J18k9k32n3
3605b77K59J22J72k60k81J48N2N6K22k00j75LK56M8J52m99J77j10R2KK92m78o
3628b33J68l3L07k51r8K45j32K44l85o9L48m23K10K06k11L12l26J93J63l68L50
$$ y = [89, 28, 135, -176, 27, 125, -6, 112, -158, 340, -218, 81, -4, 18, 232, 304, 250, 57, -68, 141, -126, -41, 115, 165, 61, 202, -11, 308, -113, 37, -59, -216, -325, -153, 76, 279, 215, 129, -70, -257, 65, -92, 393, 112, -19, 236, 124, -7, 256, -244, -8, -123, -266, 211, -40, 75, 153, -167, -101, 94, 380, -225, -77, 156, -35, -43, -124, -44, 111, 23, 60, 96, 75, 21, -255, -264, -96, 66, 19, 131, -3, -97, 66, -11, -308, -128, -104, 137, -229, 83, -84, 166, -86, -76, -382, -27, -100, -157, 115, -199, -68, -47, -65, -202, 135, 154, 97, 128, -26, 210, 70, -95, 155, -134, 23, 37, 134, -244, 252, 228, -156, -31, 15, -57, -34, 119, -201, 109, 311, -80, 174, 105, -81, 37, 8, -224, -277, -18, 104, 276, 16, -265, -117, -65, -9, 213, 13, -162, -159, 97, 145, 297, -202, -25, -135, -43, -41, 251, -227, -233, -65, -98, 209, -42, -140, 105, -27, 217, -168, -237, 111, -312, -102, 104, -107, 205, -121, 72, 235, -133, 217]
3649B17m94K70R3k36K04k3j16J68r6J52j23k92M0L68J92n30PK48Qj43k14O15j59
3672A56j50J35k47J86K30k58j61j26R4Ml0L30k6j79L72k51M4j8n9K43j79j07J13
3695A16k04L49l15P2K49j41n3M1J80l38m06K50K67o3J01k59P4JL83k70j01l5O2
3718d0l19M28O0j00P5j43O0M5J34m10K85m2k3N0%k37K03K33j63P1q3k52J81pP4
3743H0o4P8l49K24M32l97J38j47P2j21j76M56k08R8k03J67j46M2j97M82j55k21
3765a15M44l70j9oL04l0r0O8k2k31J49p1J4l6J07o4j77J01j4m8P2L6K92l36J71
3790A29l63J97p3J19R5j25j90K14J36j21O0m53P11o28M00l87M44n7k15K24J04
3811B21l55M13l4R2k79K74k84o7l40L07j5k4L13l45L70l89P8L51m27J97k66l6
$$ y = [217, -277, -7, 86, -150, 54, 31, -85, 83, -13, 139, 16, -276, -236, 132, 324, -206, -199, 49, 57, -86, -300, 315, 156, 6, 141, -106, 80, 310, 52, -109, -235, -141, -137, -167, 163, 137, -42, 330, 79, 123, 105, 46, 289, 110, 3, 116, -88, 261, -54, 18, 267, 126, 73, 114, 294, -44, -450, -200, 67, 4, 105, -154, -80, -79, 304, 34, -67, -102, -40, -359, 69, 129, 29, 104, -39, 21, 66, 200, -210, 75, 33, 10, 60, 60, -177, 26, 259, 96, 167, 84, -168, 13, 6, 80, 16, 94, -255, -31, 401, 4, 142, -5, 67, -54, -230, 226, 18, 116, -87, 80, -66, -24, -221, 261, 106, -115, 329, -41, -60, -66, 238, 208, 118, 186, 164, -67, 82, 11, 25, -11, 96, 32, -145, -44, -58, -106, -34, 2, 294, -42, 129, -234, -37, -110, 9, 104, -21, -211, 3, 139, 18, 78, -375, 336, -292, 108, -279, 165, 108, -107, 117, 221, -134, 279, 245, 337, 58, 332, 48, -19, -359, -52, -67, -91, 222, -123, 247, -142, -64, 287, -140, 57, -209, -245]
3833b45J02K23p4j05k0j30K0J43K70j74R2k98J3P2p4K41qj70L19k04K45l39O9
3856c2l3l21M56j12J12l89M44kk54J55K1j36J23J59k18j86N3j6O8p6K45K26l40
3879e3j89M86k14L5K9M0K09k82J52k40j20oj09J74J04Q6j28k4J31j66K26J73l73
3902e9J25j38O3r7J01J01J4k10M55j66k24J19k12J09r5L26l44K67J27k32l13L48
3924F5j4p7j62k5K65n54L43j9J70J04q4j99K73j46N7j35P6Mp3R2J7K68j49k23
3948a26j5J12nj00M73l08j08K95k61J80n1l0l32L63j84J15L7K16l46N7K18k56
3970e6K07j80o6L1L9J41k30j27M56p9l48QL20M1k29m1o5J8K00j30j04o9K24J44
3994A05k7k34K42L01n39M21n55M2L90k36L7K90k90L08k16j31k08K12p5K56k49
$$ y = [-245, -143, 80, 6, -99, -119, -249, -229, -86, 184, 10, 102, -196, -183, -111, -185, 56, 48, -122, 197, -7, 238, -101, -32, -65, -386, 70, -42, 70, -319, 125, 123, -131, 24, 45, -91, 32, 191, -27, -213, -160, -176, -108, -184, 61, 287, -53, -242, 244, 30, 65, 94, 134, 343, 61, 213, -27, -147, -153, -262, -88, 16, 102, -26, -50, 81, -85, 141, 314, -59, 66, -72, -9, -106, -5, 96, 110, -100, 355, 189, -35, 84, -128, -19, -114, 212, -132, 135, 262, 30, -283, 65, 51, -26, -188, -213, 52, -502, -159, -178, -8, 96, 12, -187, 86, -60, -3, -138, -62, -58, -131, -39, -22, 246, 97, -126, -141, -29, -34, -134, 339, 31, -77, 218, -43, 137, 86, 56, -276, 87, -97, 18, 55, 271, -75, -18, 200, -56, 151, -29, -95, -64, -25, 116, -114, -241, 215, 136, -212, -204, 116, 157, -72, -113, -178, -160, 40, -90, -194, -263, -39, 105, 78, -156, 86, 387, -152, 269, -286, -244, 146, -90, -53, 237, -53, 255, 39, -92, -300, -88, -163, 93, -156]
4015a56J04K35M0Ll97m0K38nM7J35m31K63j11l30J23P8K28k43N12K17k71r2k63
4038a16J36q4L69m53L0K15J4j51R1k7J98k15J14q4M7l0k11P8P6k35J12L99j73
4061A00l91o1L44k52L13j10L35l06Q5k81N34p7J11m81J43K8j28L76j90Q4R3j18
4083A51n0j39m5O0l1J42k6q8K0o9k3N03p39L55o8P6j0l40M19R1j56pj12j02K50
4108F2R7k3l68J89o5q3K27j20j80K20K31j99J44j62l7q7l0j08J88L7l23L41J03
4131E4J39l03J54l64L41l3o0O3l94O97j67j00L5R5j3l12L11j01q6nJ26l2K48l76
4155h3J09j77p9n2K21J1P3p0MJ76k27L17l20O3J32k12K71k73l4R7j4j1n1N0M1
4180c8J32q2M0n0n1l7q1L42Q2m24J83K61k61m35L79J50r8J07k02l7N21l49LJ36
$$ y = [-156, -52, 183, 223, 226, -171, -211, 27, 22, 69, 204, -227, 36, -75, -405, -282, -204, 24, -219, 293, 510, 239, 147, -116, 20, -64, 305, -148, -118, 97, 111, -40, 51, 24, 222, 7, 121, 37, 84, 54, -157, -79, -3, -238, -126, 273, 100, -291, -352, -8, -260, 53, -57, 278, -28, 57, -224, 310, 233, 344, -137, 6, 34, -94, 282, 92, 176, 269, 151, 101, -38, -83, -23, -54, 88, 62, -26, -6, -75, -98, 405, -334, 21, -47, 29, 19, -321, 98, 189, 33, 26, -86, -188, 62, 159, 136, -232, -43, -108, -191, 36, -84, -264, -44, 187, -12, 132, -30, -67, -154, -184, -292, -104, -67, -390, -49, 54, 193, -110, 44, -320, 21, -12, -72, -9, -403, 294, 127, 27, 62, 157, 144, -168, 143, 42, -44, -49, 77, 45, 293, -83, 26, -151, -230, -282, -61, -50, 23, -47, -43, 133, -94, 223, -97, -34, 98, -114, 157, -116, -150, -53, -67, -78, -129, -79, -38, 94, 12, 52, 2, -49, -86, -167, 175, 257, -167, 16, 277, 16, -419, -40, 110, 12, 119, -83, -120, 401, 52, 55, 191]
4204A91l14M01j37j84n6Mk16N28k45N8k57J23L17k47K51j38l25K07n6j84J5K62
4226bR5K8j44O8J67k34Q7l1j75L64j66k58j92L66q3l9K30k48K49Oj3m42K39J6
4250a12m9J64J63j28o6J96m3K7p5k67M51j64j91P9P1k47j6J52j56K32l0o2J40
4273F9J84m00J16l32L88p2j43K84j4r6QK57l64J98N9m52M11j64j42J12K61k97
4295a29K86m75K41M24k25k39j58m7J04M53k88J8k5q7K77l64K20j87P4R2Q9J18
4317A72j66j90k3L15q1L55m70J37j06K40k99R5l43J76O6K22K7lk56J41L30k10
4339A29J01l91P2j8K99j76m8K08k01j33N9M25j88k9Kj41k03O0L12l04K03jl42
4362c05K67j90J19J4J12J46l53N80m31p1K48l43j5J19R0j03j03K16m7K63j38j94
$$ y = [191, -123, 278, 141, -43, -99, -95, -311, 217, -28, 30, -227, -104, 213, -34, 217, 79, -246, -39, -95, -279, -264, -2, 93, 121, -23, 45, 212, -22, 65, 34, -141, 223, 57, -201, -393, -27, -110, -149, 81, -167, 82, 88, 75, -367, -128, -112, -161, 3, 166, 38, -28, 168, 125, 152, 77, -190, 261, 97, -94, -15, 56, -191, -207, -55, -211, 21, -9, -71, 69, 253, -147, -31, -363, 25, -47, -190, 94, 80, -16, -8, 249, -115, 83, 142, -310, 101, -63, -205, -93, 168, -129, 157, -318, -77, 347, 122, -117, -275, -322, -218, 235, -53, -35, -60, -147, 130, -234, -14, -201, -127, -35, 54, 172, 6, -184, -207, 108, 27, 382, -88, 49, -57, 183, -116, -21, -364, -188, -122, 100, 127, 124, -132, 9, 339, 129, 230, -161, -89, -107, 192, 16, -32, 176, -25, -158, -99, 326, 138, 109, 111, -30, -233, -173, 139, -165, 38, 37, -305, -38, -228, -109, -95, 17, 163, -190, 390, -41, -112, 136, -207, -222, -103, -13, -116, -219, -3, -50, 213, 75, -119]
4384a19l8K40j23R1J82J4l00K69r6O9k8m73K36K97j40n06J29K69n6j86j18L42
4406d5l2l3J60R5j0j25l08K23Q5J49k63q2M9j0L04l03j04J78r3K21j76O4j11M05
4430B38n75N03j33ok27K94J6q6j27M59q8l23j15K50k4J90n07o2J99J81K19o13
4452c37N85m23P02k51m13k7J61J77k55nm4J02J55Kk17J63J07l27K69j96L36k61
4474CM9j16K56l1m87J98oN3j3O3K33j88J0n8j14K03o9L7J7k41J91k21K49K41m24
4499a65j08M90l12m0j16L27m26L39p4K65k00k89P0J24J31l50M90k53J90l4k4L
4521C8K8j32j94J7L83L7k53K72k65J12J88j61O8p0J0k60K8J38j02N30m53J39k3
4544G5l6q0N7J14j02k2O0j18Q8Rm9k17J24J63r5r4j46L97j14Q5j62J24j04M5J25
$$ y = [-119, -157, 83, -40, 51, 233, 247, -53, 216, 120, 189, 161, -312, -76, 221, 81, -425, -296, -27, -83, -269, -387, -45, -77, -110, 50, 145, 135, 10, -298, -75, 10, 159, -104, -186, -137, -147, 157, -146, -250, -72, -165, 56, -120, -56, -167, 238, -337, 166, 33, 27, -200, 94, 110, 24, -103, 356, 268, -55, -170, 80, 56, 246, -261, -323, -124, 57, 276, -337, 248, -175, 527, 276, -137, -164, -3, 174, -81, -86, -130, -28, 127, 129, -88, 75, 182, -145, 124, -72, 264, 3, 52, -64, 192, 161, -326, -128, -134, -81, -94, -31, 202, 14, 24, -34, -148, 55, -14, 23, 40, -201, -10, -231, 18, 259, -165, -273, 217, -95, -135, -251, 76, -350, -11, -85, 180, -20, -309, -239, -115, 16, -334, 156, -97, 93, 59, 35, 38, 66, -66, -260, -243, 140, 177, -76, 196, -69, 43, 231, 70, 138, 68, 78, -182, -154, -16, -118, 412, -41, 98, 75, 39, -41, 16, 130, 28, 6, 66, -52, 36, 45, -4, -221, -97, 66, -29, -123, -269, 128, 14, 99, -63, 61, -43, 2, 127]
4569A27l54O47m10K20n74K48J2M3K7R4l5J8R4k30N7J46L26m46r7oL3K2J87j11
4593C8J31k98J23P6q5k46L96k40L27l35M7l2M38m92n3L24m23L93m9j65kK92k50
4616h5J68j78j17K26k00p6L28K4O2l88Q0J99m4l8l43L81O4K41m89L71l8n4p3J12
4640A33o7J89j73l8Nq8L04k09J16m4K29l52j7q1n9J25J23k47K21O5m65O01l5m94
4664b58J41j68O38l19j97R2L7n0K44j27j97K34k1k47L17J3K17k61j10K28k59J38
4686H5j48K8K81l77K20JJ46l77K90l43J80l9r4N13l69J18k21l25L73J41m5k7o4
4709e3j16J93J98m7l55J83R9L4k66k9qR3J16j76m5J12n1J21L9l9j58M31R9j05
4733B70m26J36n1k89N24j77r5L22m77K20j33rj75k14J62N70r0j54j7J08R6k1j22
$$ y = [127, -227, 420, 10, 230, -344, -96, -84, -41, -14, 80, 45, 63, 157, -73, -16, 130, 456, 10, -87, -93, -60, -38, 149, 38, 169, -129, -6, 70, -15, -261, 135, -105, 222, -113, -66, -98, 340, -152, -205, 119, -304, 89, 40, -125, -127, 165, -85, 83, -95, -212, 14, -186, -262, 66, 90, 152, -236, -156, 43, -1, -39, -382, -1, 63, 304, -185, 186, 148, 94, 21, 133, 66, 255, 82, 44, 49, -39, 265, 56, 172, 128, 357, 5, -12, -93, -152, -27, 96, -151, 70, 135, -330, 271, 236, -258, -117, -285, 353, 34, -163, -71, -34, -84, 160, 33, -164, 70, 49, -198, 119, 132, 349, 88, -22, 206, -53, 85, -63, -35, 246, -131, 89, 90, 236, -141, 149, -194, -14, -53, -147, 366, -3, 115, -106, -431, -58, 83, 38, 11, -53, -169, 24, 222, 175, -180, 3, 102, 136, -130, -159, -167, -74, 42, -134, -179, -67, -118, 3, 42, 3, -155, 276, 375, 270, -156, -20, -71, -360, 164, -13, -108, 214, -263, -43, -176, -185, -360, -574, -412, 158, 68, -86, -103, 5, 101, 80, -42]
4756d2j01J97M1J6k1k8j00j16K17O1k68k2K27j66J53k29K43L0K9k70m5OJ16j59
4780b31J95K67J01l79P2j16L75Pk57j29J62N9j18J44l21J15J02J21j2k99K00M
4802F2J40l7k81J69j96K94k7o0m50N03k10o1K54P2l43J38Q7J3K7o2p2P9Ml10L97
4827A30q0L4k74M66k53P0o5l46J90M14l36LL88j43J42o40L65M2L1j96l6O4O6J54
4851A90n28L83k3j59K36J5J36k01j55M16k70l6l47L72J88o26M41Ln05N50J46k54
4873b8R4J25J6k40L24l19J86N6k00q4L9j79m8M08k78kL81o6l37P3J98l47M66k65
4897b7j95M9L25l51J90M4q3n8J66j17k73K93o9J81P5l8q9J00n1k10Q4J96L4l60
4921a84K94j41n8Q6j12k9K97l31J87M5lM5k62N04k47J82m10J63j59M8kK2J14o2
$$ y = [-42, -143, 54, 95, 111, 90, 62, -38, -154, 63, 124, -144, -166, 61, -105, 48, -181, 62, 92, 121, -149, -194, -188, -72, -231, -36, 231, 332, -47, 25, -91, 284, 291, 34, -95, 67, 126, 8, 152, -169, -54, 48, 169, 157, -142, 58, 62, 202, 165, -116, 53, -143, 151, 124, 64, -386, 117, -93, -154, 100, 172, -171, -33, 54, 67, 94, 32, -40, 39, 43, -267, 130, 50, 84, -190, 276, 23, 93, 28, -318, -128, 286, -50, -47, 341, 198, 340, -300, 65, 107, 138, -58, -94, -30, 36, 190, -338, 45, 22, -137, 99, 114, 250, 49, -106, 310, 40, 4, -343, 29, 217, -409, 32, 35, -470, 80, 226, -28, 66, 191, 207, -33, 291, -28, 158, 214, 14, -70, -31, -210, -258, 150, -128, -130, 251, 185, -152, -79, 119, -228, 238, -27, -222, -173, 152, -199, -9, 35, -48, -106, 60, -57, -330, -37, -106, 75, 150, 112, 23, 123, 72, -138, -54, 142, 176, -184, 110, -31, -89, -3, -115, -144, 153, -178, 9, 54, 51, 96, -166, 338, 91, 273, -137, 26, -133, -85, -87, -65, 49, -13]
4945a3J39j9j58NM64l03k1j18n1J99j25kq7J53j6j7j38jL07l11j39L43k74Q0r0
4970a93J20m8j54K26r2M6l1J47mnJ7k47j3J06K78m79M03M5k62k7L61k93k48J81
4994a66N14n13J7m7M56k32m3m8M4m8K38k40J03J11m80K20K3N0Q2MJ93k16Rj29
5018i8O3P4p7nj26j0K17O7n9n8k1p4K85j26o3J38o7K91l78k56K43K0n8q0J92r0
5044e6K25k41M48l66j38K16k84L45j47j18l3J49n7q5l7N7L49j65j53j09K09L32
5066C41n22K24QJ51o43M83j74K1l1J98K63K6L0j55k94J08q2J81l41J63k08K33
5088b0K2o4m1J30M0j45K15j58J68k17j06L08l57Q0j6Q1K85j95O3k6q2l4k3L62
5112B70l18K48p4n6qN2j31j58o2L54n4j12r8L04q3KN4J83k85j62pN82m54K01j37
$$ y = [-13, 126, 107, -51, -46, 418, 115, 94, -24, -75, 124, -1, -3, -90, 63, 47, 30, -108, -109, 198, -113, -252, 91, -183, -103, -193, -73, -121, -275, -49, -141, -95, -126, 21, 17, 12, 29, -218, -231, -125, 153, -326, 77, 122, -140, -167, 194, -99, -347, -166, 348, -165, -148, -195, 261, 29, -14, -62, -18, -66, 172, -68, 35, 146, -334, -114, -91, -41, 41, 45, 238, 22, 31, -98, -35, 39, -38, -43, -169, -179, 38, 105, 46, -12, -33, -107, 178, 52, -11, 127, 60, 351, -27, -283, -40, -20, -78, -158, 34, -56, 169, -72, 376, 10, -128, 88, -196, 149, 2, -116, -149, 0, -57, -142, -179, -122, 227, 62, -91, -200, 9, 341, -181, 43, 51, 202, -441, 42, -132, -111, -142, 56, 319, 345, 375, 220, -74, 34, -48, 133, -208, -45, -253, -20, 2, -62, -103, 27, 67, -78, 137, -21, 147, -70, -176, 132, -225, -145, -161, -80, 205, 10, 73, 47, -35, -69, -92, 270, -48, 200, 126, 70, 62, 114, -17, -175, -237, 117, 63, -49, -147, 157, 74, 76, 130, 313, 28, -134, -141, 441, -13, 188, 51]
5137E1Ol96M96p6OJ01l67Q6J83L0j92K17j80j76K67k12P5J56j1k16J74m2l45L95
5161C0j22j51J13j97L63K40k51J05k97J11J8l5J30j14j22K74l9j05k55K59Jl8
5183h2L53j77J4j46K58j93K5j15K25k20%q2j80J73jJ2r0J17K98k96L22m51M7J79
5207a0j66J34M0J15R3n22M24k50O9J73mj63K43j54K2q0j0R9k8k93L46o8J55m61
5231b96J61j4L2K53k86L99k61J81j28N3J9J33j91j10q1J98k30j5M50Nj80k78K01
5254A5K36o57J09L39q4J50k88L42k53k82M53m7l63L21J47j35k03M1K5J53p5K36
5276A80k58n4n5K13N6l58K29J85j41j61K6J48l51N67n7k87L97l02m5p8O50l43
5298A61j7j47n7q1K66j28j19j71K13K14j44K91k23K11l16Q0o0R8l1K6lp6J74p9
$$ y = [51, 57, -339, 157, 81, 87, 188, -179, -93, 90, 120, -72, 145, -35, -211, 56, -156, -81, 75, 64, -152, 22, -20, -365, 30, -92, -243, -130, -327, 36, 276, 25, 130, -167, -56, -38, -73, 57, -57, -179, 95, 56, -49, -304, -45, -44, -82, 271, 94, 108, -38, 220, 27, 52, -63, 162, -58, -58, -140, -320, -147, -148, -136, -226, -109, 189, -107, 215, -236, -189, -10, -176, -42, -2, 113, 206, -316, 108, -142, -73, 100, 96, -67, 176, 22, 44, -36, -46, 53, 25, -268, 78, 10, 165, -296, -135, -149, -117, 136, -150, 249, -12, 169, 41, 94, 113, 246, 55, -55, -136, 62, -168, -183, 267, 272, 92, -186, 15, 251, -406, -297, 42, -42, 108, -180, 162, -91, -373, 80, 33, -330, -9, 138, 3, -200, -159, -134, 19, -56, 180, -78, -132, -187, 26, 82, -276, -47, 138, -3, -164, -138, 10, -341, 226, 169, -118, 279, -23, -68, -146, 504, 161, 144, -3, -60, -141, 125, -3, -122, -293, -80, 134, -10, 281, 58, 269, -47, 33, -27, 71, 40, 66, 63, -13, 161, 82]
5322H2m0j19J33m07K99N7m23L79p4k28O4J47L0J80%L8K8K6k39L08l85L76l64K58
5346A26m36O1M57o1j67n5K57Pj96Q7r7J17n6J25l61K63R6r9J60k58J85Q2l41Q5
5370a9K95l07M15m62J11J16k47M9j05R4K98r8j81M7k75L12Q9k01K28r2j42J39
5392F4k7PK38k04l15N64j23K56o67R0K03Q9n6n8q9J32j52K74l38J41n0j14M54
5415C19l25Jj0k73M34k37j38N1n3J77J3K09N0j04L3n06J71L46j29L2l62M97L1
5438B27k7j22k38L8K94j63m3K8K20j80Kj71J20J29n0J20Jk36J06j88Q6L9j13m3
5462a64J72J10j36l3j24K20L6l6j7L6j26l2r7L94j19l01J38J52j86L47l90K90
5484A34j12j82J94L6Q9P6M5n70L24J29k57J54O6l5j45K85l16p2k61N55k37K40
$$ y = [82, 42, -77, 56, -351, -52, 5, -418, -39, -113, -341, -277, -130, -100, 80, 80, 118, 146, 172, -67, 241, -144, 232, -132, 126, -310, -249, 208, 147, -20, -75, 182, 189, -7, 80, -17, 100, 44, 169, -192, 71, 167, 68, 228, -30, 155, 237, -104, -19, 276, -31, 384, -78, 33, 149, -98, -49, -154, -60, 238, 140, -41, 6, -269, 43, 132, -69, 159, 67, -75, 64, 37, 44, 282, 78, -237, 327, 204, 460, -207, -117, 86, 175, 119, 61, -28, 104, -48, 226, -112, 29, -21, -135, 319, -6, -5, -15, -288, 146, -91, -229, -178, -231, -54, -41, 168, 218, 114, 147, -359, -188, 158, 29, 61, -301, 196, 227, 200, 78, -160, -122, 172, 9, -34, -6, 214, 34, 36, -135, -15, 114, 64, 184, 185, -51, 55, -133, -47, -8, -121, -164, 8, 118, -18, -51, -175, 45, 81, 45, 28, 64, -62, -94, -191, 203, 84, -217, -79, 73, -113, 234, -156, 134, 22, -160, 34, 70, 159, 235, 280, -290, 34, 163, -94, 60, 126, 91, -54, 231, -85, -157, -418, 137, -100, 140]
5506A40M2J24k86l1l8L61l99m3L15j94m2l5L8k52K25M7K81j60q2J14j80R6n1K07
5530A97l4k90L25j3m71L08j25J11m6q9N2J86j39J78l31K35J16m46M98j97j77J37
5552a5O8J96m07J27N2J88Kk26J02j52K1M9J03l59P6K21M0j73o0O0Q6p4p2L62l99
5577a84J95J41k75p8Q5q3J04L48l38L7j78K35J40l95N11m47O8j29j57K31J6K56
5599A03o6K26n44K40J28p9J25N9k63n9K37N6N1k09o1k87L88l66M58k81M7K2n5
5622a30L49l09j43LR6Q6j06K71o2k7K70j03j86M25j96o35J88M37j46l1j78J65
5644C8p9k9J1J16l38K02q9J52j99Q1J40Ml93J22K74q5K3j40O3J94Q1K8k78J61
5668F0K01p2l15J66o1l5j17M53m77k0N27m94K52J64k06k1J2n99P08n2Oj56K34
$$ y = [140, 182, 306, 20, -11, -49, 312, -87, -130, 185, -9, -51, -86, -48, -300, -75, -28, 253, 93, 11, 125, -55, 41, -10, 197, 163, -127, 198, 185, -286, 22, -103, 8, -38, -127, -75, 111, -28, 150, -181, 54, 170, -276, 222, 25, -152, -15, 53, 249, -158, -31, 21, 209, 211, -15, 87, -65, -44, 5, 108, -251, -175, 46, 86, -87, -147, -87, -1, -75, -147, 215, -184, 11, 152, -123, -201, -116, -199, -95, 253, -85, -48, -226, 9, 149, -246, 265, -182, -114, -243, -400, -169, -153, 103, 37, 263, -281, -41, 87, 8, 133, 192, -71, -130, 107, 163, 214, 5, -56, -343, 45, -321, 137, -144, -97, -75, -130, 219, -90, -233, -230, -134, -48, -154, 117, 55, 28, 298, 195, 9, 434, 238, -397, -209, 228, 82, 51, -127, 38, -41, -70, -59, 57, -281, -79, -168, -16, -215, -134, 6, 10, -383, -261, 13, -72, -49, -189, -126, 68, 149, 177, -101, 60, 261, 189, -126, 40, -21, -56, -173, 280, -197, -217, 310, -184, 68, 232, 26, 5, 17, -582, 126, 74, 80, -76, 158]
5691A58L9j86q7l8J96J12j29j06J70n54M57l1l2pJ17l1O3k82L57J55k63j39n1
5714a12L7j00J26q1KM02j28L3m76N66j92l85K22J11k71J83K3k01M16l81RL8k3
5737a82J17J83l39L31j61K90k18p8K40k55N8L03j81k18J43k16J09K77j71j41K65
5758A56k71P0K89m45M58l71j77M64o5k46J90K33q7j14K6O8J2l69M1J16j98N08
5780B88l04j94j3oK93j92J02qL45m13p6L01rj01O9J75P5n26L13l0J82m3j0j72
5804D6O9k10j52M88j77k13q1N2J68j30j1J71K6J23K4l13K10q7k97K00j65K39j93
$$ y = [158, 197, 11, -76, -114, 82, 194, 65, -41, 129, -425, 32, 1, -31, -38, 79, 48, 111, -171, 186, 341, 78, -61, -112, -75, -175, -49, -130, -128, 274, 146, 179, -297, 269, 77, -308, -86, 25, -246, -63, -40, -241, 175, -206, -197, -159, -182, -65, 118, -221, 110, -51, 239, 21, -57, 183, -72, -14, 289, 108, -110, 33, -183, -74, 203, 32, -109, 156, -115, -45, 244, -201, 257, -114, -291, 173, 108, -138, 52, 285, 198, 84, 110, 178, 190, -179, -138, -22, -220, 288, -16, -210, -223, -229, 64, -128, -26, -34, 311, -102, -178, 123, 114, 13, 82, 257, 332, -194, 119, 89, 271, 228, 218, 46, 115, -95, -247, 241, 64, -149, -230, -178, -10, -140, -151, 20, 46, 169, 193, -120, 90, 3, -294, -94, -259, -20, -213]
$$ [...]
8191a17
##END NTUPLES=NMR FID
##END=
