##TITLE=1H_DE-32_oil_TFAA
 CDCl3
 64 sc, 
 20.2.2024
##JCAMPDX= 6.0         $$ Bruker NMR JCAMP-DX V2.0
##DATA TYPE= NMR FID
##DATA CLASS= NTUPLES
##ORIGIN= UXNMR, Bruker Analytische Messtechnik GmbH
##OWNER= root
$$ XWIN-NMR		Version 3.5
$$ Tue Feb 20 16:12:51 2024 Russian Standard Time (UT+4h)  she@DPX200
##.OBSERVE FREQUENCY= 200.1313
##.OBSERVE NUCLEUS= ^1H
##.DELAY= (6, 6)
##.ACQUISITION MODE= SIMULTANEOUS
##.ACQUISITION SCHEME= undefined
##.AVERAGES= 64
##.DIGITISER RES= 18
##SPECTROMETER/DATA SYSTEM= spect
##.PULSE SEQUENCE= zg30
##.SOLVENT NAME= CDCl3
##.SHIFT REFERENCE= (INTERNAL, CDCl3, 0, 15.7039)
##AUDIT TRAIL= $$ (NUMBER, WHEN, WHO, WHERE, WHAT)
$$ ##TITLE= Audit trail, XWIN-NMR		Version 3.5
$$ ##JCAMPDX= 5.01
$$ ##ORIGIN= Bruker BioSpin GmbH
$$ ##OWNER= she
$$ F:/spectra/data/she/nmr/H-F/1/audita.txt
$$ ##AUDIT TRAIL=  $$ (NUMBER, WHEN, WHO, WHERE, WHAT)
(   1,<2024-02-20 16:08:42.35 +0400>,<she>,<DPX200>,
      <continue with go, POWCHK disabled, PULCHK disabled
       configuration hash MD5:
       00 E9 B6 7A A2 85 ED C7 34 08 36 98 17 FE 4E 26
       data hash MD5: 16K
       CF 4E E8 5E 1F FE FE EB 60 B8 D9 FD 87 2B DF C5>)
$$ ##END=
$$ 
$$ hash MD5
$$ 02 11 FE B7 07 6D BC 31 47 9C D5 6F E5 4A CA 45
##$RELAX= 
##$RELAX= 
##$RELAX= 
##$RELAX= 
##$RELAX= 
##$RELAX= 
$$ Bruker specific parameters
$$ --------------------------
##$DU= <F:/spectra>
##$EXPNO= 1
##$NAME= <H-F>
##$PROCNO= 1
##$TYPE= <nmr>
##$USER= <she>
##$AMP= (0..31)
100 100 100 100 100 100 100 100 100 100 100 100 100 100 100 100 100 100 
100 100 100 100 100 100 100 100 100 100 100 100 100 100 
##$AQSEQ= 0
##$AQ_mod= 1
##$AUNM= <au_zg>
##$AUTOPOS= <>
##$BF1= 200.13
##$BF2= 200.13
##$BF3= 200.13
##$BF4= 200.13
##$BF5= 200.13
##$BF6= 200.13
##$BF7= 200.13
##$BF8= 200.13
##$BYTORDA= 1
##$CFDGTYP= 0
##$CFRGTYP= 5
##$CHEMSTR= <none>
##$CNST= (0..31)
1 1 145 1 1 1 1 1 1 1 1 1 1 1 1 1 1 1 1 1 1 1 1 1 1 1 1 1 1 1 1 1 
##$CPDPRG= <>
##$CPDPRG1= <>
##$CPDPRG2= <>
##$CPDPRG3= <>
##$CPDPRG4= <mlev>
##$CPDPRG5= <mlev>
##$CPDPRG6= <mlev>
##$CPDPRG7= <mlev>
##$CPDPRG8= <mlev>
##$CPDPRGB= <>
##$CPDPRGT= <>
##$D= (0..31)
0 1.2 0 0 0 0 0 0 0 0.06 0 0.03 0 0 0 0 0.0002 0 0 0 0 0 0 0 0 0 0 0 0 
0 0 0 
##$DATE= 1708430704
##$DBL= (0..7)
120 120 120 120 120 120 120 120 
##$DBP= (0..7)
150 150 150 150 150 150 150 150 
##$DBP07= 0
##$DBPNAM0= <>
##$DBPNAM1= <>
##$DBPNAM2= <>
##$DBPNAM3= <>
##$DBPNAM4= <>
##$DBPNAM5= <>
##$DBPNAM6= <>
##$DBPNAM7= <>
##$DBPOAL= (0..7)
0.5 0.5 0.5 0.5 0.5 0.5 0.5 0.5 
##$DBPOFFS= (0..7)
0 0 0 0 0 0 0 0 
##$DE= 6
##$DECBNUC= <off>
##$DECIM= 32
##$DECNUC= <off>
##$DECSTAT= 4
##$DIGMOD= 1
##$DIGTYP= 9
##$DL= (0..7)
0 120 120 120 120 120 120 120 
##$DP= (0..7)
150 150 150 150 150 150 150 150 
##$DP07= 0
##$DPNAME0= <>
##$DPNAME1= <>
##$DPNAME2= <>
##$DPNAME3= <>
##$DPNAME4= <>
##$DPNAME5= <>
##$DPNAME6= <>
##$DPNAME7= <>
##$DPOAL= (0..7)
0.5 0.5 0.5 0.5 0.5 0.5 0.5 0.5 
##$DPOFFS= (0..7)
0 0 0 0 0 0 0 0 
##$DQDMODE= 0
##$DR= 18
##$DS= 0
$$ [...]
##$SUBNAM2= <"">
##$SUBNAM3= <"">
##$SUBNAM4= <"">
##$SUBNAM5= <"">
##$SUBNAM6= <"">
##$SUBNAM7= <"">
##$SUBNAM8= <"">
##$SUBNAM9= <"">
##$SW= 18.0517328524113
##$SWIBOX= (0..15)
0 0 2 0 0 0 0 0 0 0 0 0 0 0 0 0 
##$SW_h= 3612.71676300578
##$TD= 16384
##$TD0= 1
##$TE= 0
##$TE2= 300
##$TE3= 300
##$TEG= 300
##$TL= (0..7)
0 120 120 120 120 120 120 120 
##$TP= (0..7)
150 150 150 150 150 150 150 150 
##$TP07= 0
##$TPNAME0= <>
##$TPNAME1= <>
##$TPNAME2= <>
##$TPNAME3= <>
##$TPNAME4= <>
##$TPNAME5= <>
##$TPNAME6= <>
##$TPNAME7= <>
##$TPOAL= (0..7)
0.5 0.5 0.5 0.5 0.5 0.5 0.5 0.5 
##$TPOFFS= (0..7)
0 0 0 0 0 0 0 0 
##$TUNHIN= 0
##$TUNHOUT= 0
##$TUNXOUT= 0
##$USERA1= <user>
##$USERA2= <user>
##$USERA3= <user>
##$USERA4= <user>
##$USERA5= <user>
##$V9= 5
##$VALIST= <valist>
##$VCLIST= <CCCCCCCCCCCCCCC>
##$VD= 0
##$VDLIST= <DDDDDDDDDDDDDDD>
##$VPLIST= <PPPPPPPPPPPPPPP>
##$VTLIST= <TTTTTTTTTTTTTTT>
##$WBST= 1024
##$WBSW= 4
##$XGAIN= (0..3)
0 0 0 0 
##$XL= 0
##$YL= 0
##$YMAX_a= 227496
##$YMIN_a= -317559
##$ZGOPTNS= <>
##$ZL1= 120
##$ZL2= 120
##$ZL3= 120
##$ZL4= 120
##$ABSF1= 10
##$ABSF2= 0
##$ABSG= 5
##$ABSL= 3
##$ALPHA= 0
##$AQORDER= 0
##$ASSFAC= 0
##$ASSFACI= 0
##$ASSFACX= 0
##$ASSWID= 0
##$AUNMP= <proc_1d>
##$AZFE= 0.1
##$AZFW= 0.1
##$BCFW= 1
##$BC_mod= 2
##$BYTORDP= 1
##$COROFFS= 0
##$CY= 11.3945322036743
##$DATMOD= 1
##$DC= 2
##$DFILT= <>
##$DTYPP= 0
##$F1P= 15.7292609196834
##$F2P= 12.9074282941183
##$FCOR= 0.5
##$FTSIZE= 0
##$FT_mod= 4
##$GAMMA= 1
##$GB= 0.15
##$INTBC= 1
##$INTSCL= 1
##$ISEN= 128
##$LB= 0.24
##$LEV0= 0
##$LPBIN= 0
##$MAXI= 10000
##$MC2= 0
##$MEAN= 0
##$ME_mod= 0
##$MI= 1.114404
##$NCOEF= 0
##$NC_proc= 0
##$NLEV= 6
##$NOISF1= 3.799351
##$NOISF2= 2.8
##$NSP= 1
##$NTH_PI= 0
##$NZP= 0
##$OFFSET= 15.70392
##$PC= 1
##$PHC0= -24958.5
##$PHC1= 10.65264
##$PH_mod= 1
##$PKNL= yes
##$PPARMOD= 0
##$PSCAL= 0
##$PSIGN= 0
##$REVERSE= no
##$SF= 200.130013532006
##$SI= 16384
##$SIGF1= 3
##$SIGF2= 2
##$SINO= 400
##$SIOLD= 16384
##$SREGLST= <1H.CDCl3>
##$SSB= 0
##$STSI= 0
##$STSR= 0
##$SW_p= 3612.71676300578
##$SYMM= 0
##$S_DEV= 0
##$TDeff= 0
##$TDoff= 0
##$TI= <>
##$TILT= no
##$TM1= 0
##$TM2= 0
##$TOPLEV= 0
##$USERP1= <user>
##$USERP2= <user>
##$USERP3= <user>
##$USERP4= <user>
##$USERP5= <user>
##$WDW= 1
##$XDIM= 8192
##$YMAX_p= 0
##$YMIN_p= 0
$$ End of Bruker specific parameters
$$ ---------------------------------
##NTUPLES= NMR FID
##VAR_NAME=  TIME,          FID/REAL,        FID/IMAG
##SYMBOL=    X,             R,               I
##VAR_TYPE=  INDEPENDENT,   DEPENDENT,       DEPENDENT
##VAR_FORM=  AFFN,          ASDF,            ASDF
##VAR_DIM=   8192,          8192,            8192
##UNITS=     SECONDS,       ARBITRARY UNITS, ARBITRARY UNITS
##FACTOR=    0.0002768,     1,               1
##FIRST=     0,             0,               0
##LAST=      2.2672688,     0,               0
##MIN=       0,             -317559,         0
##MAX=       2.2672688,     227496,          0
$$ Real data points
##PAGE= N=1
##DATA TABLE= (X++(R..R)), XYDATA
0@%%%%%%%%%%%%%%%%%%%%%oO6j24J28j28J28j28J32j70K28k54K62l00L56l89M31
37B32m92N49o13O81p56Q30r19J031j135J247j375J512j666J835k023K230k462
54a294K722l012L347l727M170m696N325o101P082q365J0123j2690J6772k4319
68a4663M2763j81841j63818L74597N8671j64512J14750J48179j66932l1831J40298
79A55661p9125j64873R8441N8955j61694n0364J07917o1095r4361J11965J14031
90C5458m1191K0085J03807j5512q5643L9793O3637o7344n0631N5627k9774j07908
102g9596J4765M6098o4914l391R5444j1297o5072O2373M4214q0852J3941J17819
114H9532k6075p8761O8527L6129r6501r032O4018m6402n1376N5709n79p9664J0222
$$ y = [0, 0, 0, 0, 0, 0, 0, 0, 0, 0, 0, 0, 0, 0, 0, 0, 0, 0, 0, 0, 0, 0, -6, 60, -64, 64, -64, 64, -64, 68, -102, 126, -128, 134, -166, 190, -199, 232, -260, 289, -324, 357, -399, 431, -488, 543, -592, 655, -720, 792, -874, 961, -1062, 1168, -1294, 1428, -1584, 1763, -1964, 2206, -2490, 2835, -3266, 3816, -4549, 5574, -7116, 9656, -14663, 28100, -153741, -317559, 57038, 115709, -48803, 65947, 214126, 47194, 15363, 155661, 76536, -88337, 10104, 69059, -92635, -142999, -35082, -96177, -190538, -78573, 35458, -5733, 14352, 118159, 102647, 17004, 56797, 120434, 53090, 2459, 58086, 28312, -79596, -64831, -18733, -83647, -87038, 8406, -2891, -67963, -5590, 38624, -42228, -28287, 89532, 63457, -15304, 53223, 89352, -7149, -16181, 47837, 1435, -49941, 5768, 5189, -74475, -64253]
127f4253O0682k6493j9558P1811K4394m5503K2260M3705m1161l1519M1296Q22
139C6483n9118k132L1619l5938l7205M5416K7517l8552J4326N5186k2479l1479
151a6356M7700J2307n5255J2919M5838m3062m0350M5918M763n8338J7686M8750
163B2520l5331k4292N1422K928m6356K5451M3238l2556j9004M2996Q92m3274R134
176b232K4468l1551j9891K8898l383l4181J3408K8102j9311p371L7634J2391k5012
189A969J2689K8053k0414k1580K0646r55l5191O80J6237k5913j5136K6866J558
202a0491k2271J8837K9427j5465m610K8941P81k0007J5448J2264k5560q744J7965
215A6515j0890k6534P904R886j9570m480J8238l557j1238J8909J4754j0670M716
$$ y = [-64253, -3571, -30064, -49622, 22189, 46583, 1080, 23340, 67045, 25884, -5635, 35661, 36483, -22635, -24767, 6852, -29086, -66291, -20875, 6642, -31910, -17584, 37602, 15123, -16356, 31344, 43651, -11604, 1315, 47153, 4091, -36259, 9659, 14422, -43916, -26230, 22520, -12811, -37103, 14319, 17247, -29109, -3658, 39580, 7024, -11980, 31016, 31908, -11366, -2232, 22236, -9315, -29206, -308, -3691, -37872, -24464, 3638, -15673, -23044, 14590, 26981, 1969, 14658, 42711, 22297, 717, 21363, 20408, -14783, -14103, 2134, -23779, -38915, -12049, -10491, -32762, -13925, 15502, 37, -4573, 24368, 25149, 5142, 20590, 32854, 7294, -1450, 16515, 5625, -20909, -13005, -3119, -22689, -27169, -8931, -12488, -23726, -4817, 9937, -733, 3983]
228C983K1969k379j2549J0095N626j9037r370R429r432j9970N125N571j3067Q7
242b3919J7515J60n564J5238J1596p447J478J2935m040j1048O142j39j5016k238
256d347O451r755r314P180K722q456L690R751l179r61J1128L011m993O557O434
271A5919o753l702O663m496j1183J007K891j0403k459P604l254n108P447Q671
285B844n487J260J1762j674o283M933L097q359k653N518n269q427O871K629p636
300f874r1J0223l258o124P752L157o682N2Q665m723n831P261J657q899J390P064
316D739n564n383P542J672p887L049P033n011m509P966K413r219K602P289o598
331A34n553O002P80p437O04O388l589k800P792J195n409M058O067m497m929P190
$$ y = [3983, 25952, 23573, 11024, 21119, 26745, 7708, -1662, 7767, -1665, -21635, -16510, -10939, -24006, -23919, -6404, -6244, -11808, 3430, 15026, 7579, 9057, 21992, 17952, 6904, 13046, 12907, -2109, -4347, 2104, -7651, -16965, -9785, -7063, -15519, -11829, -2078, -5257, -6218, 4910, 7921, 2928, 9485, 15919, 9166, 5464, 12127, 7631, -3552, -2545, 346, -10057, -12516, -4912, -8166, -13274, -5827, 2844, -2643, -1383, 10379, 8705, 2422, 7355, 10452, 2093, -560, 4958, -311, -8738, -1867, 762, -6874, -6965, 3258, 0, -6124, 1628, 4785, -1897, -1845, 6820, 2097, -3734, 3527, 5184, -3715, -2325, 4739, -825, -6208, 1334, 3006, -4881, -1832, 5201, 190, -4319, 3647, 6060, -3159, -557, 6732, 134, -5419, 583, 1363, -6074, -5470, 918, -2671, -5471, 2321, 3516, -1893, 2165, 8232, 3735, -1194, 5996]
347E996o75q313J135L498n379m203N419J97n890M318O464m135k78P137R15n782
363D24L463N118o333l188M819j167p702K062L731p101j819N739M48n638L919N996
379B771m494Q58O209K08m004L281K992n395k417M173j975o168P42J787l917j384
395f733M214l80k285M104M437l080j20O066r60l141J679K248m638k132L673l026
411g4m959K414J004l179J79L587m0l337M148L377k931n1M103j075k791L386P50
428D511m873M20J491j510l544K249j5k368K72L524j369j155K940J378j582M31
444H00L579j992k429J973K23k769L67J508k315j481J938L45k529J264J954j578
460a142j571L165J124j776m73L056k293q1J597m92k001P63J785j963p55J445M
$$ y = [5996, 5321, -2992, -1857, 1641, -3738, -7941, -2522, -2325, -8215, -3897, 2567, -1568, -1846, 5291, 6206, 424, 3887, 9005, 2672, -516, 4303, 3136, -4566, -2504, 1227, -5874, -7693, -1954, -1506, -7144, -3225, 2771, -1723, -865, 5344, 5552, 1548, 4829, 7821, 2426, 9, 4182, 2207, -3961, -3219, -1432, -5349, -6733, -2519, -2899, -5184, -1080, 3357, 277, 157, 6223, 5263, 2122, 3801, 6049, 1411, -721, 2952, -74, -5033, -2619, -1615, -4794, -4615, -1028, -1068, -4405, -257, 3120, 189, 138, 4241, 3166, 375, 3761, 4511, -362, 58, 1549, 39, -3505, -1256, -1271, -3639, -3367, 157, -1212, -2367, 573, 1951, 369, 800, 4379, 2387, -42, 1931, 2154, -615, -248, 1260, -1055, -2536, -598, -253, -2782, -1518, 436, -1142, -2713, 452, 1576, -200, -673, 2383, 90, 9, 1606, 1114, -887, -124, 1661, -302, -1057, 388, 392]
477C92j757P49J359j068q62K384n49j804N86K441k142j118K463m39o24j2P10O5
495G74j567J032M70j067Q81R38j694j36O77r6j982R45J483k021MJ396R91q94L98
514E32Q85q53m08J068n41j281J292J26j300l21N14q87k78R72l55r5J118j98n03
533e13k10J663N70p73j56L33n27l32J151l89j690L35M04j788O11Q86l38k35k2
552a020J420m22Q3Q06K26q24L24J691j294r56N85N40j923k84O36r49j56Q36K28
571d53q58J432P70q58o27J651q22r4K99Q61j378J54N67j37j874J292k66j047n
590a393J261k83o51J99J465r68L38R34p1o23M86M30l34j024J278r32o08k46R94
609B52r94j68M29M10m00N96k13k68N92L82p47L51m25O99k73l99K69L84m29r37
$$ y = [392, -1365, -616, 743, -325, -1187, 1197, 648, -1156, -570, 1871, -271, -1389, 1074, 635, 11, -1, 709, 774, -793, 239, 709, -358, 523, 1461, -233, -369, 308, 212, -1770, -825, 658, -1363, -1359, 37, 1028, 134, 532, 1417, 564, 156, 1224, 683, -598, 694, 820, -480, -801, -287, -1174, -1452, -480, -835, -930, 188, -10, -513, -723, 940, 1510, 737, 581, 914, 387, 55, 1206, 817, -873, -538, -134, -1922, -1311, -425, -763, -998, -1020, 400, -22, 61, 867, 1093, 269, 593, 2284, 990, 34, 619, 1159, -764, -1048, -412, -1361, -1517, -681, -453, -1311, 121, 891, 33, -594, 1057, 235, 141, 440, 1301, -77, 77, 644, 507, -1367, -75, -341, -1388, -1393, -132, -415, -1066, -867, 598, -370, -32, 902, 831, 208, 694, 1124, 790, -234, 1044, 112, -496, -742, 252, -742, -910, -481, -71, -471, 125, -88, -356, 236, 618, -129, 222, -203, 496, 223, -176, 93, 477, 48, -889]
629h89P09L24j19m48Q8m17R04K85n42M59Q77n82j121O23L77q23L66K08J26n70
649a65n06J917k711J385K57k69o66O63j83J158j833J183N0m01J18O40o71R2O45
668G03n91l44K85P81j276P27o59L17n61K9J00L54k5J4M0L17o43P00L96m46J194
689A412o39r29j39M42n43p7k3L54n06O82K68j27n55K26L21n36P52j18J12%J91
710E68l82L01l06k72K40kj075J105j21o85J25o24M96Q40q11l76J726j001J78M93
730D17k43j26p9Q4P43j049P6K01N8r75J506j60o22n25R52m92k13J19J044n8p22
751f4J22m0j71N87j7N4M8o21O09q50J30J92l38N17k46k40p6K67L71j4n43O52K49
774E78n10p0p21R62k81K95n58l22O43n37K1p7J98J202j106K41L15k02M50n2q99
$$ y = [-889, -180, 144, 25, -423, -335, -752, 152, 437, -105, 354, 1231, 649, -472, 151, 528, -295, 71, 279, 405, -165, -671, 1246, -1465, -80, 177, -92, -758, -95, -278, 880, -953, 230, 280, -121, -3, 637, -34, 58, 703, 112, -232, 53, 834, -442, 285, -374, -57, -618, -589, -489, -135, -160, -146, -106, 211, -432, 268, 664, 218, 1412, 773, -156, -295, 147, -396, -473, -496, -142, -648, 34, 302, 175, -380, -154, 167, -369, 383, 265, 377, 377, 568, 186, 487, 181, -91, 149, 147, -928, 177, 56, -629, -504, -1128, -632, 208, -603, -979, 747, -254, -76, 417, 174, 48, -31, 53, 796, -253, -177, 24, 82, -893, 613, 453, -169, -694, 258, -234, -447, -328, 716, 658, -64, 58, 18, -153, 434, 417, 471, 519, -102, 507, -343, -213, -21, -359, 158, -88, -328, -404, -137, 234, 220, -323, 329, 578, 68, -2, -723, 239, -42, 253, -305, -627, 16, -521, -500, -577, -379, 823, -283, -42, 273, 71, 521, 469, -430]
795d30J260k22l92k42O14j80q40m84O72M57m07l04N91q70N15l3K76k68K64N03
815D80n99P34J54l15p29L93m42K80M55J01N20j647J50J004r86L06L64j173J121
834A71K02n11J60j68O40O3m46k30J02p10P37N37j80m9l94J38o7k73K30m83N65
855C4N25Q3q82L49L38l91k39j84N15k5J18k5j80oJ97J24L40q27m04N02O0j54n3
878a85J09J94j58m90P35P48o27K04L42p75j8j46j20J99L13l73M29m20j081Q04
898c16N44k58K14r4j95l08J383o66M34l56j67m87M61N13j238O91p82O19P18r86
918b76M47m76M50n11K19K22l44Q86l45n36L47L04l4o02N8L3K20j52J4k45L10K94
940B83p87J249p29l1l7M27p64J78N41r28P65m7P52j217K30M00k99J94l93P6l07
$$ y = [-430, 830, 608, 216, -26, 588, 408, -432, -916, -244, 213, -194, -498, 93, -777, -262, -295, -19, -287, -23, 480, -119, 615, 769, 454, -275, 118, -324, -44, 411, 512, 1032, -615, -465, 539, -447, -141, 223, -950, 171, 373, -138, 22, -146, 494, 557, 111, -119, -17, -727, 10, 547, 367, 318, -76, 62, -5, -278, -48, -531, 34, 559, 642, -240, 109, 447, 56, -183, -367, 148, 123, 241, 216, 36, 30, 227, 351, 691, -136, -540, -38, 22, -132, -185, -76, 118, -40, -530, 205, 953, 326, 530, 872, 97, 79, -67, -187, 12, 325, -48, 381, -39, -1120, -316, 228, -30, 184, 90, -105, -413, 970, 304, 738, 382, 215, -272, 189, 702, -536, 155, -627, -8, 710, -276, 171, -305, 145, -366, -147, 75, -269, 617, 272, -264, 83, 387, 353, -249, -191, -158, 62, -90, -76, -321, -11, 283, -504, 745, 16, -15, -52, 375, -389, -211, 330, -598, 167, 120, 872, -345, -115, 285, -14, 180, -213, -137, -444]
961d44M69qK0J98m12j91M61P03j325K6O65l49N59k35m87O97m09o9j66O7L61n67
983d36O38l6k24k53M43O93j131n1l99R51K30o57m09P08P14o69p15O9K4L95O46
1004E31l40l26l44P10l00L78m56K02L9l95M94L68o95L02J86j2K37k80J57j96R36
1025A196j405l96J337n16j98O7k18l45O09l73K79J32M7o67R01o93M23l25L67l46
1045a24j04J19j22l35P06j63J3n49L02Q75m15j29J31m82J48k60n08J572m99K53
1065D29o81R86p87K44k28k5O3M62l29l70L61j81j14L11m39L43N93l97J46j47l77
1086a37k89P6p6O02m54J63k6o81R97j99L63l19k42k81M42P44k90L87j042P8M93
1107C09j063J080q67K89N72K46m17K43Ro9k05l61N56m06j31K8N71Jm50L98j059
$$ y = [-444, 25, 17, 37, 235, -177, -368, 93, 796, -529, -503, 162, -187, 372, 137, -350, 347, -62, -131, -297, -230, 131, -436, 202, 166, -58, -311, 132, 825, -306, -357, -756, 195, 425, -232, -641, 67, 781, 112, -603, -534, -510, -115, 531, 191, -135, -479, 231, -69, 309, -147, 55, 94, -301, 193, 561, -134, 168, 354, 342, 579, 299, 456, 260, 1196, -209, -605, 732, 216, 18, 85, -133, -478, 131, -242, 37, 169, 216, -451, 450, -243, 180, -145, 222, -124, -228, -109, -231, -566, 140, -23, -10, -559, -257, 618, 203, 74, 205, -277, -129, -389, -897, 675, 176, 429, -252, 734, -53, 191, -37, -62, 1, 463, 134, -236, 125, -56, -170, 141, -298, 45, 638, 241, 387, 240, -137, -426, -350, -426, 176, -278, -115, -141, -822, 175, -24, 339, 20, -222, -503, -61, 683, 393, 780, -262, -184, 309, -754, 326, -541, -252, 320, 566, 149, 392, 401, 332, 127, -234, 322, -84, -215, -187, 384, 385, -65, 333, -726]
1128g26J005j88j2j67l15N55n59M86m48O40l67q8j50m37K25P16J72j57m33J52
1148i6K38K69P8q70P58r13N25j80L33m15Q30n36Q07o47J31p36N15l70L3J15k92
1169d23R2J12J36L85m70J65n65Q18J27m71k64O36n05NN81m38O21n61P25q07M91
1190C90l60m54R80n75K44j24k22j01Q29j52n67L82m8l15J07m79k8N74o43J249
1210F87j093L55K2N07p30J084p76j80K35R6q17J018n95P23j93L47j044Q03l02
1229A47O2L12o20P77o40j61M53j19k19N78j225J302j378J426l36J03m08M4m22
1248c24P19j038N39q6r3K24l81O72k13k13j07N68n31N9N7R46j233J12N08J04n73
1269b84n89Q78J17k15J03j91O32p56K34p66J264n51J004q75K03R9l09q88K70R82
$$ y = [-726, 279, 91, 79, -88, -403, 152, -407, 79, -369, 271, -96, -184, -334, -771, -546, 170, 342, 185, -248, -96, 142, 411, 489, -381, 377, -536, -11, -191, 142, -273, 557, 21, 828, 181, 312, -424, 91, -279, -246, -131, -423, -331, -219, -83, 302, -168, -3, -568, 250, 377, -94, -358, 278, -227, -222, 359, -79, 542, -19, 706, -101, 390, 30, -424, 556, -19, 225, 101, -121, -222, 607, 455, -112, 270, 222, -93, 14, -465, -493, 81, -562, 687, -406, -51, -29, 478, -252, 832, 56, -124, 111, 207, -610, 408, -187, 536, 343, 690, -354, 449, 147, 209, 521, -99, 678, 38, -123, 330, 211, -8, 570, -655, 647, -731, 695, 359, 462, 54, 98, -324, 395, -643, -104, -190, -283, -59, -440, 232, 19, -194, -301, 267, -264, -205, -148, 798, -435, -323, 185, 289, -284, -873, 5, 122, -93, 10, -181, 451, -305, -71, -837, 427, -124, 880, 5, 208, 307, -2, -890, -620, 362]
1289C62J92j008N92K54n75P90j000p18J058K52J11q19L42Q25n01J58o82L64N03
1308E00m14q6m78R56k04k28N02l53L19n52o35Q51r7m9J46j37o5J73O03p94o26
1329f68k3l99J864o00l72N90k54O16r86j32K13O09l4q71J13L71Q7k07M77j4m04
1350b4l04N50J4j24m64O98N05q31j14O8j14j64O78n71k37L76k1n93O40P4k27J55
1372c0N35q24K32j49j01M16O42r93M42M00o56R84j357L76n99O14Q62j221M20o1
1392f8J1L66j62n2J75m76P5j02J90M22k30L9l15%J55j62j72l43K62l07K27J200
1414G33p11j052J053J83J36p52J82p5M37J30j031Q37n04n4R20o68j87O18p22l8
1434e65N57J7J4M6j38o4k42L6O29k39l01m32Q45p6K40R05r88k40P54l80j68P01
$$ y = [362, 554, -454, 138, 392, -183, 607, -393, -1111, -53, 199, 310, -509, -167, 658, 157, 315, -367, -3, 500, 86, 0, -478, 478, 274, 46, 548, 195, 514, -38, -673, 178, 81, 32, 178, 41, -24, 149, 752, -42, -668, -691, -1090, 774, 174, -198, 392, 138, 754, -232, -364, -151, 458, 424, -447, -334, 37, 124, -83, 394, 380, -24, -328, 222, 236, 112, -352, 346, 851, 20, -94, -26, -140, -304, 374, -197, -434, -58, -79, -672, -32, 42, -185, -30, 505, -319, -87, -236, -337, 79, 721, -272, 170, 570, -86, 898, -459, -83, -682, -68, 794, -427, -7, -68, -57, 309, 147, 95, 270, -206, -131, -233, -43, 379, 149, 188, -127, -127, 28, -134, -306, -649, -387, -694, -467, 733, 22, -1030, 23, 206, 342, -410, -228, -303, 134, 264, -767, 70, -434, -488, 432, -236, -423, 195, -527, -565, -8, 9, 23, 69, -69, -133, -375, -339, 290, 51, -250, -682, 163, 87, 327, 1232, 244, 4, 758, 378, 210, 911]
1456I11q17O53m94l05j40L35m30m71O45k6Q7P87o02m60J05K20p9n06R07j87k97
1477a64P6k22J47J68k72N04j65k06O27r9j250R64q84J092J93k78j85J49k63K70
1497B02q6j42j9j12K00r9M4j02J61j33j24l0m8K52K95o45k40O64m3L3K74m92P3
1520a17n59R67k43j30j4qo8J90P1m15Q19r98O70l41J331j092K2P5n53M16R60p37
1542B46j99n52Q18m67l43Q85q07q7L45K33j7o15P32p3j6J12M75l34j03K4k2l23
1564h8K81J76j66K30l58p24R39J22K43p84L56k12p6J2l29O94N2o55l43N41l77
1585d66N49n39n3J30p9P84P7n28J11o35P31n28L02K13m42N99q6Q91j065mp4K93
1607A81k09J39k8K91o59l0P38l59m08N60q84O81o1K28P5n88Q53o60J45M97q63
$$ y = [911, 94, 747, 253, -52, -192, 143, -287, -758, -113, -139, -52, 735, 133, -327, -222, -2, -81, -587, 320, 133, -164, -88, -310, -163, 5, -267, 237, 72, -134, 493, 394, -856, 108, -776, 316, 509, 231, 46, 195, -68, 202, 116, -26, -45, -157, 43, -56, -12, -114, 47, -86, -210, -240, -288, -36, 259, -386, -626, 38, -5, 28, 302, -190, -117, -676, 291, 48, -82, -96, -104, -172, 18, 89, -326, 493, -505, 165, -176, 1155, 63, 85, 160, -393, 23, 983, 246, 47, -505, 313, -154, -497, 388, -419, -506, -161, 72, 55, -560, 172, 99, 83, 195, 670, 336, 233, 257, 235, -88, 193, 369, 203, 433, 75, -649, 290, 412, 655, -129, 227, 15, -61, -49, -378, 316, 368, -287, -630, -89, -466, 83, -456, -509, -379, -458, 326, 403, -125, -14, -649, 82, -446, -144, 69, -373, 226, 140, 1031, -34, -38, -112, 181, -28, 111, 83, 374, -285, -315, 423, 64, -344, 216, -668, 13, -48, 180, 255, -333, 520, -140, 5, 502, -361]
1628c61L80O91n88k32l39L39n9k25m5P56l43o3n5K33m94M05n66R74J54k95K48
1649E15o10m84j82Q16P02o44j051J155O98j063J49k26Q23k87K73j70l68O13r30
1668b71K00J08j90P14r09j5J92L46q15P28j77l3O12q67J35L35j09m48M32k97L05
1689b4n9L34k29K9m21RL20l46M41K63n33K20N07m76n3K16m16J07M10l85M3J19
1711G6j28R25n34o67K12J48j17Rk07K70J52J59p17n0M84j95K7k13O13m00K46k47
1733a54j43O0O31n51j97M34l93O63l50o2J52P9L59n14J97m74N15K36j25L37p96
1754i6k67M74j425J086J24M41m2j29m01k03P79M92n10j44q96Q30o7k26K21q1k3
1775f3k13j0M45J22o32Q96k44p11L28J00L9j16M28j96o5p0K9K25l05l90R48j2
$$ y = [-361, 19, 710, 122, -110, -449, -110, -169, -394, -439, 317, -26, -89, -144, 89, -405, 0, -566, 408, 562, 267, 515, -95, -579, -761, 55, 757, 113, -938, 217, 915, -148, 1, -225, 598, 311, 584, 414, 46, 659, -271, -71, 37, -153, 561, -348, -363, -171, 175, -640, 88, -89, -122, 490, -377, -242, 93, -16, -464, -32, -329, -24, -83, 251, 22, 51, -370, -361, -41, -387, 54, 317, -216, 4, 511, 35, -18, 198, -218, -111, 299, -86, -43, 76, -52, 873, 339, -328, -116, 32, -85, -76, -283, -13, 139, 298, -419, -469, 15, -180, -153, -366, 247, -153, 93, -154, -297, -237, 394, -157, -354, 80, -313, 350, 0, -62, 90, 169, 528, 14, 211, -263, 252, 488, 363, 700, -96, -363, 111, -1314, -228, -104, 337, 295, 166, -235, -438, 341, 833, 323, 179, -717, 113, 46, -180, 41, -40, -63, -276, -286, 159, 281, -351, 545, 301, -410, -82, 18, 57, -59, 369, 173, 108, 38, 67, 292, -13, -403, 545, 533]
1797E33j25j067R22n23k28M87J54o26Q67m04k45K81J35L46r64J56O62j16j44K34
1817C35r0L61r01j3N41O3j14j70k42N56n34J22N01o59k5N40j92L29j62L88r94
1838c60L84j53J028p50l30Q48p88J67J1l10k09O44N30l35m04m01N01p3P5m61N30
1859A44j38l2R00o59j66K76L63j016K64M22l85O63l87j83j39O3l6L46p91K83M62
1880B54J38K14p40K10M33q12j55K65j4O43n03J28j52K22J53p89L79J79j39k27
1900c13o3O56J17p20l2k13P86nj93M4l4K43j68m33M95L84p71N95r27k63M15L88
1922a2J67n32Q03l81L74k92M7K27K69m85l17L16l39m1Q5R2L76jm9K19j099M30
1944a43kK57K72k3m63Q03k41n09o63P96r4r6K70j34K03m06N30o91J21J40L05k67
$$ y = [533, 408, -659, 263, -260, -488, -1, 153, -473, 394, -10, -255, 26, 161, 507, -457, -301, 361, 245, 101, 335, 245, 606, -295, -308, 233, 296, 182, 12, -230, 326, -208, -86, 415, -244, -269, 271, 79, 408, 246, 634, -360, 24, -129, 899, 149, -181, 667, -121, 46, 57, -253, -462, 182, 712, 377, -27, -428, 73, 0, 75, -386, 144, 6, -26, 874, 215, 49, 325, 688, -328, -64, 358, -27, 636, 249, 66, -73, -10, -46, 300, -491, -208, 254, 392, 606, -134, 76, 509, -303, -458, -193, -207, 436, -67, 61, -91, 131, 284, -505, -126, 53, -86, -313, -376, 280, 397, -323, -355, -568, 218, 213, 20, 64, 30, 273, 105, -328, 167, 551, -220, 375, -552, -815, -400, -12, 155, -377, 426, 45, 419, 127, 174, 401, 670, 185, -132, 184, -155, -196, -111, -19, 357, 356, 307, 526, -573, -143, -145, 112, 384, 361, -102, 701, 460, -49, -712, 84, -10, -106, 164, 30, 233, -173, 357, -334, -213, -73, 232, -35]
1966c5Q0J08P1K79L69j612O42m50O79n58O93l95r12O23j8N85M39j023J81m0M81
1987A87K95n21M63K57j090P93M1o11L82o9l06K90n74j9k74K94P77m92J06K83m37
2008b25M56q46R81r52K34n41O24J029j023L52l91k9N45o23J29j83N92L86j167
2027f52J7P62L98m07j05J65k50N09o32n57J86j42J113m5O13l71p75k71P68l05
2047A9k02j60q4N14L46p45JK47L02N21o33o39J069p07J03r8K25M5J55k00k36Q24
2069F67K72j190N76J41o24Q32K7o89J32L54o70K27j40R99j086Q8O09j213Q33o99
2089e54Q20p51M44J68k72K0m19O44K6l29m59N32P67j087N66L64p62J93m38J51
2109c76O86m23M79O81j257K76j00L25o4m06k71O67p79Q66q12N14m76K17L95q49
$$ y = [-35, 45, 153, 224, 503, 872, -740, -98, -548, 131, -427, 266, -129, -1041, -418, -436, 149, 588, -435, -254, -294, 187, 482, -39, 424, 681, -409, 384, 425, -186, 196, 127, -179, 111, -463, -482, -756, -462, 315, -177, -71, 212, -225, 231, -615, 366, -586, -352, -893, -269, 760, -263, 89, -302, -331, 214, -409, -280, -463, 129, 515, -652, -635, 127, 525, 118, 13, 178, -72, 437, -195, -752, -566, -708, 405, 360, 973, 602, -173, -444, 324, 19, -183, -343, -427, 87, 433, -312, -311, -64, 238, 759, 126, -513, 556, -151, -48, -146, 79, 124, 279, 79, -157, 667, 939, -251, 325, 466, -158, 674, 701, 12, 144, 498, -172, 55, -85, 914, -172, -84, 525, -688, 145, -554, 266, -485, -41, 127, -145, -125, -544, 100, 126, -203, -662, -130, 637, -450, 116, 480, -282, -89, -527, -376, 310, -113, 366, 1047, -210, 66, -34, 291, 227, -179, -450, 217, -562, 304, -508, 6, -470, -253, 142, -707]
2129g07Q56o49O83P5j110Q46m94L29L32l9k66L37m00R2p2M94l02p80O53k3Q74
2150G29o30O49j234J90n09J8N59m39O12j61q9j60Q77m02L43p9m10K49K48j081
2170g20P48l83N50j32k28M63j16j73n16N50J30l12k52O05l60L68J66r13L08L78
2190A61L49m78k53M9j49M82L52o28P40j449K89L20J224o26j14J07p51K79j52N8
2210a90k22k91J051k45j3K91q19Q46p99Q79m8k58m18j85R56r53M76k92N25m40
2230a49j85K51l81P53L74p42j6P47n09L5k00J79j76l25M16L06o10L91L44k53j218
2251i68J129N30n24n05K82N02l77m28K04K25L06o48JK98j11J77J06K54r90K94
2271b43M22r58P68J81n34M45k55l77O9O65m01J18N30m15L74j8m22k32n6N63l35
$$ y = [-707, 149, -500, 183, 258, -852, -6, -500, -171, 161, 122, -144, 193, -207, -115, -187, 307, 5, -775, -122, -145, 729, 99, 748, -486, -296, -805, -787, -228, -667, -55, -216, -305, -465, 412, 10, 353, 274, -136, 113, 361, -720, 28, -355, 195, 63, -165, 298, 182, 9, -507, 43, 173, -139, -391, 214, -146, 222, 388, -525, -217, 161, 510, 32, -221, -172, -321, 161, 513, -115, 625, -824, -535, -215, 1009, 383, 269, 376, -375, -96, -248, -190, -412, -703, 348, 103, 90, 381, -438, 408, -391, 488, 440, 182, -236, -421, 535, -418, 58, -234, 291, -149, -334, -83, -464, 289, 663, -79, -95, 652, 143, 178, -22, 157, -19, -344, 72, 378, -232, 159, 503, 250, -968, 161, 691, 167, -338, -56, 446, 69, -359, -155, 70, 376, -272, -271, 27, -84, 93, 199, 453, -537, -243, 179, -779, -11, 170, -364, 81, -174, -551, -482, 183, -218, -100, 430, 15, 389, 371, -51, -283, -339, 224, -111]
2292a11n81M69L30k77J86p1O89j290N10J39L24j20M65n50r68M61M52K44k99m13
2312d11N73l71j84O02k87L91k42N57q01L85p81M71K0l71R10q07J37N7J06j20N
2333a61r8N79n02j48Q4M72J79l06j04r5j20O00n42q25R06M0j07M1P06m73j74l31
2355c79J05J50J40J72p09O92p5J42j24K08L9q65R85M63p16M57q59K15O24l90j059
2376g84Q29k9l63j0O68q23M24P10m41p76P55k61L62J61k01m57k3M60k53l09n4
2397d15r1J88N83k68K83n1l20p04R09l20L07J92k51l56K93J042q09l13m18M18
2417a01L92k18J78j42k96jN46J52r19M52o24O12k67N16N2l18o53O72L78l06l9
2438F6J08q4k44j21Q70o23j66Q48j193J004l32j61q0O13j008J55L11j57l85P01
$$ y = [-111, -692, -223, 107, -170, 16, -55, 634, -656, -146, -7, 317, 197, 662, 112, -856, -395, 57, 301, 2, -411, 162, -209, -393, 209, -78, 313, 71, 628, -173, 212, -569, -98, -78, -449, 461, -346, -209, -152, -46, -166, -161, -259, 320, -182, -330, -246, 226, 405, 99, -5, -100, -220, 380, -162, -987, -81, -41, -148, -107, 599, 126, -48, -379, -274, -124, 16, 188, -521, 171, 96, 238, 114, 322, 361, -504, 481, 944, 228, 685, -174, 41, 665, 275, -784, 45, 16, -347, -357, 311, -512, -88, 622, 181, -595, 160, -101, 261, 422, 221, -236, -259, 201, -52, -361, -415, -506, -318, 265, -3, 280, 229, -91, -795, 114, -206, 101, 293, 42, -314, -21, 1021, 212, -101, -519, -101, 291, 73, 251, 109, -187, -188, 358, 510, -409, 43, -581, 31, -236, 280, 332, 14, -639, 33, 411, 105, 66, 174, 90, -154, -275, 595, -28, -194, 654, -539, 465, 133, -28, -108, 505, -503, -348, -37, -194, -579, 122]
2458A22J9p94O41K66k24P0M49j36l73K38n3j9K76p22N20j8o31L07N1q0q59M99
2480d51k61M59J10O82j95p67L13j48L20n23Q58m40p8J95j86K49n3P2o34M11l9
2501a06K97N6p81J58N12k88l55O66k01N05k99o71J186k83j001O16N36M0l02m68
2521a83k53P7L58N25m58k54J217j504M0q9L36m02N61n8P89j311J371r58j57P6
2541b77j7J74M64j17j37l73N28n67L53J95j85n1P27o13m68O45k77j35k53M0m13
2562g57J154o25K69m61R91q64L34k18J71j73R86j321P86o69l1M88j9n5N44k38
2582B92K35m99J88j52n4p3k9j2k23M52j90J67q9J03j42n44P81K34n35N67Q4n14
2604D7kN82r36N5J64L46M87q61J01k8J98k45r4O01m26M02l40qj30L79K79j144
$$ y = [122, 141, -653, -12, 254, 30, 100, 549, 413, 40, 278, 225, 206, 482, -240, 280, 262, -369, -62, -11, -91, -950, -451, -712, -253, -143, 539, 344, -423, -110, -258, 62, -461, 397, -43, -121, 74, -112, 137, 84, 156, -478, -67, -106, 191, 247, -534, -376, 136, -152, -507, 159, -42, 463, 164, -507, 679, 396, -605, 11, 547, 587, 285, -183, -436, -359, -1, 524, 66, -188, 1029, -475, -435, -524, -188, -590, -29, -87, 702, -609, 762, -196, -353, -277, -294, -120, 344, 227, 90, -283, 245, -322, 31, 226, 41, -10, 717, 104, -364, 281, 4, -131, -384, -344, -757, 397, -228, 41, -420, 571, -293, 41, -177, -6, -179, 807, -514, 272, -397, -428, 60, 41, -14, 530, 292, 527, 28, 216, 64, 10, -63, -92, -104, -327, 125, -65, 102, 13, 116, -26, -570, 211, 445, -90, 477, 561, 47, 45, 627, -309, -254, -90, 256, 743, -118, -17, -45, 153, -92, -186, 415, -11, 391, 51, 43, -87, 292, 571, -573]
2626e73J11K23o26J185l33j54l93o5J62R81L90p03o46M92O4L68m59p63J241j214
2646g12L03J61J36J0p44M7J318p16n1Q12l00l11j0O0l93J60j08K06N91p04L35
2667I0O5n33L41J7L91M81p57m52K93J95K63m47M8Q25n12q06L66K03q72R91k63
2688g3KN6N49p73k62P56k95N70n48L3N4M3K54p0l85K06l92L62M10o37l36J220
2710G44p86J04P7j70j84j74P63m29o3N91k29n51P50l50m68L68R33j154K99p1Q97
2731H97j645O07j92M84j61l84j10L17Q8K67N3M53q13M76L63j294R7R21m66O61
2751F19l62j196Q81M52l50K62k26P6m74M27m55J456r36k74M78j226Q18k45J004
2770G29n97L73l66J16k96K91j35J93q39J195m90m17l4M29J67l33L32j90r4k00
$$ y = [-573, -462, -239, -865, 320, -13, -167, -560, -625, -463, 518, 908, 205, -441, 51, 115, 483, 24, -739, 502, -712, -409, -248, -112, -102, -846, -799, 519, -197, -248, 564, 264, -47, -57, 3, -390, -230, -338, -132, 459, -245, 90, 155, -378, -37, -20, 371, 852, 95, -357, -64, 131, 394, -53, -5, 820, 308, -498, -132, 71, -801, 190, -73, -71, -15, 534, -239, -501, 255, -40, 530, -18, 15, 69, 112, 366, 296, -89, 117, -275, 87, 497, -140, -476, 744, -42, 62, 139, -31, -215, -389, 374, -55, -118, 473, 244, -307, 443, 93, -375, -7, 926, -228, 71, 0, 897, -748, -141, -333, 151, -10, -394, -504, -187, -99, 168, 221, 674, -139, 337, 700, -594, -497, 424, -42, 619, 257, -939, -58, 394, 44, 306, 80, 156, -318, 109, -346, 1110, 174, -100, 378, -848, -30, -275, 729, 132, 505, 139, 255, -41, 250, 115, 308, -531, 664, 174, -243, -277, 152, 319, -14, 318, 128, 34, -166]
2790a66R7M11N6p59L29l2O61p10P47j43k87j83o15J031n25O14j65k71J65J22l53
2811B4J89O12m85l37k74O15pK79m20l14p82O33M50K20m7l70Q8j62K59m53M17K14
2833C49l97l68Q89q42N10l69O98k16k26K41Q3j98o77Q8L80M4j0Q8k62k6J54l12
2855c79O90l0j77k7j9J23l49j35j9M44m7J82m89L46n64J27l52O35Q14n92k07J60
2877A35o1J59J86k37J30l81M90p57J590j816O72o1P4N77p37L69m99K31j25J41
2897H0j35j27J09O98j39p02M20p37R98l96l33M42n84L50l89J71P35r57Q91l02
2917I3p47M07l74l83R86P38j568J123j74r8R9J02o42J25l82J136l21j75j86J378
2937A137j109k81P98p75J07k95N09m07m4K37j59J049k48m93k69m37J049k22n73
$$ y = [-166, -69, 342, 398, -361, -32, -64, 597, -113, 634, 491, 204, 21, -594, 437, -88, 526, 361, 90, 255, 377, 24, 213, 825, 340, 3, -271, 344, 337, 616, 196, -118, -900, -267, 183, 403, 356, -14, 74, -88, 171, -282, 135, 349, -48, -416, 473, -369, 141, -228, 470, 254, 28, 269, 352, 154, -523, -435, -55, -11, -21, 67, -195, -221, -67, -379, 311, 281, 104, 77, 58, 181, -168, -303, -322, 122, 75, 257, -232, 114, -450, -323, -675, -40, 774, 182, -25, 135, 74, 233, 419, 182, 312, -69, 421, -336, 1254, -562, 110, 49, 123, 700, -37, 332, -167, 64, -61, 80, -55, -182, -73, 625, 486, -216, 204, -533, 465, 69, -264, 178, -406, -56, -445, -274, 461, -496, 395, 93, -654, -247, -621, -1004, -18, 720, -848, 275, 101, 3, 102, 204, -438, -313, -695, 441, 120, -55, -241, 1137, 28, -253, 545, -230, -123, -418, 91, -316, -360, -123, -282, 767, 519, 26, -243, -680, 369, 147, -426]
2956d26O8L09P35j100K85O43M14o48L87q52L65q9m53N04l99N97j035O50j32N8
2976a19l21O62J96p98O39l20L7L8k29l11K99O56p57Q61l58j68M46p3k94N19o82
2997g7M87k9r01N96J53n30L75Q4j23l0O56l33k96j75n9K99j87J62k38K76R5L44
3019E49l29J83m96j09J04J56O4m19L69K84m45J03K40m45j35L35k89P07n34R87
3039H80r81J018o09m33N64p76M66k60L06m3m06K9L3K97m79n1L92O26k59k26J42
3060B30m98P00k28o15Q06p79J5Q43q02J074o74o22K13L87n42M92m11p3k96J436
3080F56j47n34r2N36j4q98P41l74M03K09n36M21k70%n03P85N9j26p94J234j253
3101d97J047o55j00K6N5n5J41n57K25O59l41N03q21J33N0j30L50l31j8O33mm30
$$ y = [-426, -358, -49, 686, -414, -129, 514, 928, 280, 667, -185, 180, 91, -362, 142, -257, 340, -695, -45, -177, -119, -440, 222, 418, -380, 259, -61, -24, 14, -215, -526, -227, 429, -328, 533, 175, 7, 453, 380, 86, 605, -77, 410, 381, -520, 76, 229, -301, 74, 158, 35, 5, 661, 328, 32, -143, -202, 97, -90, 72, -166, 110, 205, 549, 220, 403, -93, -202, -98, 58, 122, -297, 72, 356, -89, 14, 254, -191, -326, 9, -280, 427, -107, 880, -101, 917, 308, -125, 439, -337, 129, -131, 175, 132, -274, -245, -212, 85, -394, -445, -53, 573, 314, 88, 230, -268, 432, 204, -411, 395, -384, -369, 474, -328, 746, 72, -550, -337, 50, -492, 0, -411, -484, -780, 656, 509, -25, -117, 419, 405, -493, 248, -126, 277, 486, -50, 371, 101, 101, -402, 383, 442, 316, -478, 756, -497, 550, -105, -205, -179, -124, -179, -38, -595, -370, 289, -52, 451, -370, -237, -187, -317, 33, -298, -316, 317, 313, -117]
3123a17l53k24O75J12k84L10p20O50m2l90J36ON05o9N19p00K64j86k5l80L92o01
3145e22r0k1J07Q73l66P37p15o28R97J31q25K40L10N43p29j48M29O04r86P46j64
3166E23j197J68j96J134l88N16j5p75N66k98o21K41K87l27M84l31M18l50l69R64
3186D34n25l60M18p96N96N13P7K44q7o7p81L59K45n6o20J47K38J63j02n26R09
3207D23j00o09R89j226N3k68J049N8j09l92M72J86k09m91P80m97J66k85r3M87
3227C84o55J46n32L45N21M3l62K60q11O28l21J61M50j33L44o97l4P34l2qj16L5
3249C50n43Q8R3O8N35r36M20l46L33J12J74m37J60r6r3K29q07J88K41J85J50o92
3271f24J044m44p65Q87K5K41p75N59J33o51N49l69k11M2j5N10j22k01M45k22p53
$$ y = [-117, -470, -694, -19, 93, -191, 119, -601, 49, 7, -383, -247, -241, 264, 195, 714, 14, 278, 92, 67, -313, 79, -522, -612, -633, -526, 347, -19, 718, 3, -625, 372, 503, -322, -82, 228, 771, 42, -106, 323, 927, -59, 687, 523, -674, -506, -702, 432, 44, 560, 545, -230, 336, 38, -583, -342, -55, -382, 102, -229, 189, -161, -530, 434, -91, -451, -33, -829, -233, 280, 357, 601, 514, 447, -334, 25, 270, 214, -406, -259, -21, 142, 40, -486, 423, 323, -286, 703, -523, -470, -738, 311, 369, 260, -132, 340, 526, 317, -174, 606, 109, 275, -10, -103, 384, -271, -125, -657, -312, 209, 252, -110, 150, -661, -33, -354, -193, 257, 124, 468, -229, -263, 471, 439, 431, 315, 350, -193, -105, -12, 56, 591, -345, 75, -271, 62, 174, 348, -89, 71, -25, -118, 111, -696, -508, -267, -82, 68, -624, 420, -24, -789, 98, 123, 364, -411, 148, 281, -370, 179, -190, -401, -359, -374, 136, 14, -187, 258, 36, -717]
3292g17P64j08L42j247R19L60n37K4O26n25j39N20j96l16l18J78K24J96n55O57
3312A52L9l73J5L52l68N99n64j31O33j439J363p04J06M21n79J768j359M2J26o20
3332e21j19P29j75NL31N59j316P47p41J97L04j20L88r72N29K60o26M04J77m82
3352d42R48k81m53M28M2m67j38m79P95M17l0j243Q07o02Q11N08q88O24k19Q7l66
3373a41k1l25N8P32j84q19N14J8o42P49Q57o51r1R6j52M05o10P31j232N83q07
3394i32J015j17L00j37j28J38l85Q60q06K20n37n5N89J59n48m44J121p24L86J80
3414A55j95p51M82j32O76j25k03M50n65K15R8k65J67r46J380o24j23K71j6K25
3434A74L10p66M77n58Q17n44k60m92P19j99L08P60n95o98M78rL28M5l66O27k88
$$ y = [-717, 47, -61, 281, -966, -47, 313, -224, -200, 426, -99, -238, 282, 86, -230, -548, -370, -146, 50, -505, 152, 191, -182, -167, 185, -183, 416, -148, -279, 354, -1085, 278, -426, -320, 101, -478, 1290, -69, -27, 99, -521, -640, 89, -86, -81, 250, 809, -507, 240, -501, -304, 0, -120, 268, -704, -175, 85, -541, -137, 40, -442, 506, 225, -228, 200, 242, -225, -363, -842, -47, 370, 340, -903, -96, -698, 113, 621, -267, 357, 138, 225, -141, -162, -487, -429, 303, 119, -700, -186, -168, -810, -61, 796, 145, 54, 150, -2, 403, -207, 524, -708, -125, -932, 83, -34, 266, 129, 1, 139, -246, 614, -192, 28, -509, -564, 25, 184, -364, -808, 313, -411, -25, 155, -40, -791, -309, -441, 235, 110, -93, 357, -208, 7, 105, -160, 7, -939, 441, -183, -306, -35, -51, 174, 484, -282, 195, -363, 454, -90, -350, -842, -123, -322, -14, 746, 151, -547, -69, -78, 250, 295, -71, 556, 268]
3455B68m77K1P91j68m95K94l88j55L45L21n42k73N67k84n92Q12M77l09m75N92
3475C30m45rK47L95r63J57J20M13m69r8O64K08k83N3k50p26P24p7L10r2p03R06
3497D12p38N09O46r10m21J314j317P44l63l27N5Q18n89j7N10L29r71J70k36M96
3517A14j44J54j19k06r6M75m04K1j82J80J83K48l3j1J32j127M22M26M7m15o8k76
3539f79R52l01L26p09R74n59rl97Q21l58l0L25p36m4M16M84n78L09n53K38L5l
3561g6J72k82kl07N59k69q1L91j2k64K25q4n21P70r5j65M67p37J81P78j119O38
3583A67j38K17k64j42K74k1j52n24K6J030J64m32K89n89l49L14l41P67m47K01
3603E0l23j56K15j39J18K10j68Q4j32L71m38K28p0m0J77O38m94j26M41k60l69
$$ y = [268, -209, -188, 603, 435, -60, 234, -154, -309, 36, 357, -185, -458, 109, -175, -767, 45, 522, 213, -262, 330, -115, -124, 123, 518, -445, -288, -168, 245, -224, -322, 342, 550, 267, 320, 70, -656, 68, -9, 301, 209, -494, 412, -326, 183, 829, -81, -502, 812, -505, 239, -124, -451, -396, 422, -167, -184, 326, 655, -316, -146, -382, 114, -30, 124, 5, -201, -297, 178, -226, -205, -387, -207, -24, 224, 191, 180, 312, -815, -393, 33, 80, -335, -403, -679, 273, -28, 298, -411, 563, 4, -5, -402, 419, 61, 31, 356, -380, -424, -8, 476, -102, 207, -346, -108, -73, -76, 96, -186, -188, -495, 64, -205, -286, 105, 93, -171, 54, -30, -551, 219, 124, -41, 426, -311, -130, 648, -471, 167, 29, 246, -18, -160, 114, 93, -59, -583, -557, 473, 637, 205, 494, -95, -444, -130, -471, 296, -151, 50, -273, -429, -214, -353, -235, -25, -193, -109, -241, 130, -308, -80, -150, -190, -13, 625, 131, 5, 446, 186, -183]
3624a83J95j5m23J045q50K85O44n44j80L38k68L36n14r2o4J24Q07m95K81o92J157
3645H92j065M95q66J261j324O64K53l65K47m02L04l42N38j034R31m0l81P19n73
3664h8N45P2j234P48Q87j374O78m52P1K3n0L59K58m46p27J161l12J66p62M26Q5
3685C4R6N0n95J64L29Q39j030N62k66n87K16Q00J32j217N85O75m49n98M66j15
3705I1P4k58l73J042q03K40L8K14mJ51n8o05m8n84J287L18o33N8k72J16m86p8
3727e73K39L48l2RN6N80q06J17k46R4j97N78R5o60J12O82o0l63j072J005n30M68
3749a56l59K74J16J29l89N94K60q20K67M36o62P37p18R7L35p05O61n7l20M78l
3770A95J22o00J30L24l33P4J65l0j77j7N49n90RK75j68P5l9J4L03k8p43M85L90
$$ y = [-183, 12, -3, -426, 619, -231, 54, 698, 154, -26, 312, 44, 380, -134, -226, -290, -166, 641, 146, 427, -265, 892, -173, 322, -544, 717, -607, 57, 310, -55, 192, -210, 94, -248, 290, -744, 187, 147, -234, 485, -88, 457, 529, -705, 43, 930, -444, 234, -218, -147, -124, -174, 185, 443, -3, -730, 431, 119, 285, -477, -51, 34, 130, 180, -415, -251, 78, 917, -113, 449, 183, -404, -188, 612, 744, -473, 112, 787, 338, -260, 206, 91, 165, -93, -466, 576, -227, 13, 51, 265, 261, 412, 354, -251, -299, -883, 404, 722, 89, 147, -125, -9, -495, -573, -334, 14, -18, -9, 47, 627, -179, -62, -308, -214, -411, 167, 262, -398, -286, 396, 336, -27, -1099, -94, -624, -156, -515, -241, -125, 4, -385, 209, 469, -351, -84, 352, -310, 427, -291, -194, 141, -564, 97, 40, -280, 198, 195, 317, -283, -153, 171, -162, -88, 77, 47, -130, -147, 402, -188, -179, 96, -72, 3, -36, -22, 281, 253, -490, -5, 385]
3793C85J29j29j93j96m70N97L65l48l93R7l55M42K32k29P29o90n62O04K63l46
3813f8O28R6o05J28L79l94k76L76J03p81P75l50J36m5O40m72n71M45q1k60J018
3834H21q08m74N67K17j53k72q1N55r99L90N6k6J20k2K32l3P3m54K23J68L86q31
3856c45l50N32n9o60N74R9J46K04n36Q12l06j76K11k06j78pM42l92J59j65J2O01
3878D12j27n13Ll80Q09m23j53J4O86n18K3O09l08k44%M65k04J19Q3p57O50p83
3900e37P43J57o03K41O36l01Q7M20p94k10K07o37j15N64M5j12L55n39J90J89N82
3921E68n76l78Q72l46J05m54K86p10Q60j6L46j64p15M11M47o48K00l5J32K13q33
3942d35M28K12M35m92j67K92k00j49K39j78l15K09L43l43q21Q93J45o14M00J018
$$ y = [385, 514, 385, 192, -4, -474, 123, 488, 140, -253, -156, -511, -69, 163, -66, 663, -27, -589, 15, 278, -68, 560, 656, 51, 179, 558, 164, -112, 264, 367, -414, 361, 11, 147, 102, 742, 270, -301, 144, 63, -197, 821, 13, -461, 106, 323, 170, -102, -183, 372, -627, -237, -181, -207, -87, -109, 123, 90, 163, -291, -68, 100, 486, -345, -695, -163, -222, -882, -308, -209, -63, 141, -395, 417, 111, -65, 146, -60, -238, -245, 197, -195, -36, -201, -189, 412, 285, -228, -225, -605, 204, -219, -372, -358, 328, -190, -167, 442, 134, -110, -110, 355, 151, 270, 353, -404, 246, -537, 206, 363, -240, 1, 637, 336, 423, 843, 49, -161, 46, -591, -706, -142, -97, -209, 146, -393, -203, -14, 568, -8, -386, 486, 140, 245, -209, 77, -633, 227, 211, 557, 393, -322, 89, 536, -112, 88, 53, 185, 398, -435, -7, 205, 640, 148, -19, 273, 73, -76, 163, -15, -330, -121, 222, -121, -942, -49, 96, -518, -118, 900]
3962I00r83j2j80R24k32o34K9L40j83q9k86Q66o04qK17M88l25l27K80j078J081
3983A84K48q60O85M69p66l34J022p85q71J546j63k9K6l30j4J69j75J02l23K38
4003C9N25l49K58n49K23p76J415J7r64K25P73k89m96Q74k93o46P41o01L16o62
4023b19L82l09O7L55j46N04r17L2l18%P81j99l1j04Qp6M61o00P9m95O34K34K90
4046D13j117P83J78k57L78j068Q93l02k92M14j67j79M48l29K05J66R4r5L15p76
4066b95K09j07J38l07K65J66j21Q05j048L79j00n3K93K79l36k69K11n77M2R99
4086E73k66r5r9J02k60P2M8N0O21n84p44L28R23m73p86L14J31K93L3J57m02L90
4108C26m69M3N01L6N9j522P33K90j16L82M31q43J54o51L65O79o69O28J98p21K04
$$ y = [900, -83, -95, -275, 649, 417, -217, -188, 152, -31, -120, -406, 460, -144, -152, 65, 553, 228, -99, 181, -897, 184, 432, -428, 257, 726, -40, -374, 648, -137, -1008, 538, 375, 346, 372, 42, 28, 197, 22, 124, -199, 39, 564, 215, 473, -76, 147, -629, 786, 803, -161, 64, 837, 548, 52, 926, 633, -13, 728, 127, 443, -219, 163, -146, -79, 276, 130, 634, -283, -251, -569, -569, 212, 13, -18, -122, -114, -190, 271, -329, -250, -745, -111, 123, 413, -704, 79, 257, 0, 378, -690, 203, -99, -391, 23, -144, -323, 125, -204, 1, 167, 261, 166, 481, -295, -86, -193, -55, -362, -97, 69, -52, 753, -295, 84, -16, -69, 224, 503, 167, -102, 109, -468, -426, 573, 307, 212, 113, 215, -45, 27, 75, 125, 746, 162, -582, -254, 669, 196, -590, -276, -145, 148, 181, 338, -64, 326, -143, -100, 401, 437, 496, -1026, -293, -3, -119, 263, 694, -149, 5, -646, -281, 398, -271, 357, 555, -166, 38]
4129C8m98K26J56l0j1K54N4n84O38pK67q03Q70l38N6o06K29k74K61m4J45K03l4
4152A68j63o78M00O88j243N26P26p87Jk81N3P21M55j064N15J37M5j25l52P08N9
4173E09l14j83k41O61N38j178M62n21J47N29l29r50N16Q46n48K93J02jp77M68
4193B9K10m82P94k2j011J052j50p37M71p1k81K51m31j7M67M23l04k60j29O17p26
4214c07K86j74J41n13PR11j73j75L43m30p11O40j02Q42p99L87Q4n45K47l09j51
4235e01P58k04J3O0q09Q63J95l91L21o64O1J123p45L88l71m77L51Q7r5k60Q81
4256E84m58m82N65L39j49M9j92l11M22j12m22p75R48j56J88L22o16N99p27R53
4276E69n88O72l41m7l36L14o60P97l28l18J0j64M15k10K65j24q4K35j9J01L27
$$ y = [38, -460, -234, -78, -108, -119, 135, 189, -395, 243, 236, 503, -300, 570, 232, 288, -318, -89, -363, -102, -146, -1, 202, 168, 5, -673, -273, 415, -828, -302, 424, -363, -362, -643, -590, 131, 586, -478, 37, 174, 219, 94, -258, 450, 509, 195, 12, -229, 432, 970, -208, 254, -267, -120, 409, 80, -870, -354, 492, -56, 237, 339, 338, -439, 29, 239, -243, 551, 529, -482, 570, 420, -317, 154, 83, -198, 53, -378, -395, 72, 495, 191, -69, -198, 419, -307, -21, -195, -54, -567, -560, 351, 178, 3, 346, -84, -795, -155, -257, 585, -214, 173, 257, -288, -41, -350, -501, 257, 53, 66, 126, -683, 180, 375, -16, 305, -359, -298, 825, 80, 468, 97, -380, -29, 58, -37, -297, 584, 126, -356, 209, 548, 399, 448, 256, -55, 367, 255, -167, -942, 6, -150, 38, 360, -256, 343, -384, 569, -19, 653, 312, 265, -71, 243, -417, 380, 52, -266, -256, -420, -5, -215, 50, -74, -158, 77, 58, 159, 486]
4297D86l22O35o49L86l75m01O99o63L38l28L01k49j49J03N20n67M8j45M48N3j48
4318B1j50m69J423n16m45l13Q87o44P25o74l70k60R02o75J58N24l14Kj82R48o25
4339d7J3Q7k33L00j56k95N5L40k30k74J490o45L07K75p82l36j02k81R42k00p6
4360A52Q5o39l5N8L49L14L6p94R8O40l3j18q62M47n25J142L5k52o81P84k35j03
4382a37J6Q75k06l03o04N06K78m89l42P37l73Q8m18P52m03l02J39N26o99L09n50
4403f00q4M89L04J23j45K93m18m36M49j35P68o16m09J28K25K92l82l03M01Q97
4423H41o35K16n66O25q76J025q08J38k05K17m9k39M52q42P22k80J76j34M91q09
4443e40N07K43o15L25p30P80l01J288j119J68j73m73K10j42R73o31M41p08O12
$$ y = [486, 164, 799, 150, 536, 161, -240, 459, -204, 134, -194, 107, -142, -291, -188, 332, -235, -187, -332, 116, 169, 21, -129, -598, 825, 309, -136, -449, 438, -206, 519, -155, -525, -785, 117, -558, -400, 124, -190, -188, -370, 578, -47, -34, 53, -180, 120, -36, -331, -276, 64, -166, -440, 1050, 405, 712, 987, 205, -131, -233, -514, 428, 228, 152, 237, -402, -437, -379, -30, 284, 320, -474, -376, 264, 231, 113, -749, -302, -827, 315, 350, 98, -583, 201, -34, -137, -121, 754, 548, 245, -359, 147, 425, -64, -406, 331, -42, 46, -372, 380, -23, -325, -186, 340, -359, -50, -600, -684, -195, 109, 232, 87, 380, -38, -474, -25, -160, 608, -8, -417, -289, -64, 228, -154, -457, -56, 841, 206, 422, -144, 481, -395, 630, -178, -40, -245, -28, -77, -316, 136, -706, 16, -264, -88, -222, 269, -540, -33, 210, -405, -80, -810, -30, -331, 957, -162, 6, -167, -640, -430, -572, 401, -230, 211, -497, 115]
4462A15k46L24P3K09q61N2L48j88j41r9q5N81M4j073N20R69m46J6J9j97L21J65
4484D20o48m16K46L62O14M9l65l21J21N46J43n47Kk37mm77J07k7P03N79k49j232
4506f31O55o2J82n38K09K11M47j038m5M62M47q72J13K99j69N6k17M53j85Q1L39
4527A97k22n54J202n62m25N4Q33q48J99k45M45r0L88J97j156L01q2K1J43K3L75
4548A94l83K40K94r56J131j254O92l7n14K53L17l17K52M32l25oK13J7j47k9J38
4569B05NJ14r8l98J22K82j129J198n34N28o12L97n92O40k0k38K89J53o78M4M72
4590A50j09J77n44J5p4M21k16J191r06l15j51J92n69J316o2n23n53R40o7j40N20
4611F93r18J098l08q75R13j068M93l24k00j60Q52n23M61q7j31L0P2k89L34m34
$$ y = [115, -131, 193, 266, 475, -386, -334, 14, -174, -315, -414, -499, 82, 126, -947, -427, 542, 96, 112, 131, -66, 255, 420, -228, -644, -398, -36, 578, 627, 262, -59, 62, 608, 751, 204, 206, -31, -35, -512, -405, -432, 271, 850, 601, -631, 24, -38, 144, -394, -185, 26, 473, -565, -610, -148, 299, -573, -460, -161, -330, -274, -491, -38, -223, -142, 197, -25, -579, 623, 61, -364, -310, 523, -325, -126, -371, 74, -16, 372, 569, -587, -286, -368, -347, -204, -181, 194, -189, 51, 345, -611, 520, -734, -42, -79, -593, -340, -23, -340, -88, 344, 19, 13, 226, 243, 96, 67, 205, 210, 324, 226, -172, -50, 232, -897, 301, -233, 295, -317, 80, -512, 128, 108, -130, 159, 312, -366, -322, 150, 41, 218, -326, -311, -385, 36, -180, 1011, 105, -210, -361, -169, -738, 578, 516, -7, -560, 380, 313, 173, 693, -225, 873, 565, -310, 603, -465, 28, -296, -496, -656, 196, -327, 134, 47, -84, -54, 18, -271, 63, -371]
4631c71N42j011M75O47j21k29m5L50n40N41l55n78O54J88R8m71N58o52L79k09
4651a50O60k91M19K54j057m33J172l71N0L8m96Q19r35L35M52n22N28k76j130J757
4671H23r83N71o46J70l28O15j20J14n45l53R46m22j90l95J138N35j028M11k11
4690A02N5n44j55P57j04m31m6L87j57K21P42r40O35n04o85J66M36l34P93j75k28
4711iP52j391P34l29k73Q56r00M04Q92j044j25L24n90O46K43l39K52j2o96K41
4731c64m0Q70j60p08R82j15k22k43J066p78m29J71M33l12J05k64n34L91J90k10
4751a71l14R07m9o34O43J48j262R79N43p69k34M9R42q60J83k55L52k84j44L21
4771I1R5K64n58j99J17l05P49n07N40l82J15o2m38j20J027J61q18P51m87j40K44
$$ y = [-371, 171, -840, -365, 282, 161, -68, -113, 237, -303, 238, -117, -695, -41, 147, 245, -226, 332, -320, 59, -150, 510, 219, 638, 892, -165, -598, 574, 203, 253, 291, -205, 614, -321, 14, 466, -56, 472, 196, -934, 823, -160, 411, -235, -65, -393, 222, 102, 216, -329, -682, 264, -158, -348, -743, 395, 930, -98, 313, 102, 157, -387, -542, 215, 111, -320, -366, 21, -136, 85, 827, -113, 522, 18, -667, -501, -65, -399, 394, 219, -9, 743, -648, 86, -243, -516, 340, -560, -156, 736, -308, -433, -109, -699, -53, 190, -149, 103, 91, -605, -364, -404, 466, 306, -402, 580, 465, 243, 0, 1066, 288, -141, 30, 463, 151, 256, -8, -542, -151, 39, -171, -485, 422, 373, -261, 382, 530, -732, 247, 790, 21, -213, -164, 778, -82, 101, -154, 198, -86, -230, 91, 186, 450, -108, -307, -190, -495, 254, -253, 287, -95, 20, -42, -480, -600, 427, 588, -230, 521, 34, -106, 138]
4792A38j09q45N23J234o77o30N54r1J127j276K67J56k71p30N36M93k15%l56l08
4812d80R83J07m76l03K70J35n58M41j252O55J216r84J18M48k25r07J013PJ51k75
4832H4l16J013q0j250P81m26L30lM7p4n67N43J22k58k8K81L23J81n16p2K56j055
4854f84J164o68k59R60o13L74k67K30n14R3j40l87N60J063j211R33l00j87K36
4873C83n30o79J213m07O52j094K86Q25q20J94M38m14l6l7J42j57M00m3m28Q7J24
4894I9j30l44M93P11j506J15M54J87J40m13P67Jr67R2M27m67N46j134R39N43l88
4915A65j10K23n65O30J59k48Kl53L4N2J24m2m43M34j90L67o79O07k82J17n5L20
4937B67k66P5J87K2j00Q31m86q48O98q77J57M83J40O6o7j41L5m01l11K70N61N3
$$ y = [138, 29, -816, -293, 941, 264, -366, 188, 97, 1224, -52, 215, 371, 100, -630, -94, 399, 184, 184, -172, -480, 503, 610, 134, -169, 101, 236, -322, 119, -1133, -478, 738, -246, -128, 320, 95, -812, 201, 208, 359, 84, -232, 781, 701, -549, 232, -194, 136, 133, 180, 106, -461, 82, 204, -54, -82, 199, 522, 703, 187, 115, 371, -684, 480, -188, -447, 513, -100, 274, 7, 237, -277, -184, -324, -711, -151, 912, -299, 634, 334, 147, 383, -147, -826, 387, -20, 632, -462, -176, 649, -171, 23, 461, 47, 11, -26, 116, -41, 359, 316, -112, -25, 99, -31, -375, 118, 829, -677, -562, -108, 79, 219, -194, 573, 574, -393, -301, 126, -341, 205, -929, 10, 553, 165, 55, 278, -287, 343, 502, 254, 256, -97, -63, -11, 113, 71, -372, 62, -128, 239, -440, 167, -115, 2, -53, 267, 1, 76, 263, 285, 185, 1016, 530, -318, 380, -497, -340, 143, 283, 349, 282, 141, 176, -225, -536, -266, 295, 348]
4959C48J19j015M41mP31R3r47P12k77p79J074j58j74l12K40N11p15M55k74O98
4979G67q93P4L74r71J142q23J13p1o17J203k03j34M29L22p6j224K66O86L63n80
4999A47l87J160j734M57J09M95j189J069L48j59J46q89L81m29J69j2p0k58j68
5018h14Q81j67K5J90K73j031L39J51k07K41m3N04k11q1o36M27j84M92M33j349
5038g67q8J272K7r70M80J77k45L69J98k09o8P7l29k29N04jn1Q8n10L18K66n72
5060b63J24K32j029R67k53J36k32M97L99o90O60o72O56O8n88o86O31K98j07o06
5080d58R74o00r6M95j87m17K07k92J007r98N01N40q03j98L55j85M53l95r42J164
5100A25p12Q87j85K25n49Q21o93M53j81K9k85l29M7M88N03k71K16r39Q28m52j45
$$ y = [348, 467, -548, -107, -111, 620, 713, -234, 478, 201, -578, 496, 338, 164, -148, 92, 603, -112, 343, 69, 767, -126, -52, 322, -649, 493, -330, -217, -288, -905, 298, 95, -39, 390, 712, 636, -588, -322, 364, 727, 147, -240, 920, -814, -357, -248, 247, -942, 127, 475, 316, 462, -427, -46, -475, -306, -318, -388, -646, -814, 67, -100, -75, 115, 388, -643, -304, -153, -360, -119, -162, 342, 131, 50, -586, -159, -343, 149, 582, -767, -855, 417, 444, -526, -46, 131, -114, 255, 453, 244, 176, 253, -76, -305, 199, 198, 147, 235, -275, 43, 309, -263, -139, 93, -936, 31, -222, -86, -318, 179, 578, -112, 548, -124, 532, 600, 12, -674, -43, 255, 148, -458, 516, -84, -180, 315, 128, -289, -82, -374, 633, -365, 136, 676, -127, -325, 30, -155, 298, -97, -1039, 125, -587, 300, 115, 340, -209, 612, -81, 372, 191, 220, -65, -394, -347, 141, 644, 373, 589, -350, 478, 26, -119]
5121a19K01j04K6l32N08j49mK29K2k52q21J400m23l09o42Q38N67o17n41J57O7
5142b98M40L76P1j29l02r4l64O38q51J79P76j05K92q48Q03j66l65o89R22J42l48
5163H0o30O16qL70J62q04Q71o32P91j171R35q82j89P64J77o26q8M14jM83k78K54
5185F08m22O36q09K49m05k35pJ185j016j33P08o17K91Q6J28m34K13p6K83l5p08
5206e10K91L12k88j28J44l34R64q14M2K66k21k44R82n47r6j5J16m5p6j00J93n96
5228g04O89L26p95M19k43K31O45m52n18K67m17N46m3J138j010Q40r81K61K55m85
5248c1O08j53k12K8O6j71n9Jp0p52O25k67j36J227n06K33m71K76j286J492k15
5269B27Q5J87k8j036J079j006K78J88k75kK50L14r8j34k81L91q18Q91L87n40k24
$$ y = [-119, 82, -22, 4, -328, 180, 31, 27, 256, 278, 26, -795, 605, 182, -127, -769, 69, 636, 19, -522, -365, -298, 142, 518, 589, 460, 158, 64, -300, 338, -513, -334, 442, 337, 629, -219, 584, 418, 53, -636, 286, 428, 80, -550, 66, 58, 428, 590, -214, 657, 25, 816, -355, 580, -302, -491, 273, 450, -176, -264, 150, 149, 632, 354, 608, 186, 822, 13, 262, -143, -378, -385, 800, -216, -349, 359, -258, 33, 119, 247, -187, 26, -50, 233, 198, -510, -219, 93, -195, -323, -179, -513, 451, -363, -321, -55, -276, -520, 462, -85, -181, -196, -80, -125, -201, -301, -108, -704, -15, 311, -484, -65, -308, -77, 568, 116, -402, -135, -552, -6, -49, 1089, 79, 919, -62, 199, 454, -31, 577, 424, 212, 240, 306, 135, 76, 77, 7, -745, -120, -387, -523, 704, 198, 431, -40, 236, -1050, 442, 227, 312, 499, 471, -565, 514, -492, -214, -26, -301, -303, -53, 261, 163, 29, -252, 139, -679, 212, 599, 59, -165]
5290a65M83k93o35Q23mn71J91L70Pm35L24k89O34m43N58k63j76k83L71m19k06
5311d21L8j57J284j283M32n24R70j15m09J57J52j06l10o22J016K6j76m53O07k7
5331G9q77M34J19O60p51L91j78N11m03J358j417q48J200o53M94l35K88k67L74
5350A79n66K08j29N15j014L72N86K89n94K12j71P21l59j061L86P46J38l82j19
5369d3M47r15R69K25j270P37j90j41q3M26R75j388M92P0j19k7j51n0j37L15J75
5390C17n60N05N5m05M45k19K56N5n21j127O78L11L78K91o78l5J162j246O46k60
5410D8n21M59n57J229n41k42L5M51j69p35N82K57j131R33j25m11j01p5O23L87
5430C96k50n27L89j008J448l54p7k12K47P4j06p18J070j64o12M94l59N99m58j76
$$ y = [-165, 318, 25, -610, 213, 209, -362, -171, 199, 206, -229, 95, -194, 440, -3, 555, 292, 116, -167, 204, -215, -421, -383, -540, 744, -539, -107, -631, 339, 224, -185, -28, 124, 18, -292, -914, 102, 128, -48, -501, 106, 79, -798, -364, -245, 415, -336, 55, -123, 388, -15, 1343, -74, -922, 278, -375, 119, -216, 72, -195, 179, -387, -179, -308, 207, -807, -435, 151, 440, -154, 58, -113, 608, 249, -812, -426, 320, 458, 76, -43, 404, -511, 458, 683, -587, 150, -40, -181, -264, 162, 1137, -251, 241, 311, 192, 165, 14, -36, -173, 142, 317, -243, 262, 317, -88, 357, 138, 394, 449, -72, -1199, -521, -210, 168, 459, -219, -254, 908, -338, 308, 48, -473, -14, -571, 658, 117, -125, -90, 361, 192, -543, 39, 296, -835, 98, -27, -438, -539, -614, 9, 396, 146, -381, 8, -1000, 448, 94, 17, -195, 52, 126, 20, -698, 372, 208, -404, 90, -269, 330, -128, -304]
5450c04M12k7o6J47k1J26q17J053j202K35K09M76K15m58k5J23P46o29j16m59R11
5471E29q5m43j12K49O58j253N57l4J59l83L47K9k1l23k22L20J4J84j06O17p95
5492a14j90o7r9m26R73K82j2k41j79N1k61Q5k8P23o63L39J67j38k67L77l6l50
5514g4J96j78L17M8l05m4M1K73m04L9k51L22o1J237j797N83K34k30k00J43mO25
5536E10o55R44p92m81Q00l13k95Q20j288L92J019l48p00L33M64q63K85R1lo78
5556g58P41r48R69K47P6l02N74o49N29q8n48L02L65l70J15m73J69n87L30P97n60
5577f9j03j45O91k89k53L84j71J27l31J81N8k54l3P57j22L40q98J05n26L7L94
5598a20Q57o51l73L56K49J28l81j22K37n37N76J59q71N50k59N55o92M29k10K69
$$ y = [-304, 108, 81, 15, 162, 141, 267, -550, 503, -699, -464, -255, 221, 436, -22, -47, 76, 822, 193, 77, -382, 529, 444, 1, -111, 138, 796, -457, 100, 66, 225, -158, 189, 218, 197, -126, -348, -28, -14, 170, 64, 681, -114, -304, -371, -470, -896, 77, 359, 347, 106, -73, -22, -283, -198, -226, 497, -166, 173, 340, 202, -65, 312, 276, -74, 122, -56, 261, 309, 4, -40, 1, 274, -130, -91, -342, -20, -81, 1156, -641, -58, 176, -54, -254, -111, -115, 510, -145, 799, 7, -474, 326, 13, -282, 538, -750, -358, 661, 313, -387, -54, 410, -453, -168, -77, -80, -758, -17, -965, 4, 251, 327, 25, 599, -50, 479, 391, -157, 145, 510, 140, 255, -218, -49, -636, -306, 491, -69, -172, -317, 374, 85, -168, 216, 45, 172, -159, 22, 80, -174, -207, 550, 428, 768, -130, -25, -551, -514, -120, 737, 86, -287, 69, 318, 446, 65, -57, 180, -357, 219, 378, -493, 57, -202, 353, -339, 90, -120, 149]
5618A49K40m87K48m54P04k57J07k7j47J85p78J90m18L50M02R6p6N22j076Q20m79
5639a86L29M19j049J217n26J1j67P00j75n53M12r46O18J14p47J005l22l00j29
5658b75L74r0k02m56O79N9l88L14j00q7O32o14m65J450n34j90o71N83P36m86N02
5679G71r25P06j101N09O45o80M75n49K23k22K85m94J47P8M87J97r83L70K14m22
5699b69R7Q44j117L10o07R6K97P21P4N4j32q31M32l81M70l23O02o12J47Q6J23
5720H1L78l40L4P58j423J094j563J195K4m69O32l76j38l33J69O98j18L60q35P4
5740i8N20r36N71j15O73o46P53J85n17m53M67p73N81L5m42J02P13q23K28j38l31
5761d44N74N76l80j5l32n47L26R41o96j44N64m11k10M02l39L36L91q41K60j94
$$ y = [149, 389, -98, 150, -304, 400, 143, 250, 223, 76, 261, -517, -327, -745, -395, 7, 103, 27, 549, -527, 293, -186, 143, 562, -487, 730, 204, 215, 48, 748, 573, 20, 432, -514, 104, 218, -529, 476, 154, -146, -275, 99, 9, -193, -649, 30, 89, -299, 15, -85, -172, 460, -154, -619, 831, 297, 107, -564, 19, 755, 269, 771, -154, 552, -549, -40, 605, -75, 400, -149, 74, -148, 137, -357, -210, -132, 355, 552, -431, -61, 153, -269, -172, 672, -445, -135, -742, -646, -349, 372, 446, 500, 368, -463, -31, -412, 58, -265, 337, -275, -128, -42, 81, 459, 119, 153, 911, -512, 582, -981, 214, 238, -231, 401, 25, -113, -446, -277, 421, 303, 663, -172, -98, 422, -514, 57, -58, 615, -31, 722, 907, 390, -63, 404, -369, 212, 247, -195, -93, 620, -203, 25, -113, -444, 130, 706, 326, 311, -21, -568, -242, 699, 3, -141, 423, 12, -198, 204, -135, 201, 592, -249, 11, -183]
5781a83O16j11m79N56n65m4R5J27m25j36J193m47p3K64o46K35J61l48n82J056
5801B64L07k74m14J71J83j22L01o90m9N70R4O01j033O9o50J120J2k04m75o6m50
5822g35N54K18nQ7j83l35Q5Q46j029R22r9q76P41J84j66n31m67J357o09N82p57
5843b16l65P36k45m04M8J116k03l07j65K13j28J15p21P10m68O36p03l6N24j42
5863eL26j21j124R00O23m02l56M03q3J60l65j7O61r79O40q12R09n10m7m68J33
5884e34J088r78J085p12K79m10O39n07J5n94J126m35m89P58k69N81m32J04j09
5903B06q51J312m69K0n68R4P46k97Mo92J038l95K56j134R42N19n19k11Q3o50K85
5924b81j22P0O81l22R1k37pk51M88M56o84r4J51M33o34n38P89l04m11N61M60J81
$$ y = [-183, 433, 322, -157, 399, -166, -210, -115, 12, -413, -549, 644, 197, 124, 388, -258, -23, 138, -210, -792, 264, 571, 297, -117, 54, 237, 115, 416, -274, -323, 247, 341, 942, -91, -22, -672, 448, 460, 256, -219, -285, -735, -181, 37, 32, 119, -64, -399, -314, 532, -497, 425, 326, -550, 191, 375, 209, -322, -789, 568, -41, 541, -216, -581, 155, -90, -494, -446, 670, 467, 160, -5, 208, 80, 195, -526, 184, -284, 352, -351, -387, 137, -5, 321, 200, -924, -24, 599, 197, -159, 244, 161, 321, -44, -61, 600, -379, 261, -551, 358, -152, -199, -667, -534, 554, -424, 661, -51, 228, -182, 457, -50, -35, -629, 497, 62, -427, 331, 62, 643, 211, 315, 206, -645, 667, 198, 218, -350, -256, 490, 193, 197, -495, 543, 148, 404, -730, 212, 731, 212, 1, 84, -566, -281, -403, -333, 348, 26, 117, -120, -127, -378, 110, 566, -118, -212, -61, 372, -262, -800, -11, -315, -726, -165, 295, 476]
5946D76r12M65j1J8n5J04L78j61o49J23K39j78K1J6J025j210P03o47j15N86K19
5967D35j078M77L14j95J86r0q1k61P86o84M90j99r3n0l16O0oJ66N50m96K3m50
5989e12L66k66K39N21k56K33k59%j87N93O2m64q09P36L97o82J721j498J91k65
6009a39L0n0k34J49J2K63%j46N92m11J65J09Pk21n52P23p79Q05k66m05Q6m15J221
6032E44p06R72o76k22P7J22n9O2n3Q3m72R87L0p39J48l64j92K24P28r05N63R6
6054B48j89Q1n16N90m76O88p05j46j14p9L76N30o2o58J55J1M56m49O11o76p27
6075a051J438l83M77p32L97K07k86J44k23k13L26o77J028p73N22m30Q72n69j46
6094g2L64k95N08k47N4m0j82l03M53p13Q05o2m31P97l25p05J57K22L58L15l96
$$ y = [476, -436, 29, 18, 36, -19, 85, 463, 302, -347, -224, 15, -163, -142, -126, 899, -311, 392, -255, -370, 216, 435, -643, -166, 148, -47, 139, 49, -32, -293, 493, -191, 299, 100, 7, -43, -359, -299, -305, -139, 411, -85, -62, -512, -146, -412, -173, 348, 92, 325, 66, 66, -121, 472, 534, 70, -739, -3, 394, -288, 1433, -65, 126, -139, -109, -159, -393, -244, -232, 31, 31, -115, 477, 66, 231, 340, 347, 126, -426, 297, -482, 323, 57, -348, -262, -677, 544, -162, 810, 134, -88, -11, 111, 52, 114, 61, 144, -328, 659, 689, -50, 98, -266, -458, -234, 494, -411, 152, 248, 59, 140, -376, 214, -262, 426, -279, -425, -539, -618, -242, 288, 226, -432, -277, -266, 190, -259, 352, -324, -1051, 387, 4, 481, -251, 146, 353, 67, 211, -12, -225, 101, -576, 452, -321, 201, -229, 643, 74, -72, 292, -3, 505, 258, 312, 272, 90, -213, 240, -473, 332, 270, -161, 636, 311, -394, -237, -15, 343, 658, 262]
6115B62p74O4Q12l59N27l35k24k4L52o37J127l28j9m2k24O5k18M85m74j50L91
6136B77j46J23J85l79m77M91r6n40N34J80j88K97n16LJ78K17q6l98N02m98J16
6157b21L46O03j457P58Rk58m20J48O37Q8j20r24J725n08j96N8k13r94m2O70J85
6178a26O7K0N52r94L32k62M54J41J0N05l01k57j93N41o03O22p47M64lm26k65l5
6200e04Q43r5j58K25k9n61P76o00m58k45O73J42l1j28l07K99M01o93N29n47J78
6221b90J008m61j057J163n82O95j22o50j09k46R87R3p80N29j75k62k65O61m74
6240c37J74k83J53m0M42L92n9p41Q58n46l05O46r72R3L57l1K63k88M7N34l09J50
6262A98J72o00J041j013K83K09n52J02O53l13k70P06n17l99l17L78N21n87K1K80
$$ y = [262, -512, -448, 364, 5, 532, 197, -27, -51, 301, -336, 791, 463, 444, 402, 178, 243, 25, 510, 36, -114, 277, 131, 254, 439, 60, -417, 74, -22, -562, -28, 152, -36, 261, -255, -252, -74, 143, 57, -341, 161, -337, -221, 125, 728, -729, 29, 38, -220, -640, -492, 145, 233, 113, -811, 914, 406, 210, 268, 55, -939, -981, -311, -126, -59, -39, 513, -481, -149, -411, 43, 184, 194, 699, 398, 141, -52, 489, -114, 508, -239, 225, 222, -204, -469, -504, 339, 244, 86, 311, 282, -279, 497, -103, -561, -806, -133, 9, -22, -150, -457, -158, 243, -450, 79, -468, -290, 718, 257, -800, 363, -219, 476, 354, -296, -405, -651, 336, 429, -351, 178, 3, -259, -524, 137, -337, -163, -446, -293, -333, 109, 501, 442, -299, 559, 13, -292, 354, -618, -525, -168, -199, 64, -224, -177, 357, 48, 198, 370, -230, 811, -202, 81, 290, -262, -160, 493, 180, -90, 616, 99, -300, -617, -239, 282, -305, -284, -4]
6282dn21L55O87k39j57J38m54K96Q1m39N2K07r70N43ML78k78L36R7n44Q41j327
6304i18P49k95K28P35m91O7P23o91P9n00L21k65N28k1M75j309N51J92J73J12j081
6325f38Q38no98Q00k54q9m3j47L58n32O53J03M78j144M14j51J89k43q9k25N58
6346A33l00O51o82J02m16K08O31r52Q57p56P15m59K2N1P60Jj5j99k55j66P59m29
6368B61k72j95l21Q67o62M23O3O4m57L97p38J109q86m7L44L9L58k47K49j001O44
6389hm04j61P02J88o26L57k97j15M67j76J25n07m40J439p81K67K44l59k04k0J34
6410a75N24p49K96J17J59k75K39nl08L83l15r6K19L2k97L87N82j306L22O36p09
6431c39j67L97j02K64O5j64j85N75q40J331q87k69M50J53k13Q0L80o26k13k48
$$ y = [-4, -525, -170, 517, 278, 121, 259, -195, 101, 182, -257, -205, 2, -968, -425, -421, -43, -321, 15, 112, -432, 409, -918, -169, -464, -236, 499, 8, 75, 798, 107, 186, -314, 7, -258, 270, 249, 724, -585, -34, 158, 331, 443, -638, 200, 195, -503, 297, 43, -46, -89, -236, 122, -410, 243, 346, 824, -320, 94, -57, 132, -111, -200, -425, 133, -167, 484, -198, -96, -512, -304, 327, -625, 232, -524, 191, -268, -246, -195, 565, 566, 551, 352, 97, -69, 690, 261, -11, -206, -527, 340, -322, 101, 164, 228, -229, 168, -570, 539, -347, -394, -50, -11, 347, 100, 349, -652, -8, -412, -573, 129, 317, -309, 48, -249, -364, 103, -73, 52, -455, -895, 544, -237, 30, 274, -85, -289, -309, -175, 349, -400, -104, 13, 172, -103, 136, 131, -177, 206, -109, -205, 14, 46, -251, 136, 718, -588, -266, 370, -339, -506, -109, -211, 53, 118, -46, -231, 344, -496, 835, -52, -321, 129, 282, 69, 149, 529, -97, -310, -558]
6451e58Q41n09J067k58j202J018r71K11l80N83N77m94r1L29l63P67n31J19K89
6470D44K8l30J40k56J01J078o39k83p63N52n28P1N84K43m86R8m24N8l8Q80m36
6491I4l35O38j15m06M20N64o97j78m82P96n80K89r93Q09K92m50Q99o00l46k7N45
6512A37r57N79J24m86P54j65K0l92Q7J82k97J00Q4Q09p05r5M93j16m76n2N60k15
6534b7j57l4J38M50m9M19j540M19P12j70p5J49n95M94q6N06o06j75J68n2k74M14
6556B9J98n51j7J3J07J06l6m40Q97r42J222j135P28J08n31J39O81j13o28k29K79
6577a15Pj33R3O34K25m31q07k79L72R44m59J87o14j57N17qj68k34J765j387M29
6598C81n23J11J80l72L65O94k42j011N17J70J71n61L49p85R05j042J007r99O91
$$ y = [-558, 283, -226, 841, 583, -619, 399, -572, -361, -741, -158, 419, -75, -166, 163, -200, 567, 36, 155, 444, 472, 142, 282, 26, 127, 1205, 566, 283, -480, 72, -456, -385, 199, 442, -44, 54, -370, -312, -350, 530, 94, -241, 397, 282, -124, 296, 860, 163, -15, -497, 299, -281, 8, -985, -176, 116, -334, 565, -35, -381, -408, 137, -820, -241, -117, -603, 151, -14, 6, -386, -299, -117, -414, -314, -230, 579, -126, -221, 272, 156, -320, -372, 188, -27, -184, -218, -80, 370, 321, 740, -800, -381, 331, 161, 86, 235, -360, 134, 48, 554, -52, -227, -59, -111, -385, 29, 227, -324, -341, -328, -221, -115, -151, -591, 306, -636, 586, -549, 179, 287, -244, -105, 576, 463, -165, -394, -115, -108, -241, -148, 486, 711, 280, -527, -806, -434, 510, 51, 238, -376, -533, -16, -24, -192, -426, 1339, -48, 381, -142, -31, 149, -223, 142, 836, 594, -417, 100, 270, 441, -120, 229, -556, 349, -693, 314, -685, 6]
6617Fm59K93J38L94j49m98P96l36K96p67M14j45j9J44j75P33k70l46k53N12m21
6638a12k41L07m05J65L13j3p5K46O0j26l29Q76n44o39j21R41n41m27N6J94N1M65
6660A01P5n66L66J04p50M20K46K79n82M67J41n38M89k3n20j77Q5O7K64q5K37k85
6682a85L42j92m39K43R5j48N96m46n1m20L30P73q57L95K57p24M56O0m00j76O28
6703A37O0o36P36m05k47M09l35k68J346r28K15Q44j455J202j83o10O34n72m6M54
6723C52o65k22K61N88o94j20R9P43k22o57N62K06o05P09m25p35O17j57J647j262
6743B0k68L44N75n33P0l61J20J64n82L24K31r6k8N55p12l31O62l01m16M5K26M78
6765A86o90M96L26J27l87m51N61j242P11p7M55K41M4r96Q07j43l01N83r77K58
$$ y = [6, -453, -160, -22, 372, 223, -275, 521, 185, 481, -286, 128, -17, -36, 108, -67, 666, 396, 50, -203, 309, -112, -353, -46, -451, -286, 27, 14, -61, 185, 245, 119, -210, 666, 122, -517, -638, 303, -238, -665, -609, -415, -364, 101, 176, -390, -24, 80, -670, -250, -4, 275, -307, 160, 301, -237, 252, 229, -291, -468, -383, -316, -52, -137, 100, -185, 157, -35, -474, -231, -136, -284, 312, -134, -185, -605, -275, 498, -359, 36, 293, -431, 25, 85, -315, -491, 137, 197, -439, 297, -108, -355, 54, -281, -549, 797, -131, 84, 928, -527, 675, 492, -118, 516, -56, -102, 352, -313, -535, -274, 314, -380, -500, -401, 342, 120, -537, 25, 231, -374, 335, -90, -825, -208, -365, 1282, 20, -248, 96, 671, 138, 208, -153, -33, 131, -451, -127, 104, 8, -20, 535, -177, -508, 154, -147, -563, -518, -292, 186, -504, -8, 318, 445, 58, -393, 168, -1074, -363, -440, 15, 256, 300, -696, 111, -32, -333, 250, -727, -469]
6785d69P00J63j083J40N23J43l66P8J31L26p50M61j18L47K26p0q64P51j96j97
6805a24q3K22n85K00J93L99o33k6J097q65k08M79n67K18K94n81P9k3M79J80l42
6826a97j51L0O19n58l6j96J72J95R35j280J427l78m25P40j199J33J13j10j41Q26
6846E19L1j093M52l46O17j8m0J81k49k00Q2p7l40L97R71j409J091k66m03J43j15
6867g2J37l19N79k33q8l26L46j56J68N84o06j43L46r29J213m80K07L89k83j172
6887h38J288J0k53j173R00Q1m91J37N98n31K94j31n66J098l88m48N71p9L37q34
6907d18N32K55k94k26P68l88q53l16J753j036J98j13k4K16J47K05j561J129M72
6926D46K72q31L20l38k05O5M21J22L50k24j1j79L77m01j85l26M40P4k54n20J124
$$ y = [-469, 231, 394, -689, -549, -26, 117, -249, -171, -40, 286, -464, -3, -121, 226, 452, 382, -482, 269, 73, -124, -207, 15, -570, -370, -177, 222, -411, -437, 660, -205, -413, 66, -501, -283, 11, -570, -491, -514, -35, 145, -197, -348, -318, 301, -257, -293, -489, -317, -122, 813, -467, 960, 582, 157, 897, -302, -169, -56, -166, -307, 519, 550, -543, -91, -437, 180, 162, 122, 303, 54, -146, -64, -141, -481, -84, 887, -522, 569, 303, -100, 43, -72, 65, -254, 325, 92, 4, -322, 24, -132, 36, 620, 14, -129, 217, -712, 501, 21, 228, 617, 334, -838, 450, 460, 207, -966, -66, 15, -476, -339, 259, -272, 22, -109, -675, 423, 35, -413, 158, 79, 416, -418, 114, 369, 75, -151, 617, 229, -624, -940, 813, -223, -25, -138, -162, 54, 201, 406, -1155, -26, 446, 718, -113, 207, -131, -336, -271, 150, 272, 622, 398, 387, 208, 585, 184, -1, -327, 113, 187, -67, -587, 537]
6947E37n80l7Q5m22M02J42M15q68J45k34j30O23j01o94N94j04K39r1k13P14k23
6968A99j237J107q13J491p60J9m28R45j03k02m10K24M91l18m94M20L18m99M44
6987C94q01n38J070m24K78K89j82p3m4l74O17m55o1P01l97N65o17j12Q9J91J95
7008C11n11O76q12M70j46N08o4k19l75M93r4p71P21k51L00J32K47n00j54L00J
7029B62o70K85J74J90N9k76m04L67O03n88O37n43K57Q4m28q44J118K46k27j77
7049A25N37r79J32K04L93l05L08K3n95K54n4M92p64P20j41k98N65j306K27L47
7069a15J12J98K0l46J68O31p50O91m61K43o08J95Q14m32r71N37l2j5O38p52J97
7090c8n22Q09N57p92K33m26l1K85j69jl57L31Q22q01M78q90Q98m38m6P3m38k1
$$ y = [537, -43, -80, 5, -417, -15, 127, 542, -326, -181, -415, -545, 78, -23, -717, -123, -227, 12, -79, -292, 422, 199, -1038, 69, -744, 747, -13, 6, -422, 523, 420, 218, -192, 32, 523, 205, -289, 131, 449, -50, 394, -407, -945, 125, -299, -21, 268, 86, 13, -31, -405, 212, -243, -304, 397, 0, 565, -52, -164, -75, 116, 311, -200, 476, -336, 134, -12, 496, 432, 213, -162, 331, 237, -534, 187, -64, 236, 368, 615, 115, -39, 261, 262, -408, -123, 51, 241, 300, 24, -380, -13, 590, 2, 639, 96, 353, 437, 9, -835, 283, 529, 302, 125, 662, -317, -185, 19, 412, 107, 415, 438, -157, 97, 43, 535, -229, 491, 350, 52, 617, -689, -462, -115, -3, 195, 215, -131, 37, 668, -82, 609, 148, 391, -217, -22, 792, 360, -611, -74, -106, -121, 517, -235, -38, -560, 249, 806, 14, 247, -179, -210, 75, -94, -95, -452, -121, 701, -100, 378, -512, 386, -52, -98, -25, -463, -484]
7112d84K45K62L37k47K27q14j01Q70m33n15Q68p30k36P24L74j28n98N86j98l17
7132c08q5R69n54J17M00o09q3J39N07L6Ol21K08n96J74k04q19J072m12N5K01P2
7154c5j7k35J81M60n84p9M42M81r89j5P49q64M96p27N98j81N39o45Q88k28k25
7175A0J90M34p35K34L4Q6L81m61l30j9K77l87O84l47L00k86k06K60m54J83N81
7196D29n77j06l7O93n27r3m0J089p08k46j43j85K04K77O29m15P34j248M58k6l79
7217b17J83P2j17N75m50jM95k11j62p83Q57J50p00j59K58k68l3J82K54K19m23
7238b79j25O05m63P4m54P01M09l44N4l86N38j264L07n4l22J324j16l69K80N45
7258F61n30J24l47J24N72o01m74O82l99k63J024p81j73P52m50O5k72l21N78K26
$$ y = [-484, -239, 23, 360, 113, 340, -474, -575, 295, -138, -653, 215, -515, -751, -27, 347, 219, -379, 207, 9, -308, -393, 576, 22, 139, 539, -70, -153, -14, 493, 529, 535, 214, 422, -174, 0, -204, -1023, 49, -363, -308, -107, -35, -52, -287, -106, 354, -230, -309, 133, 614, -375, -390, 359, -505, -9, -736, -138, -319, 220, -425, 463, 235, 10, 200, 634, -101, 133, 167, 253, 634, 173, -157, -176, 101, -286, 398, 51, 351, 65, -141, 119, -335, -152, 429, -148, -254, -291, 402, -125, -218, -258, 831, 123, -123, -266, -451, -247, 30, 659, 244, 978, -270, 188, 162, -217, -34, 38, -79, 496, 46, 45, 540, 329, 167, -616, 241, 391, -309, -468, -210, -478, -511, -329, -75, 144, -279, -404, 201, -262, -188, -642, 59, 468, 124, 178, -208, 330, -934, -627, -681, -1003, 321, 205, -164, 116, 661, 131, 255, -92, 32, 604, 3, -471, 211, -188, -451, 573, -208, -381, 371, -79, -14, -286, -607, -29, 197]
7278A97k72J35jO4k93L26j80j72J98n43J63J69n79N18oK44j55N64l49M46l52m99
7300c77O16j111P23K06j78N57L62q72J75l6l99l03R49K68k72p73M37J66K1K55
7320D14o83k57n05J423o3r91N45J61j71M20l81j2J28j69k49L19J15K51r55R32
7340B72J3L85r15K32J81o2j89M00L93j25o79L81N4m70K63N11p22k58J139m63k89
7361E2J14K11m31O48m84k32k48J08K08J64j72j44P80J75j555O10l17k00L68L67
7381B2r43J287m03j8J79K08R4q33J199o75K30o4k62k36J72r6l71M74k59L53J19
7402A77R7J25n46L48l55K12K6q1k5K89j78n60J07M80j88n55O59k99O02r43M07
7423b01N00q44P17K63P50r22j94j46M92r1m43o9m35R01p47M82N21p38N11r73M0
$$ y = [197, -75, 60, 59, 123, -170, 156, -24, -196, 2, -541, -378, -209, -788, -270, -276, -32, -187, 377, 28, 474, 122, -377, 239, -872, -149, 57, -121, 436, 798, -74, 101, 65, -334, -637, 312, 580, 308, -465, -28, 138, 159, 414, -269, -526, -1031, 392, 329, -662, -117, 44, -127, 293, -88, -100, 28, -141, -390, -71, 44, 295, -660, 272, 285, 670, -245, -13, 168, 106, -83, 317, 710, 585, -94, 287, 341, -129, 134, 645, -77, -335, 804, 341, 52, 166, 377, -54, 594, 110, -122, -370, -262, -54, 110, -62, -206, 574, 749, -806, -196, -513, -713, -345, 22, -921, 366, -37, -55, 124, 332, 426, -407, 792, 117, 347, 283, 21, -215, -43, -139, -510, -36, -295, 58, 177, 274, 399, -147, 201, -154, 58, 84, 3, -22, 267, 89, -471, -364, 116, -72, -627, 32, -267, 335, -608, -201, 299, -545, 172, 435, 1185, 263, 69, -77, 415, 324, -119, -188, -623, 278, -469, 13, 534, -204, 307, -666, -626]
7444f26P00P9M78q36M02k54n5m77P7O52l90M62n2k98J82k52P15r78K28K94j5q04
7466g68L26J34O52P4l56O21j44p15K8pl87N19m58K53N16m05K60l79K70k5r05O83
7488b13O31j5m68J08j71O75n35K60j16l10O57k44K65m45o16K47O40m6l0K78p78
7509b26J73p5l58O45j10K14l66K42l9m39M06k12K15q0K71j98l83O24J62j101P93
7530A58k45K60k00K20J24Q7l81J48o74%Q48m91k67J44K09N47N7o58j22M90O50
7551I04j175o5J1Q15k16L00q11J62L13L96p59n6r4P20n0n62K70P1K79o58P34j26
7573D03p80M66J23k60M82n43p5jJ93K48k66K53o81M21l64nj05l15J93Q68p16N51
7595I0q04Q30n1m15k26Q39Oo04R00r33Q32q93k42M40N61k23j04L25o74o24O87
$$ y = [-626, 74, 153, 631, -205, 197, -57, -112, -589, -512, 140, -250, 212, 160, -138, 44, -208, 507, -471, -243, 51, 36, -768, -442, -308, 344, 418, 62, 683, 539, -176, -148, -155, -542, -23, -481, -228, 288, -117, 143, -236, 34, 9, -896, -213, 418, 403, -65, 43, -128, 547, 12, 272, 156, -154, 503, 259, 524, 79, -537, -290, 350, 304, 274, 552, -226, -53, -128, -486, 159, 49, 263, -103, 139, 100, -339, 67, -145, 70, -10, 261, 63, -320, 304, 466, -635, 158, -87, 173, -27, 193, 317, 404, 23, 171, -503, -503, 345, -146, -413, -269, -60, 487, 544, -114, -236, 254, 904, -271, -336, -325, 490, 274, 574, -237, -75, 238, 634, -125, -181, -275, 445, 395, -167, 103, 174, 453, -205, 529, 403, -377, 89, 212, -48, 434, -109, -184, -185, 8, 256, -10, 243, -438, -17, -381, -386, -491, -806, -613, 255, -461, 90, -714, 116, 65, -350, -576, 263, 269, -335, 565, -368, 464, -429, -671, -231, 330, 107, 3, 328, -346, -970, -283]
7616b83J88K94j08K19K38n33j66n48J176k12N83j174j9j34P00L53r22O39o7J26
7636C50m40J09J04N9l96LO8j56m94O12J4n20Q92N13r40N33l37J47k19M07o23L62
7658D8K51o67L77n74Q23n80O62n63N52l56l20J04r9Q33p28J48P01j21K03q34l8
7679a78J34q24J418n12j87N81M60p69J37K11l14m51K60Q8R9O1r2p57J174p65M14
7700A88q99N76L40l40L71q4k23q45N90J94M87o35L19K02j31k13N36q42P17j38
7720A70l18oq4L17j79m71Q27q08O30k68L3l72O02k82N68J59m19O14r65P61n49
7741d0J83N37L95j508M26M07p60J049o97L0j48j5q27N57K64l46O45r23M56K53
7761f2m31L94K13K53q6q79O45k38N77m50N5J73k33K90m02o02L61Q25k5j36l74
$$ y = [-283, -95, 199, 91, 310, 548, 15, -151, -699, 477, 265, 848, -326, -345, -479, 221, 574, -348, 291, 224, 350, -90, 19, 123, 182, -214, -211, -143, -299, -793, -181, -167, -687, 205, 718, -222, 311, -26, 121, -98, 309, -314, 48, 299, -368, 9, -565, 258, -322, 340, -223, 329, -27, -347, -243, -342, 491, -237, -89, 612, 491, 694, -140, -178, -44, -868, 550, 38, -149, 432, 892, 123, 260, 471, 157, -294, -34, 54, 153, 214, 122, -635, 539, -226, 188, -711, -135, 205, -135, 236, 152, -71, -916, -326, -132, 355, -280, 39, 241, 110, -103, 433, -409, 308, 170, -148, -154, -238, 79, -100, -571, 256, -552, 78, -190, -157, -529, 73, -209, 359, 518, 99, 713, -252, 509, -40, 143, 680, 1075, -433, -7, 400, -360, 689, -8, 22, -126, -141, -968, -411, -147, -493, 152, -771, -315, -62, -493, -99, 114, 367, 281, -598, 47, -191, 386, -64, -9, 164, -69, 221, -181, -783, -422, 403, 378, 242, -132]
7782a32M7K8k06j66M74q5K00K23J44k38N8K59r69N59n82M64n4k60L9M32r0n3q6
7805FM34r7o05L14O07j328Q24M97j44l52J37k87L32p11l54J188p42Q00m27K3r31
7826h16M04j2L3O31k17K07m17n62J65J303p98m37Q42j211J151o54L13K63J98p82
7846c96K66k26R9k13L74N93k59l4M92m92k11j27J24L27o34M28R6m41m66J151j00
7867C51o90J98M26j73j06j45j6k78N30j33j89M01j18N02p92K74q69Q62N40r76
7887d01R1M21o48K78O11k33O84r85j81m57P8P25l0l42N25k32k35O22m53N08o37
7908b91L11R51r71j21K9j49N15p25L57l33l87J34J252l01K4q7j005R21r21R31
7928A34r50Q99p09Q91j67K95j06L14j282P05P84l71O5r96K88L1M13o15R23q92
$$ y = [-132, -85, -57, -263, -429, 45, -40, 160, 383, 527, 289, 347, 606, -363, 196, -386, 78, 24, -236, -197, 235, 145, 92, 6, 440, 343, -262, 52, 659, -669, 155, 652, 508, 156, 293, 6, 338, -373, -727, 461, -281, 519, 92, 115, -816, -412, -424, -391, 240, 23, 230, -187, -749, -584, 719, -79, -516, 326, -885, 266, -388, -75, 188, 386, -396, -130, -356, -257, -470, -96, 497, 238, 204, 696, 204, -7, -134, -10, 317, -317, 111, 207, -234, -700, 451, 351, -339, -141, 285, 112, 6, -139, -155, -433, 97, -36, -225, 176, 58, 560, -232, 42, -827, 35, 575, -401, -310, 111, -537, -259, 352, 119, 803, -182, -363, -820, -742, -17, -47, -389, 136, -96, -331, 291, -162, 346, -291, 20, 971, 0, -121, -92, -241, 274, -451, -94, -427, -814, -680, 572, 271, 295, 208, -797, 124, -797, 134, -816, 83, -626, 265, 98, 393, 287, 601, -681, 24, 808, 437, 502, -494, -206, -175, 238, -377, 546, -346]
7948c46P38o61K29j27L63J13l62K71l39o61R83k94J146n54k15m2o62p1P58k30
7968C7k25m16O23N59m08M9k0n40j89P94q38j5N74J51k42O17m43n85R55l48j44
7989e4L28k29M51m55J87L57o74m55J410j046K72l0K45N3Kk96J81l18k13J096j309
8010d97O57l31l3J94n43N15K34k18Q5R51q22K41o58L76L37K47k10o82N97J53l61
8031B32l24J18j5N96n12J67J04o52o9j08P57o91k1N26rO9%k62J72m8L34o0j84
8054A20K45m59m30m6O32O89r59O60o7p67R59n82m89J58L18K92k68j16n60L99P08
8075D37k85K55k28J0r56L99R68j028K37qK09q36P50M33n57M46l35k6m6K0L32N55
8097G46n79m7M74m70K65k10N2l62J70k67M24j26n88M72P06l36L28j206j72R65
$$ y = [-346, 392, -269, -40, -167, 196, 309, -53, 218, -121, -782, 201, -93, 1053, 499, 284, 242, -420, -491, 267, 37, -188, -604, 19, 578, 170, 219, 199, -341, -530, 264, -574, -589, -15, 136, -106, 511, 68, -517, 438, 90, -54, 274, 45, 496, 41, 228, 585, -89, -544, 866, -180, 92, 62, 307, 360, 362, 66, 247, -71, -284, 812, -497, 160, -171, -204, -10, -553, -38, 196, -22, 63, 1014, 192, 433, -225, 151, 488, 735, 525, -157, 440, 593, 232, -92, 26, 11, 607, 95, 262, 366, -286, -355, -463, 294, -397, -418, 108, 99, 168, 168, -94, 78, 30, 364, 304, 120, 365, -94, -524, -570, 62, 751, -208, 452, 385, -382, 577, -5, -494, -336, -18, 274, 6, -110, -670, -271, 437, 152, 407, 179, 189, -767, -368, 600, -428, -191, -199, 10, -826, -76, 357, -200, 246, -89, -115, -161, -141, 191, 746, 167, 120, 594, 124, 389, 179, 231, -131, 39, -228, 196, 70, -518, -46, 660, 324, 652, -554, -726, 239]
8117B39K13o04K74m96K09o2k09J50J99M16j2j91l15N12m1j95L09r8k77M47l73
8138I5J67m82r3m30J251P9m48M5l07p4l59R03n42K36M23Q0r48Q25m63K8k17M46
8160B15l34P70p01M47m05K21J72p67O25J87r41Q41p34N30o55N61L4j24j007J234
8180A69L3M5j83j12O08r54K48l33m0O45P05
$$ y = [239, 452, -152, 122, -374, -165, -227, -436, -286, -87, 329, 317, 126, -189, 323, 282, 87, 396, 298, 21, 468, 95, 262, -220, -313, -743, 508, 587, 139, 184, -123, -197, -556, 347, -195, 41, 464, 544, -404, 421, -42, -14, -231, 215, -119, 651, -50, 397, -8, 213, 385, -382, 243, 430, -511, 330, -404, 126, -529, 32, 66, -58, -1065, 169, 202, 247, 64, -48, 560, -394, -146, -479, -519, 126, 831]
8191H31
$$ Imaginary data points
##PAGE= N=2
##DATA TABLE= (X++(I..I)), XYDATA
0@%%%%%%%%%%%%%%%%%o4J28j28J28j28J28j92K56k56L20l84M38n02N74o47P13
33C84q32R53j073J200j336J492j674J868k069K297k551K823l122L448l803M192
49B197m617N089n605O175o811P524q316R213j0245J1434j2832J4492j6507J9009
63A0200k2218K6513l2578M1866n8046R4388l55155J36563L48818l92706N3955
74a48400K85077p4710j95851K48186Q3736k04265J5341K18382j39921j85555J14426
85A6446O7654j93555L964J69419m7739j54240P7264P4308j16545k4970J74650
96D6656J7509j11696P0667J08186j02080m8667J22653n069j15542L8327M1236
107F2180j19173n3150Q1382k4936o4092Q9261O3867q0094O620J04994j6505n4227
$$ y = [0, 0, 0, 0, 0, 0, 0, 0, 0, 0, 0, 0, 0, 0, 0, 0, 0, 0, -64, 64, -64, 64, -64, 64, -128, 128, -128, 192, -192, 246, -256, 318, -329, 384, -448, 505, -568, 632, -704, 788, -886, 982, -1087, 1210, -1341, 1482, -1640, 1808, -1995, 2197, -2420, 2669, -2936, 3239, -3572, 3952, -4364, 4849, -5396, 6038, -6794, 7698, -8809, 10200, -12018, 14495, -18083, 23783, -34263, 60125, -295030, -158467, 190351, -202355, -148400, 136677, 61967, -133884, 114302, 198038, -6227, 9114, 227496, 87575, -97980, 16446, 84100, -109455, -105491, 63928, 16189, -138051, -60787, 13521, -103024, -127994, 46656, 64165, -47531, 23136, 131322, 29242, -19425, 103228, 98159, -17383, 20944, 62180, -56993, -110143, -28761, -53697, -117789, -28528, 35339, -44755, -38135, 66859, 50354, -3873]
119c873N8495L5295n7841j7605K1387l8717m3692K4752J8416k9844k503K8660
131g070q512j7439J8770J7984p003P351K2960l502j6908Q052Q419j7806k530J8255
145B1021j2499k4113O254j242k0521P634J6532r180P400K7582m669j3577K2490
158B3112J0131k6071K187J8145k6775k2171J5654q243k6925J6479K3514j6807
170a7770Q87L2555O28j5498J8740J2797j8886k298J3868j6905k3123J1113K118
183a774k3656J53K0662n861j4347J6924J4790j3239Q89K6431j155j5032J5407
196B0192R730k3792l860J8743j6228k6928J4228Q064l0362l213K4932o693j4975
209c0162K9311J6119k0240R818L1793j1631j8697J9069O937l0704n547J5232j9839
$$ y = [-3873, 54622, 89917, 32076, 14471, 35858, -2859, -46551, -21799, -3383, -33227, -35730, -7070, -15582, -33021, -14251, 3733, -3270, 4081, 27041, 23539, 6631, 14683, 23102, 5296, 2766, 21021, 8522, -15591, -9337, -10579, -31100, -23466, -6934, -16114, -8714, 18868, 14199, 622, 23112, 33243, 7172, 9359, 27504, 729, -21442, -5788, -14031, -40956, -24477, -963, -17770, -16883, 15672, 16300, 802, 19542, 32339, 13453, 11155, 25023, 8118, -15005, -3892, -1774, -25430, -25277, -4615, -10476, -24823, -7899, 6891, -6348, -5459, 20972, 19817, 4785, 20192, 29922, 6130, 2270, 21013, 4785, -22143, -7915, 149, -30213, -33426, -8494, -15187, -30162, -851, 15268, -4972, 4846, 36639, 25008, 6311, 25380, 32317, 1613, -3934, 11298, -8541]
222h541k2089J7404N922k5150O724K6999p761j2289K4864J4469j7906M447K2984
235C0077q870j9449J4181O033k4944n809J5980j2666k0878J3444Q079j8738J75
248b3385K3013l512r529K0145J2058j3781L866J8261r773j5346J0962K642k2072
261f451m201J0771r999j2937J2641N707j1719N695J6570m511o401J5418N262j3292
275B553K942J1249j0212r485Q219O38j4202J884R001q261q094J1006K918j0241
289a0085L819J1387m010m887J0285K849r227K789Q589q740o488P319q34j1387
303h621K690P213n710n141R642K159o988M088Q003n517l819P952k224p622L386
318e09M282p705k274P275p33o384N789N213n454r49P470j142p510L922M176p266
$$ y = [-8541, -30630, -13226, -7304, -32454, -25730, 1269, -6492, -18781, 6083, 20552, 2646, 7093, 30077, 21207, 1758, 15939, 21972, -2972, -8781, 7199, -5467, -26345, -12901, -4822, -23560, -23385, -372, -3884, -13413, 6732, 18790, 5009, 8875, 27136, 17363, 2017, 12979, 15621, -6451, -10652, 119, -9880, -22817, -10176, -4469, -16188, -10493, 6077, 1566, -4835, 10583, 15845, 2553, 5495, 16744, 6532, -2953, 5266, 5904, -8298, -6414, 2587, -5674, -13768, -2762, 156, -10085, -6266, 5121, 1111, -3776, 6509, 9358, 131, 2920, 11509, 2769, -3719, 3600, 2766, -8621, -5931, 1282, -4428, -9569, 73, 2232, -4756, -668, 7335, 1818, -2001, 5951, 3727, -3895, -509, 3773, -3932, -6206, 1069, 336, -6048, -259, 4954, -500, -1449, 6021, 4879, -2631, 1291, 5467, -1799]
334a799j527M305j554n372L938K697n595K94O897j526l199M318M178n060j45M965
350E815j849l781K009J170n629q98L242l627l382L892R21l903J744O454k773J54
366d41N118K229m619J645L357k938m945K561o77o532P05K399l778j662M026J240
382b312k367L418M385j365j466N907o9m239J004L569m687l109K328j652m521K254
398b922Q15k466j249L959Q11l176L336L477j596Q0M566o98l544J636J842m296
414E75j064J536j770m116J651K150l091n99M364j020j184L461K718k203M00K571
430D379r75k878J579J247m451K6K130j909l087J706O44j823J734K540j420k075
446b633L648J596k391k0L016j734j672J560M72j911k11J056j336k276K714k6k429
$$ y = [-1799, -3326, 979, -575, -5947, -2009, 688, -4907, -4613, 2284, 758, -2441, 1877, 6055, 995, 850, 5815, 3966, 185, 2194, 3364, -2265, -3163, 79, -3548, -6930, -3038, -2117, -6020, -4276, 2178, -595, -441, 4677, 6906, 2287, 3932, 7289, 4351, -594, 1967, 1290, -5242, -4537, -2138, -5916, -7578, -3552, -2312, -4679, -1261, 3124, 1759, 293, 6200, 6131, 1892, 2896, 6465, 1778, -1331, 997, -655, -5176, -2922, -2107, -4573, -5822, -1863, -1052, -4228, -892, 2585, 989, 1069, 5635, 4937, 1393, 3029, 4871, 575, -489, 1047, -723, -4839, -3188, -1038, -4129, -4728, -364, -1384, -2568, 893, 3611, 1408, 1808, 4379, 3404, 526, 2105, 3352, -1099, -1073, 1057, -852, -3939, -2233, -1589, -3412, -1678, 862, -558, -2633, 1015, 2611, 220, 200, 3216, 1482, -190, 1370, 1842, -69, -280, 776, -560, -2836, -122, -148, -2577]
463b577O33L362j316j480K295P18k248J323J653k027j658K329k91k079O92J926
479A255k315j0J670O18k959J113J674j580r65J853l94j366n6J961j037j137K561
496H86K13j106l09J213l10j238J199N14j708O10R43j100n70N61O81k072J122Q63
514C92j009M36J367q70o92J715K46n14n33J549k159L56J12O74j015j152P35j024
532a386o17J253Q51k37j052J818j88o79R61L65q36mJ066p13j243k46J480j263
550f70j041J216k2j669R84J321j282K55J255o21L57Q10J11k06M1Q53j298j182
568g88J031n08%j06o07J39j488K237q45J97O20J125o32n87J308L20p81r1Q91j264
588A71j30J64M16j576K89P42p75o84O15N21j134J210P04j09m46K69M95j170M73
$$ y = [-2577, -1944, 1418, 102, -1378, 917, 1635, -613, 710, 2363, 336, -1322, 1007, 716, -1363, -671, 1255, -1060, -1070, 600, 1218, -1741, -628, 1046, -534, -1499, 354, -40, -1406, -1462, 499, -538, -1675, 886, 1099, -7, -316, 897, 587, -651, 548, 1062, -646, -36, 907, -193, -763, -202, 479, -1593, -471, 392, -617, -181, 1186, 316, -376, 1339, 1585, 1071, 538, 2087, -72, 284, 396, 1070, 55, -1097, -362, -1386, -2003, -750, 101, -136, -1188, 630, 442, -237, 724, 1089, 253, 249, 1315, 602, -641, -887, 593, -670, -1711, -495, -517, -2186, -1202, 119, -1163, -908, 347, -274, 83, 893, 1004, 798, 839, 1692, 394, -788, 243, -265, -265, -371, -978, -839, -2327, -90, -935, -738, -118, 1007, 375, -212, 1096, 1416, 635, 544, 1435, 171, 41, 205, 621, -955, -666, 76, -699, -1383, -768, -247, -1381, -171, 533, 424, -22, 247, 742, -428, 45]
607D5J492j258o41L2M5o51N70k06q3j71O37l43K7M5N74lm17P98L31j377M0J040
629E26j33o81M45j1Q3r57J219q99l89R72p68l69L90O31n55L69M55L07p61l52M48
650c0k89L75J057k95l99m79Q92r31k85M14K18l65J22M35N0j121L79M40l85O08
670D11k33N3L1M56p25j82K70N98j172N37M17n94Rk8L18o04l60L15L96Q7J98J90
692C88k57q1R1P78r76J5P61q80m47Q43l64k62J261j215L17l92N1J41k44Q82k60
713A50l89O40o8o9n26K38Q85j233J22O60m70m98O73j43n90L50n7J262m19j87j72
734A59k28K19P96o44j037O44K38o88O0M92o1l1j40M14n78q2K35L09q7L96l05M4
756A25n67R21J27n33P02o45k80m98K74L15k6j01K07j26K24L56p0R8m97J80k36
$$ y = [45, 1537, 279, -362, -330, -285, -936, -366, -572, -655, -826, -189, -532, -505, -460, 114, 111, -306, 492, 823, -554, -514, 526, 393, -288, 157, 146, 229, -728, 491, -408, -797, 175, -593, -962, -572, 59, -496, -127, 328, 635, -126, -478, -30, -319, 56, 1113, 818, 419, -60, 832, -99, -384, 30, 248, -117, 5, 440, 490, -631, -252, 188, -197, 411, 178, 231, 262, 718, -7, -189, 81, 679, -493, 44, 461, -133, -124, -152, 166, -438, -798, -483, -87, 0, 198, 388, 131, 50, 141, 919, -57, -42, 719, -161, -608, 235, -129, -391, 870, -345, -28, -420, -369, -228, -472, 410, 150, -239, 401, 333, 264, -262, -24, 861, -372, -250, 410, -60, -558, 115, -28, -618, -268, -325, 937, 518, 331, 159, -69, 150, 946, 302, -735, -91, 147, -541, -481, 11, -50, -81, -221, 193, -385, -467, -232, 77, -10, 386, 81, 125, -442, 479, 606, 73, 775, 130, -150, -648, -374, -59, -85, -186, 21, -105, 119, 475, 405, 503, 6, 186, -50]
777e0L81m76J55L25l03j40J513r95k53l57k15P45m1j079p0J234n33M9P96j076
797c90J17L89l88r3l44J540l83q76J602j222k87O66l83N30j257N63M04K35m38
816a5kj50J99o5j92M26o7J08N6o71O43o63Q46q34P12m14o36R45l12k81L34O73
838F40j228O7R10l85O9O3l2N54j96q1l16l02m06J36O16q63j42R19J29p97O76k70
860b39j92J66K65j24n08N53Q0j18n6J61m41J25j13O55l72O0L99r49M96M64J01
881D13n68L00N19o16L01m37J74k87O93l21L38ro24R7L07o27P51m70P1o8k79p9
903d21L20N22r61M20L34l48R04k91j50J24q53K77R1j83j60N60l63J085m23m72
923A2k85j49O38N53o07k60m01q5P37k20N21l38J17k04J8L53r84J00J64N36r56
$$ y = [-50, 331, -145, 10, 335, 32, -108, 1405, 410, 157, -200, -415, 330, 289, -790, -860, 374, -159, -110, 686, -390, -273, 116, -272, -365, -709, 831, 448, -428, 1174, -48, -335, 331, -52, 478, -779, -216, 188, 423, -15, -17, -167, 32, -33, -225, 201, 134, 242, 298, -373, 270, -393, 453, -381, 331, -83, -719, 226, -86, -367, -33, 640, -588, -521, 389, 4, 73, 136, 104, 658, 462, 381, 65, -237, -643, -507, 109, -754, -896, 23, 152, -645, 31, -239, -431, -265, 0, -124, -632, -79, 1, -117, -173, -12, -453, -328, -441, 214, -158, -98, 301, -648, -152, 312, 413, -155, 145, 664, 48, 349, -88, 86, -201, 492, 171, 509, 500, -124, -27, 280, -347, 404, -66, 5, -63, -342, -421, -101, 421, -540, -120, 214, -134, 770, 479, 329, 453, -400, -123, -32, -215, -375, 185, -178, 907, 484, 12, -273, -422, 216, 769, 162, -98, -499, -584, 153, -67, 454, 116, 233, 29, 47, 400, -584, -484, -320, 216, -740]
944g40Q41J85q64Q02q25J017r96P85O54j004n67P37O8n66J38L76L73q82N77p67
964f58O92K77o0O77p47l05L17N62n61K10K66n06O70j030J76M97l67N12k58O9j266
985h33P35O3l10M68o78Q4O12n99O21M02q03o24M59M45r85R10K15o38j61M92j17
1006b42J21o13P76K99j359O69P07n79j94M73L71n82N30K02m41Q0O10j012K47j53
1026i0k68J20M47Q8n80N26r8m51p7K11K49k85P99n48O15j291Q75k38K77o2r1j28
1048@j54L66r31J369k55jn34n02Q86o48j4M99n7n12O32m4l80o43Q04O18o85J65
1070b1q17J003J119j595M83O8m51L3j77P6j49M56J03J54k60J69j42p4m40O36n56
1091c82K43M11l09M6n44M32P55q1n94N84l87j4P1o92n0N54P18j215M56p07J145
$$ y = [-740, 101, 286, -578, 224, -601, 416, -580, 205, 859, -145, -712, 25, 93, -473, -335, 41, 414, -468, 109, -658, 34, 311, 251, 928, 181, -124, 193, 755, 194, 404, 670, 164, 834, -196, -20, 477, 110, 622, 364, 433, -833, -98, -35, -345, 123, -555, -471, 141, -458, 163, 565, -238, -862, -403, 42, -943, -33, 182, -456, -617, -125, -242, -121, -734, 42, 341, -1018, -349, 358, -221, -415, 58, 429, -153, 377, 579, 138, 218, 828, -184, 63, -90, -358, -238, 209, 297, -283, 243, 145, -306, -383, -172, 77, -208, 591, 43, 658, -633, 242, 4, 281, 219, 128, 0, -154, 212, -719, 650, 395, 394, -140, -642, 244, -404, -418, 81, 24, -488, 144, 100, -280, -923, -119, 499, -186, -21, -838, 165, 1284, -311, 172, 240, -211, -178, -355, -279, -428, 28, 131, 285, 25, 194, 52, -22, -462, 174, -382, -139, 272, -37, 9, -535, -103, 652, 571, -23, 561, 174, 160, 231, -461, -511, 43, 761, -454, 2, -705, 440]
1112D40j00P5j85j089R50o59M51l37K64L35j57o85l39R46k07Q53m52n3K19l92
1132a22p1K87J35j19j1p6Q1L83l94l20J96k0l3K73l3M57m84q1o07M53l8N33l88
1155Aj24J67p47O76P37q81R43l46n63O0m52J157r72N17m57L70M74r31K74K23J29
1176B55O11m37m96m85J291q42j22j7N65j033R48j84N54p7q44J83K04K12L10k35
1196C61j190J270l68n50N26L94o44j27J68q2k36m5Q20k30k28K96j12N24p83j95
1216d31P63l77l55M18J380j148q2n40k18K75j63Q83n00n73O29J11m65L41P60o02
1236A06n53J89K63K11n8p43M85j34J77n32l04J104q20K63J8P29m53M35p60r1K71
1257a97M39m72k88M08L98q61P85k79J15k06k81P79k70M2L32p43N55o7k86O45K06
$$ y = [440, 340, 415, 230, -859, 91, -568, -117, -454, -190, 145, -12, -697, -1036, -90, -297, 556, 104, 51, 270, -122, -193, 94, 229, 110, 99, 23, 104, 487, 93, -227, -31, -51, -84, 189, 156, 613, 129, 48, -559, -106, -144, 389, 1, -123, 44, -703, -27, 710, -171, 772, 426, -137, -77, -529, 628, -344, 173, -284, 86, 560, -371, -97, 126, 255, 866, 429, -67, -552, 739, -103, -225, -242, 323, -710, 238, 54, 608, 531, -313, -130, 74, 286, 596, 361, -829, 441, 73, -477, 49, 443, -201, -328, -160, -242, -478, -523, 297, 67, -161, 135, 23, 547, -236, -431, 332, -45, -400, 18, 1398, 250, 168, -372, -590, -315, -478, 405, -95, -668, -39, 72, -393, -52, 708, 106, -447, -258, 5, 216, 158, -585, -100, -234, -57, -589, -893, 211, -609, -346, -328, 401, -52, 383, -377, -468, -197, 242, -230, -518, -110, 288, -573, 212, -67, 48, -158, -439, 340, 70, 112, 444, -299, 256, 189, -97, 548, 754]
1278G54k97q11J75K99m19P13p5m12J96J49l26R62q62l16k1M87N3l89R6k34m21
1299f99J098q36L62K56J99l71o42J112l94k96K3m82P08L62m18Q17j208L69L09
1318B69k19PJ63p30l1R2N44M84m85o25N6N12L24j92L43j57K87r36j2O12qn17M10
1341A91p21M43o97Q43q5o18P17k50L06m26J155r73N29l18O9j05L69j007P81P12
1361I15l87p92M47n30n3j62N27L3o75O36l83R04K1m09n75K25m9O05m37QL42k24
1383a3M58K58q74J72R0K8j84p2N32m16l77N37P91j105o4L34J4m32J37K72r0K32
1405B28k54L56J85o05j3k5L60K98m46p25K74K06K02j12p4P91p11K43p25L20J41
1426h6M94o97J79N2P1m3J70q0M9p3q5J27Q08r23J10j79L75p40P28K02j02q95J95
$$ y = [754, 457, -354, -179, 120, -299, 414, 339, -73, 123, 272, -54, 908, 46, -270, -291, 196, 249, -140, -44, -278, -699, 399, -437, -75, 181, 380, 9, -633, 479, 85, -211, -188, -670, 38, 400, -18, 799, -409, -40, 269, 50, 57, 220, -510, -541, -449, 95, 579, 94, -531, -475, 37, 361, 169, 512, 355, 642, -294, -306, 306, 298, -219, 191, -530, -87, -784, 59, -26, -644, 73, -177, 129, -297, 858, -115, 414, 96, 165, 60, 429, -578, 203, 915, 528, -264, 183, -347, -400, -562, -35, -2, -677, -41, -424, 480, 501, 92, -483, -258, -307, 298, -139, -131, 211, -13, 445, 703, -171, 1, 91, 119, -65, -137, 395, -21, -398, 139, 930, -175, -239, 95, 109, -323, -186, 86, -4, 228, -26, 330, 515, -90, -103, -128, 232, 530, 84, -641, -367, -161, 41, -71, -145, 646, -65, 178, -547, -227, -86, 408, -289, -110, -58, 13, -30, 140, 60, 109, 36, -49, 78, 886, -37, 73, -106, 269, -471, 257, 459, 357, -538, -343]
1449c43k39J538p91L11m28j36O46l30m29K33L54N30j13r16M51j81k36L43j23k7
1469A14N92q75L40o71J75k71J83P9Q45o80Q0L36k0J65k29k27p2O99m29l87J43
1490a10j90P96k75j46J72L89j262M07J00M9k36j05m1J201l21o1p29J7O60r09O59
1511F5M31j078J230p84o85N87K45j07P7O04j035L50m0R30j168O38p31Q15l31n63
1531e50P16m40J65J42m43O64J83m2J09j10m64k15P65p74L18J2N15r37M50l26J42
1552a20m20N06L22%n66j66N13m98M65o6K41q21L94O48k9n18M97r31KO02N9j56
1574d2r93O04R24r39Q49K1q00k76J073p17Q18q24N23j105R27O31j200P71K82o67
1594a40j12Lo2O74l20P28j598J555m15l07L3k3n18J39J119o80L16o10L16P2jp77
$$ y = [-343, -582, 956, 165, 476, 48, -88, 558, 228, -201, 32, 386, 916, 803, -113, 338, 157, -79, 264, 141, 114, 706, -169, 171, -500, -325, -596, -413, -334, 511, -169, -89, 247, 227, 392, 163, -64, -136, 563, 134, -253, -110, -300, 496, 221, 75, 247, 636, -626, -219, -119, -70, -306, -411, -452, 749, 428, 367, -362, -345, 315, -594, 65, 496, -582, 648, -136, -821, -234, 11, -96, -19, 585, -450, -100, -140, 790, -378, 260, -471, 344, 13, -550, 166, -274, -109, 33, -410, 254, 437, 395, 504, 394, -70, -285, 480, -294, 24, 36, 551, -386, 64, -262, -120, -540, -34, 288, 288, -278, -444, 69, -429, 36, -30, 211, -610, -216, 432, 403, -115, 382, -549, -547, 55, 114, -42, -1035, -431, 493, -446, 403, 424, -376, -652, 421, -296, 522, -302, 221, -884, 43, 674, -526, 245, 527, -140, -252, -249, -311, 363, 43, 771, -827, 728, 313, 6, 39, 16, -502, -363, 756, 76, 392, -218, 98, 170, 169, -608]
1616f08N64J9O9m68P99R6j439R72K08R2q02K04m91L04m86P18q2K01J34l40K57
1637g9R4J78P8l81m75P72p9K39j315J559j337Q96n32N71L09j077M18N29k35n49
1657d16K07P35j7n22r99Q75L40n7m19N39n32J04O31r33M15M48n81K49k80l78P98
1678B07l32j7j89R49q17l76J065n46p6N8k47L07k00M26l79M00o46M07K13J21M4
1699C72l47k21O88p99Q13m08M26j77j053J206n54Q51k92k39L55p03K15N9l03k27
1719c38O18n22r0p02R40M00l56K36L9o15Q20q84L59L91m84j88Q71J00o43m10P77
1740C19r53K83K67j13M81q02L78P91q60M94l49r59J095n20j0O53p42J70P61m71
1760h7j01N67o80L45k1O97j627J527r5l56r8k66l96Q45m19l30J16l91M43P98q50
$$ y = [-608, -44, -25, 44, -424, 375, 471, -968, 4, 212, 304, -498, -294, -785, -481, -967, -249, -331, -130, 4, -336, -79, 15, 193, 271, -110, -585, 187, 108, 347, -968, 591, -746, 150, -382, 189, 498, -579, -161, 368, 133, -416, -209, 526, 509, -13, -1012, -137, 203, 146, -273, 266, -266, -162, 469, -464, -49, 399, -182, 67, -213, -591, 207, -125, -142, -331, 618, -199, -575, 490, -56, -132, -74, -321, -14, -214, 212, -167, 233, -413, -6, 207, 328, 372, 25, -196, 492, -307, 506, 98, 524, 347, -706, 500, -54, 797, 505, 266, 621, -82, 133, 192, -111, -338, 280, -242, -332, -1034, -94, 306, -50, 186, 225, -390, 430, -454, -95, 296, -188, -376, 495, 595, -48, -458, 319, -634, -351, -84, -197, 284, -518, -140, 651, -209, 285, -64, -1023, 72, -448, -458, 195, -547, -377, 384, -87, -188, 379, -301, 44, 23, 720, -907, 620, 525, 169, 71, -195, -591, 254, -165, -495, -379, -770, -327, 471, -379]
1781c79k86Q12o4j97j03J89J63K54k94r2N40l12l0K56p22N96k91K17K21q41L47
1802a6l74L69M92m91L54k43ok94Q18k62m5p00L11N48k04j33j90J77K53o03N70
1823C31n79J097j684N66J88J1pK70K36L6r01Q49m19l31M75l23K00J44l73K91m18
1844c41P44m13J04L53l18j34m60k9P93J10p34P06n65M95k65l51L80n70J055r83
1864d23M69P9K3k60m42J053q08M39j64k55K25r1P0l41Q91q50N06l59P05k10j06
1885A51K14j58l20j07J64L39m94Q1l91N51n73L73R48r00M70J5q82N69K64l72K62
1906B04m55P30J00r44M72j69j99RM6j85J55O44l50j93K88l79m64J053j8l48j89
1927a92N46M44m7n54k40k1pj71M5L11J36k66l07R09j216N15L81j90m58J065M39
$$ y = [-379, -665, 147, 83, -114, -217, -28, 135, 389, 95, 3, 543, 231, 201, 457, -265, 331, 40, 257, 478, -363, -16, -390, -21, 471, -20, 334, 91, 85, -209, 609, 347, 302, -398, -87, 461, 257, 124, -66, 111, 364, -239, 331, -248, 849, -835, -269, -81, -70, -77, 193, 429, 465, -436, 413, -6, -337, 138, -185, 15, 159, -214, 77, -341, 403, -10, 94, 447, 129, -5, -465, -494, 299, 409, -325, 381, -184, 311, 46, -305, 75, -495, 560, -423, 46, 125, 148, -112, -554, 499, -309, 130, -34, -289, -64, -155, -85, -426, 465, -385, 121, -238, 467, 257, 151, 365, 207, -113, -220, -56, 283, -211, -130, -521, 30, -543, -170, 778, -122, 348, 363, -519, 50, 314, -58, 204, -251, 479, 579, -365, 107, -62, -261, -252, -206, -391, -236, 408, 58, -135, 153, -226, -690, 363, 345, -3, -192, 354, 798, 751, 197, -43, -64, -71, -242, -197, 114, 250, -16, -323, 586, -630, -115, 266, 76, -382, 683, 1122]
1948A122r03M72k55l68R3J27J80n99k82J125m63q83K60L19l97N08P4m85J01j51
1968d05j38J73KK70l63P62k57l65J69Q50m26j20n51L90m2O59l41m14J74j70L10
1989A67J5J49Q4o74M10M64n58k11l94K13M12j17J48l92l84J117j088L17K81L08
2009B67n87P62o94k57Q49l25k82M18o25K14N35p61J796j407L49o72Q01j26k88
2028c3k0j98K13k46O36j9J21r52R09l73L59k87K55o87l7L63l68O1J96P75q37K83
2050A14j99J4k25P47o09P5K29k04O94j16j44O8n20k27K58l00L27M15l23M77j27
2071D24k95o10K44J10L95m01l31Q72p12L54m60N56j90k4l48P25m34K71K1K42L2
2092D41p57L83k68J42p00R16O76j054j77K5r2L77l64L66O21l15q18N15L04K14
$$ y = [1122, 219, 691, 436, 68, 161, 288, 468, -131, -413, 712, 249, -634, -374, -55, -452, 56, 130, -355, -254, -405, -543, -370, -368, -98, -461, 301, 44, -321, -152, 698, 272, 152, -399, -9, -51, 608, 267, -147, 27, -143, 167, 182, 331, 415, -259, 151, 615, 57, -154, -548, -335, 77, -40, 108, -284, -668, 449, -639, -322, -41, 267, -320, 442, -252, -509, 340, 15, -267, 151, -474, -260, 275, -486, 1310, -97, 252, -420, 381, 255, -33, -53, -251, -38, -284, 352, 333, 454, -498, 411, 38, 397, 110, 365, -322, -359, 4, -364, -303, -107, 668, -169, 114, -85, -71, -296, 451, -158, -83, 146, -58, 636, 520, 376, 444, -76, -303, -45, -345, -18, 397, 74, 551, 424, 129, -481, -237, -127, 268, -133, -464, 408, -304, 50, -410, 146, -44, -68, -416, 309, -125, 146, 167, 409, 441, -316, 67, -201, -59, -759, 157, 833, -221, -398, -373, -465, -88, -452, -86, 535, 220, -598, -83, 221, 435]
2112D35o79L22n93L68N22N42p52r32O28J12l83P07L14j368J229R2j499Q91k85
2131c29P6K2J70l95L74k05L32J78l96j66J01K78J46m38J89l15O54j57k38P4k10
2152b55J036l73k05k36K88Kk76J58m68L71k5m42LP11K47j124J390j453Q66K1K57
2173D93k13o47K51o4n01L92O89n33K2N01j30p05p0R03m89K23o92l13J112L03o68
2194a36q6K57m5l54Q01n9L30j148L17l97K16J69j06R31j81L3n25m1m95O22K96
2215C99L10j085L64K32n5j44N89j837J337l64J42L95k97j96O44p76L89l55M87
2234A79j31N07k31J78m24l53j16N23p49R96l44q1o26O16L15o88P32k82j08M92
2254D05o8K58j006O07l9Q9q15j9M28k61P81j14m3k92J03l94K29L3L13j85m18M31
$$ y = [435, -244, 78, -515, -147, 375, 917, 165, -767, -139, -27, -410, 297, 611, -757, 472, 564, -935, -44, -329, -253, -231, -61, -456, -82, -287, 45, 223, -173, -339, -238, 40, 186, -252, -63, -378, 276, 119, -119, -45, -255, 781, 408, 203, -33, 255, 257, -19, 139, -329, 42, 17, -425, -422, 289, 536, -588, 802, -651, 215, 236, 493, 280, -367, -116, -180, -681, -289, 400, -133, -111, 390, 260, -445, -515, 388, -101, 122, -570, -883, 229, 532, -136, -222, 35, -10, -364, 437, 378, 708, -440, -123, -520, -304, -135, -241, 690, 509, 542, 17, -24, -519, 103, 399, 709, -376, -12, 220, 165, 21, 610, -1227, 110, -254, -112, 283, -14, -210, 434, -342, 47, -308, 179, 48, 555, 324, 502, 78, -275, -391, 132, -617, 379, 35, -46, -672, -56, 259, -429, 303, 21, -87, 405, 337, 595, -411, 196, 157, 246, -569, -588, -160, -421, 360, 246, 203, -89, 14, -380, -151, -118, 195, 10, -408, 23]
2276B3m91Q21m0n34J11j3Q6k30J81O19l54J92m10j54P7M28n62L61Q5n14KR41j48
2299D77k22L63o46l83P74j70k16j06j62M2M96j99n15J59P68k44K52p9%k87J77
2320B79j37n71R99m94l07m63K54K70J64K06J31o48M84J77k75K91o95J198k88j499
2340i24J305p88O37n70M33P9k85O17l38O5j30R7k59Q3M14m96M66j93l17K86j11
2361G1N23l80J21k80j53k94O84J33n26j2J76p63P59K62p54L48J34m58L95K99O4
2382C49q04L27L64p51P10o52N82K73q98j51O16j42O96q71R5P05k13k87k14M3k56
2403d79P05k25K5k84k12Q93r84J108p07R6O18l50m66N21p47P34L4o36M68L03j33
2424B82o01L5j64N52K10L69r18k45N44r6J00M37j48n51m0k43K56J36K06n50k00
$$ y = [23, -468, 353, 313, -221, -110, -123, -37, -267, -86, 533, 179, 371, -39, -193, -116, 312, -250, 111, 196, -318, -316, 625, 477, 255, 618, -28, -411, 363, 193, -23, -129, -291, -249, 247, 48, -467, -308, 460, 216, 468, 389, 389, 102, 279, 142, -429, 570, 76, -231, -694, -440, -170, -6, 200, 331, -317, 167, 344, 69, 360, -335, 863, 575, -924, 381, -407, 230, -340, 93, 172, -113, 504, 166, 231, 101, 198, -61, 22, 436, -60, 406, 213, -104, 182, 71, 594, 214, 335, 55, -98, -392, 292, 425, -101, -113, 63, -700, 59, 321, -433, -85, 49, -409, -14, 285, 349, -455, -128, 236, -515, 195, -457, 125, 398, -500, -651, -35, -177, 519, -352, -257, 448, 235, -52, -266, -223, -479, 226, 1, 26, -258, -470, 423, -561, 547, -160, -64, 554, 204, -262, 259, -488, 246, 280, -356, 112, 415, 282, -319, -284, -448, 104, 314, 683, -235, -480, 64, -32, 68, 505, 357, -194, -234, -477, -221, -85, 121, -429, -629]
2445f29Q09q0L4m69M83J74O5r84Q82m91K74k75K62N51j340M81N50m06M68m85J216
2466A090j972O43L04J30m49K57o94J010p1k67l65N00m00O53j29l38j75L89j61
2485d5O38o46k02O40j90K02j292N49K95J21j01p14J058K20k44q79P71J07P8m01
2505c5M64r76J13M16K4N7O6m5o2j51n2M68K41O6j178M36Q5K3j83q17J040J54m96
2528c42M55N7N70j095J283k80l46l96M14n63J17M07n21M80n65P81m25M07m23K22
2548B37n83P30l47M45m28o69P28o3J22m03M42r62R90j40k10N07l31j70J35Q37
2568H67m94l49K77n11M11O4q13J218j05r26l32J314k08q67M01J51J5l57L16M27
2588D99m36ml2j17q6J29K39K56n35M71j130L06O6j51M58r3N47L88j070r5l09N43
$$ y = [-629, 180, 100, 134, -335, 148, 322, 387, -597, 285, -206, 68, -207, 55, 606, -734, -253, 297, -109, 359, -126, 1090, -882, -239, 65, 195, -254, 3, -691, 319, 248, -19, -384, 116, -284, 369, 240, -98, -273, 116, -45, 593, -53, -255, 385, 195, 397, -895, -346, -51, 70, -31, -745, 313, 533, 289, -590, 181, 288, 366, -35, 429, -547, -434, -18, 6, 63, 129, 84, 22, -129, -181, 287, 528, 594, -584, -148, -63, -40, -223, -1040, 0, 154, -342, 113, 170, 740, -355, 928, 648, 302, -94, 320, -243, -126, 281, -240, 240, -325, 456, 31, 438, 15, 237, -346, 384, 37, 482, 54, -615, 113, 50, 172, -231, 211, -751, 239, 99, -111, 396, 65, -105, 30, 867, 373, 24, 301, -210, 201, 265, -548, 670, 565, -361, -693, 621, 413, -454, -53, 98, 113, -244, 72, 499, 63, 59, 27, -90, -176, -47, 192, 448, -87, 384, -746, -440, -374, -525, -67, -160, 387, 775, -295, -390, -699, -156]
2610a56j93N97l91O87K16o16q20R18k48J90o73j25J040j10k16n65J95M62j16m9
2630B7l16j95n02Q76P63j108K83L11m60N40k73p20R21k9o76M14L89j14n51N21
2650A01l8l2k39K85p7q91J074k21j52J38k77l05M07O20J21k32K62m51m07k99R2
2671e21M77r9l15J327o35K58j050N3K00k53J331q53M01K52J0l75l5J11n0k63j93
2692b22M54j25L17q94O55p63M22O0l25K44L95J30r3p08L91M0L22P6p8K69q69M64
2714A62m15l34N00P68j237J7L62N22l85L94r78J08K50K80j8K76p18O37r4k64k34
2735d01O41l13n01j5P35K52j68m89J19K00N15o92L54J71k93n87J33J048j35N6
2755F30r33k85L81N12l89Q86j540J100n47P72n95J73M16o45Q6O9M54l36l71m71
$$ y = [-156, -349, 248, -143, 544, 760, 144, -676, 242, -6, 184, -489, -614, 426, 316, 100, -465, -270, 192, 76, 27, -289, -484, -986, -110, 653, -455, -172, 139, -321, 219, -54, -774, 147, 118, -558, -144, 245, 131, -420, 101, 63, 31, -208, 77, 0, -891, 183, -38, -190, -52, -329, -634, -227, 393, 514, 282, 544, 93, -314, -613, -521, -44, -143, -458, 869, 234, 492, -558, -505, -305, -558, 773, -80, 321, 573, 583, 208, 173, 284, 234, -29, -222, 232, 107, 424, -470, 185, -578, -156, -96, -421, -177, 218, 348, 255, -453, -62, -22, 300, 376, 298, 567, -302, 162, -253, -587, -87, 681, -556, -539, -177, 345, -40, 354, -624, -516, -266, 14, -4, 272, -446, 191, 97, -167, -401, 240, -73, -574, -589, 146, 398, 230, -259, -140, 60, 575, -117, 237, 408, 115, -472, -339, 709, 574, 630, -303, -588, -207, 305, -84, 802, -738, 362, -185, 587, -8, 165, 581, -64, 22, 91, 545, 209, -162, -633]
2775f33Q21J2o35k1N65j36O86l25k39j00J98m03l86N06L32k69J17K7N6J56j374
2796a045Q80L73J15M88o16J75k55o71J069q72N54l81L28k29q8l1l43O77l91K16
2816d7K64O19o26k92O55n87k47M6mm47L79p9M14J37j32M1l71k12Q31k84K49n44
2838b37J07J02P56p01P33p01J51n39j40O16l69O07o35k8J028j024K31k55P97p91
2858b92P75o25J4j10j58P84l8k85k00P27m0l84l59j77M31k7k8p3n5L58o54M72
2880E6K9k95L49QJ52n20L27m95l3P7j77O80L92l91o61Q76J42r17M12k84K13o03
2902f63K65M71j008J871j186N8o11Q00l96L4L94L03k5M62n38k82L5K5J01p57L37
2923c10N35n35K53O2k34L19j4r45O88J8O92l33L20J47n22l58K9j50O23P15q25
$$ y = [-633, 188, 200, -435, -456, 109, -27, 659, 334, 95, -5, 193, -210, -596, -90, 242, -27, 90, 117, 173, 329, -1045, -165, 208, 323, 811, 195, 370, 115, -556, 513, -359, 195, -186, 142, -87, -175, -206, -549, 128, -263, -47, 217, 836, 210, -82, 573, -14, -261, -215, -219, -666, -287, -366, 48, 185, 53, 94, -277, -489, 342, 58, 307, -237, -130, -28, 728, 27, 760, 59, 210, -329, -469, 147, -222, 385, -250, -278, 750, -274, -43, -298, 499, -292, 483, -142, -128, -238, -396, 388, 350, 65, -135, 592, 552, 168, -191, -368, 63, 36, 8, -65, -120, 238, -416, 56, 85, -210, 139, 147, 299, -221, 106, -389, -422, -345, -522, 158, 550, 159, -502, 374, 516, -401, 11, -273, -60, -663, -398, 73, -935, 936, -250, -192, -803, -3, -399, -365, 29, 332, 307, 769, 231, -51, -16, 9, 110, -647, -310, 225, -310, -57, 5, -229, 90, 76, -869, -181, -163, 529, 196, 516, 663, 141, -217, -188, -338, 285, 1000, 175]
2944A75m21K18k5J72pK45p02M46K64l43l05N10m61M96p91O25l56j48K83m32l6
2965e93N49N98k33j28l49K50P5N66o28J1m0J16n22M4K69K97p71J93R1O29o01J072
2987H95r48o22P85N3j27R4M91j32k05l82K66n37K57l34O36J50o50M88k70R2k02
3008b02J65l7j45l75O59Q1m52N17L63n16j8k6K83k32n45J00M16N23q01K82l76
3029c36L38l61l74R87k93J51o30M7J267o59j12P0k56M13K81r40L22k33J15O20
3049D17r32P54p45Q02l77M36j09m24l26N83O49q77j33k7L47r07J374J19n75m93
3069d44J150o68O05k83p62P91pl83K30m33L71o31J77J70J12n70N68m68M68ll40
3090c50j62M15P04q68K07n07Q60k2o12O79L2K11n43M97o13n40R12n78o8N93K14
$$ y = [175, -246, -28, -53, 119, 112, 357, -345, 101, 365, 22, -283, 227, -234, 262, -529, 96, -260, -408, -125, -557, -593, -44, 554, 321, 193, -156, 94, 169, 735, 107, 118, 78, 194, -328, -284, -15, 282, -489, -296, -205, 424, -177, 895, -53, -675, 110, 163, 36, 130, 621, 489, 284, -98, 168, -369, -112, -446, 190, 340, -310, 178, -92, 0, -202, -37, -74, -219, -594, 65, 146, -306, 211, 574, 58, 40, 14, 297, 65, -480, -380, 36, 559, -242, 40, -336, 2, -359, -733, 254, -39, 112, -518, -471, 796, 137, 25, 95, -161, 252, 533, -407, -85, -318, -203, 417, -515, 239, -506, 296, -81, 355, 246, -178, -504, 79, 728, -149, -282, -309, 38, -869, 505, 624, 49, -444, 706, 38, 643, 360, -402, 389, 382, -1, 229, -204, 167, -464, -287, -117, -5, -575, -7, -475, -7, -10, -350, -512, -97, 607, -261, -54, -561, 299, 277, -335, 344, 376, 587, 44, 541, -72, -612, 300, -278, -346, 247, 461]
3111D61j258J128n81M14N00j097N53j76j86j9N49m34l34L6R61n63L64j09k30o11
3131f32P83M09p42PJ97L72m12m04P22k85k89N6K53j7M82j298J208J27l12P31j363
3152d07K53P50l98j4p08N36m04P43N94m21n26m27N89N98j178m73Q19K67M1P8j075
3173g63J005l47N38l56J7n8j33o24O30L88j050J006l26p27J175l04j89N68j93
3192B57K47o91L63k99O4k57J79RM30j350J618m10o04J15K13j78L28L15k83N2o24
$$ y = [461, -797, 331, -250, 164, 664, -433, 120, -56, -242, -261, 288, -146, -480, -444, 517, -46, 318, 209, -21, -632, 151, 560, -182, -175, 22, 394, -18, -422, 300, 15, -274, -218, 35, 18, 500, -798, 410, 537, 225, 956, -407, -154, 596, 198, 184, -524, 12, -392, 351, 945, 524, -2, -429, 160, 758, -420, -893, -74, 193, 234, 312, -763, 242, -105, 433, 77, 94, 36, -97, -721, -91, 297, -753, 253, -73, -800, 375, 71, -118, 450, 257, 504, -187, 176, -123, -59, -316, -137, -128, 302, -1048, 570, 160, -444, -329, -116, -294, 34, 349, 66, 118, -506]
$$ [...]
8191B70
##END NTUPLES=NMR FID
##END=
