##TITLE=1H_DE-32_oil_TFA
 CDCl3
 64 sc, 
 20.2.2024
##JCAMPDX= 6.0         $$ Bruker NMR JCAMP-DX V2.0
##DATA TYPE= NMR FID
##DATA CLASS= NTUPLES
##ORIGIN= UXNMR, Bruker Analytische Messtechnik GmbH
##OWNER= root
$$ XWIN-NMR		Version 3.5
$$ Tue Feb 20 14:32:09 2024 Russian Standard Time (UT+4h)  she@DPX200
##.OBSERVE FREQUENCY= 200.1313
##.OBSERVE NUCLEUS= ^1H
##.DELAY= (6, 6)
##.ACQUISITION MODE= SIMULTANEOUS
##.ACQUISITION SCHEME= undefined
##.AVERAGES= 64
##.DIGITISER RES= 18
##SPECTROMETER/DATA SYSTEM= spect
##.PULSE SEQUENCE= zg30
##.SOLVENT NAME= CDCl3
##.SHIFT REFERENCE= (INTERNAL, CDCl3, 0, 15.7039)
##AUDIT TRAIL= $$ (NUMBER, WHEN, WHO, WHERE, WHAT)
$$ ##TITLE= Audit trail, XWIN-NMR		Version 3.5
$$ ##JCAMPDX= 5.01
$$ ##ORIGIN= Bruker BioSpin GmbH
$$ ##OWNER= she
$$ F:/spectra/data/she/nmr/H-F/1/audita.txt
$$ ##AUDIT TRAIL=  $$ (NUMBER, WHEN, WHO, WHERE, WHAT)
(   1,<2024-02-20 14:30:35.68 +0400>,<she>,<DPX200>,
      <continue with go, POWCHK disabled, PULCHK disabled
       configuration hash MD5:
       00 E9 B6 7A A2 85 ED C7 34 08 36 98 17 FE 4E 26
       data hash MD5: 16K
       3E 5A 67 4C 8B D1 70 B5 A4 84 2C 29 8F 45 80 C9>)
$$ ##END=
$$ 
$$ hash MD5
$$ 84 8D DD CD 5E BF B2 F4 51 AB 74 84 0F 30 B6 A8
##$RELAX= 
##$RELAX= 
##$RELAX= 
##$RELAX= 
##$RELAX= 
##$RELAX= 
$$ Bruker specific parameters
$$ --------------------------
##$DU= <F:/spectra>
##$EXPNO= 1
##$NAME= <H-F>
##$PROCNO= 1
##$TYPE= <nmr>
##$USER= <she>
##$AMP= (0..31)
100 100 100 100 100 100 100 100 100 100 100 100 100 100 100 100 100 100 
100 100 100 100 100 100 100 100 100 100 100 100 100 100 
##$AQSEQ= 0
##$AQ_mod= 1
##$AUNM= <au_zg>
##$AUTOPOS= <>
##$BF1= 200.13
##$BF2= 200.13
##$BF3= 200.13
##$BF4= 200.13
##$BF5= 200.13
##$BF6= 200.13
##$BF7= 200.13
##$BF8= 200.13
##$BYTORDA= 1
##$CFDGTYP= 0
##$CFRGTYP= 5
##$CHEMSTR= <none>
##$CNST= (0..31)
1 1 145 1 1 1 1 1 1 1 1 1 1 1 1 1 1 1 1 1 1 1 1 1 1 1 1 1 1 1 1 1 
##$CPDPRG= <>
##$CPDPRG1= <>
##$CPDPRG2= <>
##$CPDPRG3= <>
##$CPDPRG4= <mlev>
##$CPDPRG5= <mlev>
##$CPDPRG6= <mlev>
##$CPDPRG7= <mlev>
##$CPDPRG8= <mlev>
##$CPDPRGB= <>
##$CPDPRGT= <>
##$D= (0..31)
0 1.2 0 0 0 0 0 0 0 0.06 0 0.03 0 0 0 0 0.0002 0 0 0 0 0 0 0 0 0 0 0 0 
0 0 0 
##$DATE= 1708424789
##$DBL= (0..7)
120 120 120 120 120 120 120 120 
##$DBP= (0..7)
150 150 150 150 150 150 150 150 
##$DBP07= 0
##$DBPNAM0= <>
##$DBPNAM1= <>
##$DBPNAM2= <>
##$DBPNAM3= <>
##$DBPNAM4= <>
##$DBPNAM5= <>
##$DBPNAM6= <>
##$DBPNAM7= <>
##$DBPOAL= (0..7)
0.5 0.5 0.5 0.5 0.5 0.5 0.5 0.5 
##$DBPOFFS= (0..7)
0 0 0 0 0 0 0 0 
##$DE= 6
##$DECBNUC= <off>
##$DECIM= 32
##$DECNUC= <off>
##$DECSTAT= 4
##$DIGMOD= 1
##$DIGTYP= 9
##$DL= (0..7)
0 120 120 120 120 120 120 120 
##$DP= (0..7)
150 150 150 150 150 150 150 150 
##$DP07= 0
##$DPNAME0= <>
##$DPNAME1= <>
##$DPNAME2= <>
##$DPNAME3= <>
##$DPNAME4= <>
##$DPNAME5= <>
##$DPNAME6= <>
##$DPNAME7= <>
##$DPOAL= (0..7)
0.5 0.5 0.5 0.5 0.5 0.5 0.5 0.5 
##$DPOFFS= (0..7)
0 0 0 0 0 0 0 0 
##$DQDMODE= 0
##$DR= 18
##$DS= 0
##$DSLIST= <SSSSSSSSSSSSSSS>
$$ [...]
##$SUBNAM2= <"">
##$SUBNAM3= <"">
##$SUBNAM4= <"">
##$SUBNAM5= <"">
##$SUBNAM6= <"">
##$SUBNAM7= <"">
##$SUBNAM8= <"">
##$SUBNAM9= <"">
##$SW= 18.0517328524113
##$SWIBOX= (0..15)
0 0 2 0 0 0 0 0 0 0 0 0 0 0 0 0 
##$SW_h= 3612.71676300578
##$TD= 16384
##$TD0= 1
##$TE= 0
##$TE2= 300
##$TE3= 300
##$TEG= 300
##$TL= (0..7)
0 120 120 120 120 120 120 120 
##$TP= (0..7)
150 150 150 150 150 150 150 150 
##$TP07= 0
##$TPNAME0= <>
##$TPNAME1= <>
##$TPNAME2= <>
##$TPNAME3= <>
##$TPNAME4= <>
##$TPNAME5= <>
##$TPNAME6= <>
##$TPNAME7= <>
##$TPOAL= (0..7)
0.5 0.5 0.5 0.5 0.5 0.5 0.5 0.5 
##$TPOFFS= (0..7)
0 0 0 0 0 0 0 0 
##$TUNHIN= 0
##$TUNHOUT= 0
##$TUNXOUT= 0
##$USERA1= <user>
##$USERA2= <user>
##$USERA3= <user>
##$USERA4= <user>
##$USERA5= <user>
##$V9= 5
##$VALIST= <valist>
##$VCLIST= <CCCCCCCCCCCCCCC>
##$VD= 0
##$VDLIST= <DDDDDDDDDDDDDDD>
##$VPLIST= <PPPPPPPPPPPPPPP>
##$VTLIST= <TTTTTTTTTTTTTTT>
##$WBST= 1024
##$WBSW= 4
##$XGAIN= (0..3)
0 0 0 0 
##$XL= 0
##$YL= 0
##$YMAX_a= 85081
##$YMIN_a= -85135
##$ZGOPTNS= <>
##$ZL1= 120
##$ZL2= 120
##$ZL3= 120
##$ZL4= 120
##$ABSF1= 10
##$ABSF2= 0
##$ABSG= 5
##$ABSL= 3
##$ALPHA= 0
##$AQORDER= 0
##$ASSFAC= 0
##$ASSFACI= 0
##$ASSFACX= 0
##$ASSWID= 0
##$AUNMP= <proc_1d>
##$AZFE= 0.1
##$AZFW= 0.1
##$BCFW= 1
##$BC_mod= 2
##$BYTORDP= 1
##$COROFFS= 0
##$CY= 11.3945322036743
##$DATMOD= 1
##$DC= 2
##$DFILT= <>
##$DTYPP= 0
##$F1P= 15.7292609196834
##$F2P= 12.9074282941183
##$FCOR= 0.5
##$FTSIZE= 0
##$FT_mod= 4
##$GAMMA= 1
##$GB= 0.15
##$INTBC= 1
##$INTSCL= 1
##$ISEN= 128
##$LB= 0.24
##$LEV0= 0
##$LPBIN= 0
##$MAXI= 10000
##$MC2= 0
##$MEAN= 0
##$ME_mod= 0
##$MI= 1.114404
##$NCOEF= 0
##$NC_proc= 0
##$NLEV= 6
##$NOISF1= 3.799351
##$NOISF2= 2.8
##$NSP= 1
##$NTH_PI= 0
##$NZP= 0
##$OFFSET= 15.70392
##$PC= 1
##$PHC0= -25115.64
##$PHC1= 12.25264
##$PH_mod= 1
##$PKNL= yes
##$PPARMOD= 0
##$PSCAL= 0
##$PSIGN= 0
##$REVERSE= no
##$SF= 200.130013532006
##$SI= 16384
##$SIGF1= 3
##$SIGF2= 2
##$SINO= 400
##$SIOLD= 16384
##$SREGLST= <1H.CDCl3>
##$SSB= 0
##$STSI= 0
##$STSR= 0
##$SW_p= 3612.71676300578
##$SYMM= 0
##$S_DEV= 0
##$TDeff= 0
##$TDoff= 0
##$TI= <>
##$TILT= no
##$TM1= 0
##$TM2= 0
##$TOPLEV= 0
##$USERP1= <user>
##$USERP2= <user>
##$USERP3= <user>
##$USERP4= <user>
##$USERP5= <user>
##$WDW= 1
##$XDIM= 8192
##$YMAX_p= 0
##$YMIN_p= 0
$$ End of Bruker specific parameters
$$ ---------------------------------
##NTUPLES= NMR FID
##VAR_NAME=  TIME,          FID/REAL,        FID/IMAG
##SYMBOL=    X,             R,               I
##VAR_TYPE=  INDEPENDENT,   DEPENDENT,       DEPENDENT
##VAR_FORM=  AFFN,          ASDF,            ASDF
##VAR_DIM=   8192,          8192,            8192
##UNITS=     SECONDS,       ARBITRARY UNITS, ARBITRARY UNITS
##FACTOR=    0.0002768,     1,               1
##FIRST=     0,             0,               0
##LAST=      2.2672688,     0,               0
##MIN=       0,             -85135,          0
##MAX=       2.2672688,     85081,           0
$$ Real data points
##PAGE= N=1
##DATA TABLE= (X++(R..R)), XYDATA
$$ [...]
$$ plain form
1101 -84 -220 -149 -111 -35 34 22 139 248 -49 39 75 145 22 46 72 0 11 -108 -56 -321 -238 -237 -77 -198 26 -92
1127 -92 -194 121 160 32 69 314 180 216 136 162 201 84 4 -180 -53 -144 -141 -132 -254 14 -17 -121 -54 -90 35
1152 35 33 64 -40 42 -103 80 181 85 105 65 -49 -40 -103 -203 -104 34 -243 -258 2 -90 69 144 11 105 222
1177 222 -25 198 227 46 41 -71 -58 39 -66 -157 -76 65 -89 -210 -193 -171 25 -160 2 -102 207 129 119 18
1201 18 52 17 114 25 -118 34 -30 -116 -112 -53 -156 -121 138 -25 34 -132 125 -9 135 93 116 84 123 22 65 36
1227 36 70 -64 17 -54 -65 -125 -74 -177 -179 -73 -145 -44 36 -18 -3 -11 46 104 55 42 98 108 15 139 160 -25 81 -57
1255 -57 -43 -190 -72 21 -19 65 63 201 -32 9 -19 -12 96 120 -66 126 144 94 -91 -141 -34 59 -85 -70 -103 -51
1281 -51 -30 -13 138 -247 110 9 106 205 24 8 106 58 -29 194 -75 28 46 -183 -28 -77 169 98 -142 17
$$ packed form
1101h4j36P1L8P6O9j2J17J09k97Q8L6P0j23K4K6p2J1j19N2k65Q3JJ60j21K24j18
1127i2j02L15L9j28L7K45j34L6q0K6L9j17q0j84J27r1LRj22K68l1j04O7l6J25
1152C5kL1j04Q2j45J83J01r6K0m0j14Ro3j00R9J38k77j5K60r2J59P5j33R4J17
1177B22k47K23K9j81nj12J3R7j05r1Q1J41j54j21J7K2J96j85J62j04L09p8j0j01
1201A8L4l5R7q9j43J52o4q6MN9j03L5K59j63N9j66K57j34J44m2K3l2L9j01M3k9
1227C6L4j34Q1p1j1o0N1j03kJ06p2J01Q0n4J5qN7N8m9j3N6J0r3J24K1j85J06j38
1255e7J4j47J18R3m0Q4kJ38k33M1k8PJ08K4j86J92J8n0j85n0J07R3j44J5l3N2
1281e1K1J7J51l85L57j01R7R9j81j6R8m8q7K23k69J03J8k29J55m9K46p1k40J59
$$ plain form
1305 17 -33 165 -51 172 123 73 12 -7 173 159 102 6 1 -88 -135 15 -114 -24 -164 -104 -197 -212 -16 50 33 -18 35
1332 35 39 13 107 181 20 185 -67 -41 12 71 -82 -143 62 47 -59 -29 -64 -106 -33 50 -117 100 152 132 -101 -56
1358 -56 -59 -43 -4 -33 -18 14 143 -209 23 -167 -115 -77 -49 24 -73 -74 -158 143 43 86 30 153 -116 67 262 94
1384 94 -27 -9 -108 -80 60 -140 3 -110 144 31 -171 47 -34 -58 -93 -34 -30 73 295 30 61 -14 -21 -22 6 -50
1410 -50 34 -10 -101 -95 34 -100 24 -10 174 114 103 213 42 113 49 -125 59 7 256 135 53 -19 244 -128 -20
1435 -20 66 141 -128 15 -70 32 94 4 35 169 193 136 40 -24 91 57 49 166 -82 -18 27 -106 -8 -76 -107 30
1461 30 35 12 88 49 92 70 24 90 181 120 53 -64 -9 -83 -14 63 90 -129 -140 -19 -71 -37 10 108 -106 34 59 62 -83
1490 -83 -37 147 47 37 117 -62 -145 -141 -224 -138 -213 44 -77 -124 -96 44 64 7 123 178 101 38 198 96 60 120
$$ packed form
1305A7n0J98k16K23m9n0o1j9J80j4n7r6nq9m7J50j29R0j40O0r3j5J96O6j7n1N3
1332C5Mk6R4P4j61J65k52K6N3N9j53o1K05j5j06L0l5m2P3Q3j67K17N2k0k33M5
1358e6lJ6L9k9J5L2J29l52K32j90N2L8K8P3r7jq4L01j00M3n6J23k69J83J95j68
1384I4j21J8r9K8J40k00J43j13K54j13k02K18q1k4l5N9MJ03K22k65L1p5pjK8n6
1410e0Q4m4r1OJ29j34J24l4J84o0j1J10j71P1o4j74J84n2K49j21q2p2K63l72J08
1435b0Q6P5k69J43q5J02O2r0L1J34K4n7r6o4J15l4qJ17k48O4M5j33R8o8l1J37
1461C0Nk3P6l9M3k2m6O6R1o1o7j17N5p4O9P7K7k19j1J21n2L4M7R8k14J40K5Lj45
1490h3M6J84j00j0Q0j79q3Mq3Q6p5K57j21m7K8J40K0n7J16N5p7o3J60j02l6O0
$$ plain form
1516 120 174 79 -104 91 -45 -107 5 15 70 -15 18 -128 -128 -43 -192 147 10 92 64 31 63 -154 36 -111 -274
1541 -274 46 -95 211 -11 -76 -118 -10 112 102 -81 3 -10 -22 165 122 96 165 333 66 -98 83 64 15 23
1565 23 -112 -18 -7 -46 -85 -66 -57 -62 36 -162 30 -174 24 169 65 49 -76 49 -90 -21 -83 42 226 -33 86
1590 86 -54 23 54 54 -37 -117 86 -7 52 141 80 143 109 54 60 190 5 80 170 -99 -31 11 108 -100 -46 -72 67 -98
1618 -98 -116 -23 -100 -20 6 -75 64 -17 64 -16 -27 91 -71 -21 -82 85 222 -9 91 -9 -5 -29 55 -22 140 136 125
1645 125 12 30 121 -40 64 62 -17 2 75 -55 -23 -111 -77 -124 -39 -6 11 98 122 -5 2 117 -95 138 -24 -122
1671 -122 117 -93 -156 -14 23 4 -132 55 18 -63 -14 162 20 29 14 78 134 -27 -135 198 177 63 38 -32 -88
1696 -88 -138 -34 8 -34 -10 -30 -90 -76 -179 -118 135 -146 -30 -17 -90 11 -6 6 -32 131 233 45 -62 58 18
$$ packed form
1516A20N4r5j83J95j36o2J12J0N5q5L3j46%Q5j49L39j37Q2k8l3L2k17J90j47j63
1541b74L20j41L06k22o5m2J08J22j0j83Q4j3j2J87m3k6O9J68k67j64J81j9m9Q
1565B3j35R4J1l9l9J9RnR8j98J92k04J98J45j04j6j25J25j39O9o2J25J84k59J19
1590H6j40P7L1%r1q0K03r3N9Q9o1O3l4n5OJ30j85P5R0k69O8M2R7k08N4k6J39j65
1618i8j8R3p7Q0K6q1J39q1Q1q0j1J18j62N0o1J67J37k31J00j00Mk4Q4p7J62mj1
1645A25j13J8R1j61J04kp9J9P3j30L2q8L4m7Q5L3J7Q7K4j27PJ15k12K33j62r8
1671a22K39k10o3J42L7j9j36J87l7q1M9J76j42Rj5O4N6j61j08L33k1j14k5p0n6
1696h8n0J04M2m2K4k0o0J4j03O1K53k81J16J3p3J01j7J2l8J63J02j88j07J20m0
$$ plain form
1721 18 117 37 126 122 -95 -182 69 -68 -81 33 181 -53 31 25 15 214 28 -61 111 -33 -103 67 19 -48 -57 57
1747 57 5 -59 -43 26 -9 5 46 58 192 171 -96 12 21 62 29 -41 115 28 23 21 -39 -11 -177 -131 -95 33 -155 -33
1775 -33 36 192 158 -8 27 15 208 -58 12 -14 -130 103 78 -73 -45 -21 -98 17 -99 -135 -95 -39 -1 50 164
1800 164 -7 45 190 274 86 -73 202 109 252 120 -120 -111 -79 11 -11 21 -14 -56 -32 -66 8 47 84 9 -10 -58
1826 -58 122 43 -53 -29 -193 -55 72 -111 -66 -37 21 -103 -94 25 86 -109 31 -34 60 107 21 129 -90 56 48
1851 48 62 -68 -127 -17 33 104 100 -36 -49 -34 141 38 38 -53 -121 -149 -77 -46 -26 47 59 6 -115 106 99 -26 -152
1878 -152 34 -9 30 33 -80 -33 -106 52 75 10 61 158 51 38 11 133 119 21 -36 25 112 28 131 61 76 3 -66
1905 -66 -40 99 27 -64 6 3 -62 36 -88 -137 -85 149 44 145 73 135 13 -54 -52 65 -99 -8 -189 -16 88 -53
$$ packed form
1721A8R9q0Q9mk17q7K51j37j3J14J48k34Q4oj0J99j86q9J72j44p0J70m8o7rJ14
1747E7n2o4J6O9l5J4M1J2J34k1k67J08RM1l3p0J56q7nko0K8j66M6L6J28j88J22
1775c3O9J56l4j66L5j2J93k66P0k6j16K33k5j51K8K4p7J15j16l6M0N6L8N1J14
1800A64j71N2J45Q4j88j59K75r3J43j32k40RL2R0k2L2l5m2K4l4P4L9L7p5j9m8
1826e8J80p9r6K4j64J38J27j83M5K9N8j24RJ19O1j95J40o5R4M7q6J08k19J46q
1851D8J4j30n9J10N0P1mj36j3J5J75j03%r1o8k8P2L1K0P3J2n3j21K21pj25j26
1878a52J86m3L9Lj13M7p3J58K3o5N1R7j07j3k7J22j4r8n7O1Q7q4J03p0J5p3o9
1905f6K6J39p2r1P0lo5R8j24m9N2K34j05J01p2O2j22o7KJ17j64R1j81J73J04j41
$$ plain form
1931 -53 -79 184 84 147 60 14 109 158 91 163 70 -9 22 -18 16 81 -17 23 -28 -106 -111 118 27 10 -184 -231 69 -75
1959 -75 130 -15 36 -106 -11 4 89 14 18 12 43 6 17 45 45 64 145 30 139 121 95 94 -134 -5 63 -81 98 -48
1987 -48 21 -76 77 -47 -127 -259 -30 -147 -82 -94 20 28 81 -21 -141 -25 -13 164 4 -53 -35 31 10 -7 99
2012 99 -74 8 118 2 -57 13 19 89 -16 -9 -1 -16 19 76 -40 36 34 184 62 -114 54 -52 88 -124 -133 137
2038 137 -29 55 -162 -2 56 -63 -59 43 7 -18 115 34 60 135 10 236 0 53 118 72 95 53 -17 19 67 196
2064 196 -263 95 -18 51 176 38 54 38 -69 39 -17 56 -39 104 -5 -53 -127 -137 -167 -126 38 -31 86 63
2088 63 -13 4 -32 71 122 -179 -71 21 255 43 -53 -2 16 122 -114 37 -25 48 60 -50 -101 -34 73 163 88
2113 88 -29 29 86 -62 2 -70 97 57 -14 -9 -68 -49 19 -58 -98 45 -168 -67 -110 -17 67 122 -97 40 26 -106
$$ packed form
1931e3k6K63j00O3q7m6R5M9o7P2r3p9L1m0L4O5r8M0n1p8nK29r1j7j94m7L00j44
1959g5K05j45N1j42R5J5Q5p5MoL1l7J1K8%J9Q1j15J09j8k6jk28J29O8j44J79j46
1987d8O9r7J53j24q0j32K29j17O5j2J14QN3j02j20J16J2J77j60n7J8O6k1j7J06
2012I9j73Q2J10j16n9P0OP0j05PQj5L5N7j16P6kJ50j22j76J68j06J40k12rK70
2038A37j66Q4k17J60N8j19MJ02l6k5J33q1K6P5j25K26k36N3O5m6K3m2p0L6M8J29
2064A96m59L58j13O9J25j38J6j6j07J08n6P3r5J43j09m8p4j0l0M1J64o9J17k3
2088F3p6J7l6J03N1l01J08R2K34k12r6N1J8J06k36J51o2P3J2j10n1O7J07R0p5
2113H8j17N8N7j48O4p2J67m0p1Nn9J9O8p7m0J43k13J01m3R3Q4N5k19J37j4j32
$$ plain form
2139 -106 165 80 32 105 -102 2 -50 -28 -51 1 -13 -20 -25 -17 39 9 -70 0 150 16 195 -68 -136 -25 -12 -83 -52
2166 -52 -135 35 -261 37 81 -88 59 23 -195 -182 -26 -74 -4 17 58 9 0 192 65 -80 -40 -47 12 23 2 -129
2192 -129 24 36 -39 118 68 2 68 -85 4 -96 -84 -160 91 36 -78 -20 79 58 10 16 -195 -43 -205 -112 -74 72
2218 72 43 -213 31 81 0 139 -18 198 -169 30 110 45 -34 -57 57 52 36 -105 -40 5 56 -108 -37 -167 -64
2243 -64 -105 39 -74 -45 -47 -17 -3 -5 -88 -11 -14 -8 22 -98 -127 -14 16 -102 -141 -115 -108 -5 126 33 6 -21 -57 44 174
2272 174 160 31 -28 105 125 -59 52 33 -16 64 -45 -71 81 37 11 -113 -158 -11 39 -60 108 -89 -43 8 -126
2297 -126 -72 -57 -61 -30 -43 29 26 -112 113 -135 -55 -97 -14 -79 80 16 38 102 21 1 -71 124 156 28 98 61 -31 -19
2325 -19 -12 -24 -140 -4 -50 -77 49 46 68 71 0 -2 -76 -84 69 37 51 -43 -64 -64 -88 82 10 37 -35 -26 10 -34 103 123 -75
$$ packed form
2139a06K71q5m8P3k07J04n2K2k3N2j4pnQN6l0p9P0J50j34J79k63o8J11J3p1L1
2166e2q3J70k96K98M4j69J47l6k18J3J56m8P0K1M1m9rJ92j27j45M0pN9J1k1j31
2192a29J53J2p5J57n0o6O6j53Q9j00J2p6K51n5j14N8R9k1m8Ok11J52j62R3L8J46
2218G2k9k56K44N0q1J39j57K16l67J99Q0o5p9k3J14nj6j41O5M5N1j64P1j30J03
2243f4m1J44j13K9kL0J4kq3P7lOL0j20k9J13L0j18l9K6PJ03J31r3k7k7l6J01J30
2272A74j4j29n9J33K0j84J11j9m9Q0j09k6J52m4k6j24m5J47N0r9J68j97M6N1j34
2297a26N4J5mL1j3P2lj38K25k48Q0m2Q3o5J59o4K2O4q1k0p2J95L2j28P0l7r2J2
2325a9Pj2j16J36m6k7J26lK2Lp1kp4qJ53l2J4r4k1%k4J70p2K7p2RL6m4J37K0j98
$$ plain form
2356 -75 3 -99 30 -1 64 78 51 2 32 92 125 -81 22 2 -104 -10 -12 3 -109 -24 -58 16 52 115 -36 2 41
2383 41 12 -78 13 -41 10 2 -62 95 -50 -92 89 106 -95 78 -25 -14 70 74 187 -8 54 -12 56 35 16 6 59
2410 59 -95 42 37 104 -81 -77 -112 0 34 -60 86 -146 -180 -74 106 -102 19 -157 -76 -23 -65 11 -57 71 122
2435 122 126 -110 65 -18 3 -74 11 41 58 29 27 5 47 -13 111 56 -76 -102 -47 -75 84 6 90 -74 -135 -14 54
2462 54 -18 15 -11 -153 97 56 -49 -46 110 10 88 -8 179 -34 39 55 46 59 -22 -61 -9 -12 -55 -7 87 70 -30 -41
2490 -41 157 -35 76 -2 114 27 -31 83 20 35 113 -156 42 -53 66 136 227 63 -41 -73 -97 -116 -43 53 13
2515 13 -26 -132 64 75 -72 -69 -73 49 137 77 -9 9 109 -65 72 79 133 -72 -27 -54 43 -31 -82 171 174 -48 4
2542 4 -57 8 81 6 -24 -37 -73 -6 95 -107 54 -24 -42 -77 -9 -85 -5 -36 96 83 45 -91 -49 34 229 107 71
$$ packed form
2356g5P8j02J29l1O5J4k7m9L0O0L3k06J03k0j06R4kJ5j12Q5l4P4L6O3j51L8L9
2383D1k9r0R1n4N1qo4J57j45m2J81J7k01J73j03J1Q4MJ13j95O2o6O8k1j9j0N3
2410E9j54J37nO7j85Ml5J12L4r4J46k32l4J06J80k08J21j76Q1N3m2P6o8J28N1
2435A22Mk36J75q3K1p7Q5L0J7k9kk2M2o0J24n5j32k6N5k8J59p8Q4j64o1J21O8
2462E4p2L3k6j42K50m1j05LJ56j00P8r6J87k13P3J6rJ3q1l9N2lm3M8R4j7j00j1
2490d1J98j92J11p8J16q7n8J14o3J5P8k69J98r5J19P0R1j64j04l2k4j9P3R6m0
2515A3l9j06J96J1j47LmJ22Q8o0q6J8J00j74J37PN4k05M5k7R7p4n1K53Lk22N2
2542Do1O5P3p5l0j3l6O7J01k02J61p8j8l5O8p6Q0l1J32j3l8j36M2Q3J95j22l6
$$ plain form
2569 71 10 84 -6 21 -139 6 1 -14 104 -18 -23 40 58 37 -89 -111 -158 69 17 -67 24 18 12 11 21 39 -14 16 154
2598 154 -41 -97 34 40 -70 21 -114 -24 138 78 37 -53 -41 10 12 -85 217 -10 49 28 135 99 -15 17 -104 114
2624 114 -19 111 -113 56 -50 -46 67 -46 -49 3 42 146 32 -137 -66 -5 24 -26 160 -134 87 70 21 51
2648 51 -116 -29 21 32 17 -7 -72 68 79 205 -37 -21 123 81 8 94 26 26 -3 60 169 -96 189 -148 3 -24
2674 -24 -86 -15 -211 -174 -48 91 21 -157 17 -109 75 149 -42 -136 131 59 -167 -74 90 -2 125 0 -31 220
2698 220 107 -91 2 7 -122 -89 134 126 120 -76 -33 36 -97 -18 -115 -157 20 -25 121 -108 -8 62 -59 -156 -46
2723 -46 -77 113 -63 -68 54 17 116 -188 -51 -25 30 -9 109 233 -40 -21 35 -62 254 97 -76 36 47 54 64
2748 64 -223 82 106 -32 75 105 -42 -5 -26 -24 -58 -33 215 4 -44 -87 -145 58 -125 46 -61 -101 -102 68 -12
$$ packed form
2569G1o1P4r0K7j60J45nj5J18j22nO3J8k1j26k2m7K27n2q4R1oojJ0J8n3L0J38
2598A54j95n6J31Oj10R1j35R0J62o0m1r0J2N1Kr7L02k27N9k1J07l6j14L2j21K18
2624A14j33J30k24J69j06MJ13j13lN2L9J04j14j69P1O1K9n0J86k94K21j7m9L0
2648E1j67Q7N0J1j5k4o5J40J1J26k42J6J44m2p3Q6o8%k9O3J09k65K85l37J51k7
2674b4o2P1j96L7J26J39p0j78J74j26J84P4j91r4K67p2k26R3J64r2J27j25l1K51
2698B20j13j98R3Nj29L3K23qoj96M3O9j33P9r7m2J77m5J46k29J00P0j21r7J10
2723d6l1J90j76nJ22l7R9l04J37K6N5l9J18J24k73J9N6r7L16j57j73J12J1PJ0
2748F4k87L05K4j38J07L0j47L7k1Kl4K5K48k11m8m3n8K03j83J71j07m0jJ70q0
$$ plain form
2773 -12 -55 -42 43 18 -44 -195 127 -43 -42 -35 -65 5 -75 71 86 53 -19 -78 37 3 9 35 -55 34 -72 -6 -32 -26 17
2802 17 178 -148 -32 -179 -73 155 92 23 -30 12 32 41 28 40 -45 50 98 -59 10 -57 39 18 -49 0 16 -128 32
2829 32 132 15 2 -58 19 -41 180 -59 -184 19 55 48 106 48 -20 -134 49 67 32 47 -41 -52 42 75 -61 -19
2855 -19 -76 -34 192 -27 81 -37 -51 -23 -33 23 86 -91 -33 111 -85 123 63 15 59 69 68 1 28 184 55 -20
2881 -20 0 -63 -32 -106 -128 -51 2 -50 -82 -59 59 -15 -85 94 -89 -54 183 -24 63 50 -70 57 -120 3 -82 -65
2907 -65 133 -62 -12 79 -139 4 99 35 -10 92 24 -31 -68 -19 -118 21 42 -62 1 -169 -27 102 -62 -126 71
2932 71 -181 8 -71 9 3 -4 51 -200 -55 -21 -15 -61 123 3 9 -37 -30 -255 91 -10 -157 -66 97 -28 0 -44 -43
2959 -43 40 1 142 21 -3 -15 -51 -53 -40 -123 55 6 31 -65 -29 51 56 153 -17 -33 -104 -66 10 -49 31 80 74 -125 166
$$ packed form
2773a2m3J3Q5k5o2j51L22j70JPl0P0q0J46J5l3p2n9J15l4OK6r0Q9j06O6k6OM3
2802A7J61l26J16j47J06K28o3o9n3M2K0Rj3J2q5R5M8j57O9o7R6k1o7M9J6j44J60
2829C2J00j17j3o0P7o0K21k39j25K03L6pN8n8o8j14J83J8l5J5q8j1R4L3j36M2
2855a9n7M2K26k19J08j18j4K8j0N6O3j77N8J44j96K08o0m8M4J0jo7K7J56j29p5
2881b0K0o3L1p4k2P7N3n2l2K3J18p4p0J79j83L5K37k07Q7j3j20J27j77J23q5J7
2907f5J98j95N0R1k18J43R5o4m5J02o8n5l7M9r9J39K1j04O3j70J42J29j64o4J97
2932G1k52J89p9Q0opN5k51J45L4Om6J84j20Om6Pk25L46j01j47R1J63j25K8m4J
2959d3Q3l9J41j21k4j2l6kJ3q3J78m9K5r6L6Q0NR7j70j6p1L8P6n9Q0M9oj99K91
$$ plain form
2988 166 66 136 74 26 -60 -24 127 77 -74 -40 111 3 49 -7 79 85 -83 -69 -102 149 -42 53 58 41 -38 82
3014 82 57 -44 64 69 -17 66 -122 41 7 -43 52 3 172 -64 0 7 -93 53 -58 5 -37 58 -80 -115 -21 20
3040 20 21 164 -38 -4 35 -129 121 53 -16 119 -34 2 78 -52 -34 -13 1 -75 -3 -188 162 10 -72 -81 -114 7
3066 7 165 37 -47 18 126 16 19 -167 -21 35 4 70 -12 -81 38 -178 -52 55 -41 36 -73 9 -6 36 36 -74
3092 -74 -46 -24 -57 121 57 -49 -77 26 69 49 -45 -86 46 -114 -8 -80 -68 161 36 -114 -22 -25 -82 -20 9 34
3118 34 4 -28 45 82 25 -89 -91 95 30 -38 -45 35 11 -126 107 -8 166 75 139 -20 36 108 17 -66 93 -1 49
3145 49 -46 -19 154 29 -37 -139 5 -105 -31 -41 -71 -103 -96 -16 -33 64 21 79 66 24 28 -34 -77 159 53 -12 -34 96
3173 96 -142 75 -84 -7 122 -157 -95 -13 -39 11 -39 50 -5 12 -158 -78 -55 70 -10 -109 -72 -106 50 -58 -41 28
$$ packed form
2988A66j00P0o2m8q6L6J51n0j51L4J51j08M6n6Q6Oj68J4l3K51j91R5Nj7p9J20
3014H2k5j01J08Nq6Q3j88J63l4n0R5m9J69k36O4Pj00J46j11O3m2R5j38l5R4M1
3040B0JJ43k02L4L9j64K50o8o9J35j53L6P6j30J8K1J4p6P2j85L50j52q2rl3J21
3066GJ58j28q4O5J08j10Lj86J46N6l1O6q2o9J19k16J26J07r6P7j09Q2j5M2%j10
3092g4K8K2l3J78o4j06k8J03M3k0r4m1J32j60J06p2J2K29j25j50R2ln7O2K9K5
3118C4l0l2P3L7n7j14kJ86o5o8pQ0k4j37K33j15J74r1O4j59N6P2r1q3J59r4N0
3145D9r5K7J73j25o6j02J44j10P4j0l0l2PQ0j7R7m3N8j3m2Mo2m3K36j06o5k2J30
3173I6k38K17j59P7J29k79O2Q2k6N0n0Q9n5J7j70Q0K3J25q0r9L7l4J56j08J7O9
$$ plain form
3199 28 -23 -68 -29 38 68 -125 6 -161 52 14 -7 -17 41 15 38 129 -81 -86 -52 27 -42 -19 -3 93 59 -110 -97 -33
3227 -33 -22 -79 71 -204 -97 -43 37 61 -16 -74 86 17 20 99 78 57 122 -57 -31 53 -68 -60 2 166 85 18 129
3254 129 130 -13 88 24 57 56 217 55 46 4 101 68 -30 94 -13 -135 -45 -8 59 -39 139 -91 139 -60 73
3279 73 -25 65 -35 178 -6 -43 189 -170 138 -104 13 12 79 117 135 -23 -49 117 -69 86 -49 44 -15 -181
3303 -181 -12 -8 146 -72 104 -63 -6 25 -93 83 -32 149 21 7 120 -136 135 90 -12 87 4 -13 -17 115
3327 115 150 2 57 -14 -69 21 2 -122 -7 -19 -1 -149 69 56 58 41 -51 -53 -18 -26 3 -6 31 20 -5 -24 62 47 -10
3356 -10 -115 -37 -37 8 -31 70 -34 -58 -74 24 -47 71 125 109 91 41 -170 99 -75 -123 30 68 12 51 12 -10 199
3383 199 61 -18 107 164 9 -35 -51 -7 71 0 72 20 28 50 -71 -58 -166 -114 66 -31 -79 -133 12 14 -112 -19 45
$$ packed form
3199B8n1m5L9O7L0j93J31j67K13l8k1j0N8k6K3R1k10nL4P9o9K3J6R6l4j69J3O4
3227c3J1n7J50k75J07N4Q0K4p7n8J60o9LP9k1k1O5j79K6Q4j21QO2J64q1o7J11
3254A29Jj43J01o4L3jJ61j62rm2R7l3r8J24j07j22R0L7O7r8J78k30K30j99J33
3279G3r8R0j00K13j84l7K32l59L08k42J17jO7L8J8j58k6J66j86J55j35R3n9j66
3303a81J69MJ54k18J76j67N7L1j18J76j15J81j28j4J13k56K71m5j02R9q3j7mJ32
3327A15L5j48N5p1n5R0j9j24J15j2J8j48K18j3Kj7r2kL5qK9rL7j1k5j9Q6j5n7
3356a0j05P8%M5l9J01j04k4j6R8p1J18N4j6j8n0k11K69j74m8J53L8n6L9l9k2K09
3383A99j38p9J25N7j55m4j6M4P8p1P2n2QK2j21J3j08N2J80r7m8n4J45Kj26R3O4
$$ plain form
3410 45 -110 6 75 -85 98 -6 -108 15 87 -18 34 3 27 -11 51 40 -65 -58 92 37 243 0 -103 53
3434 53 -95 -6 -161 -21 42 6 57 48 -27 -75 10 16 80 -47 15 107 54 61 -4 119 -93 79 -67 14 67 -9 177
3461 177 -87 100 47 -84 -49 12 -92 -8 16 -3 102 74 -19 -115 -138 -71 -114 -96 75 -3 -40 25 22 94 100 4 77 -105
3489 -105 131 105 94 -36 -41 40 -4 53 -51 -91 68 170 56 18 23 100 -96 154 -87 68 -38 -212 -44 -12
3513 -12 -26 68 -12 64 -33 70 84 -52 12 79 -85 132 -119 -6 -48 -72 6 -70 45 -82 -84 -15 -4 -22 -17 -7 148
3540 148 147 119 77 -65 38 48 86 -28 -22 -18 -48 73 53 56 -36 37 5 -144 31 -14 -112 100 -20 -58 -11 74 50 -18
3568 -18 96 -66 -115 29 -125 -43 -70 -54 -15 15 44 112 -33 -116 -2 107 -156 115 33 -14 -120 -115 -60 210 36
3593 36 121 11 59 149 -55 35 -142 -9 -98 130 -8 -188 -9 -38 102 -40 11 144 21 131 -1 160 -29
$$ packed form
3410D5j55J16O9j60J83j04j02J23P2j05N2l1K4l8O2j1j05PJ50n5K06k43j03J56
3434E3j48Q9j55J40O3l6N1rp5m8Q5OO4j27O2R2n3Po5J23k12J72j46Q1N3p6J86
3461A77k64J87n3j31L5O1j04Q4K4j9J05k8r3r6k3O7m3J8J71p8l7O5lP2Or6P3j82
3489a05K36k6j1j30nQ1m4N7j04m0J59J02j14l8NP7j96K50k41J55j06j74J68L2
3513a2j4R4q0P6r7J03J4j36O4O7j64K17k51J13m2k4P8p6J15j27kO9J1j8NJ0J55
3540A48jk8m2j42J03J0L8j14OMl0J21k0Lr2P3l2j49J75m5r8K12j20l8M7Q5k4o8
3568a8J14j62m9J44j54Q2k7J6L9L0K9O8j45q3J14J09k63K71q2m7j06NN5K70j74
3593C6Q5j10M8R0k04R0j77J33q9K28j38j80J79k9J40j42N1J33j23J10j32J61j89
$$ plain form
3616 -29 52 116 -66 -82 -65 95 85 0 0 -18 -84 -92 -16 100 78 71 139 -38 53 -53 -15 78 -34 80 12 -87 24 37
3644 37 -36 -102 -75 10 -76 -2 21 -115 22 -64 -185 -122 17 5 -68 -21 -118 140 -66 6 -41 167 -31 -99 -75 58
3670 58 -4 133 160 -24 -37 100 -86 -32 170 -70 199 78 68 53 20 -31 -30 -47 34 39 -15 -104 -14 -8 -46 -81 -4 0
3698 0 -48 31 147 -72 -22 -61 -62 -58 -30 -74 63 -2 -104 71 -89 -143 -59 78 -46 -4 59 108 -89 -12 -91 -43 25
3725 25 -67 102 30 -115 60 -87 -37 -66 -54 -11 24 71 -101 -11 -22 -43 20 -182 1 211 74 13 184 128 35
3750 35 18 58 -3 128 39 45 4 -78 59 69 -101 62 -66 161 196 -39 61 -131 109 -82 141 -112 16 81
3774 81 44 17 -73 -60 -38 69 46 -88 47 -31 29 131 64 73 -67 -21 -104 89 -72 -105 -25 -43 -74 -102 -26 61 28
3801 28 -132 88 -42 127 -16 1 100 -50 -19 42 216 86 112 -5 -1 120 48 -77 29 8 -162 36 33 20
$$ packed form
3616b9Q1O4j82j6J7J60j0q5%j8o6qP6J16k2pO8j77R1j06L8R3j12J14o8r9J11J3
3644C7p3o6K7Q5q6P4K3j36J37q6j21O3J39j2p3M7r7K58k06P2m7K08j98o8K4J33
3670E8o2J37K7j84j3J37j86N4K02k40K69j21j0j5l3n1Jj7Q1Nn4q9R0Ol8l5P7M
3698@m8P9J16k19N0l9jMK8m4J37o5j02J75j60n4Q4J37j24M2O3M9j97P7p9M8O8
3725B5r2J69p2j45J75j47N0k9J2M3L5M7j72R0j1k1O3k02J83K10j37o1J71n6r3
3750C5j7M0o1J31q9Om1q2J37J0j70J63j28K27L5k35J00j92K40j91K23k53J28O5
3774H1l7k7r0J3K2J07k3j34J35p8O0J02o7Rj40M6q3J93j61l3Q0j8l1k8P6Q7l3
3801B8j60K20j30J69j43J7R9j50L1O1J74j30K6j17MJ21p2j25J06k1j70J98lj3
$$ plain form
3825 20 -75 60 1 -18 -103 57 83 -17 -6 78 -57 -118 -114 1 6 -75 -94 -44 -33 -95 81 -94 42 52 -1 37 90
3852 90 95 -5 57 30 -31 -24 35 -94 29 77 -82 -99 -115 -102 -164 -185 -15 -47 -37 7 -105 3 6 -15 -60 172 83 62
3880 62 -52 -47 -91 -9 6 9 -76 135 -62 20 152 70 5 -127 68 -140 32 4 -38 95 -48 5 -85 -138 -119 -5
3906 -5 -118 -1 -86 123 33 -29 67 -28 -63 18 -67 121 39 162 109 -78 -97 -82 28 -101 6 -166 -24 20 -89
3931 -89 -46 52 -26 -50 52 -91 -13 -111 -35 90 -60 45 -53 92 -145 -31 -74 -87 -80 27 6 -127 5 -110 102
3956 102 20 -28 -23 35 36 -52 -90 -77 -23 149 -31 -13 74 46 -95 99 39 23 -110 -109 60 129 75 13 95 8 -58 11
3984 11 52 56 -12 27 28 -135 32 -96 -87 -91 10 71 -8 8 85 85 29 93 -22 37 126 -6 17 -112 -55 28 -42 66 -106
4013 -106 10 164 4 1 1 22 -20 -8 182 88 140 82 138 27 -17 -8 50 -53 -53 -66 -107 115 32 -134 -11 -4 -2 66
$$ packed form
3825B0r5J35n9j9q5J60K6j00J1Q4j35o1MJ15Nq1j9N0J1o2J76j75J36J0n3L8N3
3852I0Nj00O2k7o1PN9j29J23M8j59j7j6J3o2k1J70l2J0M4j12J08Lk1m5K32q9k1
3880F2j14Nm4Q2J5Lq5K11j97Q2J32q2o5j32J95k08J72k8m2J33j43N3r0n3J9J14
3906ej13J17q5K09r0o2R6r5l5Q1q5J88q2J23n3j87j9J5J10j29J07j72J42M4j09
3931h9M3R8p8k4J02j43P8r8P6J25j50J05r8J45k37J14m3j3PJ07k1j33J32j15K12
3956A02q2m8NN8Jq8l8J3N4J72j80J8Q7k8j41J94o0j6j33JJ69O9n4o2Q2q7o6O9
3984A1M1Mo8L9Jj63J67j28RmJ01O1p9J6P7%n6O4j15N9Q9j32K3j29N7Q3p0J08j72
4013a06J16J54j60l%K1m2J2J90r4N2n8N6j11m4RN8j03%j3m1K22q3j66J23PKO8
$$ plain form
4041 66 18 -10 -89 30 62 28 -8 1 66 22 -69 50 -69 -87 39 55 88 61 39 109 62 160 15 -63 -1 77 30 39 1
4070 1 -7 19 -119 -99 6 140 37 44 7 -61 57 -26 -47 20 -110 143 -42 -85 -53 62 116 6 79 -131 7 59
4096 59 50 22 16 21 83 -79 1 105 55 -55 29 59 78 52 -59 183 -49 32 31 159 86 -25 32 -66 9 -71 -25 -195
4124 -195 84 128 47 -48 31 -51 161 52 -39 -125 17 -4 -59 62 -34 101 67 39 -157 101 58 92 -49 -15 55
4149 55 0 49 73 -41 -89 -38 72 -15 -39 36 -51 154 176 -97 -138 59 -88 -31 3 -53 -13 24 9 -62 -29 13 31
4176 31 65 -27 -59 -24 61 60 -10 -22 73 -45 -32 -89 -101 83 -24 -158 47 7 -50 -89 -74 -11 -124 -96 -191 -95 -80 -119
4204 -119 8 -51 -42 -2 -40 -116 83 83 48 -23 -68 -162 1 120 7 45 22 -127 -37 67 -3 -16 -97 -55 42 75 22
4231 22 64 -3 -60 -36 99 94 -95 105 -51 96 34 25 -89 -6 -23 -101 -44 19 -167 -42 -4 -118 -22 11 83 -40
$$ packed form
4041F6m8k8p9J19L2l4l6RO5m4r1J19j19j8J26J6L3k7k2P0m7R8j45p8O2P8m7Rl8
4070AqK6j38K0J05J34j03Pl7o8J18q3k1O7j30K53j85m3L2J15N4j10P3k10J38N2
4096E9rk8oNO2j62Q0J04n0j10Q4L0J9k6j11K42k32Q1jJ28p3j11N7r8P5q0M6j70
4124a95K79M4q1r5P9q2K12j09r1q6J42k1n5J21r6J35l4k8j96K58m3L4j41L4P0
4149E5n5M9K4j14m8N1J10q7k4P5q7K05K2k73m1J97j47N7L4n6M0L7j5p1L3M2J8
4176C1L4r2l2L5Q5jp0j2R5j18J3n7j2J84j07j34K05m0n7l9J5O3j13K8r5R6J5l9
4204a19J27n9RM0l8p6J99%l5p1m5r4J63J19j13L8k3j49R0J04p0j3q1M2R7L3n3
4231B2M2o7n7K4J35nj89K00j56J47o2rj14Q3j7p8N7O3j86J25L8j14R6L3P2j23
$$ plain form
4257 -40 11 -74 84 -75 -4 131 -32 -100 -82 -8 63 90 0 -97 -1 -68 147 -43 -130 -28 4 -72 -75 60 -22 203
4283 203 -145 -72 -43 10 -174 139 31 39 52 -139 -47 -34 -33 66 -43 3 61 -23 -75 51 100 111 74 -96 -59 20 -90
4310 -90 -22 -25 -21 -21 69 -52 49 -36 -67 -19 -1 76 8 2 -87 -90 14 -30 -126 -18 -81 6 0 -26 -109 37 -17 118 95 -75
4340 -75 -64 84 74 95 160 -7 146 -76 -116 154 0 17 -163 -64 123 -23 -40 5 -49 78 -83 76 -23 -81
4364 -81 -97 108 -91 27 -85 16 74 -43 -77 -163 -83 -49 -70 -87 103 -54 -31 -48 -130 13 -71 103 89 27 -49
4389 -49 -50 39 39 -21 -100 50 66 114 27 -5 -46 69 -117 22 72 -80 -71 174 -66 -15 -134 -47 -191 -47 -22 25 12
4416 12 -15 -47 -62 14 -12 -26 -135 141 -36 -13 24 -5 75 -94 155 -1 124 254 -22 53 54 -78 5 90 -73
4441 -73 -25 -32 45 80 -37 43 -113 161 -201 -32 31 -74 -39 73 -24 -56 3 77 -66 -109 114 -142 60 -75 52
$$ packed form
4257d0N1q5J58j59P1J35j63o8J8P4P1K7r0r7R6o7K15j90q7J02L2p6lJ35q2K25
4283B03l48P3K9N3j84L13j08QJ3j91R2J3JR9j09M6N8q4n2J26M9J1l7j70L7P9j10
4310i0O8lM%R0j21J01q5l1M8J8P7o8oq9lJ04m4r6J08o3Q7ok6q3J46n4J35k3j70
4340g5J1J48j0K1O5j67J53k22m0K70j54J7j80R9J87j46j7M5n4J27j61J59r9n8
4364h1j6K05j99J18j12J01N8j17l4q6Q0L4k1j7J90j57K3j7q2J43q4J74j4o2p6
4389d9jQ9%o0p9J50J6M8q7l2m1J15j86J39N0j52RK45k40N1j19Q7j44J44K5M7j3
4416A2k7l2j5P6k6j4j09K76j77K3L7k9Q0j69K49j56J25J30k76P5Jj32Q3Q5j63
4441g3M8pP7L5j17Q0j56K74l62J69O3j05L5J12r7l2N9P4j43m3K23k56K02j35J27
$$ plain form
4466 52 85 24 -53 54 151 -152 -86 -7 34 27 11 161 59 108 -56 -69 31 2 20 -75 -1 34 -74 171 -78 -70 131
4493 131 -10 110 38 -96 41 32 -125 -29 -22 -9 -103 -105 125 -6 59 -92 -42 64 -36 -34 -204 -56 -134 -27 -53
4518 -53 67 40 -7 50 -25 30 -32 123 -118 -36 -21 -93 97 83 96 121 -51 -93 -106 155 79 -31 41 32 72 -19 -75
4545 -75 11 35 -72 -147 -29 -195 -1 104 -29 152 -108 3 -145 49 -74 32 93 -3 -51 31 166 123 -106
4568 -106 -4 -77 55 -10 -72 104 7 76 -52 -84 -106 -9 -87 -92 100 121 86 105 -98 34 -142 45 33 -30 32 -37
4594 -37 -66 88 36 82 26 61 -21 -5 -88 -13 -69 75 -29 24 -26 127 89 -98 -83 -18 -17 94 113 20 83 49 -16 -58
4622 -58 -67 -34 2 -16 -8 16 -18 8 -134 -126 82 70 -28 -24 -79 18 -2 -29 -26 -35 16 -80 -93 21 116 7 79 61 -211 -49
4652 -49 121 98 8 -38 62 -225 93 52 -67 -10 18 -40 17 -1 108 61 -23 -7 -10 188 -62 5 38 -22 28 65 -92
$$ packed form
4466E2L3o1p7J07R7l03O6P9M1pj6J50j02M9j64j3J00k9J8r5P4L5j08K45k49QK01
4493A31j41J20p2j34J37rj57R6PJ3r4kK30j31O5j51N0J06j00Kj70J48p8J07k6
4518e3J20k7m7N7p5N5o2J55k41Q2J5p2J90j4J3K5j72m2j3K61p6j10P2rM0r1n6
4545g5Q6K4j07p5J18j66J94J05j33J81k60J11j48J94j23J06O1r6m8Q2J35m3k29
4568a06J02p3J32o5o2J76r7O9j28l2k2R7p8nJ92K1l5J9k03J32j76J87j2o3O2o9
4594c7k9J54n2M6n6L5q2J6q3P5n6J44j04N3n0J53l8j87J5O5JJ11J9r3O3l4o5m2
4622e8rL3L6j8QK4l4K6j42QK08j2r8Mn5R7k0k7LrN1r6j3J14R5j09P2j8k72J62
4652d9J70k3r0m6J00k87L18m1j19N7K8n8N7j8J09m7q4J6lJ98k50O7L3o0N0L7j57
$$ plain form
4679 -92 -129 104 -30 -8 -31 4 59 131 109 119 32 -76 64 -53 -4 43 -127 -45 69 118 127 -129 -80 -7 -25 80
4705 80 -136 6 42 -64 -70 -88 -71 21 -34 -56 7 -31 -50 50 -118 -157 75 14 14 28 19 -20 -37 111 -25 -95 -44 0
4733 0 -112 -28 134 90 -29 82 108 82 -36 -126 -89 -20 -54 -161 60 45 84 97 -24 -20 -34 34 -26 -118 -198 -159 -110
4760 -110 71 13 -34 199 -16 22 -135 106 -73 99 -61 -52 167 -221 75 106 64 122 -33 80 -58 -69 16
4783 16 -17 -129 -7 -187 -122 39 -81 -57 35 -86 -31 -69 1 36 1 97 119 -154 -60 -14 -7 -20 -35 31 20 117 -70
4810 -70 -30 80 -130 -42 -56 0 53 116 57 0 86 -91 61 66 119 -103 -49 74 -143 166 -3 27 12 64 -124 -49
4836 -49 -30 -140 -20 -29 20 -4 -44 -44 -155 130 111 -175 -92 20 75 22 43 75 64 7 -66 38 -4 -15 29 112 51 -38
4864 -38 128 33 -29 68 -2 52 18 -86 -82 95 -36 134 -85 -32 -4 -69 -38 -53 -5 135 -35 -16 -74 -32 85 25
$$ packed form
4679i2l7K33j34K2k3L5N5P2k2J0q7j08J40j17M9M7j70Q2J14M9Rk56M9P3j8J05
4705H0k16J42L6j06oj8J7R2n5k2O3l8j9J00j68l9K32o1%J4rl9j7J48j36p0N1M4
4733@j12Q4J62m4j19J11K6k6j18r0L7O9l4j07K21j5L9J3j21Mj4O8o0r2q0L9M9
4760a10J81n8m7K33k15L8j57K41j79J72j60RK19l88K96L1m2N8j55J13j38j1Q5
4783A6l3j12J22j80O5J61j20K4R2j21N5l8P0L5l5R6K2k73R4M6Pj3j5O6j1R7j87
4810g0M0J10k10Q8j4N6N3O3n9n7Q6j77J52NN3k22N4J23k17L09j69L0j5N2j88P5
4836d9J9j10J20rM9k4m0%j11K85j9k86Q3J12N5n3K1L2j1n7p3J04m2j1M4Q3o1q9
4864c8J66r5o2R7p0N4l4j04MJ77j31J70k19N3K8o5L1j5M8J40j70J9n8M2J17o0
$$ plain form
4890 25 -35 87 5 -159 -5 133 49 -45 3 114 -92 69 55 8 94 -45 -36 28 48 17 -52 33 -87 -267 -38
4915 -38 -3 -3 -74 -135 -11 -2 63 -58 58 -13 22 65 5 -46 -58 -181 -66 155 -4 -59 5 7 -1 -51 -44 125 37 98 -37
4944 -37 128 -27 -33 -69 33 164 86 -103 55 -67 44 2 29 19 -2 -30 -58 29 -2 3 -17 17 -33 -96 -21 104 -119
4971 -119 -53 -82 -142 72 -134 -110 102 36 3 -53 27 -81 58 -72 -30 -48 71 155 30 69 -42 -78 89 29 -63
4996 -63 86 -68 -162 41 55 39 -16 -110 61 -36 -57 8 51 -82 148 135 -71 -8 -108 178 -19 -25 -40 -203 -6
5021 -6 -34 -40 -5 -95 26 -20 -70 -2 -90 138 84 -30 19 128 69 106 83 -70 138 60 -108 62 79 43 -47 11 -10
5048 -10 57 -127 46 -34 -18 71 -33 7 -70 -56 -111 -44 47 19 -146 107 -23 -25 -48 -30 -120 -47 66 -83 -195 23
5074 23 -29 136 -14 4 -12 32 -191 116 21 -46 7 -16 34 -22 -52 102 31 67 -150 -102 35 -151 22 63 114 207
$$ packed form
4890B5o0J22q2j64J54J38q4r4M8J11k06J61j4m7Q6j39RO4K0l1o9Q5j20j80K29
4915c8L5%p1o1J24RO5j21J16p1L5M3o0n1j2j23J15K21j59n5O4Kqn0PJ69q8O1j35
4944c7J65j55ol6J02J31p8j89J58j22J11m2K7j0k1k8k8Q7l1Nk0L4n0o3P5J25k23
4971a19O6k9o0K14k06K4K12o6l3n6Q0j08J39j30M2j8J19Q4j25L9j11l6J67o0r2
4996f3J49j54r4K03J4j6n5r4J71r7k1O5M3j33K30j3k06O3j00K86j97oj5j63J97
5021fk8oL5r0J21m6n0O8q8K28n4j14M9J09n9L7k3j53K08p8j68J70J7l6r0N8k1
5048a0O7j84J73q0J6Q9j04M0p7J4n5O7R1k8j65K53j30kk3J8r0P3J13j49j12K18
5074B3n2J65j50J8j6M4k23L07r5o7N3k3N0n6l0J54p1L6k17M8J37j86J73M1N1R3
$$ plain form
5100 207 89 -116 -25 69 -127 -30 -18 63 132 114 54 41 -9 -64 -5 -32 15 -106 43 -50 -15 13 -135 -16 -42 14
5126 14 39 -113 -6 24 -60 0 -104 -101 78 -63 -64 -22 -66 191 -44 -172 -33 -43 -21 46 9 -129 -79 16 36 -192
5152 -192 -10 -36 -25 -95 49 -59 -171 147 81 30 -2 -26 21 49 -35 -73 28 -7 55 -84 108 -1 71 -35 -136
5177 -136 22 -37 -61 -66 -32 -95 -74 -93 102 36 -51 -152 -76 -6 -102 56 -6 -17 -74 113 -11 -5 69 -9 -23 94 -74
5204 -74 26 103 -91 48 114 -128 11 -14 81 -5 -34 -32 45 -64 33 -39 -125 -17 -89 66 7 29 90 -39 -26 14
5230 14 -36 -109 -12 59 -3 -28 -1 -47 19 62 4 157 -138 75 -16 21 -12 78 -42 -66 -85 23 125 -23 176 169 67
5257 67 26 175 138 51 -62 151 54 30 -34 20 66 -17 -164 -47 -82 30 50 -15 -74 -53 -73 -26 -37 -228 109 55
5283 55 -24 -34 28 -27 42 1 78 -43 -32 -1 15 194 19 30 -48 42 115 62 -5 -13 -131 42 -77 -38 14 -142 -8
$$ packed form
5100B07j18k05R1R4j96R7J2Q1O9j8o0j3n0n5N9k7M7j21J49r3L5K8j48J19k6N6
5126A4K5j52J07L0q4O0j04LJ79j41jM2m4K57k35j28J39j0K2O7l7j38N0R5K0k28
5152a92J82k6J1p0J44j08j12L18o6n1l2k4M7K8q4l8J01l5O2j39J92j09P2j06j01
5177a36J58n9k4nL4o3K1j9J95o6q7j01P6P0r6J58o2j1n7J87j24OP4p8j4J17j68
5204g4J00P7j94J39O6k42J39k5R5q6k9KP7j09R7p2q6J08p2J55n9K2O1j29J3M0
5230A4n0p3R7P1o2k5K7m6O6M3n8J53k95K13r1L7l3R0j20k4j9J08J02j48J99pj02
5257F7m1J49l7q7j13K13r7k4o4N4M6q3j47J17l5J12K0o5n9K1k0M7j1j91L37n4
5283E5p9j0O2n5O9m1P7j21J1L1J6J79j75J1p8R0P3n3o7qj18J73j19L9N2j56J34
$$ plain form
5310 -8 -46 -24 74 32 -34 -19 -33 -126 15 -39 -34 -57 -224 -168 -67 72 70 62 11 -36 39 -63 -20 -43 15 15 104 -88 -26 -49
5340 -49 -5 55 -16 -215 45 8 18 -63 -33 183 -2 28 -114 7 101 101 -84 141 93 -110 -59 130 7 -1 85 61
5366 61 -85 -36 -26 -43 -75 123 -67 2 12 13 23 -83 -71 -218 5 -80 17 169 114 19 -34 22 -35 30 157 -31
5392 -31 92 -101 -13 162 -93 60 2 -24 157 11 -31 -44 53 141 -91 -26 14 39 118 31 -38 -21 -76 -54 25 47
5418 47 -114 -53 -1 96 -24 -91 4 7 157 99 2 139 -64 -134 94 161 7 -62 -2 50 163 -69 -92 15 78 -17
5444 -17 74 -23 -112 0 29 27 -95 28 -96 -27 39 -98 -50 -106 -42 -87 -41 -84 -38 -73 -51 -102 -33 -143 19 -111 -86
5471 -86 58 -14 57 -2 6 -29 37 34 -23 23 -55 45 9 -31 -44 40 -52 -35 -19 49 30 17 70 -84 -147 -103 -65 -10 -7 304
5501 304 69 -8 6 158 -37 -19 158 34 91 15 14 69 -9 8 127 -47 124 54 17 -12 27 24 -15 32 -14 0 136
$$ packed form
5310hl8K2R8m2o6J5j4r3J41n4Nk3j67N6J01J39kqn1m7P5j02M3k3N8%Q9j92O2k3
5340d9M4O0p1j99K60l7J0q1L0K16j85L0j42J21R4%j85K25m8k03N1J89j23qQ6k4
5366F1j46M9J0j7l2J98j90O9J0JJ0j06J2j47K23q5R7J52n5r5n3N6n7O5J27j88
5392c1J23j93Q8J75k55J53n8k6J81j46m2j3R7Q8k32O5M0K5P9q7o9J7n5K2P9K2
5418D7j61O1N2R7j20o7R5LJ50n8r7J37k03p0K28O7j54o9O0N2J13k32k3J07O3r5
5444a7R1r7q9J12K9kj22J23j24O9O6j37M8n6O4m5M6m3M6l5K2n1O9j10J62j30K5
5471h6J44p2P1n9Ql5O6ln7M6p8J00l6m0j3Q4r2J7J6O8j9j3N3j54o3M4L8N5LL11
5501C04k35p7J4J52j95J8J77j24N7p6jN5p8J7J19j74J71p0l7k9L9ll9M7m6J4J36
$$ plain form
5528 136 107 -63 71 204 60 -1 -30 -44 -7 -75 50 20 101 -37 35 73 -164 41 90 -55 -41 55 -22 -41 100
5553 100 51 116 -170 -8 93 -22 -98 63 22 -87 88 -177 117 -211 37 -109 -51 -86 50 -7 -4 15 39 167
5577 167 11 50 60 6 -63 1 -2 -62 -18 -7 38 13 98 4 -11 84 104 -85 21 138 104 -152 -58 -29 -92 -18 -95 32
5605 32 -140 16 51 15 -34 -74 -20 33 66 36 142 40 73 -16 49 -46 109 -20 -37 89 -38 117 43 23 82 -3
5631 -3 -131 -31 25 -155 -254 -2 -92 48 40 95 101 15 32 8 -138 -90 -125 -24 67 -136 -26 -88 -45 -79 -3 22 132
5658 132 39 -32 103 -81 -57 -112 -36 -9 -127 -17 -6 -17 40 170 14 -123 -61 21 56 -33 -75 -130 -69 -128 -50 6
5684 6 -34 -57 30 -84 -3 -11 38 7 -84 169 52 -71 22 49 95 64 179 154 -95 -13 -70 168 35 108 41 -66 -45
5711 -45 -127 11 13 -16 -30 -111 54 -74 -89 17 119 65 -19 -92 -5 -148 119 -32 163 118 -4 -136 181 92 -33
$$ packed form
5528A36k9j70J34J33j44o1k9j4L7o8J25l0Q1j38P2L8k37K05M9j45J4R6p7j9J41
5553A00m9O5k86J62J01j15p6J61m1j09J75k65K94l28K48j46N8l5J36n7LJ9K4J28
5577A67j56L9J0n4o9O4lo0M4J1M5k5Q5r4j5R5K0j89J06J17l4k56R4K9o3P4p7J27
5605C2j72J56L5l6m9m0N4N3L3l0J06j02L3q9O5r5J55j29j7J26j27J55p4k0N9q5
5631cj28J00N6j80r9K52r0J40qN5Oq6J7k4j46M8l5J01R1k03J10o2M3l4P6K5J10
5658A32r3p1J35j84K4n5P6K7j18J10J1j1N7J30j56j37O2Q2L5q9m2n5O1n9P8N6
5684Fm0k3Q7j14Q1qM9l1r1K53j17j23R3K7M6l1J15k5k49Q2n7K38j33P3o7j07K1
5711d5q2J38Kk9j4q1J65j28j5J06J02n4q4p3Q7j43K67j51J95m5j22j32L17q9j25
$$ plain form
5736 -33 -24 -74 65 -31 106 12 -55 -19 35 18 -19 16 182 14 -8 -64 22 16 -14 -49 78 42 63 4 -18 16 49 154
5764 154 0 -15 39 -7 97 -77 17 33 55 49 42 9 -49 -112 -81 61 -112 80 44 -1 90 156 7 -93 45 72
5790 72 -13 -87 78 49 -75 -3 46 99 -62 97 -126 -172 67 28 -69 39 -41 -44 18 11 82 41 -72 -31 -29 0 40 -79
5818 -79 42 95 103 56 -44 -79 -80 0 -7 -85 -76 -74 142 24 -24 -24 -49 -15 17 9 -104 -90 -55 -79 30 -36 7 36 -81 -3
5848 -3 -128 26 -66 175 -4 -126 111 -95 -309 19 15 -56 -106 9 9 10 -9 138 -29 25 -1 147 8 -1 167
5873 167 46 -41 75 103 -87 -66 45 136 73 38 -45 -76 35 -41 -47 -76 66 9 -20 7 21 -21 -158 -17 109 -128
5899 -128 60 -100 3 25 -89 -2 -33 -15 26 -72 -116 27 26 -48 89 176 76 -36 109 -116 83 108 -64 -3
5923 -3 73 -96 -79 136 107 -76 -137 27 13 19 -106 11 78 29 -58 -97 -154 127 34 32 19 -184 -45 132 7 -3
$$ packed form
5736c3Rn0J39r6J37r4o7L6N4j7l7L5J66j68k2n6Q6ol0l5J27l6K1n9k2L4L3J05
5764A54j54j5N4m6J04j74R4J6K2opl3n8o3L1J42j73J92l6m5R1O6j49j00J38K7
5790G2q5p4J65k9j24P2M9N3j61J59k23m6K39l9r7J08q0lO2pP1m1j13M1KK9M0j19
5818g9J21N3Qm7j00l5jQ0pp8RKK16j18m8%k5L4L2qj13J4L5k4J09o6M3K9j17P8
5848cj25J54r2K41j79j22K37k06k14L28mp1n0J15%Jj9J47j67N4k6J48j39rJ68
5873A67j21q7J16K8j90K1J11R1o3l5q3l1J11p6ok9J42n7k9K7J4m2j37J41J26k37
5899a28J88j60J03K2j14Q7l1J8M1r8m4J43jp4J37Q7j00j12J45k25J99K5j72O1
5923cP6j69J7K15k9j83o1J64j4Oj25J17O7m9q7l9n7K81r3kj3k03J39J77j25j0
$$ plain form
5949 -3 10 30 109 -3 161 46 123 80 -106 -4 10 104 -130 43 -5 39 72 -46 -18 74 -18 -93 -166 203 10 -25
5975 -25 -61 -14 27 -86 -15 -94 -139 -82 -38 27 74 44 -32 94 -17 -26 13 103 159 91 4 -46 -22 -3 81 -128 21 -6
6003 -6 -168 -29 180 69 43 -53 -81 50 13 22 23 215 -17 -37 14 -49 -27 -70 -104 70 -123 83 -25 -143 -94 -17
6029 -17 -96 -112 -41 13 -135 47 116 -32 62 14 31 -96 -2 73 -3 -71 11 -24 -18 -26 60 103 -97 -96 -3 -69 1 37 -72
6058 -72 69 53 55 -154 -100 -55 -2 71 -20 145 52 -10 67 -128 10 152 -59 79 1 19 13 57 -97 58 -15 42
6084 42 110 95 101 -149 -271 6 230 57 40 -14 141 -38 -11 -211 21 30 -77 74 -112 -94 -187 153 -138 111
6108 111 101 105 -92 -63 22 -32 15 -40 -24 85 -150 8 3 -35 -1 120 -15 115 106 -21 -81 78 -99 54 119 41
6134 41 77 94 -29 116 117 -122 131 -69 57 49 -94 -106 -80 -25 -54 23 42 -78 -27 -140 32 74 -17 115 -22
$$ packed form
5949cJ3K0P9j12J64j15P7m3j86J02J4R4k34J73m8M4L3j18K8R2r2p5p3L69j93l5
5975b5l6M7M1j13P1p9m5N7M4O5M7l0p6J26j11rL9R0N6o8q7n0K4J9Q4k09J49k7
6003fj62J39K09j11k6r6k8J31l7RJJ92k32k0N1o3K2m3l4J74j93K06j08j18M9P7
6029a7p9j6P1N4j48J82O9j48R4m8J7j27R4P5p6o8Q2l5OqQ6M3k00JR3o6P0L6j09
6058g2J41j6Kk09N4M5N3P3r1J65r3o2P7j95J38J42k11J38p8J8oM4j54J55p3N7
6084D2O8j5Ok50j22K77K24j73j7n4J55j79K7k00K32Rj07J51j86J8r3L40k91K49
6108A11j0Mj97K9Q5n4M7n5J6J09k35J58nl8L4J21j35J30rj27o0J59j77J53O5p8
6134D1L6J7j23J45Jk39K53k00J26qj43j2K6N5k9P7J9j20N1j13J72M2r1J32j37
$$ plain form
6159 -22 -70 105 5 -131 -135 -36 -37 -42 87 89 -40 13 -37 82 -128 64 197 -48 -49 90 -56 -242 100 58 27 69
6185 69 -68 69 -54 97 -27 -54 6 -119 2 -2 -107 72 128 164 20 96 34 84 18 75 -29 139 -12 -20 -73
6210 -73 42 52 58 41 -73 -56 77 -16 216 107 -18 17 48 -45 92 42 -65 -130 19 84 -14 10 -12 39 -66 12
6236 12 226 -4 -2 -87 35 -127 -126 60 -36 -76 -66 87 43 51 57 95 52 96 -131 -75 11 -19 -39 36 154 121 24 -14
6264 -14 31 53 9 -132 55 3 -17 83 262 -17 -65 -30 -102 -76 -21 23 62 -40 -107 -49 -12 -102 14 113 19 -35 94
6291 94 -42 7 33 13 101 -38 138 55 5 -70 125 7 -9 78 -111 22 53 101 94 46 -3 -20 84 47 -45 -19 83
6318 83 63 62 -11 -46 46 14 20 56 38 -88 0 10 -63 -6 -68 -113 58 -63 -25 3 102 94 68 48 -7 -77 14 -34 63 90
6348 90 -60 95 -34 -25 47 103 -73 83 111 29 39 152 50 -43 -52 -36 10 -186 159 82 31 -20 -12 -8 8 -48 -17 87
$$ packed form
6159b2m8J75j00j36mR9jnJ29Kj29N3n0J19k10J92J33k45jJ39j46j86L42m2l1M2
6185F9j37J37j23J51j24k7O0j25J21mj05J79N6L6j44P6o2N0o6N7j04J68j51qn3
6210g3J15J0Oj7j14J7J33r3K32j09j25L5L1r3J37n0j07o5J49O5r8K4k2N1j05P8
6236A2K14k30Kq5J22j62JJ86r6m0J0J53m4QOL8m3M4k27N6Q6l0k0P5J18l3r7l8
6264a4M5K2m4j41J87n2k0J00J79k79m8L5p2K6N5M4L9j02o7N8L7r0J16R9r4n4J29
6291I4j36M9K6k0Q8j39J76q3n0p5J95j18j6Q7j89J33L1M8pm8m9j7J04l7r2K6J02
6318H3k0jp3l5R2l2OL6j8j26Q8J0p3N7o2m5J71j21L8K8R9qk6k0n5p0R1m8R7K7
6348I0j50J55j29RP2N6j76J56K8q2J0J13j02r3rJ6M6j96L45p7n1n1QMJ6n6L1J04
$$ plain form
6376 87 -9 -13 -39 75 74 -41 -75 33 -103 36 15 93 -35 -35 78 -112 22 -10 103 143 -26 -17 27 1 120 -35
6402 -35 -56 67 -7 35 64 -101 -79 52 119 54 -213 -44 83 86 26 74 53 -35 -35 -6 -14 133 33 64 19 -52 70
6429 70 -2 61 48 73 68 64 32 -190 0 -30 -71 76 94 108 37 -61 -11 35 -117 -121 33 -119 -70 35 60 120 107 148
6457 148 0 -39 39 45 -42 142 113 86 -168 -25 -58 -4 8 23 -76 -79 -15 54 -105 105 -36 -8 -24 31 -64 76 5
6484 5 201 95 -139 15 70 -119 -36 144 -81 -1 -28 146 69 -77 -82 34 102 60 -88 -74 -103 -117 -29 145 -125
6509 -125 65 107 38 54 -239 -147 -88 61 105 70 -200 -37 -50 18 -3 100 36 94 -20 96 -3 108 136 10 -54
6534 -54 -50 -96 65 -37 -6 -69 -16 44 -24 -67 -57 17 5 56 3 121 12 79 179 18 121 18 -85 -19 -73 -4
6560 -4 -27 -167 18 17 60 -11 1 -34 -60 75 -38 56 -75 -8 -2 -44 -54 -88 -81 117 -9 -96 -57 -34 -57 -20 -86 -46 -59
$$ packed form
6376H7r6mk6J14jj15l4J08j36J39k1P8j28%J13j90J34l2J13M0j69RM4k6J19j55
6402c5k1J23p4M2K9j65K2J31O7o5k67J69J27Lo0M8k1q8%K9qJ47j00L1m5p1J22
6429G0p2O3j3K5nml2k22J90l0m1J47J8J4p1r8N0M6j52mJ54j52M9J05K5O0j3M1
6457A48j48l9P8Oq7J84k9k7k54J43l3N4J2J5r9lO4O9j59K10j41K8j6N5r5J40p1
6484EJ96j06k34J54N5j89Q3J80k25Q0k7J74p7j46nJ16O8m2j48J4k9j4Q8J74k70
6509a25J90M2o9J6k93R2N9J49M4l5k70J63j3O8k1J03o4N8j14J16r9J11K8j26o4
6534e4Mm6J61j02L1o3N3O0o8m3J0P4j2N1n3J18j09O7J00j61J03j03j03O6n4O9
6560dk3j40J85jM3p1J2l5k6J35j13R4j31O7Om2j0l4PJ98j26q7L9K3k3L7o6M0j3
$$ plain form
6589 -59 47 99 169 101 -45 65 -73 26 -3 40 -27 -20 -14 180 287 -68 -21 -24 -16 39 30 53 -59 15 -25 -34 -137 -23
6617 -23 -15 -32 -40 -57 38 -97 -8 -94 -24 -32 -20 36 117 -204 -11 68 -127 -198 -8 91 -46 143 -24 82 -127 11
6643 11 -88 12 -2 -21 27 48 53 -15 116 0 29 -116 -12 -91 1 45 -42 -183 -85 -24 -115 -33 -122 44 -164 -91 -6
6670 -6 60 -38 91 113 72 -89 -38 48 -45 21 13 21 -18 47 48 -65 10 -37 -16 48 -95 91 13 -158 -84 -21 2 -17 -45
6699 -45 -65 43 -165 27 -38 -31 63 -24 -105 31 -85 -53 115 -23 -64 184 -37 69 -67 -94 37 53 -103 -70
6723 -70 -106 26 -62 12 -49 82 118 -43 -40 44 -5 43 56 -12 43 -55 -134 190 68 -85 -123 55 55 28 -56 101 18
6750 18 -98 9 -4 73 -7 21 199 -93 9 119 -45 -14 44 120 56 72 46 4 72 29 -139 -68 116 19 176
6775 176 -16 15 34 -46 -121 -163 57 -159 -57 -71 64 129 151 -3 -21 -64 106 -96 -50 191 8 23 -38 156
$$ packed form
6589e9J06N2P0o8j46J10j38R9k9M3o7POJ94J07l55M7lQN5rK3j12P4m0rj03J14
6617b3Qj7qj7R5j35Q9q6P0qJ2N6Q1l21J93P9j95p1J90R9j37J89j67J06k09J38
6643A1r9J00j4j9M8K1No8J31j16K9j45J04p9R2M4q7j41R8O1r1Q2q9J66k08P3Q5
6670fO6r8J29K2m1j61N1Q6r3O6qQl9O5Jj13P5m7K1O4j43J86p8j71P4O3K3j9k8
6699d5k0J08k08J92o5PR4q7q1J36j16L2J68j38m1K48k21J06j36k7J31J6j56L3
6723g0l6J32q8P4o1J31L6j61LQ4m9M8J3o8N5r8p9L24j22j53l8J78%k7q4J57q3
6750A8j16J07j3P7q0K8J78k92J02J10j64L1N8P6o4J6k6m2O8m3j68P1J84r7J57
6775A76j92L1J9q0p5m2K20k16J02j4J35O5K2j54j8m3J70k02M6K41j83J5o1J94
$$ plain form
6799 156 49 57 55 27 155 62 44 75 115 -29 -117 129 1 34 77 231 -80 -81 -155 -44 82 -13 -94 21 97 -23
6825 -23 -36 -236 30 -80 46 58 -33 -143 78 2 68 -64 -48 26 125 -46 -31 -8 35 -83 46 91 -126 72
6849 72 23 196 -1 -40 21 -102 30 -137 -58 -20 -49 -70 45 13 87 -49 -9 -77 -71 -31 -3 11 -137 -106 -28 1 80
6876 80 -34 -52 -206 11 39 16 33 45 -5 -63 -41 -9 76 35 -26 39 83 44 21 -22 -103 -31 -109 93 -12 -73 21 34
6904 34 -80 -96 -45 85 -46 -103 88 73 -28 -34 46 26 -51 -121 -12 4 20 48 -15 140 -66 -27 -31 -83 68 -14 67
6931 67 -224 -5 89 23 -73 99 104 37 2 0 -112 84 42 -41 -46 28 -69 34 -10 -174 -29 30 -27 -84 -75 -51 -25 -17 -205
6960 -205 -1 141 64 -37 94 -6 -16 -24 67 12 120 25 -18 64 1 -133 -1 91 23 -7 57 -157 66 -67 73
6985 73 -75 -33 67 -8 -3 -25 -136 -72 45 -33 72 -20 111 6 -93 67 -70 -2 -80 2 -49 -89 102 61 201
$$ packed form
6799A56j07Qkk8J28r3j8L1M0j44q8K46j28L3M3J54l11jp4J11J26r5q1J15P6j20
6825b3j3k00K66j10J26J2r1j10K21p6O6j32J6P4R9j71J5K3M3j18J29M5k17J98
6849G2m9J73j97l9O1j23J32j67P9L8k9k1J15l2P4j36M0o8OM0K8J4j48L1P8K9P9
6876H0j14j8j54K17K8k3J7J2n0n8K2L2Q5m1o1O5M4l9k3m3q1P2p8K02j05o1R4J3
6904C4j14j6N1J30j31n7J91j5j01oQ0k0p7p0J09J6J6K8o3J55k06L9mn2J51q2Q1
6931F7k91K19R4o6r6J72No7l5kj12J96m2q3nP4r7J03m4j64J45N9n7n7RK4K6Qj88
6960b05K04J42p7j01J31j00j0qR1n5J08r5m3Q2o3j34J32R2o8l0O4k14K23j33J40
6985G3j48M2J00p5Nk2j11O4J17p8J05r2J31j05r9J60j37O8p8Q2n1m0J91m1J40
$$ plain form
7010 201 40 -24 -72 52 128 2 55 127 47 -46 -93 38 77 24 138 33 29 -98 -7 217 -28 -35 -35 110 30 -55
7036 -55 -79 -117 -28 47 11 -26 53 -87 68 -54 32 44 -35 75 -3 -71 1 -48 -45 50 -5 -45 -27 -100 26 -24 109 75
7064 75 155 -16 -150 -62 36 120 11 -122 -112 35 142 106 149 27 -1 -6 -63 -65 -91 -39 -55 -5 28 15 -34 51 111 84
7092 84 -36 139 34 -89 -48 42 -94 32 -156 18 204 -1 93 -60 -23 -27 53 -10 64 2 133 -111 -89 -31
7116 -31 -102 -141 -4 104 87 22 42 -126 -6 -56 -155 70 -28 46 -1 -3 43 9 -59 9 119 7 106 128 -109 45
7142 45 2 157 -82 -27 -45 37 -62 5 112 -77 -163 50 -74 75 -50 34 -57 117 21 133 22 110 110 -99 130
7167 130 147 -171 -67 -61 -65 58 112 38 -169 30 79 -95 242 145 -119 179 80 13 -2 -126 -58 17 -37 3 -115
7192 -115 -162 80 153 -102 134 -93 14 49 -37 -121 -227 -83 -117 129 -76 -47 45 -115 -78 -109 -7 126 23
$$ packed form
7010B01j61o4m8J24P6j26N3P2q0r3m7J31L9n3J14j05mj27R1K24k45p%J45q0q5
7036e5k4l8Q9P5l6l7P9j40J55j22Q6J2p9J10p8o8P2m9LR5n5m0J8p3J26n0J33l4
7064G5Q0j71j34Q8R8Q4j09j33J0J47J07l6M3j22k8nn7kk6N2j6N0L3j3m9Q5O0k7
7092H4j20J75j05j23M1R0j36J26j88J74J86k05R4j53L7mQ0o3P4o2J31k44K2N8
7116c1p1l9J37J08j7o5K0j68J20n0r9K25r8P4m7kM6l4o8O8J10j12R9K2k37J54
7142D5m3J55k39N5j8Q2r9O7J07j89q6K13j24J49j25Q4r1J74r6J12j11Q8%k09K29
7167A30J7l18J04OmJ23N4p4k07J99M9j74L37r7k64K98r9o7j5j24O8P5n4M0j18
7192a15m7K42P3k55K36k27J07L5q6q4j06J44l4K46k05K9R2j60L7l1J02J33j03
$$ plain form
7215 23 32 57 17 15 -185 7 -101 8 6 39 31 111 114 96 2 -155 129 -65 -54 -40 5 93 14 19 -60 -33 12 102 -34
7244 -34 -130 -21 -116 20 -61 -4 92 -64 -13 -109 -40 69 -141 -62 85 -137 75 50 39 -7 46 46 59 -62 -15 -222
7270 -222 -64 42 38 64 -23 -42 48 -38 -8 -77 179 -105 61 39 -58 -4 23 54 -161 38 -60 44 -74 168 -18
7295 -18 -150 -7 113 -127 75 -104 -20 28 93 -90 -54 -23 157 63 -52 53 -20 -37 -128 44 40 -9 20 -147 32
7320 32 -155 -16 -67 54 -130 18 45 -37 -37 -165 -19 -6 -20 -21 -135 6 90 -1 11 -14 11 52 -105 53 -99
7345 -99 -80 77 -67 -37 30 -126 81 -40 51 -79 26 -62 -13 76 31 -39 17 -24 12 -15 42 27 49 49 34 -89 -104
7372 -104 91 -4 -5 -110 67 -288 91 -60 4 97 -37 39 -115 -151 -55 44 13 -91 -170 88 128 70 175 119 96
7397 96 83 54 -6 80 -118 75 -21 22 63 -13 -50 31 98 -13 76 75 33 55 -188 53 79 -36 8 26 -90 82 -69
$$ packed form
7215B3RK5m0kk00J92j08J09kL3qQ0Lj8r4j57K84j94J1J4M5Q8p9Np9K7M5R0j36
7244c4r6J09r5J36q1N7R6j56N1r6O9J09k10P9J47k22K12k5j1m6N3%J3j21M7k07
7270b22J58J06mK6q7j9R0q6L0o9K56k84J66k2r7N4K7L1k15J99r8J04j18K42j86
7295a8j32J43J20k40K02j79Q4M8O5j83L6L1J80r4j15J05p3j7r1J72mm9K9j67J79
7320C2j87J39n1J21j84J48K7q2%j28J46J3j4jj14J41Q4r1J2k5K5M1j57J58j52
7345i9J9J57j44L0O7j56K07j21R1j30J05q8M9Q9m5p0N6m1L6k7N7j5K2%j5j23j5
7372a04J95r5jj05J77l55L79j51O4R3j34P6j54l6R6R9l1j04p9K58M0n8J05n6k3
7397I6j3k9o0Q6j98J93r6M3M1p6l7Q1O7j11Q9jm2K2k43K41K6j15M4J8j16J72j51
$$ plain form
7424 -69 -129 -40 -37 77 -47 0 -8 -42 -20 -54 3 134 37 15 -73 20 -70 -14 -204 -3 32 -50 94 -46 158 31 -13
7451 -13 127 -34 -57 -19 -204 61 -165 -115 -84 -7 11 27 -150 -52 -32 -28 12 -20 63 -107 -14 -77 -16 -80 -40 -8 41
7478 41 39 171 181 26 69 147 -3 -47 -8 -36 -54 -79 74 2 49 -146 -19 -141 79 -90 63 -31 45 -69 -128
7503 -128 -46 34 3 14 -5 6 123 5 -115 -18 95 -176 -81 35 -107 -53 3 75 103 124 209 137 -108 142 -19
7528 -19 -159 -12 134 31 -36 -111 -33 94 -15 -115 -99 -87 28 -6 1 31 34 33 71 -174 -44 57 66 51 -19 -103 -59
7555 -59 -169 -43 -106 54 13 85 27 -2 140 7 -115 -50 73 -15 -22 77 90 62 -21 -98 94 1 47 79 42 -84
7581 -84 39 22 -37 -153 -9 40 -92 183 57 113 -45 11 -90 9 -50 -5 -14 78 116 129 -36 39 14 27 -32 -20
7607 -20 -72 99 11 5 154 9 21 9 -40 -96 -80 41 23 -133 93 66 28 -22 54 30 10 -17 14 -132 -81 9 -53
$$ packed form
7424f9o0Q9LJ14j24M7ql4K2l4N7J31r7k2q8R3r0N6j90K01L5q2J44j40K04j27m4
7451a3J40j61k3L8j85K65k26N0L1P7J8J6j77R8K0MM0l2Q3j70R3o3O1o4M0L2M9
7478D1kJ32J0j55M3P8j50m4L9k8j8k5J53p2M7j95J27j22K20j69J53r4P6j14n9
7503a28Q2Q0l1J1j9J1J17j18j20R7J13k71R5J16j42N4N6P2K8K1Q5p2k45K50j61
7528a9j40J47J46j03o7p5P8J27j09j00J6J2J15l4PL0LjL8k45J30J01Rj5p0q4M4
7555e9j10J26o3J60m1P2n8k9J42j33j22O5J23q8pR9J3k8q3p7J92r3M6L2l7j26
7581h4J23j7n9j16J44M9j32K75j26N6j58N6j01R9n9M5rR2L8J3j65P5k5J3n9J2
7607b0n2J71q8oJ49j45J2j2m9n6J6J21j8j56K26k7l8n0P6k4k0k7L1j46N1R0o2
$$ plain form
7634 -53 -172 109 114 -58 -3 94 72 2 -47 73 164 -95 -50 -43 -38 11 66 -28 25 55 85 2 69 26 30 -47 1 96 -7
7663 -7 -112 -26 59 -61 -93 186 50 -33 -25 -169 56 -30 83 -38 -76 125 8 -99 -155 -47 62 -83 -33 -86
7687 -86 23 -83 -31 47 -12 65 13 -83 -40 -35 -86 -25 55 108 46 6 15 120 -228 92 -56 38 -81 73 60 39 86
7714 86 2 4 95 88 12 -17 -65 -108 4 73 -9 24 -157 -50 93 4 -3 -23 -111 -120 -1 240 118 72 123 26 -11 -7 25
7743 25 -122 78 -5 -15 68 34 -68 -131 87 -55 -56 -134 77 19 -99 -19 12 22 94 -80 -40 -90 -21 -60 46 142
7769 142 -8 76 -94 104 99 106 -58 24 -33 -27 -36 -130 28 9 114 -24 -3 -1 -3 -50 16 50 -40 57 101 84 10 -15 -2
7798 -2 -106 -6 29 -15 -24 -71 -51 45 129 -2 14 -3 -122 -70 -163 -98 -72 -82 93 -16 31 -11 -45 28 -30 52 -62 27
7826 27 80 59 -11 -31 -18 63 -12 -22 -99 -43 107 125 -18 -81 -69 21 -89 -5 -143 18 -82 29 -91 -75 113 168
$$ packed form
7634e3j19K81Nj72N5R7k2p0m9J20R1k59M5PNM9N5r4N3L0L0q3O7m3Mp7M8R5j03
7663gj05Q6Q5j20l2K79j36q3Qj44K25q6J13j21l8K01j17j07n6J08J09j45N0n3
7687h6J09j06N2P8n9P7n2r6M3Nn1O1Q0N3o2m0RJ05l48L20j48R4j19J54j3k1M7
7714H6q4KR1pp6k9m8m3J12O9q2L3j81J07J43q9pk0q8rJ19K41j22m6N1r7l7ML2
7743B5j47K00q3j0Q3l4j02o3K18j42jp8K11n8j18Q0L1J0P2j74M0n0O9l9J06R6
7769A42j50Q4j70J98nPj64Q2n7Orr4J58j9J05j38K1Kkm7O6L4r0R7M4j7p4k5J3
7798bj04J00L5m4rm7K0R6Q4j31J6j7j19N2r3O5K6j0J75j09M7m2l4P3n8Q2j14Q9
7826B7N3k1p0k0J3Q1p5j0p7N6J50J8j43o3J2R0j10Q4j38J61j00J11j20J6J88N5
$$ plain form
7852 168 101 -49 -60 204 -56 121 41 -2 18 26 -50 17 73 -95 31 -14 35 59 103 -165 -52 -109 -44 30 -18 117
7878 117 19 -60 104 5 9 0 125 -99 -72 -73 25 21 -82 70 29 -103 -32 158 -112 37 16 -60 -148 149 -76 59
7904 59 -83 -54 -152 7 150 -14 36 -58 95 100 44 -205 43 -52 42 -35 -21 -44 54 -43 -78 3 -1 21 94 -73 29
7931 29 122 -23 17 -44 -14 69 -210 10 -8 -12 21 45 -8 -17 71 30 7 37 -27 41 121 -43 45 83 -130 -64 -94 70
7959 70 -29 -48 -166 -71 -88 66 -154 -56 67 -77 -76 -32 -42 32 -60 60 -2 30 35 -54 -106 -100 83 33 41 137 144 -4 40
7988 40 16 149 50 60 -21 6 -108 27 128 96 100 51 55 63 52 41 -22 -64 100 27 -22 80 -119 -56 -28 -13 78 15
8016 15 -41 -24 26 210 96 -74 20 102 -26 104 -166 -69 -116 -37 64 -143 7 77 -114 161 82 42 107 13 -97
8041 -97 64 62 53 65 112 -130 -37 -37 6 130 -94 -104 44 -70 -15 -141 -23 -28 22 44 -91 71 -88 -37 -29 92 15
$$ packed form
7852A68o7j50j1K64k60J77q0m3K0Qp6O7N6j68J26m5M9K4M4k68J13n7O5P4m8J35
7878A17r8p9J64r9MrJ25k24K7jR8mj03J52m1j32P1J90k70J49k1p6q8K97k25J35
7904E9j42K9r8J59J43j64N0r4J53Nn6k49K48r5R4p7J4k3R8r7l5Q1mK2P3j67J02
7931B9R3j45M0o1L0Q3k79K20j8mL3K4n3rQ8m1k3L0o4O8Q0j64Q8L8k13O6l0J64
7959G0r9j9j18R5j7J54k20R8J23j44JM4j0P4r2J20o2L2Nq9n2OJ83n0QR6Pj48M4
7988D0k4J33r9J0q1K7j14J35J01l2Mm9MQj1j1o3m2J64p3m9J02j99O3K8J5R1o3
8016A5n6J7N0J84j14j70R4Q2j28J30k70R7m7P9J01k07J50P0j91K75p9m0O5r4j10
8041i7J61krJ2M7k42R3%M3J24k24j0J48j14N5j26J18nN0K2j35J62j59N1QJ21p7
$$ plain form
8068 15 85 -77 67 -115 29 118 127 154 216 76 -104 -98 -51 -22 -146 9 -127 43 145 40 -62 -6 -16 -53 -64
8093 -64 -135 72 -28 -16 -50 -75 51 -100 -4 61 -59 -22 4 101 74 48 -84 -1 14 -92 40 -54 96 90 -48 -133
8119 -133 94 -99 36 88 -111 -71 -6 76 82 -47 -72 114 -92 23 -36 90 -8 126 106 -12 4 45 -121 50
8143 50 -60 -37 10 -7 -118 15 -50 -41 -24 -79 13 259 -50 125 -5 -31 38 -19 58 -60 32 -50 125 81 200 81
8169 81 19 -12 147 5 20 -114 -138 27 24 -2 -144 -2 -18 -11 -171 -79 39 0 4 5 -76 10
$$ packed form
8068A5P0j62J44j82J44Q9RK7O2j40j80OM7K9j24J55j36J70J02j05j02N6j0l7j1
8093f4p1K07j00J2l4k5J26j51R6O5j20L7K6R7k7k6j32Q3J5j06J32r4J50oj38q5
8119a33K27j93J35N2j99M0O5Q2Oj29k5J86k06J15n9J26r8J34k0j18J6M1j66J71
8143E0j10K3M7j7j11J33o5RJ7n5R2K46l09J75j30k6O9n7P7j18R2q2J75m4J19j19
8169H1o2l1J59j42J5j34k4J65lk6j42J42j6Pj60R2J18l9MJq1Q6
8191A0
$$ Imaginary data points
##PAGE= N=2
##DATA TABLE= (X++(I..I)), XYDATA
$$ plain form
0 0 0 0 0 0 0 0 0 0 0 0 0 0 0 0 0 0 0 0 0 0 0 0 0 0 -64 64 -64 64 -64 64 -64 64 -128 128 -128 128 -192 192
38 192 -192 256 -256 300 -320 369 -384 448 -489 526 -580 643 -709 784 -863 953 -1055 1168
56 1168 -1296 1446 -1610 1817 -2064 2365 -2741 3234 -3914 4894 -6471 9414 -16823 85081
70 85081 70309 -76857 -14472 60080 39289 -45517 -54129 -16359 26868 4075 -55527 -66498
82 -66498 17891 58957 -7251 -55536 17008 76477 25973 -42813 -20359 37718 45073 -1900
94 -1900 -34246 -15452 27146 19653 -39511 -57444 5738 41595 -11680 -57435 -16591 36712 23866
107 23866 -19530 -21218 22578 53135 24424 -26620 -21332 30309 33943 -23276 -47026 -4074 27577
120 27577 -1769 -41015 -28776 17909 31960 -3296 -26676 4438 40197 20627 -23512 -20805
$$ packed form
0@%%%%%%%%%%%%%%%%%%%%%%%%o4J28j28J28j28J28j28J28j92K56k56K56l20L84
38A92l84M48n12N56o20O89p53Q32r37J015j106J223j352J493j647J816k008K223
56A168k464K742l056L427l881M429n106N975p148Q808j1365J5885k6237J01904
70H5081j4772j47166O2385P4552k0791q4806q612L7770M3227k2793n9602j0971
82f6498Q4389M1066o6208m8285P2544N9469n0504o8786K2454N8077P355m6973
94a900l2346J8794M2598p493n9164j7933O3182L5857n3275m5755M0844N3303j2846
107B3866m3396j688M3796L0557k8711n1044N288N1641L634n7219k3750M2952L1651
120B7577k9346l9246J2239M6685J4051l5256k3380L1114L5759j9570m4139K707
$$ plain form
132 -20805 20170 29966 -6249 -31748 -9748 22663 12950 -24012 -27653 9672 28983 -844 -29413
145 -29413 -9569 25129 18359 -14258 -18977 9618 26345 6887 -21790 -15841 15788 19549 -13738
158 -13738 -28107 203 22221 3417 -20798 -10995 16252 22073 646 -15784 -612 22677
170 22677 12187 -18760 -20594 7554 15683 -8571 -24307 -7553 14373 10311 -10509 -13686 8904
183 8904 23802 6841 -14984 -5240 18457 14728 -10927 -16822 2699 13330 -1314 -18227 -13235
196 -13235 6318 11000 -7645 -18640 -396 18542 7766 -11446 -4429 16057 17490 863 -8667
209 -8667 376 12637 7071 -12540 -17545 -161 9041 -7446 -20786 -6986 10806 6952 -6831
222 -6831 -5924 8355 16604 7965 -5767 -2801 12151 12289 -5941 -14089 -206 9416 -2484 -15482
$$ packed form
132b0805M0975R796l6215k5499K2000L2411r713l6962l641L7325J9311k9827k8569
145b9413J9844L4698o770l2617m719K8595J6727j9458k8677N949L1629L761l3287
158a3738j4369K8310K2018j8804k4215R803K7247N821k1427j6430J5172K3289
170B2677j0490l0947j834K8148Q129k4254j5736J6754K1926m062k0820l177K2590
183H904J4898j6961k1825R744K3697l729k5655n895J9521J0631j4644j6913M992
196a3235J9553M682j8645j0995J8244J8938j0776j9212P017K0486J433j6627r530
209h667R043J2261n566j9611n005J7384R202j6487j3340J3800J7792l854j3783
222f831R07J4279Q249q639j3732K966J4952J38j8230q148J3883R622j1900j2998
$$ plain form
236 -15482 -9666 3810 4764 -5938 -11497 -1572 11204 7681 -5946 -4813 11135 15056 1313 -7091
250 -7091 1627 10422 4043 -8551 -10828 -1169 4547 -4277 -14003 -7345 6398 5738 -5426 -5776 5946
265 5946 11761 4576 -3833 -1093 8035 8152 -3036 -9091 -567 7039 -32 -10070 -6593 3888 4493
280 4493 -4125 -7798 -868 6765 3999 -4809 -5156 5295 9473 446 -6084 401 8110 4127 -4940
295 -4940 -5982 988 4599 -1231 -8127 -4878 4209 4700 -4130 -6110 2668 7447 1523 -4767 -1954
310 -1954 4457 4344 -2193 -5943 -841 5721 2436 -5397 -3682 4830 5769 -1784 -4810 75 4474 1624
326 1624 -4401 -5171 874 4305 -899 -6019 -1739 5374 3280 -3239 -3245 3047 5183 782 -3487 -1434
342 -1434 3628 4099 -1952 -4773 570 4417 -6 -5546 -3192 2023 1688 -2894 -4362 -769 3593 2436
$$ packed form
236a5482N816J3476R54j0702n559R925J2776l523j3627J133J5948L921j3743q404
250g091Q718Q795o379j2594k277R659N716q824r726O658J3743o60j1164l50J1722
265E946N815p185q409K740R128J17j1188o055Q524P606p071j0038L477J0481O05
280D493q618l673O930P633k766q808l47J0451M178r027o530O485P709l983r067
295d940j042O970L611n830o896L249R087M91q830j980Q778M779n924o290K813
310a954O411j13o537l750N102O562l285p833J715Q512R39p553l026M885M399k850
326A624o025p70O045L431n204n120M280P113k094o519oO292K136m401m269K053
342a434N062M71o051k821N343L847m423n540K354N215l35m582j468L593M362j157
$$ plain form
358 2436 -2128 -1896 4154 6089 721 -2653 1019 4297 1313 -3202 -3813 -407 1179 -1414 -5271 -3509
374 -3509 2188 2233 -2467 -3028 2352 4759 1629 -1295 467 3859 3644 -132 -2433 10 3005 559
390 559 -4710 -3627 838 848 -3349 -4353 -854 2098 817 -1439 -928 2671 4543 1720 -1339 704
406 704 4269 2011 -2222 -2170 504 902 -1767 -3887 -2658 366 805 -2039 -3128 539 3373 931
422 931 -1533 10 3333 3092 233 -853 773 2583 1268 -2026 -2548 469 1227 -2144 -3911 -1264
438 -1264 1240 -201 -2204 -1271 1423 2670 902 -994 438 3226 2734 -923 -1475 1148 1918 -781
454 -781 -2349 -1188 475 381 -1459 -2325 -232 1395 113 -1883 -928 1800 1720 -646 -914 1017 2198
471 2198 1262 -509 -437 1110 1862 -306 -2302 -690 803 -234 -2168 -1804 11 731 -423 -1294 -458
$$ packed form
358B436m564K32O050J935n368l374L672L278k984m515o11L406J586k593l857J762
374c509N697M5m700n61N380K407l130k924J762L392k15l776k301K443K995k446
390E59n269J083M465J0m197j004L499K952j281k256N11L599J872k823l059K043
406G04L565k258m233N2K674L98k669k120J229L024M39k844j089L667K834k442
422I31k464J543L323k41k859j086J626J810j315l294n22L017P58l371j767K647
438a264K504j441k003R33K694J247j768j896J432K788m92l657n52K623P70k699
454g81j568J161J663r4j840q66K093J627j282j996R55K728q0k366k68J931J181
471B198r36j771P2J547P52k168j996J612J493j037j934L64J815P20j154q71Q36
$$ plain form
488 -458 1657 1502 -168 -916 1080 2224 533 -1271 -117 1409 986 -684 -1218 -393 740 24 -1820
505 -1820 -1671 399 648 -1359 -1583 270 1495 571 -221 270 1390 1914 984 -500 178 1410 456 -1828
523 -1828 -1512 -38 83 -1101 -1504 -776 131 69 -365 -924 241 1576 1008 -439 45 1636 1339 -190
541 -190 -252 673 720 45 -917 -1229 -392 154 -1042 -2063 -938 714 90 -939 -232 1097 1322 573 278
560 278 541 1502 1233 -373 -771 196 757 -528 -1458 -814 46 -397 -1188 -985 -226 464 297 -527 -89 984
580 984 1105 256 143 987 1350 507 -328 -180 -64 -24 -399 -1272 -997 -183 -136 -1407 -854 248 666 88
600 88 -97 585 876 1108 348 24 400 1034 364 -740 -412 388 -121 -880 -935 -289 -243 -367 -840 -499 72
621 72 600 98 -184 574 1337 788 -13 447 719 430 -136 -463 -177 -154 -265 -898 -1195 -233 36 -541 -732
$$ packed form
488d58K115j55j670p48J996J144j691j804J154J526m23j670n34Q25J133p16j844
505a820J49K070K49k007k24J853J225r24p92M91J120N24r30j484O78J232r54k284
523a828L16J474J21j184m03P28R07o2m34n59J165J335n68j447M84J591k97j529
541a90o2R25M7o75r62l12Q37N46j196j021J125J652o24j029P07J329K25p49k95
560B78K63R61k69j606l98R67N61j285r30O44Q60m43p91K03P59O90j67q24M38J073
580I84J21q49j13Q44L63q43q35J48J16M0l75q73K75Q14M7j271N53J102M18n78
600H8j85O82K91K32p60l24L76O34o70j104L28Q00n09p59n5O46M6j24m73L41N71
621G2N28n02k82P58P63n49q01M60K72k89n66l27K86K3j11o33k97R62K69n77j91
$$ plain form
642 -732 36 428 283 101 231 730 792 624 36 162 632 601 -182 -480 -55 -124 -468 -819 -624 -312 -249 -292
664 -292 -380 -195 630 549 153 352 878 885 287 -15 221 218 18 -598 -527 -127 -3 -295 -1027 -417 -42 -120 -477
687 -477 -207 185 439 365 51 352 655 819 350 -16 423 613 -4 -444 -350 -410 -341 -452 -676 -546 -60 103
709 103 -387 -100 535 738 194 114 452 433 289 169 69 2 140 -114 -339 -385 -110 -292 -641 -704 -56 -73
731 -73 -370 -119 -128 277 419 392 181 471 764 543 169 16 185 19 -177 -273 -352 -477 -300 -472 -521 -298 122
754 122 -38 -129 160 458 259 177 317 365 280 116 -51 46 99 49 -300 -641 -195 -7 -406 -461 -335 12 -37
777 -37 23 30 126 455 492 214 204 453 458 146 37 -67 -68 -326 -331 -373 -561 -305 -129 -288 -268 56 115 94 184 418
803 418 348 300 328 301 285 155 206 -66 -128 -53 -195 -476 -433 -141 -341 -497 -133 -231 -25 50 177 219 273 665 353
$$ packed form
642g32P68L92j45j82J30M99O2j68n88J26M70l1p83k98M25o9l44l51J95L12O3m3
664b92q8J85Q25q1l96J99N26Pn98l02K36lk00o16P1M00J24k92p32O10L75p8l57
687d77K70L92K54p4l14L01L03J64m69l66M39J90o17m40R4o0O9j11k24J30M86J63
709A03m90K87O35K03n44q0L38j9j44j20j00o7J38k54k25m6K75j82l49o3O48j7
731g3k97K51rM05J42k7k11K90K93k21l74j53J69j66j96r6p9j25J77j72m9K23M20
754A22j60r1K89K98j99q2J40M8q5j64j67R7N3n0l49l41M46J88l99n5J26L47m9
777c7O0PR6L29L7k78j0K49Nl12j09j04jk58nm2j88K56J76j59K0L24N9k1R0K34
803D18p0m8K8k7j6j30N1k72o2P5j42k81M3K92k00j56L64r8K06P5J27M2N4L92l12
$$ plain form
828 353 177 306 296 41 -51 -49 -85 -233 -268 -368 -342 -214 -87 -308 -290 311 86 28 300 347 262 239 395 203
852 203 94 9 159 -225 -335 -5 -134 -287 -451 -219 -239 -312 -9 14 -78 89 402 -73 196 368 233 109
874 109 168 248 103 -52 -145 -85 -447 -240 -268 -359 -208 -30 -117 -337 54 316 275 16 189 327 330 320 190 66
898 66 44 149 4 -346 -130 -51 -295 -189 -20 -74 -152 -95 76 14 167 391 0 154 361 379 208 95 126
921 126 -15 45 -137 -142 -195 -144 -230 -356 -252 -152 63 -273 58 161 173 209 132 277 255 82 87 66 -9 43 -26 -300
947 -300 -89 -217 -319 -128 -281 -20 -13 -180 21 96 -24 269 55 167 129 231 209 178 20 103 -69 -116 -54
970 -54 -159 -245 -50 -114 -153 -71 -62 -121 149 133 194 142 213 268 186 198 300 -52 61 1 42 -105 -251 -206 -252 -267 -240
997 -240 -66 -90 -48 -117 -146 73 165 102 359 208 120 240 74 -26 -13 -89 -14 -251 -228 -332 -59 -227 -119 4
$$ packed form
828C53j76J29j0k55r2Kl6j48l5j00K6J28J27k21J8O01k25n8K72M7q5k3J56j92
852B03j09q5J50l84j10L30j29j53j64K32k0p3L03K3r2J67L13m75K69J72j35j24
874A09N9Q0j45j55r3O0l62K07k8r1J51J78q7k20L91K62m1k59J73J38Lj0j30j24
898F6k2J05j45l50K16P9k44J06J69n4p8N7J71o2J53K24l91J54K07J8j71j13L1
921A26j41O0j82nn3N1q6j26J04J00K15l36L31J03J2L6p7J45k2j73Nk1p5N2o9k74
947c00K11j28j02J91j53K61Pj67K01P5j20K93k14J12l8J02k2l1j58Q3j72m7O2
970e4j05q6J95o4l9Q2Rn9K70j6O1n2P1N5q2J2J02l52J13o0M1j47j46M5m6j5K7
997b40J74k4M2o9k9K19R2o3K57j51q8J20j66j00J3p6P5k37K3j04K73j68J08J23
$$ plain form
1021 4 92 140 107 174 112 145 310 361 65 237 171 -14 -85 -60 -57 -114 -264 -144 -263 -331 -127 -182 -153 -100 -1 94 -33
1048 -33 222 273 224 124 136 80 -78 20 -38 -146 -281 -220 -194 -181 -76 -9 -146 -234 153 -34 30 93 75 105 128 178
1074 178 124 62 79 -47 -195 -88 -117 -83 -118 -180 -86 -143 -52 -79 -82 -58 221 265 127 84 67 277 93 162 181 77
1100 77 -124 -59 -111 -120 -213 -140 -214 -61 -74 -146 5 100 -5 -42 95 126 193 158 269 33 30 197 -8 -68 -20 -116 -34
1127 -34 -104 -211 -56 -144 19 34 18 186 9 213 39 205 213 98 125 72 -32 -17 -114 -65 -169 -108 -43 -157 -258
1152 -258 46 -97 -21 -7 -74 -14 3 99 117 166 151 280 -11 164 23 90 -27 -104 -34 -47 -125 -31 -48 -167 -341
1177 -341 114 -62 -115 38 124 123 -55 155 166 127 107 89 46 169 -88 -104 10 -95 -136 -15 -74 -94 -80 -88 117
1202 117 138 99 129 78 56 -29 121 131 91 -44 -58 3 -107 76 -100 -57 -74 50 -53 -148 -89 16 110 -38 119
$$ packed form
1021DQ8M8l3O7o2L3J65N1k96J72o6j85p1K5Ln7j50J20j19o8K04n5K9N3R9R5j27
1048c3K55N1m9j00J2n6j58R8n8j08j35O1K6J3J05O7j37q8L87j87O4O3j8L0K3N0
1074A78n4o2J7j26j48J07k9L4l5o2R4n7R1k7lK4K79M4j38m3j7K10j84O9J9j04
1100G7k01O5n2rr3P3p4J53j3p2J51R5j05l7J37L1O7l5J11k36lJ67k05o0M8r6Q2
1127c4p0j07J55q8J63J5j6J68j77K04j74J66Qj15K7n3j04J5r7M9j04O1O5j14j01
1152b58L04j43P6J4o7O0J7R6J8M9j5J29k91J75j41O7j17p7P0j3p8R4j7j19j74
1177c41M55j76n3J53Q6jj78K10J1l9k0j8m3J23k57j6J14j05m1J21n9k0J4qK05
1202A17K1l9L0n1k2q5J50J0m0j35j4O1j10J83j76M3j7J24j03r5N9J05R4j48J57
$$ plain form
1227 119 104 230 119 26 32 179 -128 -79 -112 -215 -113 -230 -170 -122 -30 -44 -45 60 -39 18 98 15 -8 53 124 -13
1253 -13 91 -7 58 -15 -31 -12 -138 16 54 -12 205 81 -156 -88 4 78 16 -72 81 97 121 42 40 9 10 64 65 -255
1281 -255 -140 -57 -27 -214 -164 -52 -84 -109 -141 83 26 39 44 103 -48 164 117 69 82 57 15 -72 -55 -60 -69 -136 -55 -35
1309 -35 -100 -100 -122 69 -77 70 101 70 210 184 63 82 -64 104 42 -51 -72 -182 -73 -78 -46 -24 90 -106 10
1334 10 58 -129 -41 119 116 -19 130 99 -71 67 -60 59 36 -107 -89 -76 77 -142 80 -7 -118 -2 93 117
1358 117 125 56 46 60 141 55 144 33 128 39 70 84 6 49 42 -11 11 -139 -43 -6 31 57 34 92 80 170 56 121 141
1387 141 37 -48 83 -107 84 -1 -268 -162 54 11 72 -46 71 90 123 124 153 62 -8 69 22 -79 -1 6 17 -21
1413 -21 -30 -277 -103 -61 -139 -163 -128 -5 24 -6 -46 82 32 39 26 -17 203 107 33 44 35 53 5 7 -34 23 52 41 -54 -48
$$ packed form
1227A19j5J26j11r3OJ47l07M9l3j03J02j17O0M8R2j4jJ05r9N7Q0q3k3O1P1j37
1253a3J04r8O5p3j6J9j26J54L8o6K17j24k37O8R2P4o2q8J53J6K4p9kl1JN4Jl20
1281b55J15Q3L0j87N0J12l2k5l2K24n7J3NN9j51K12m7m8J3k5m2q7J7nro7Q1K0
1309c5o5%k2J91j46J47L1l1J40k6j21J9j46J68o2r3k1j10J09nL2K2J14j96J16
1334A0M8j87Q8J60lj35J49l1j70J38j27J19k3j43J8J3J53k19K22q7j11J16R5K4
1358A17Qo9j0J4Q1q6Q9j11R5q9L1J4p8M3pn3K2j50R6L7L7K6k3N8j2R0j14O5K0
1387A41j04q5J31j90J91q5k67J06K16m3O1j18J17J9L3JK9r1p0P7m7j01P8PJ1l8
1413b1rk47J74M2p8k4L5J23K9l0m0J28n0Pj3m3K20r6p4J1rJ8m8Km1N7K9j1r5O
$$ plain form
1443 -48 -59 -151 106 109 -3 -22 70 -18 -68 34 -151 -123 -64 41 -74 -97 -96 -59 -85 -1 -53 -24 68 35 -84 122 -4
1470 -4 -56 73 47 -4 104 -61 126 59 46 46 64 -56 78 71 -163 -36 -81 -183 -48 -36 -24 -146 7 63 50 185
1496 185 108 71 -148 -8 54 -63 -150 -107 -69 -70 -53 -85 71 -4 20 34 -86 -73 -23 6 47 35 -50 82 79 67 -55
1523 -55 70 0 -71 -41 104 -4 -125 12 -52 -3 12 123 -52 22 130 -45 -90 169 227 156 -146 106 19 -176
1547 -176 4 63 50 148 23 -45 -128 55 46 -206 62 -117 86 -81 9 7 151 46 -8 101 -14 90 142 92
1571 92 -159 3 53 -32 -44 -79 1 114 0 46 64 72 15 -104 52 -8 -18 125 26 11 -60 101 78 70 -66 -132 -21
1598 -21 98 -139 46 137 109 -20 153 76 189 167 2 62 -148 -59 -43 -23 -57 119 49 94 43 1 -77 55 -232
1623 -232 -45 -21 19 4 53 -39 47 178 44 152 -38 -1 121 68 -35 104 -132 100 22 -57 186 53 108 77
$$ packed form
1443d8j1r2K57Lj12j9R2q8n0J02j85K8N9J05j15k3JL7k6Q4n2K9R2l3j19K06j26
1470dn2J29k6n1J08j65J87o7j3%J8j20J34pk34J27m5j02J35J2J2j22J53N6j3J35
1496A85p7l7k19J40O2j17q7M3L8jJ7l2J56p5K4J4j20J3N0K9M1j2q5J32lj2j22
1523e5J25p0p1L0J45j08j21J37o4M9J5J11j75P4J08j75m5K59N8p1l02K52q7j95
1547a76J80N9j3R8j25o8q3J83rk52K68j79K03j67R0kJ44j05n4J09j15J04N2n0
1571I2k51J62N0q5j2l5Q0J13j14M6J8Qn7j19J56o0j0J43r9j5p1J61k3qj36o6J11
1598b1J19k37J85R1k8j29J73p7J13k2j65O0k10Q9J6K0l4J76p0M5n1m2p8J32k87
1623b32J87K4M0j5M9r2Q6J31j34J08j90L7J22n3j03J39k36K32p8p9K43j33N5l1
$$ plain form
1647 77 42 -37 74 64 48 14 31 -17 28 186 74 10 68 27 100 -86 -51 34 -142 -25 164 -75 -6 -26 24 -92
1673 -92 -1 20 5 37 -153 67 17 57 77 57 -76 -66 -65 -12 18 84 -64 95 -11 92 -87 -70 45 63 34 107
1699 107 -27 -9 -83 131 131 -23 -46 -34 -9 -93 11 0 20 -22 161 8 -2 86 -67 28 -105 15 -42 11 26 -115
1725 -115 -13 -64 -75 -62 -61 76 112 25 -3 56 27 23 144 17 57 -46 11 2 155 -29 90 76 -26 -21 -33 43 22
1752 22 29 61 -53 54 -169 -95 85 -11 -39 -51 -3 74 130 89 27 48 66 -44 -63 -121 -48 -32 -94 -51 -106 45 -108
1779 -108 66 26 3 72 129 143 39 -87 -21 29 85 89 -23 -67 4 -6 -30 13 -64 -70 -89 -40 -7 104 -115 -36 48 -50
1807 -50 143 85 21 3 -43 99 124 74 -126 -111 -38 23 -15 55 -50 106 -90 110 -147 54 45 42 79 -16 -48 -3 -2
1834 -2 -20 -5 -29 5 -83 -111 -96 -2 -51 100 -24 -34 -37 -64 -83 98 96 146 -31 28 -114 82 48 75 92 15 7 9 44 49
$$ packed form
1647G7l5p9J11j0j6l4J7m8M5J58j12o4N8m1P3j86L5Q5j76J17J89k39O9k0N0j16
1673i2R1K1j5L2j90K20n0M0K0k0j33J0JN3L0O6j48J59j06J03j79J7J15J8k9P3
1699A07j34J8p4K14%j54k3J2K5q4J04j1K0m2J83j53j0Q8j53R5j33J20n7N3J5j41
1725a15J02n1j1J3JJ37L6q7k8N9k9mJ21j27M0j03N7rJ53j84J19j4j02Nj2P6k1
1752B2PL2j14J07k23P4J80r6k8j2M8P7N6m1o2K1J8j10j9n8P3J6o2M3n5J51j53
1779a08J74m0k3O9N7J4j04j26O6N0N6Mj12m4P1j0k4M3p7oj9M9L3J11k19P9Q4r8
1807e0J93n8o4j8m6J42K5n0k00J5P3O1l8P0j05J56j96K00k57K01rlL7r5l2M5J
1834bj8J5k4L4q8k8J5R4m9J51j24j0lk7j9J81kN0j77N9j42J96l4K7J7p7qKL5N
$$ plain form
1864 49 -111 -87 -80 -44 35 54 63 -23 -13 30 20 9 -27 -4 -15 -21 -75 117 -60 -105 -112 -40 35 -129 15 11 -51 20 -161 -178
1894 -178 -87 165 -56 28 -51 -144 84 94 -44 -220 5 29 -101 5 -22 88 -68 -119 -23 53 -209 -17 131
1917 131 -138 -104 -27 45 -86 -22 179 33 -23 107 -4 -39 -84 -75 -12 -149 51 21 -53 -44 -13 192 95 73 -21 -129
1943 -129 -145 108 29 3 69 -26 -31 38 -10 -166 -249 -77 -64 -30 -53 85 34 -30 109 4 85 28 40 94 -53 -61 -12
1970 -12 -85 79 -4 -144 -221 -27 7 24 -1 95 -13 7 36 27 117 -82 40 -73 5 -104 31 -103 25 133 -12
1995 -12 132 150 6 -32 6 -91 -25 -34 130 12 31 -9 12 -83 -88 71 -108 -49 28 -79 57 48 19 -92 175 43
2021 43 -109 23 84 17 -42 34 -95 222 -56 108 -32 63 55 -49 -89 -15 47 -63 71 5 49 -41 -71 -84 -12 -73
2047 -73 -78 -15 -24 4 114 -104 -60 -30 52 -58 107 7 104 -27 -154 75 -102 63 24 122 -6 15 -79 11 56 -82
$$ packed form
1864D9j60K4PL6P9J9Rq6J0M3j0j1l6K3j1on4J92j77m5pP2P5j64J44mo2P1j81j7
1894a78R1K52k21Q4p9r3K28J0j38j76K25K4j30J06k7J10j56n1R6P6k62J92J48
1917A31k69L4P7P2j31O4K01j46n6J30j11l5m5RO3j37K00l0p4RL1K05r7k2r4j08
1943a29j6K53p9k6O6r5nO9m8j56q3J72J3L4k3J38n1o4J39j05Q1n7J2N4j47qM9
1970a2p3J64q3j40p7J94L4J7k5R6j08K0K9rR0j99J22j13P8j09J35j34J28J08j45
1995a2J44J8j44l8L8r7O6rJ64j18J9m0K1r5nJ59j79N9P7j07J36rk9j11K67j32
2021D3j52J32O1o7n9P6j29L17k78J64j40R5qj04m0P4O2j10J34o6M4r0l0j3P2o1
2047g3nO3rK8J10k18M4L0Q2j10J65j00R7j31j27K29j77J65l9R8j28K1r4R0M5j38
$$ plain form
2073 -82 100 104 28 120 260 111 -102 110 -53 32 82 -85 55 -28 -69 -190 -42 121 -32 -36 -294 -102 -91 -102
2097 -102 87 -3 7 -25 -13 -18 166 -51 24 -2 -70 126 45 36 -89 22 38 -10 -63 82 57 -30 -9 194 53 23
2123 23 9 52 -109 26 -234 14 -28 -97 -99 64 -57 144 98 13 -156 -8 59 69 109 9 4 12 -118 75 63 -104
2149 -104 -126 -60 5 198 35 78 -3 -39 15 23 190 67 58 99 -21 -30 -7 106 67 64 43 23 117 35 31 -67 13 -300 -46
2178 -46 -95 18 50 27 -89 -233 -99 81 105 0 66 -146 30 51 13 132 19 27 98 2 -44 87 -19 -76 -52
2203 -52 94 -87 100 29 -10 -23 21 23 34 -23 -53 -58 12 -29 45 12 -19 -146 -156 -70 -73 -16 13 -50 126 -84 -86 62 -17
2232 -17 107 30 75 -78 -64 21 217 -2 -70 42 148 -186 77 98 15 -74 -131 -165 75 -50 -34 -112 45 -31 -36
2257 -36 82 2 -50 -79 -99 -7 -32 -9 207 -166 24 65 79 -132 -14 -16 131 -45 63 66 139 210 -51 41 -24 9
$$ packed form
2073h2J82Mp6R2J40j49k13K12j63Q5N0j67J40q3m1j21J48J63j53mk58J92J1j1
2097a02J89r0J0l2J2nJ84k17P5k6o8J96q1rj25J11J6m8n3J45k5q7K1K03j41l0
2123B3j4M3j61J35k60K48m2o9kJ63j21K01m6q5j69J48O7J0M0j00nQj30J93j2j67
2149a04k2O6O5J93j63M3q1l6N4QJ67j23rM1j20rK3J13l9lk1k0R4q2mr8Q0l13K54
2178d6m9J13L2k3j16j44J34J80K4j05O6k12J76K1l8J19j13QP1r6m6J31j06n7K4
2203e2J46j81J87p1l9j3M4KJ1n7l0nP0m1P4l3l1j27j0Q6lN7K9o3J76k10kJ48p9
2232a7J24p7M5j53J4Q5J96k19o8J12J06l34K63K1q3q9n7l4K40j25J6p8J57p6n
2257c6J18q0n2k9k0R2k5K3K16l73J90M1J4k11J18kJ47j76J08LP3P1k61R2o5L3
$$ plain form
2283 9 2 -30 -46 -116 -230 1 -7 -60 -5 -19 12 -35 112 -59 34 32 7 -4 109 -33 -63 45 -125 -66 -67 16 74 -168
2311 -168 -26 37 -57 -77 -84 -92 254 45 131 -22 103 150 41 189 98 69 60 -89 111 -64 -147 -130 -8 72 1 -44
2337 -44 102 40 -20 -77 -93 46 42 -30 92 3 3 5 19 119 -15 48 113 -86 26 165 75 -81 30 61 130 16
2363 16 101 30 -40 36 -105 91 119 -139 -80 -8 -29 85 -115 17 86 -88 -159 -14 -30 -86 -5 31 67 -234 -20
2388 -20 -13 67 -170 3 -70 47 -97 -3 14 -231 -29 24 -66 77 -59 112 -133 -52 75 -43 -43 -52 6 -27 -96 -155
2414 -155 42 52 -2 -93 -72 2 -143 -22 74 -115 -12 -42 -111 -5 -163 56 83 79 -2 -22 -93 -76 -17 -122 -189 -28
2440 -28 -83 19 21 -23 111 -102 27 47 9 -75 115 172 53 40 33 -35 8 -6 -79 -67 93 86 7 -13 126 -38 -37 -111
2468 -111 27 -159 -120 -23 -68 -77 -118 -104 112 82 -55 38 -97 -162 -33 -11 -4 -69 -114 -52 -44 155 -73 -20 0 -137 -59
$$ packed form
2283Ipl2j6p0j14K31qn3N5j4L1m7J47j71R3kk5j1J13j42l0J08j70N9jQ3N8k42
2311a68J42O3r4k0pqL46k09Q6j53J25M7j09J48r1k9rj49K00j75q3J7J22Q0p1m5
2337d4J46o2o0n7j6J39mp2J22q9%KJ4J00j34O3O5j99J12J39r0j56J11L1O9j14
2363A6Q5p1p0P6j41J96K8k58N9P2k1J14k00J32O9j74p1J45j6n6Q1L6L6l01K14
2388b0PQ0k37J73p3J17j44R4J7k45K02N3r0J43j36J71k45Q1J27j18%rN8l3o9n9
2414a55J97J0n4r1K1P4j45J21R6j89J03l0o9J06j58K19K7mq1k0p1J7N9j05o7J61
2440b8n5J02Km4J34k13J29K0l8q4J90N7j19j3po8M3j4p3J2J60pp9k0J39j64Jp4
2468a11J38j86L9R7m5rm1J4K16l0j37R3j35o5J29K2Po5m5O2QJ99k28N3K0j37P8
$$ plain form
2495 -59 9 -10 93 29 -10 42 24 -20 99 42 -32 -127 -65 121 -1 172 15 104 21 23 -63 14 -72 69 39 -15 77
2522 77 -212 -135 -56 14 -78 -52 -41 -76 -9 61 -48 98 2 55 112 85 -57 -42 -35 2 0 -41 -6 -108 6 2 56 5 47
2551 47 57 12 -3 27 28 138 14 -23 22 -95 -44 -22 -37 -54 38 5 141 -36 -9 -9 -9 -21 -95 85 25 108 -9 160
2579 160 -34 -29 -75 4 -35 -92 52 78 85 86 47 61 105 -115 85 -102 -63 76 -63 -43 -136 -116 31 -81 -68 -166 50
2606 50 -66 22 140 31 -24 15 26 4 -29 11 -34 -48 45 84 -99 -85 -11 107 -73 -35 -28 -49 -37 192 -40 -103 44
2633 44 -10 208 70 27 -78 158 -23 6 -59 85 -128 -70 9 -131 -48 -28 1 42 -191 -113 -47 -199 -165 105 80
2658 80 21 -42 -29 -13 56 65 56 -10 67 95 -107 -24 4 51 81 65 12 115 83 58 -37 58 -152 -30 -41 8 -43 -162 -39
2687 -39 172 74 26 -125 29 -91 -173 -98 75 -33 -87 -122 22 -79 -17 -8 92 -19 -112 -164 -164 57 63 -87 36
$$ packed form
2495e9O8j9J03o4l9N2j8m4J19n7p4r5O2J86j22J73j57Q9q3Kq6P7q6J41l0n4R2
2522G7k89P7P9P0r2K6J1l5O7P0j09J46r6N3N7k7j42J5PL7km1L5j02J14mN4n1M2
2551D7J0m5j5L0JJ10j24l7M5j17N1K2j5j7R2l3J36j77K7%%j2p4J80o0Q3j17J69
2579A60j94Nm6P9l9n7J44K6PJl9J4M4k20K00j87L9J39j39K0r3K0J47j12J3r8K16
2606E0j16Q8J18j09n5L9J1k2l3M0m5j4R3L9j83J4P4J18j80L8Pk1J2K29k32o3J47
2633D4n4K18j38m3j05K36j81K9o5J44k13N8P9j40Q3K0K9M1k33P8O6j52L4K70k5
2658H0n9o3J3J6O9Rro6P7K8k02Q3K8M7L0j6n3J03l2k5r5R5k10J22j1M9n1j19J23
2687c9K11r8m8j51J54j20q2P5J73j08n4l5J44j01O2RJ00j11r3n2%K21Oj50J23
$$ plain form
2712 36 -15 -57 -11 -139 53 -34 -43 -155 -5 -28 -184 41 11 -28 -95 -10 38 -41 67 -34 -121 -85 -83 -77 -62 48 -113
2739 -113 -10 -185 25 -40 26 -77 -58 71 0 123 71 -4 54 -64 105 31 73 63 -173 47 -12 -5 -182 68
2763 68 -66 69 -74 90 -4 -50 -48 -87 23 56 15 -43 23 -32 14 -86 -53 -133 147 -37 0 -83 311 -42 -104 79
2789 79 153 6 -36 101 17 135 -40 -31 43 -54 -28 -43 -71 -116 67 90 -66 -33 -25 30 72 35 49 -5 -60 -31 26 93
2817 93 -75 -212 41 101 -50 59 32 -1 32 -18 28 -82 150 0 -118 52 -66 -48 -19 75 5 102 30 126 -91
2842 -91 -32 16 78 -22 46 -27 67 -111 -39 37 56 -92 -108 -67 -71 133 -59 26 57 10 -90 14 57 67 -85 70
2868 70 68 132 14 98 26 55 -1 89 -106 73 81 31 164 45 -163 -32 14 102 -146 -15 38 -77 -54 74 29 -6
2894 -6 67 -2 -99 52 -69 -37 -63 74 59 -43 -84 81 130 -20 -5 -136 34 106 13 49 110 -49 35 -50 -65 39
$$ packed form
2712C6n1m2M6j28J92q7rj12J50k3j56K25l0l9o7Q5M8p9J08j01q7L6KOJ5J10j61
2739a13J03j75K10o5O6j03J9J29p1J23n2p5N8j18J69p4M2j0k36K20n9Pj77K50
2763F8j34J35j43J64r4m6Kl9J10L3m1n8O6n5M6j00L3q0K80j84L7q3L94l53o2J83
2789G9P4j47m2J37q4J18j75RP4r7K6j5k8m5J83K3j56L3QN5M2l7J4n4n5K9N7O7
2817I3j68j37K53O0j51J09k7l3L3n0M6j10K32j50j18J70j18J8K9R4p0R7p2R6k17
2842i1N9M8O2j00O8p3R4j78P2P6J9j48j6M1mK04j92Q5L1m7j00J04M3J0j52J55
2868G0kO4j18Q4p2K9n6R0j95J79Qn0J33j19k08J31M6Q8k48J31N3j15K3J28m5l5
2894fP3o9r7J51j21L2k6J37j5j02m1J65M9j50J5j31J70P2r3L6O1j59Q4q5j5J04
$$ plain form
2920 39 159 -16 5 19 50 -83 -11 18 43 -95 120 -35 -142 106 98 1 -3 80 79 67 -42 33 94 -59 -75 -47 85
2947 85 -64 -134 6 149 -168 -37 -17 -94 -6 -211 32 33 -75 -46 -11 -79 1 57 -49 -14 82 -104 75 -180 30
2972 30 -83 160 58 1 86 114 35 -52 1 68 130 -17 57 -6 27 11 79 57 48 53 71 45 -48 119 72 -40 46 -162
3000 -162 44 -90 54 -8 31 -71 -6 -48 33 -107 -75 -16 -58 29 45 55 -8 47 -31 -103 -189 26 136 -30 -56 10
3026 10 -96 112 16 -105 37 -21 26 70 10 8 111 -48 86 42 4 -53 34 -28 41 -49 175 52 -138 -73 73
3051 73 -15 34 128 69 -38 51 45 47 112 -101 -32 -113 -15 10 6 -57 43 -129 -125 -196 -63 -107 27 -21 68 -33 188 21
3079 21 142 35 -5 152 66 118 -5 54 -18 141 95 15 26 38 12 -66 76 64 134 26 13 48 -7 190 17 -55
3105 -55 -42 -146 27 29 26 -14 -69 48 56 -158 -191 -40 -97 -31 -58 60 -100 -64 16 55 20 1 -113 64 -63 56
$$ packed form
2920C9J20j75K1J4L1j33P2K9K5j38K15j55j07K48qr7mQ3jj2j09P5O1j53j6K8J32
2947H5j49p0J40J43l17J31K0p7Q8k05K43Jj08K9L5o8Q0N6j06L5R6j86J79k55K10
2972C0j13K43j02n7Q5K8p9q7N3O7O2j47P4o3L3j6O8k2rNJ8k6r3J67m7j12Q6k08
3000a62K06j34J44o2L9j02O5m2Q1j40L2N9m2Q7J6J0o3N5p8p2q6K15J10j66k6O6
3026A0j06K08r6j21J42n8M7M4o0kJ03j59J34m4l8n7Q7o2O9r0K24j23j90O5J46
3051G3q8M9R4n9j07Q9oKO5k13O9q1R8K5mo3J00j72Mp1J33m4J34m8Q9j01K21j67
3079B1J21j07m0J57q6N2j23N9p2J59m6q0J1J2k6p8J42j2P0j08j3L5n5J97j73p2
3105e5J3j04J73Klm0n5J17Qk14l3J51n7O6k7J18j60L6Q0L9l5j9j14J77j27J19
$$ plain form
3131 56 43 -106 65 -16 73 -47 26 -78 -32 155 -64 104 67 98 -68 85 85 -49 114 -102 -39 -81 85 -29
3155 -29 -86 -126 -73 -36 -90 -125 153 62 136 77 -38 -92 8 -25 -79 140 33 -3 110 18 60 69 187 29 82 -42
3181 -42 63 62 -51 -117 34 -92 -60 108 -11 -106 83 48 -45 23 -122 -76 -35 -160 -126 -11 114 -131 48 -26
3205 -26 -70 -92 26 57 -212 62 82 153 34 112 23 -2 55 50 143 103 -162 -74 -30 -6 -44 6 143 -108 -35 98 98
3232 98 -11 8 -17 -47 39 -80 85 -92 -51 84 29 121 62 31 -90 76 -72 108 -118 3 -37 9 53 -47
3256 -47 -1 -70 223 -11 32 -113 141 -32 198 -66 -27 29 -114 -83 48 91 -34 22 -102 -45 120 121 40 36 -21
3281 -21 20 -32 12 -32 80 116 18 20 -18 -79 -16 -72 88 -65 -66 -79 105 65 43 -54 -30 -29 7 12 15 -28 -97 70 -52 -164
3311 -164 45 78 39 -84 -160 45 -8 64 45 13 12 -21 30 78 115 141 -108 -27 68 17 71 -21 8 -31 81 32 38 86
$$ packed form
3131E6j3j49J71q1Q9j20P3j04M6J87k19J68l7L1j66J53%j34J63k16O3m2J66j14
3155b9n7m0N3L7n4l5K78r1P4n9j15n4J00l3n4K19j07l6J13r2M2RJ18j58N3j24
3181d2J05jj13o6J51j26L2J68j19r5J89l5r3O8j45M6M1j25L4J15J25k45J79p4
3205b6m4k2J18L1k69K74K0P1j19P8q9k5N7nR3m0k65Q8M4K4l8N0J37k51P3J33%
3232I8j09J9k5l0Q6j19J65j77M1J35n5R2n9l1j21J66j48J80k26J21m0M6M4j00
3256d7M6o9K93k34M3j45K54j73K30k64L9N6j43L1J31M3j25N6j24N7J65Jq1mn7
3281b1M1n2M4m4J12L6r8Kl8o1O3n6J60j53jj3J84m0k2r7K4JL6NLm3o9J67j22j12
3311a64K09L3l9j23p6K05n3P2j9l2jl3N1M8L7K6k49Q1R5n1N4r2K9l9J12m9OM8
$$ plain form
3339 86 -43 196 125 -41 168 213 -21 130 60 -50 -14 35 86 4 35 -98 -58 -21 201 -124 117 100 142 -49
3363 -49 25 51 26 -72 -129 92 -70 -129 42 -24 -72 47 88 49 -16 89 -160 -51 17 -27 -126 86 60 -31 -19 -14 -8
3390 -8 29 51 63 -3 -34 -20 57 -46 -91 -68 -31 -68 -127 37 -27 104 73 -122 52 -22 -12 -117 -57 131 119 -68 -6
3417 -6 27 23 -75 -101 -11 -99 -90 61 57 65 -48 -67 27 -66 150 94 32 43 35 111 49 -8 -21 30 -1 119 -12 -80 -62 15 16
3448 16 -121 -29 -8 -39 54 -98 -39 57 30 74 -55 7 -9 118 70 59 22 34 6 -32 -48 69 155 62 -159 13 134
3475 134 -41 -19 -40 -38 26 33 -34 -17 -16 83 22 181 11 -21 -56 -13 9 3 -13 -2 -194 -41 99 -21 52 -51 65
3502 65 44 -1 62 21 138 -73 -141 167 39 -53 -128 188 -15 93 -36 -86 0 8 85 -29 29 -116 70 -18 -9 -66
3528 -66 112 -118 -105 89 -2 56 -96 23 4 102 -40 -113 -63 1 7 -107 86 94 -70 123 -93 -77 -178 111 52
$$ packed form
3339H6j29K39p1j66K09M5k34J51p0j10L6M9N1q2L1j33M0L7K22l25K41j7M2j91
3363d9P4K6k5r8n7K21j62n9J71o6m8J19M1l9o5J05k49J09O8m4r9K12k6r1J2NO
3390hL7K2J2o6l1J4P7j03m5K3L7l7n9J64o4J31l1j95J74p4J0j05O0J88j2j87O2
3417fL3mr8k6R0q8RJ51mQj13j9R4r3K16n6o2J1qP6o2n7j3N1l1J20j31o8J8P7J
3448A6j37R2K1l1R3j52N9R6k7M4j29O2j6J27m8j1l7J2k8l8j6J17Q6r3k21J72J21
3475A34j75K2k1KO4Po7J7JR9o1J59j70l2l5M3K2oj6J1j92J53J40j20P3j03J16
3502F5k1m5O3m1J17k11o8L08j28r2p5L16k03J08j29n0Q6QP7j14N8j45J86q8Rn7
3528f6J78k30J3J94r1N8j52J19j9R8j42p3N0O4Oj14J93Qj64J93k16J6j01K89n9
$$ plain form
3553 52 93 -117 -70 172 87 65 -41 14 -30 103 -121 72 83 56 -63 -18 15 40 70 -26 77 46 20 94 154 -43
3579 -43 -125 -25 44 -39 -65 -134 153 1 -51 58 -4 -89 -65 -78 -12 67 63 -73 7 -20 -6 123 43 45 -25 6 -54 -155
3607 -155 -9 68 51 26 -65 30 -56 -18 -95 119 -145 108 -228 -23 69 -83 2 68 -32 79 -34 138 -119 -92
3631 -92 13 -128 38 14 105 -26 -14 80 15 89 89 151 18 -7 39 -86 93 82 20 -27 21 27 135 -136 -31 77
3657 77 49 -1 2 -112 -45 13 61 71 50 167 -29 -51 -102 9 -97 -85 -61 217 -33 -41 60 62 -157 -132 43 -43 130
3684 130 -24 92 34 38 65 -56 18 -37 43 54 -26 31 17 51 123 -59 64 -156 28 -13 -61 -26 178 -164 -79 25
3710 25 -151 23 80 -41 32 -22 -9 106 -58 24 -24 -38 -74 -27 23 -14 57 -119 135 -19 -6 50 141 -26 -190
3735 -190 -96 -151 -78 -79 189 26 -127 17 -11 -24 18 -224 83 10 -162 5 137 -80 107 87 -22 22 68 -51
$$ packed form
3553E2M1k10M7K42q5k2j06N5m4J33k24J93J1k7j19M5L3K5L0r6J03l1k6P4O0j97
3579d3q2J00O9q3k6o9K87j52n2J09o2q5K4j3O6P9mj36Q0k7J4J29q0Kp0L1o0j01
3607a55J46P7j7k5r1R5q6L8p7K14k64K53l36K05R2j52Q5O6j00J11j13J72k57K7
3631i2J05j41J66k4R1j31J2R4o5P4%O2j33k5M6j25J79j1o2m7M8OJ08k71J05J08
3657G7k8n0Lj14O7N8M8J0k1J17j96k2n1J11j06J2K4K78k50qJ01Kk19K5J75q6J73
3684A30j54J16n8MK7j21P4n5Q0J1q0N7j4L4P2j82J23k20J84m1m8L5K04l42Q5J04
3710B5j76J74N7j21P3n4J3J15j64Q2m8j4l6M7N0l7P1j76K54j54J3N6R1j67j64
3735a90R4n5P3jK68j63j53J44k8j3M2k42L07p3j72J67J32k17J87k0j09M4M6j19
$$ plain form
3759 -51 -111 -117 -14 -53 91 -50 -129 -1 29 -48 -117 124 30 70 33 158 19 21 -53 -55 -80 -127 239 92 -6 38 -94
3786 -94 52 28 -93 -93 -84 -77 -145 104 -36 -16 8 200 -50 80 -26 50 127 161 178 30 119 58 6 -177 11 -49
3812 -49 35 116 -64 24 -62 152 -66 102 24 25 80 -22 -150 -130 -25 -28 -44 -77 -47 -54 -36 110 -49 95 78 -35
3838 -35 40 -43 -143 10 -49 159 -53 21 -149 -10 75 64 50 -6 -202 -129 -4 -72 58 5 -2 140 82 105 37 48
3864 48 -50 80 -46 42 39 -78 -12 52 -25 -50 33 -25 -73 -101 31 -55 39 55 182 94 -67 45 89 142 17 35 -58
3891 -58 -112 86 -4 17 178 13 -13 40 -91 -55 -57 48 96 -198 -73 -18 -35 -92 -63 -161 -37 121 38 39 -181 -68
3917 -68 -66 141 -58 -94 67 -162 -60 -131 10 160 -100 -126 80 -121 -74 -1 73 -4 27 -88 -73 -193 81 -18
3941 -18 -131 -40 -206 30 39 -126 76 20 -76 23 70 -65 46 18 83 -78 29 74 -105 -33 159 -41 133 -26
$$ packed form
3759e1o0oJ03l9J44j41p9J28L0p7o9K41r4M0l7J25j39Kp4kk5m7L66j47r8M4j32
3786i4J46k4j21%RPo8K49j40K0K4J92k50J30j06P6P7L4J7j48Q9o1n2j83J88o0
3812d9Q4Q1j80Q8q6K14k18J68p8JN5j02j28K0J05lj6l3L0pJ8J46j59J44j7j13
3838c5P5q3j00J53n9K08k12P4j70J39Q5j1j4n6j96P3J25o8J30n3pJ42n8K3o8J1
3864D8r8J30j26Q8lj17O6O4p7k5Q3n8m8k8J32q6R4J6J27q8j61J12M4N3j25J8r3
3891e8n4J98r0K1J61j65k6N3j31L6kJ05M8k94J25N5j7n7K9r8J24J58q3Jk20J13
3917f8KK07j99l6J61k29J02p1J41J50k60k6K06k01M7P3P4p7L1j15J5j20K74r9
3941a8j13R1j66K36Rj65K02n6r6R9M7j35J11k8O5j61J07M5j79P2J92k00J74j59
$$ plain form
3965 -26 -57 20 -37 -55 -143 -38 -120 93 -52 76 184 118 -21 -38 52 81 -136 -92 86 18 -53 31 -15 81 -55 -115
3991 -115 35 -13 4 -115 -1 -63 8 -132 49 26 45 22 -15 124 -113 19 7 -251 -66 -104 -42 -10 90 101
4015 101 19 41 140 89 25 7 66 159 105 49 62 112 -25 -81 -32 47 -48 -31 37 -125 -180 96 80 -92 62 -174 -49
4042 -49 -53 0 -61 68 -46 -25 89 4 134 9 48 -102 60 -54 -24 21 -85 -159 220 -167 -43 48 7 35 108
4067 108 -5 209 36 -92 58 -61 -28 -41 -24 188 -59 -83 -2 -33 -61 -34 27 -18 -39 -140 -101 -134 -34 143
4091 143 28 79 -91 -85 -28 48 -31 35 -79 31 50 18 -127 -72 74 2 -1 61 116 107 -62 68 9 179 28 -52
4117 -52 -111 -123 -33 -72 -68 -119 46 -83 57 8 -49 74 97 4 -1 61 45 -213 -62 -2 -9 -81 -156 -174 -136 41 -68 -14
4145 -14 -4 -127 4 156 -56 -74 -9 191 81 103 32 29 6 -222 -78 -156 23 -5 -161 -101 -73 -121 -78 -153 -79 80
$$ packed form
3965b6l1P7n7j8q8J05q2K13j45J28J08o6j39j7R0K9k17M4J78o8p1Q4m6R6j36o0
3991a15J50m8J7j19J14o2P1j40J81k3J9k3l7J39k37J32j2k58J85l8O2L2J00J1
4015A01q2K2R9n1o4j8N9R3n4n6J3N0j37n6M9P9r5J7O8j62n5K76j6j72J54k36J25
4042d9mN3o1J29j14K1J14q5J30j25L9j50J62j14L0M5j06p4L79l87J24R1m1K8P3
4067A08j13K14j73j28J50j19L3j3J7K12k47k4Q1l1k8K7O1m5k1j01L9l3J00J77
4091A43j15N1j70ON7P6p9O6j14J10J9l2j45N5J46p2lO2N5rj69J30n9J70j51q0
4117e2n9j2R0l9Mn1J65j29J40m9n7J23K3r3nO2j6k58J51O0pp2p5j8L8J77j09N4
4145a4J0j23J31J52k12j8O5K00j10K2p1lk3k28J44p8J79k8j56O0K8m8M3p5P4J59
$$ plain form
4171 80 -43 -58 -180 -128 70 47 -70 76 -193 -57 -126 111 111 -72 -12 -4 165 -27 23 118 8 104 62 84 90 -13
4197 -13 121 53 -111 82 3 -21 -37 -41 25 39 77 63 36 79 70 38 21 96 -72 -98 -138 -204 -81 -60 95 57 -77 108
4225 108 34 -33 -60 40 163 -12 41 15 215 -49 -88 219 132 88 -24 41 49 -187 15 -17 75 -75 -80 39 -135
4250 -135 23 -174 -131 -95 -52 -46 -105 -30 47 -29 5 -43 -39 -61 38 7 -93 26 -8 23 102 -46 159 172 88 26 -183
4277 -183 -77 100 190 24 -104 29 104 -94 8 -60 104 44 -31 -35 -24 68 -7 3 123 -39 23 -7 42 37 -29 -67
4303 -67 55 -43 -30 25 81 -139 -39 67 92 105 63 122 7 -39 -50 11 -17 1 44 -250 -11 -28 -52 56 -183 175
4329 175 24 -52 116 -16 -115 45 -160 69 52 -38 7 227 -44 81 -10 47 -54 11 -68 -10 -30 -99 105 50
4353 50 -125 -75 -22 62 119 41 -8 -77 -42 -19 15 215 -105 -9 -54 112 -75 52 38 -215 -86 -67 45 -171 -98
$$ packed form
4171H0j23j5j22N2J98k3j17J46k69J36o9K37%j83O0QJ69j92N0R5j10R6m2K2Oj03
4197a3J34o8j64J93p9k4j6mO6J4L8j4k7M3rl2j7P5j68k6m0o6J23K1J55l8j34J85
4225A08p4o7k7J00J23j75N3k6K00k64l9L07q7m4j12O5Qk36K02l2R2j50nJ19j74
4250a35J58j97M3L6M3On9P5P7p6L4m8Mk2R9l1j00J19l4L1P9j48K05J3q4o2k09
4277a83J06J77R0j66j28J33P5j98J02o8J64o0p5mJ1R2p5J0J20j62O2l0M9no6l8
4303f7J22r8J3N5N6k20J00J06K5J3m2N9j15m6j1O1k8J8M3k94K39j7k4J08k39L58
4329A75j51p6J68j32r9J60k05K29j7r0M5K20k71J25r1N7j01O5p9N8k0o9K04n5
4353E0j75N0N3Q4N7p8m9o9L5K3L4K00l20R6m5J66j87J27j4k53J29J9J12k16P3
$$ plain form
4378 -98 -155 -127 125 -52 29 18 -49 -55 -95 -74 19 63 -116 153 -61 0 33 189 -74 -30 198 -56 80 44 53 -121
4404 -121 57 -18 -27 44 29 -5 -53 -69 -58 149 -29 -153 86 2 -142 -19 -25 -98 35 -91 25 -115 -6 -135
4428 -135 -45 -25 -35 14 -69 -135 4 21 42 45 50 65 50 153 153 -47 102 -68 36 -138 54 -218 -2 -14 125 175
4454 175 -45 126 -23 117 -60 -35 -66 74 -43 69 -160 -178 -124 -25 -162 -25 -134 -80 144 -79 -107 16
4476 16 -42 60 177 9 138 64 78 -31 4 -14 -71 197 29 133 40 -144 46 -66 112 -66 0 -104 -115
4499 -115 -101 89 -71 17 49 -108 72 21 -43 24 -12 -93 103 34 -128 41 -49 -27 45 -21 -51 -134 -51 63 26 83
4525 83 13 92 -25 -11 115 145 58 95 -44 -47 -64 84 141 -48 -7 -76 -70 172 -56 -67 76 -104 18 97 -27 -41
4551 -41 -9 -89 -120 30 -84 -32 58 -80 36 7 -140 -31 -18 -19 74 83 -24 -62 40 71 102 6 -38 88 51 78 -24
$$ packed form
4378i8n7K8K52j77Q1j1o7om0K1R3M4j79K69k14O1L3J56k63M4K28k54J36l6Rj74
4404a21J78p5rP1j5l4m8j6J1K07j78j24K39q4j44J23op3J33j26J16j40J09j29
4428a35R0K0j0M9q3o6J39J7K1LNJ5j5J03%k00J49j70J04j74J92k72K16j2J39N0
4454A75k20J71j49J40j77K5l1J40j17J12k29j8N4R9j37J37j09N4K24k23k8J23
4476A6n8J02J17j68J29p4J4j09L5j8n7K68j68J04r3j84J90j12J78j78O6j04j1
4499a15J4J90j60Q8L2j57J80n1o4O7l6q1J96o9j62J69r0K2P2o6l0q3Q3J14l7N7
4525H3p0P9j17J4J26L0q7L7j39lj7J48N7j89M1o9OK42k28j1J43j80J22P9j24j4
4551d1L2q0l1J50j14N2R0j38J16k9j47J09J3jR3Rj07l8J02L1L1r6m4J26l7K7j02
$$ plain form
4578 -24 -172 115 80 -98 41 57 -66 150 8 -24 -96 59 45 31 -239 5 -59 76 8 114 -41 37 131 107
4602 107 87 50 106 57 59 63 -116 2 9 -88 2 -48 -47 -1 38 83 16 22 102 16 42 89 -1 13 -145 -41 -24 -14 -19 -13 46
4633 46 5 -7 -29 -19 -28 -108 -278 36 80 32 -31 115 -43 39 2 -2 57 95 61 37 18 -33 0 -100 25 146 18
4660 18 44 83 -8 -136 -5 12 -22 31 166 -82 61 84 27 81 -76 74 -113 -64 -229 53 -51 -62 -29 -5 -28
4685 -28 -50 -20 127 -71 -30 74 -93 25 305 -56 -4 -164 178 14 45 4 13 149 133 11 1 61 -49 -26
4709 -26 -42 -18 1 -87 -40 33 -24 -50 22 -47 71 80 -14 4 71 -42 -240 44 -34 59 -100 -108 116 -102 47 -30 41
4736 41 -34 50 -46 -72 6 -87 -22 124 -8 153 -56 179 59 -30 -82 -74 -38 30 -76 38 70 65 53 78 41 -26 -97
4763 -97 5 74 -58 146 56 41 -50 -142 -4 -120 -58 -75 -97 -17 15 163 45 5 63 78 50 11 -80 -46 78 179
$$ packed form
4578b4j48K87l5j78J39J6j23K16j42l2p2J55j4j4k70K44o4J35o8J06j55P8R4k4
4602A07k0l7N6m9KMj79J18Pr7R0n0JM6L9M5o7OQ0q6K6M7r0J4j58J04J7J0nON9
4633D6m1j2k2J0rq0j70L14M4m8o3J46j58Q2l7mN9L8l4k4j9n1L3j00J25J21j28
4660A8K6L9r1j28J31J7l4N3J35k48J43K3n7N4j57J50j87M9j65K82j04j1L3K4k3
4685b8k2L0J47j98M1J04j67J18K80l61N2j60L42j64L1m1RJ36j6j22j0O0j10K3
4709b6j6K4J9q8M7P3n7k6P2o9J18Rr4J8O7j13j98K84p8R3j59qK24k18J49p7P1
4736D1p5Q4r6k6P8r3O5J46j32J61k09K35j20q9n2QL6O8j06J14L2nj2K5l7o7p1
4763i7J02O9j32K04r0j5r1r2J38j16O2j7k2Q0L2J48j18m0N8J5k8l9r1L4J24J01
$$ plain form
4789 179 80 11 -20 177 -123 109 -137 30 -51 -84 69 -36 -193 -27 10 -27 67 64 47 -113 -38 -109 69 -33
4813 -33 -31 -56 -61 -82 -59 62 149 -75 22 -27 -16 -3 103 55 -39 18 133 93 -65 -85 214 90 -75 -126 4 110
4839 110 88 -47 -23 5 -1 54 -94 157 77 16 148 -65 70 -97 -22 -42 37 63 -51 -45 102 55 88 -20 5 -9
4865 -9 -119 -26 69 104 34 -70 11 -24 227 3 -46 63 -27 -11 43 -19 2 104 -119 -96 8 -24 -4 118 65 -67
4891 -67 -80 -53 24 -92 -33 17 22 -145 -72 -110 -55 74 -22 45 -20 -1 -30 131 58 179 -65 77 -80 -67 -55 110
4917 110 85 106 -30 -1 -17 -62 -93 -50 162 -107 108 -15 -125 -1 -87 -64 -2 -90 19 68 12 25 23 8 -121 -48
4943 -48 45 51 -82 -25 -163 124 58 -12 83 -20 182 31 -23 108 15 61 -20 -7 92 110 86 -82 23 -54 17 -148
4969 -148 -30 -41 -138 28 -2 10 -76 -42 -79 10 -134 67 -13 -26 65 -24 79 -17 46 65 -7 46 45 7 134 -85 17
$$ packed form
4789A79r9o9l1J97l00K32k46J67q1l3J53j05j57J66L7l7R4lj7j60P5p1J78j02
4813c3Kk5nk1K3J21Q7k24R7m9J1J3J06m8r4N7J15m0j58k0K99j24j65n1J30J06
4839A10k2j35K4K8oN5j48K51q0o1J32k13J35j67P5k0P9K6j14OJ47m7L3j08K5j4
4865ij10R3R5L5p0j04Q1l5K51k24m9J09r0J6N4o2K1J02k23K3J04l2K0J22n3j32
4891f7j3K7P7j16N9N0Nj67P3l8N5J29r6O7o5J9k9J61p3J21k44J42j57J3J2J65
4917A10k5K1j36K9j6m5l1M3K12k69K15j23j10J24q6K3O2q8J09M9n6J3kj5j29P3
4943d8R3Oj33N7j38K87o6p0R5j03K02j51n4J31r3M6q1J3R9J8k4j68J05p7P1j65
4969a48J18j1r7J66l0J2q6L4l7Q9j44K01q0j3R1q9J03r6O3J9p2N3jl8J27k19J02
$$ plain form
4996 17 65 88 30 6 135 6 -7 195 -45 -42 61 -158 -80 63 -36 -120 23 13 -204 -49 44 -9 46 -110 -67
5021 -67 -153 49 121 128 -28 -16 153 -38 66 103 20 63 -5 -6 -49 87 -10 -5 50 139 34 100 -166 19 -17 117 -87
5048 -87 -21 -16 206 -117 107 -182 19 -47 17 128 -38 -24 -42 75 -54 -13 -39 -134 -124 29 -22 123 -22 137
5072 137 31 20 -90 -36 -35 -53 -127 -187 46 66 -13 158 16 83 3 -4 -93 45 -118 -121 -79 9 14 -15 27 -42 15 -49
5100 -49 -44 -56 62 55 -48 -10 21 -172 -90 -39 -27 -28 54 75 -69 -61 -15 135 122 115 58 105 -98 90 -17 -24 24 66 -72
5129 -72 -86 -35 -222 2 8 75 14 97 39 35 -101 21 31 -77 25 41 -74 -88 -8 118 -21 -69 32 -119 32
5154 32 -60 119 75 13 55 -58 -14 -16 -46 5 145 130 -59 133 179 65 -16 3 58 95 13 -90 -5 -148 -62 -126 50
5181 50 -160 -2 -14 -181 -66 -37 26 73 -61 -156 -24 -10 -57 44 -14 -162 128 4 -13 165 72 22 74 1 65
$$ packed form
4996A7M8K3n8k4J29j29j3K02k40LJ03k19P8J43r9q4J43j0k17J55R3n3N5j56M3
5021f7q6K02P2Pj56J2J69j91J04L7q3M3o8jm3J36r7NN5Q9j05O6k66J85l6J34k04
5048h7O6NK22l23K24k89K01o6O4J11j66J4j8J17j29M1k6r5J0J53n1J45j45J59
5072A37j06j1j10N4Jj8p4o0K33K0p9J71j42O7q0pq9J38j63lM2Q8Nk9M2o9N7o4
5100d9Nj2J18pj03L8L1j93Q2N1J2jQ2K1j44QM6J50j3pn7M7k03J88j07pM8M2j38
5129g2j4N1j87K24OO7o1Q3n8mj36J22J0j08J02J6j15j4Q0J26j39m8J01j51J51
5154C2r2J79m4o2M2j13M4kl0N1J40j5j89J92M6j14q1J9N5L7q2j03Q5j43Q6o4J76
5181E0k10J58j2j67J15K9O3M7j34r5J32J4m7J01n8j48K90j24j7J78r3n0N2p3O4
$$ plain form
5206 65 69 66 69 38 74 48 -21 -18 76 -76 -30 169 25 -49 -33 2 -68 -46 -168 -17 77 -71 82 -203 8 -195 -128
5233 -128 108 -125 -64 24 45 98 -9 -79 7 -21 234 -18 13 37 4 27 7 16 18 -27 28 61 22 133 -3 -27 -78
5260 -78 -59 -96 17 -23 30 -58 82 -14 -3 -90 40 -43 25 -83 -81 148 -162 -85 97 -5 61 -19 26 -18 -10 24 -7
5287 -7 87 -59 -39 -30 10 95 34 31 -42 117 83 1 5 19 77 -191 -54 -65 28 48 -56 -124 97 -9 -28 -80 -33 -99 35
5316 35 -73 -79 10 24 -14 43 -39 -170 -75 5 23 80 -67 -46 -42 -88 46 -5 134 19 94 -15 -5 6 7 128 51 25
5344 25 82 14 126 185 78 32 -128 -57 25 -113 -68 -10 31 -15 -115 11 -83 193 69 -29 -71 -60 -126 -13 -116
5369 -116 55 -67 -81 -31 12 -26 -105 28 38 25 65 -17 123 55 10 16 6 139 89 -2 -48 68 -55 -12 0 -91 105
5396 105 -66 -202 -46 -17 91 32 -69 28 -69 -107 -85 67 35 30 40 203 8 34 -17 124 24 -27 113 -3
$$ packed form
5206F5MlLl1L6k6o9LR4j52M6J99j44p4J6L5p0K2j22J51R4j48J53k85K11k03O7
5233a28K36k33O1Q8K1N3j07p0Q6k8K55k52L1K4l3K3k0RKm5N5L3l9J11j36k4n1
5260g8J9l7J13m0N3q8J40r6J1q7J30q3O8j08KK29l10P7J82j02O6q0M5m4QL4l1
5287gR4j46K0RM0Q5o1lp3J59l4q2MJ4N8k68J37j1R3K0j04o8K21j06j9n2M7o6J34
5316C5j08oQ9J4l8N7q2j31R5Q0J8N7j47K1Mm6J34n1J39j15P5j09J0J1JJ21p7k6
5344B5N7o8J12N9j07m6j60P1Q2j38M5N8M1m6j00J26r4K76j24r8m2J1o6J13j03
5369a16J71j22j4N0M3l8p9J33J0j3M0q2J40o8m5Oj0J33n0r1m6J16j23M3J2r1J96
5396A05j71j36J56K9J08n9j01R7r7l8K2J52l2nJ0J63j95K6n1J41j00n1J40j16
$$ plain form
5420 -3 86 -124 104 28 144 16 50 63 -43 -91 105 43 -94 44 -61 70 -15 -112 99 -155 -23 21 -146 -147
5444 -147 -76 -28 -30 -81 23 33 25 -2 27 -60 -45 54 -25 45 -27 65 159 -68 12 18 -129 97 24 99 44 -71 -5 65 10
5473 10 -16 -45 -82 -49 -29 107 -81 -28 -29 16 21 75 -66 -101 -47 -195 9 -107 159 162 -109 -11 45 -35 -84 29 151
5500 151 -13 -61 55 -61 109 55 -87 -67 -9 -100 112 6 22 -49 -6 77 25 30 77 17 23 -76 -157 -43 19 -20 19
5527 19 -37 -159 -102 -62 -41 28 -5 -18 -7 106 57 -7 131 12 41 -33 65 39 -104 -125 33 -19 5 49 20 110 14
5554 14 192 -25 -64 -55 -55 43 64 36 -58 -159 -57 255 -122 -1 50 56 -242 -52 -36 -5 27 -4 -116 63 -53 53
5580 53 -82 -97 -42 40 -125 -44 39 48 -71 -68 44 -41 157 -87 241 69 43 112 -56 -309 124 -143 -41 3 -88
5605 -88 -4 -38 -78 -22 -114 -77 3 -105 58 38 108 151 -22 0 64 -18 68 -5 -61 -91 -108 72 165 41 64 -47 143
$$ packed form
5420cQ9k10K28p6J16j28L4J3j06m8J96o2j37J38j05J31q5r7K11k54J32M4j67j
5444a47P1M8kn1J04J0qk7K9q7J5R9p9P0p2R2R4k27Q0Oj47K26p3P5n5j15O6P0n5
5473A0k6k9l7L3K0J36j88N3jM5NN4j41l5N4j48K04j16K66Lk71R8N6q0m9J13J22
5500A51j64m8J16j16J70n4j42K0N8r1K12j06J6p1M3Q3n2NM7o0Or9q1J14O2l9L9
5527A9n6j22N7M0K1O9l3j3J1J13m9o4J38j19K9p4R8k6j43k1J58n2K4M4k9R0r6
5554A4J78k17l9R%R8K1k8r4j01J02L12l77J21N1Ok98J90J6L1L2l1j12J79j16J06
5580E3j35j5N5Q2j65Q1Q3Rj19LJ12q5J98k44L28j72k6O9j68k53M33k67J02M4r1
5605h8Q4l4m0N6r2L7Q0j08J63k0P0M3j73K2O4q2Q6p3n6l0j7J80R3j24K3j11J90
$$ plain form
5632 143 79 147 46 -87 111 -16 59 55 194 -151 32 91 20 109 -87 2 -2 20 -44 -225 -121 133 8 -65 -24
5657 -24 -24 19 -29 66 -134 -10 -24 117 163 94 68 8 15 82 110 -187 202 53 15 8 53 40 25 136 -79 121 8
5684 8 -218 55 68 -83 -24 -119 16 -54 107 -61 -98 -52 85 96 -23 -60 57 89 -3 111 -77 -116 44 35 39 -18
5710 -18 -35 80 -168 -64 66 -19 -74 85 28 28 -79 19 -45 -119 25 105 -145 73 127 -55 70 -16 -1 -23 -91
5735 -91 78 2 55 -58 -54 118 -31 -104 -12 -21 -47 -69 -190 128 -32 -16 24 -13 -9 33 58 64 38 -105 -5 34 43 29
5763 29 116 66 141 -99 74 -20 -26 -11 99 115 62 -124 -118 20 3 107 189 -30 -83 -34 21 148 2 -112 -32 77
5789 77 -42 13 77 -19 -81 -5 29 -78 -92 105 -24 32 143 -62 41 195 -146 126 12 -35 -17 34 -56 1 66
5814 66 -34 -68 -119 -23 -125 -135 -18 118 87 -37 -65 84 -80 -28 180 -192 -16 -21 -74 10 24 -94 -107 -36 -15
$$ packed form
5632A43o4O8j01j33J98j27P5mJ39l45J83N9p1Q9j96Q9mK2o4j81J04K54j25p3M1
5657b4%M3m8R5k00J24j4J41M6o9k6o0PO7K8k97L89j49l8pM5j3j5J11k15K00j13
5684Hk26K73J3j51N9r5J35p0J61j68l7M6J37J1j19l7J17L2r2J14j88l9J60rMn7
5710a8j7J15k48J04J30q5n5J59n7%j07R8o4p4J44Q0k50K18N4j82J25q6J5k2o8
5735i1J69p6N3j13MJ72j49p3R2rk6k2j21L18j60J6M0l7MM2K5Ok6j43J00L9Rj4
5763B9Q7n0P5k40J73r4oJ5J10J6n3j86OJ38j7J04Q2k19n3M9N5J27j46j14Q0J09
5789G7j19N5O4r6o2P6L4j07j4J97j29N6J11k05J03J54l41K72j14m7J8N1r0N7O5
5814F6j00l4n1R6j02j0J17J36l1j24k8J49j64N2K08l72J76nn3Q4J4j18j3P1K1
$$ plain form
5839 -15 93 21 36 97 -31 30 108 -65 56 -142 141 -67 -92 -20 -28 6 11 -73 -19 -58 -71 -25 43 5 -30 -8 29 17
5867 17 102 0 73 82 -37 14 192 -71 68 16 37 -81 -93 -17 145 -30 89 -19 -107 -40 145 15 61 223
5891 223 -39 18 44 -8 -136 -182 -56 -23 65 -41 -55 44 -81 52 -83 -203 -25 -16 74 75 52 64 17 55 92 71
5917 71 23 73 79 7 201 97 60 53 82 73 -142 114 89 -15 6 5 75 -2 6 -158 -52 51 -39 61 23 -36 20 -26
5945 -26 -7 -32 -9 -15 -29 -208 -13 48 28 -113 24 16 -64 79 -45 159 115 -6 -46 16 -31 84 153 -30 70 -125
5971 -125 94 -85 102 -25 -105 -6 -106 97 -23 -2 -49 112 -29 33 -31 10 -43 -95 -89 116 -60 -121 20 -121
5995 -121 -79 -95 -23 -37 83 79 -90 -27 57 35 83 52 16 -31 27 -27 169 58 153 -109 -82 -17 -190 -21 45 99 -23
6022 -23 42 -58 162 59 -14 -126 -44 -38 -77 -143 -84 -19 1 -39 53 -99 -84 127 110 -44 50 226 -41 70 -29 62
$$ packed form
5839a5J08p2J5O1j28O1P8j73J21j98K83k08k5P2qL4Nq4N4l9j3M6O8l8l5K2L7j2
5867A7Q5j02P3Rj19N1J78k63J39n2K1j18j2P6J62j75J19j08q8O7J85j30M6J62
5891B23k62N7K6n2j28m6J26L3Q8j06j4R9j25J33j35j20J78RR0Jk3J2m7L8L7k1
5917G1m8N0Op2J94j04l7pK9rk15K56k5j04K1jP0p7Qj64J06J03r0J00l8n9N6m6
5945b6J9k5K3oj4j79J95O1k0j41J37qq0J43j24K04m4j21m0O2m7J15O9j83J00j95
5971a25K19j79J87j27q0R9j00K03j20K1m7J61j41O2o4M1n3n2OK05j76o1J41j41
5995a21M2j6P2j4J20mj69O3Q4k2M8l1l6m7N8n4J96j11R5k62K7O5j73J69O6N4j22
6022b3O5j00K20j03p3j12Q2Ol9o6N9O5K0m0R2j52J5K11j7j54R4J76k67J11r9R1
$$ plain form
6048 62 80 78 150 74 31 88 107 -59 -20 31 -92 -87 -41 25 77 -34 12 140 -100 -37 -37 -2 -31 52 145 -71 -11 92
6076 92 -20 -29 -67 -44 -126 -130 -99 87 -17 120 56 166 128 -7 11 -34 27 -86 -162 108 -75 13 -65 -11 -12 -35 83
6103 83 -77 61 6 149 35 27 -16 68 -35 35 -9 -7 34 -41 -76 -215 -55 66 56 15 80 -62 166 -156 83
6128 83 -79 -42 89 -5 -39 -20 -36 -127 99 95 89 -4 -60 -62 -65 -81 49 -23 31 -11 -55 130 -24 -226 -111 47 -31 51
6156 51 75 -29 44 -74 -77 -29 25 -170 -144 25 -103 110 -62 75 43 -88 15 -63 -49 48 7 86 62 107 20 3
6182 3 13 -114 -14 123 23 1 27 -5 -34 105 -5 -21 6 -4 100 23 76 -45 -103 -54 59 -75 28 -1 32
6207 32 31 -85 69 -5 -15 -49 -155 119 -19 -22 -18 -94 118 53 18 -28 -13 -31 119 139 -49 25 69 24 64 70 112 38
6235 38 -61 -12 46 1 7 1 4 -49 -27 -23 -51 -31 45 -34 133 37 -120 -75 -50 72 -88 82 113 40 -97 48 67 3 22
$$ packed form
6048F2J8kP2p6m3N7J9j66L9N1j23NM6O6N2j11M6J28k40O3%L5k9Q3R3k16O0J03
6076I2j12rl8K3q2mL1J86j04J37o4J10l8j35J8m5O1j13p6K70j83Q8p8N4jk3J18
6103H3j60J38n5J43j14qm3Q4j03P0m4KM1p5l5j39J60J21j0m1O5j42K28l22K39
6128H3j62L7J31r4l4J9j6r1K26mor3n6klj6J30p2N4m2m4J85j54k02J15J58p8Q2
6156E1K4j04P3j18lM8N4j95K6J69j28K13j72J37l2j31J03p8J4R7m1P9k4M5q7j7
6182CJ0j27J00J37j00k2K6l2k9J39j10j6K7j0J04p7N3j21n8M9J13j34J03k9L3
6207C2jj16J54p4j0l4j06K74j38lMp6K12o5l5m6J5j8J50K0j88P4M4m5M0OM2p4
6235C8r9M9N8m5OoLn3K2Mk8K0P6p9J67r6j57M5K5J22j60J70L1p3j37J45J9o4J9
$$ plain form
6264 22 57 34 -4 -104 -29 -57 35 -76 -40 -118 85 -40 77 -20 -20 -14 -15 -17 -23 -99 -102 -42 -52 -72 -190 -65 35 125 -53
6293 -53 -41 -162 104 -55 16 73 -101 -35 67 -110 76 -17 36 63 137 76 -117 -47 -42 -30 62 -57 35 -26 -142 -8
6319 -8 14 -44 4 -121 4 -38 -91 -54 -152 -8 -59 27 -21 -68 114 13 11 -5 -55 81 -245 -51 -1 -70 5 23 -90
6346 -90 -76 -71 -30 -51 10 35 67 4 62 -2 -8 37 74 100 152 -135 -14 -73 -179 17 -4 80 34 30 -53 -44 113 -95 30
6375 30 -34 70 28 -16 86 43 -124 -10 -97 -36 64 109 50 -48 183 -33 238 7 146 104 19 10 46 -16 -51 104
6401 104 -17 3 166 75 -7 219 25 123 -92 -73 73 -1 -96 -93 47 -48 -17 -28 -150 -89 -48 182 -3 -27 16
6426 16 13 -33 32 29 -13 119 -31 59 -68 -19 208 -87 -46 168 -61 93 -23 -50 36 57 -117 -38 -96 9 34 -214
6452 -214 100 66 44 2 30 87 16 -71 -61 -39 36 -187 -72 37 26 67 30 13 -47 59 78 -21 5 42 90 38 141
$$ packed form
6264B2L5k3l8j00P5k8R2j11L6p8K03j25J17r7%Ojkop6lO0j0k0j18J25J00R0j78
6293e3J2j21K66j59P1N7j74O6J02j77J86r3N3K7P4o1j93P0NJ2R2j19R2o1j16J34
6319hK2n8M8j25J25m2n3L7r8J44n1Q6m8m7J82j01kj6n0J36l26J94N0o9P5J8j13
6346i0J4NM1k1O1K5L2o3N8o4oM5L7K6N2k87J21n9j06J96k1Q4m6mq3RJ57k08J25
6375C0o4J04m2m4J02m3j67J14q7O1J00M5n9r8K31k16K71k31J39m2q5rL6o2l5J55
6401A04j21K0J63r1q2K26j94R8k15J9J46p4r5LJ40r5L1j1j22O1M1K30j85k4M3
6426A6lm6O5lm2J32j50R0j27M9K27k95M1K14k29J54j16k7Q6K1j74P9n8J05K5k48
6452b14L14l4k2m2K8N7p1q7J0K2P5k23J15J09j1M1l7j7o0J06J9r9K6L7M8n2J03
$$ plain form
6479 141 -56 11 61 -89 51 144 202 -39 55 -40 -61 6 -84 -50 0 -11 35 -36 -64 138 135 -78 2 51 12 8 13 8 17
6508 17 86 168 84 84 38 84 -109 -39 -9 51 199 104 159 -34 -57 -88 21 167 100 -71 53 87 -4 -37 -31 70 -106
6535 -106 42 -28 -171 -69 -71 -93 -13 -62 -74 -96 116 91 70 43 -98 -69 -25 -39 39 57 -11 45 42 113 -8 92 115
6562 115 -79 -158 -77 124 -12 15 59 -5 -27 50 -171 138 -51 -10 -121 -227 -17 -102 -97 86 125 -54 -58 3 -163
6587 -163 -33 -17 90 163 49 16 171 -161 -129 43 65 113 51 -92 16 85 117 52 -57 112 95 51 4 -2 76
6612 76 -98 56 103 -179 -29 107 -34 26 -39 1 116 8 -156 2 13 -24 -33 -57 125 37 -57 35 33 -152 -109
6637 -109 -99 2 95 -76 126 36 60 -43 1 -78 7 -44 134 -64 -36 163 20 -120 -63 44 -173 -66 145
6660 145 -18 -91 -6 -48 46 -91 -34 -94 -50 137 -23 21 -76 7 -112 15 72 -79 84 -16 0 -56 43 40 115 -151
$$ packed form
6479A41j97O7N0j50J40R3N8k41R4r5k1O7r0L4N0j1M6p1k8K02lk13Q0M9l9mNnR
6508A7O9Q2q4%m6M6j93P0L0O0J48r5N5j93k3l1J09J46o7j71J24L4r1l3OJ01j76
6535a06J48p0j43J02kk2Q0m9j2k2K12k5k1k7j41K9M4j4P8J8o8N6lP1j21J00K3
6562A15j94p9Q1K01j36K7M4o4k2P7k21L09j89M1j11j06K10q5NJ83L9j79mO1j66
6587a63J30J6J07P3j14l3J55l32L2J72K2M8o2j43J08O9L2o5j09J69j7m4m7oP8
6612G6j74J54M7k82J50J36j41O0o5M0J15j08j64J58J1l7rk4J82q8r4R2kj85M3
6637a09J0J01R3j71K02r0K4j03M4p9Q5n1J78j98K8J99j43j40N7J07k17J07K11
6660A45j63p3Q5m2R4j37N7o0M4J87j60M4r7Q3j19J27N7j51J63j00J6n6R9lP5k66
$$ plain form
6686 -151 -46 12 45 16 87 87 19 147 -136 -83 -106 167 -28 27 67 -11 87 4 14 -19 4 -14 174 123 16 15 -116
6713 -116 2 37 5 -69 20 117 52 -38 -14 -244 -62 51 25 62 120 -36 16 50 52 43 51 3 -54 25 -67 112 -236 71
6741 71 121 -177 -23 -85 -9 -49 97 9 -159 57 81 79 79 -108 -90 -172 -117 66 -41 97 146 32 -41 13 24 39
6767 39 5 86 175 -34 68 -88 116 -143 -48 68 3 -30 -66 63 32 77 13 17 172 -57 -2 -1 -10 62 -179 -9
6793 -9 -30 -45 -62 45 -37 12 -141 52 -149 -110 -82 -35 -62 150 -22 66 -94 126 -30 -189 -83 72 116 -111
6817 -111 -11 -169 22 91 243 19 -1 -7 -48 70 117 -103 90 62 21 -143 -7 9 8 27 25 13 -11 15 15 52 0
6844 0 -16 -23 -57 43 20 -31 -15 -52 57 -82 0 -36 13 -64 36 87 50 -75 10 104 58 135 183 -24 1 -14 -43 -20
6872 -20 61 -73 -1 14 -6 -17 -126 -58 43 28 -129 -4 27 3 -2 -41 -47 6 -78 -72 22 -67 -184 112 31 83 44 16
$$ packed form
6686a51J05N8L3k9P1%o8J28k83N3k3K73j95N5M0p8R8q3J0l3K3j8J88n1j07jj31
6713a16J18L5l2p4Q9R7o5r0K4k30J82J13k6L7N8j56N2L4KrQm8n7P9r2J79l48L07
6741G1N0k98J54o2P6m0J46q8j68K16K4k%j87J8q2N5J83j07J38M9j14p3N4J1J5
6767C9l4Q1Q9k09J02j56K04k59R5J16o5l3l6J29l1M5o4MJ55k29N5JrP2k41J70
6793ik1j5j7J07q2M9j53J93k01L9K8M7k7K12j72Q8j60K20j56j59J06J55M4k27
6817a11J00j58J91O9J52k24k0om1J18M7k20J93k8m1j64J36J6jJ9kj2k4K6%L7n2
6844@j6pl4J00k3n1J6l7J09j39Q2l6M9p7J00N1l7j25Q5R4m6P7M8k07K5j5k9K3
6872b0Q1j34P2J5k0j1j09O8J01j5j57J25L1k4nl9oN3q4OR4q9j17K96q1N2l9k8
$$ [...]
8191H6
##END NTUPLES=NMR FID
##END=
