##TITLE=1H_DE-32_oil
 CDCl3
 64 sc, 
 20.2.2024
##JCAMPDX= 6.0         $$ Bruker NMR JCAMP-DX V2.0
##DATA TYPE= NMR FID
##DATA CLASS= NTUPLES
##ORIGIN= UXNMR, Bruker Analytische Messtechnik GmbH
##OWNER= root
$$ XWIN-NMR		Version 3.5
$$ Tue Feb 20 13:57:25 2024 Russian Standard Time (UT+4h)  she@DPX200
##.OBSERVE FREQUENCY= 200.1313
##.OBSERVE NUCLEUS= ^1H
##.DELAY= (6, 6)
##.ACQUISITION MODE= SIMULTANEOUS
##.ACQUISITION SCHEME= undefined
##.AVERAGES= 64
##.DIGITISER RES= 18
##SPECTROMETER/DATA SYSTEM= spect
##.PULSE SEQUENCE= zg30
##.SOLVENT NAME= CDCl3
##.SHIFT REFERENCE= (INTERNAL, CDCl3, 0, 15.7039)
##AUDIT TRAIL= $$ (NUMBER, WHEN, WHO, WHERE, WHAT)
$$ ##TITLE= Audit trail, XWIN-NMR		Version 3.5
$$ ##JCAMPDX= 5.01
$$ ##ORIGIN= Bruker BioSpin GmbH
$$ ##OWNER= she
$$ F:/spectra/data/she/nmr/H-F/1/audita.txt
$$ ##AUDIT TRAIL=  $$ (NUMBER, WHEN, WHO, WHERE, WHAT)
(   1,<2024-02-20 13:56:07.81 +0400>,<she>,<DPX200>,
      <continue with go, POWCHK disabled, PULCHK disabled
       configuration hash MD5:
       00 E9 B6 7A A2 85 ED C7 34 08 36 98 17 FE 4E 26
       data hash MD5: 16K
       73 84 54 19 02 46 9F 01 77 9E AA 23 BB 43 C3 84>)
$$ ##END=
$$ 
$$ hash MD5
$$ 62 74 59 D0 85 52 54 D8 FB F3 41 3A AF CA 8C 92
##$RELAX= 
##$RELAX= 
##$RELAX= 
##$RELAX= 
##$RELAX= 
##$RELAX= 
$$ Bruker specific parameters
$$ --------------------------
##$DU= <F:/spectra>
##$EXPNO= 1
##$NAME= <H-F>
##$PROCNO= 1
##$TYPE= <nmr>
##$USER= <she>
##$AMP= (0..31)
100 100 100 100 100 100 100 100 100 100 100 100 100 100 100 100 100 100 
100 100 100 100 100 100 100 100 100 100 100 100 100 100 
##$AQSEQ= 0
##$AQ_mod= 1
##$AUNM= <au_zg>
##$AUTOPOS= <>
##$BF1= 200.13
##$BF2= 200.13
##$BF3= 200.13
##$BF4= 200.13
##$BF5= 200.13
##$BF6= 200.13
##$BF7= 200.13
##$BF8= 200.13
##$BYTORDA= 1
##$CFDGTYP= 0
##$CFRGTYP= 5
##$CHEMSTR= <none>
##$CNST= (0..31)
1 1 145 1 1 1 1 1 1 1 1 1 1 1 1 1 1 1 1 1 1 1 1 1 1 1 1 1 1 1 1 1 
##$CPDPRG= <>
##$CPDPRG1= <>
##$CPDPRG2= <>
##$CPDPRG3= <>
##$CPDPRG4= <mlev>
##$CPDPRG5= <mlev>
##$CPDPRG6= <mlev>
##$CPDPRG7= <mlev>
##$CPDPRG8= <mlev>
##$CPDPRGB= <>
##$CPDPRGT= <>
##$D= (0..31)
0 1.2 0 0 0 0 0 0 0 0.06 0 0.03 0 0 0 0 0.0002 0 0 0 0 0 0 0 0 0 0 0 0 
0 0 0 
##$DATE= 1708422695
##$DBL= (0..7)
120 120 120 120 120 120 120 120 
##$DBP= (0..7)
150 150 150 150 150 150 150 150 
##$DBP07= 0
##$DBPNAM0= <>
##$DBPNAM1= <>
##$DBPNAM2= <>
##$DBPNAM3= <>
##$DBPNAM4= <>
##$DBPNAM5= <>
##$DBPNAM6= <>
##$DBPNAM7= <>
##$DBPOAL= (0..7)
0.5 0.5 0.5 0.5 0.5 0.5 0.5 0.5 
##$DBPOFFS= (0..7)
0 0 0 0 0 0 0 0 
##$DE= 6
##$DECBNUC= <off>
##$DECIM= 32
##$DECNUC= <off>
##$DECSTAT= 4
##$DIGMOD= 1
##$DIGTYP= 9
##$DL= (0..7)
0 120 120 120 120 120 120 120 
##$DP= (0..7)
150 150 150 150 150 150 150 150 
##$DP07= 0
##$DPNAME0= <>
##$DPNAME1= <>
##$DPNAME2= <>
##$DPNAME3= <>
##$DPNAME4= <>
##$DPNAME5= <>
##$DPNAME6= <>
##$DPNAME7= <>
##$DPOAL= (0..7)
0.5 0.5 0.5 0.5 0.5 0.5 0.5 0.5 
##$DPOFFS= (0..7)
0 0 0 0 0 0 0 0 
##$DQDMODE= 0
##$DR= 18
##$DS= 0
##$DSLIST= <SSSSSSSSSSSSSSS>
$$ [...]
##$SUBNAM2= <"">
##$SUBNAM3= <"">
##$SUBNAM4= <"">
##$SUBNAM5= <"">
##$SUBNAM6= <"">
##$SUBNAM7= <"">
##$SUBNAM8= <"">
##$SUBNAM9= <"">
##$SW= 18.0517328524113
##$SWIBOX= (0..15)
0 0 2 0 0 0 0 0 0 0 0 0 0 0 0 0 
##$SW_h= 3612.71676300578
##$TD= 16384
##$TD0= 1
##$TE= 0
##$TE2= 300
##$TE3= 300
##$TEG= 300
##$TL= (0..7)
0 120 120 120 120 120 120 120 
##$TP= (0..7)
150 150 150 150 150 150 150 150 
##$TP07= 0
##$TPNAME0= <>
##$TPNAME1= <>
##$TPNAME2= <>
##$TPNAME3= <>
##$TPNAME4= <>
##$TPNAME5= <>
##$TPNAME6= <>
##$TPNAME7= <>
##$TPOAL= (0..7)
0.5 0.5 0.5 0.5 0.5 0.5 0.5 0.5 
##$TPOFFS= (0..7)
0 0 0 0 0 0 0 0 
##$TUNHIN= 0
##$TUNHOUT= 0
##$TUNXOUT= 0
##$USERA1= <user>
##$USERA2= <user>
##$USERA3= <user>
##$USERA4= <user>
##$USERA5= <user>
##$V9= 5
##$VALIST= <valist>
##$VCLIST= <CCCCCCCCCCCCCCC>
##$VD= 0
##$VDLIST= <DDDDDDDDDDDDDDD>
##$VPLIST= <PPPPPPPPPPPPPPP>
##$VTLIST= <TTTTTTTTTTTTTTT>
##$WBST= 1024
##$WBSW= 4
##$XGAIN= (0..3)
0 0 0 0 
##$XL= 0
##$YL= 0
##$YMAX_a= 180929
##$YMIN_a= -279250
##$ZGOPTNS= <>
##$ZL1= 120
##$ZL2= 120
##$ZL3= 120
##$ZL4= 120
##$ABSF1= 10
##$ABSF2= 0
##$ABSG= 5
##$ABSL= 3
##$ALPHA= 0
##$AQORDER= 0
##$ASSFAC= 0
##$ASSFACI= 0
##$ASSFACX= 0
##$ASSWID= 0
##$AUNMP= <proc_1d>
##$AZFE= 0.1
##$AZFW= 0.1
##$BCFW= 1
##$BC_mod= 2
##$BYTORDP= 1
##$COROFFS= 0
##$CY= 11.3945322036743
##$DATMOD= 1
##$DC= 2
##$DFILT= <>
##$DTYPP= 0
##$F1P= 15.7292609196834
##$F2P= 12.9074282941183
##$FCOR= 0.5
##$FTSIZE= 0
##$FT_mod= 4
##$GAMMA= 1
##$GB= 0.15
##$INTBC= 1
##$INTSCL= 1
##$ISEN= 128
##$LB= 0.24
##$LEV0= 0
##$LPBIN= 0
##$MAXI= 10000
##$MC2= 0
##$MEAN= 0
##$ME_mod= 0
##$MI= 1.114404
##$NCOEF= 0
##$NC_proc= 0
##$NLEV= 6
##$NOISF1= 3.799351
##$NOISF2= 2.8
##$NSP= 1
##$NTH_PI= 0
##$NZP= 0
##$OFFSET= 15.70392
##$PC= 1
##$PHC0= -24963.29
##$PHC1= 20.25264
##$PH_mod= 1
##$PKNL= yes
##$PPARMOD= 0
##$PSCAL= 0
##$PSIGN= 0
##$REVERSE= no
##$SF= 200.130013532006
##$SI= 16384
##$SIGF1= 3
##$SIGF2= 2
##$SINO= 400
##$SIOLD= 16384
##$SREGLST= <1H.CDCl3>
##$SSB= 0
##$STSI= 0
##$STSR= 0
##$SW_p= 3612.71676300578
##$SYMM= 0
##$S_DEV= 0
##$TDeff= 0
##$TDoff= 0
##$TI= <>
##$TILT= no
##$TM1= 0
##$TM2= 0
##$TOPLEV= 0
##$USERP1= <user>
##$USERP2= <user>
##$USERP3= <user>
##$USERP4= <user>
##$USERP5= <user>
##$WDW= 1
##$XDIM= 8192
##$YMAX_p= 0
##$YMIN_p= 0
$$ End of Bruker specific parameters
$$ ---------------------------------
##NTUPLES= NMR FID
##VAR_NAME=  TIME,          FID/REAL,        FID/IMAG
##SYMBOL=    X,             R,               I
##VAR_TYPE=  INDEPENDENT,   DEPENDENT,       DEPENDENT
##VAR_FORM=  AFFN,          ASDF,            ASDF
##VAR_DIM=   8192,          8192,            8192
##UNITS=     SECONDS,       ARBITRARY UNITS, ARBITRARY UNITS
##FACTOR=    0.0002768,     1,               1
##FIRST=     0,             0,               0
##LAST=      2.2672688,     0,               0
##MIN=       0,             -279250,         0
##MAX=       2.2672688,     180929,          0
$$ Real data points
##PAGE= N=1
##DATA TABLE= (X++(R..R)), XYDATA
0 0 0 0 0 0 0 0 0 0 0 0 0 0 0 0 0 0 0 0 0 0 0 0 2 -18 60 -64 64 -64 64 -65 70 -102 123 -129 132 -158 185 -195
38 -195 222 -251 271 -305 338 -376 414 -457 503 -555 612 -674 745 -819 903 -996 1105 -1223
56 -1223 1359 -1517 1704 -1917 2189 -2522 2946 -3513 4305 -5496 7467 -11377 22003 -128664
70 -128664 -279250 -18678 91395 17833 70634 180929 80833 11061 86054 86137 -15882
81 -15882 13477 53816 -65668 -154940 -87822 -93803 -155912 -66998 51640 11517 -24634 54614
93 54614 85055 23039 45766 122951 80711 985 31168 35304 -48512 -53565 7601 -22678 -67879
106 -67879 -28690 -15645 -67334 -64945 -15501 -21672 -22337 44056 61376 13596 34986 86964 53360
119 53360 12131 41355 44629 -11101 -39066 -34546 -57003 -74689 -45724 -20555 -25879 -12772 12290
132 12290 7654 5425 34920 46359 27983 24812 31824 13462 -11160 -6845 -1942 -14401 -11631
145 -11631 1436 -14221 -31198 -16753 -7687 -13785 -4997 6656 4715 5074 14115 12842 8179 20022
159 20022 24340 8614 528 2070 -10938 -25168 -17140 -10549 -16965 -12664 -2801 2118 4792 10787
173 10787 14565 15321 16782 15540 4764 -4890 -4292 -5440 -14130 -16095 -9237 -8812 -10117 -5771 -353
188 -353 -98 3247 10987 11261 8557 11831 13017 9820 7863 6517 1855 -2455 -4566 -10565 -16989 -17880
204 -17880 -17408 -18660 -14457 -7314 -2422 2649 10872 18150 22168 24606 20387 17309 15936 8455 -4527
219 -4527 -11924 -10821 -15923 -23252 -21632 -17220 -16320 -12813 -4777 -257 4297 10510 15786 16132 17274 21670
235 21670 18401 11433 11936 10523 -1362 -9025 -9698 -15527 -23286 -22377 -18899 -20956 -17343 -6128 880
250 880 3046 11960 22753 21266 19358 22941 19927 10918 6984 1928 -7209 -11615 -10847 -16938 -22279
265 -22279 -16520 -10794 -13191 -12445 -1779 2906 1648 7663 14962 14775 13389 16480 15599 10903 9809
280 9809 5911 -3434 -8271 -7440 -12781 -19762 -17158 -12518 -12615 -9209 -3095 1907 3936 9944 13470 11760
296 11760 10932 13767 9481 3503 2746 1982 -3923 -5944 -6138 -7418 -8248 -6591 -6722 -8018 -3888 -234
312 -234 -1936 -3113 4668 6667 4342 5259 9392 7289 5024 4038 1835 -1162 -948 -2153 -5816 -6418
328 -6418 -2946 -3104 -6273 -2065 2355 -149 -2091 3172 2395 -956 -371 1511 -477 -1250 1852 870
344 870 -1010 1078 5047 2240 802 3463 2493 -1213 -1370 -1455 -4330 -4335 -1373 -3081 -5551 -2532 1157
361 1157 -1460 -2308 1414 2517 1309 3429 4726 2784 3196 5644 3487 1804 2556 2027 -2644 -3276
377 -3276 -2639 -5928 -9253 -7384 -4668 -5100 -4198 -1981 478 3416 6635 6644 6531 7529 9338 6014 3933
394 3933 2701 236 -2236 -3393 -4893 -8492 -9153 -6706 -6575 -6923 -4000 -1079 -40 2864 5284 6895
410 6895 6554 9190 9279 7187 6666 4723 1319 -1778 -1655 -3948 -9295 -9571 -7505 -8357 -9078 -6026 -2849
427 -2849 -1810 2339 5721 6672 7022 9889 9918 6025 5991 5744 543 -1887 -2096 -4809 -7817 -7006 -6606 -8457
445 -8457 -7715 -4036 -2070 -2003 217 4232 4441 5557 7368 7849 6586 5446 5304 2821 694 -236 -3882
462 -3882 -5855 -4527 -4499 -7130 -6949 -4966 -2635 -1247 424 1354 2652 5149 6687 4123 4378 4617 3178
479 3178 1844 2039 1139 -2176 -3209 -2289 -3194 -5145 -4858 -2977 -4378 -2493 -1805 -236 333 3204 3422
496 3422 1623 2486 3654 3524 937 3056 1933 -126 220 485 -2271 -4209 -1991 -182 -3709 -4116
512 -4116 -975 -2197 -2168 -474 -390 -1151 1904 3715 2000 1000 4146 2896 -113 1397 4320 990
528 990 -2278 -250 832 -3062 -3701 -414 -1784 -3505 -1693 -1745 -3180 -1863 2334 1001 -548 2184
544 2184 4644 2660 3252 4839 3322 1379 1886 2043 -2464 -4109 -1822 -3090 -6145 -4505 -1992 -4542
560 -4542 -4225 -1118 -638 602 1544 4393 3805 3683 4780 3913 2257 2832 3335 64 -2681 -1183 -1906
577 -1906 -5212 -6051 -3407 -3398 -5123 -2392 -979 -720 1691 3627 4430 4872 5730 5685 4105 2707 2472 1161
595 1161 -475 -1346 -3157 -4645 -5778 -5151 -4871 -4773 -2648 -1059 -597 -196 1753 3528 3419 3028 4828
612 4828 5255 3306 1600 1824 1313 -1620 -2402 -2257 -3644 -4519 -4418 -5428 -4315 -2563 -496 -755 1065
629 1065 3438 3519 2934 3472 5239 4271 2155 2370 1996 -622 -2051 -1600 -2341 -4338 -3204 -3660 -3345 -3618
647 -3618 -1194 -1210 -1265 1417 2646 2355 2827 4313 3209 2485 3252 3581 682 -1138 223 -1011 -3510
664 -3510 -2540 -2386 -2920 -2911 -1670 -1218 -1561 397 1111 840 1319 3578 1561 1194 1745 2943 1956 377 949
683 949 90 -458 -1195 -1658 -2241 -2637 -2234 -1482 -1773 -1562 -738 -82 559 378 1138 1246 2151 2405 1315 1797
703 1797 2819 1416 32 618 -491 -714 -1480 -1113 -1490 -2312 -2638 -1891 -1435 -1333 -445 -62 690 1688 2566
722 2566 1348 3152 3951 2000 768 1416 629 -1151 -969 -670 -1235 -2423 -2264 -2186 -2403 -2216 -1236 -1229 -968
741 -968 1042 1544 1170 2675 3690 3136 2755 2905 2185 656 743 522 -1202 -3492 -2458 -2550 -3708 -3322
759 -3322 -3227 -2100 -1442 -368 529 811 2479 3232 2713 2960 3174 2508 1509 1169 638 -362 -1939 -1815 -2407
778 -2407 -2416 -3609 -3008 -2825 -1801 -1000 -454 765 1946 2477 3206 3777 3651 3303 2102 2002 1628 -860 -1410
797 -1410 -2098 -2649 -3773 -3279 -2388 -2463 -2040 -1670 -902 463 584 699 2155 2129 2439 2584 2145 3506 1496
816 1496 321 -424 41 -1939 -3439 -2659 -2936 -2873 -2907 -1970 -2229 -219 957 1094 1093 2553 3070 2823 2126
835 2126 2573 1940 1083 -173 371 -1478 -1113 -1317 -1332 -1687 -2217 -1147 -1923 -1368 -1067 -19 677 672 1015 1742
855 1742 2311 2162 1960 1500 1396 803 234 -848 -159 -2058 -2275 -2516 -2185 -1455 -1493 -969 -626 -198 819
874 819 931 536 763 664 1656 905 1828 429 1220 817 -520 -170 -1114 -1159 -1335 -1735 -1891 -2156 -1740 -1389
894 -1389 -653 -476 -702 1117 544 1015 1330 1590 979 1027 1171 1824 342 54 183 -198 -1309 -2178 -1178
913 -1178 -1897 -808 -762 -831 -748 -132 -231 2 1093 1850 1121 1534 2101 2764 962 912 608 121 407 -1022
933 -1022 -1024 -2097 -1440 -1411 -1330 -1476 -1104 -379 169 953 657 1809 1707 2299 1864 1747 1696 1597 1381 106 -703
954 -703 -1293 -1253 -1266 -1986 -2649 -1349 -1573 -870 -449 1127 515 1180 1156 1302 2421 1497 1961 1647 1295 296
974 296 -414 -501 -1754 -1425 -1471 -2025 -2118 -1559 -749 -1342 -551 135 490 1657 2002 1418 1584 2177 2546 1656 369
995 369 894 -616 -1226 -768 -1120 -1655 -2484 -1743 -1586 -2048 -127 -1008 -409 1011 1244 1343 1627 1769 1991 1279
1015 1279 951 1161 362 -352 -353 -1145 -1583 -1578 -1791 -1587 -1749 -925 -978 -705 3 1203 663 1253 1376 1820 1151
1036 1151 502 451 895 -159 -475 -261 -652 -1448 -1278 -1173 -1501 -704 -571 -395 -259 -287 163 425 705 1730
1056 1730 1671 1468 650 1373 1104 8 -24 138 -1260 -1105 -448 -1155 -1233 -1120 -380 -938 -1188 -642 714 568
1076 568 710 613 1767 1172 1095 928 -51 874 -1 70 -802 -315 107 -1316 -1389 -1466 -1579 -1285 -589 -628 -1490
1097 -1490 -808 704 382 -266 673 1407 1348 635 1160 412 -55 -331 -381 -739 -547 -74 -737 -1166 -1540 -632
1117 -632 -1178 -624 -274 334 -197 897 1103 452 1288 1139 1099 749 386 916 -561 -999 -928 -1104 -2369 -1608
1137 -1608 -1018 -1660 -1255 -120 195 -385 1388 1021 1260 874 1844 1467 1489 1150 1486 756 -322 -296 -684
1156 -684 -1719 -591 -916 -1815 -1439 -893 -543 -634 31 1277 759 814 1270 1864 1449 1218 1316 486 572 -408
1176 -408 -585 -1359 -829 -1500 -1696 -1633 -1033 -808 -342 -303 169 821 979 775 945 1542 1314 1153 -273 612
1196 612 136 -285 -559 -833 -1383 -1200 -1010 -1809 -1002 -1020 461 164 279 -93 912 1254 492 650 1365 919
1216 919 646 978 36 953 190 -489 -634 -915 -376 -1441 -1238 -373 -748 -383 -348 526 438 765 632 674 1171
1237 1171 565 359 1128 220 263 -207 -92 16 -853 -1121 -1182 -350 -1208 -819 -482 6 587 11 518 765
1257 765 760 682 1026 706 1255 496 448 675 33 -535 -569 -929 -386 -671 -828 41 -907 -500 -267 -200 488 573
1279 573 220 309 1440 157 1109 419 184 392 346 -882 -601 -219 -537 -1057 -374 -727 -1272 -215 -59
1298 -59 433 828 1064 742 810 1279 987 722 1076 268 -312 320 -602 -1071 -723 -327 -33 -1717 -1108 -356
1318 -356 216 -242 -757 139 190 518 539 -11 991 677 1037 642 -136 -99 130 -402 -779 -1588 -1226 -1033 -1224
1339 -1224 -684 -1217 -725 730 538 229 704 562 461 609 1283 657 796 -267 76 -385 -957 -685 -839
1358 -839 -498 -1153 -777 -601 -579 -587 164 651 12 -172 880 1076 1601 1398 272 863 429 -502 473 166
1378 166 -599 -1169 -227 -896 -849 -583 -66 282 225 386 -420 249 252 904 1059 442 224 788 519 -458 215
1399 215 -858 -874 -407 -361 -947 -370 -659 -191 159 -511 168 249 -291 555 514 -152 505 1269 959 392 419
1420 419 743 -199 -884 -636 -442 -1187 -642 -839 -1440 -869 -1056 -12 -491 -301 206 1164 470 501 647 520
1440 520 342 328 207 -71 -92 -1183 -1177 -345 -1098 -527 -597 7 -591 705 -520 929 705 257 -4 1108
1460 1108 822 853 600 1022 572 -239 -107 -859 -1181 -344 -793 -1015 -290 -133 54 2 -204 -186 356 18 307
1481 307 118 229 678 221 -682 419 -63 -753 151 -44 -292 -757 -487 -530 28 -595 -354 -113 153 640
1501 640 466 545 325 825 347 248 421 225 764 528 255 129 -641 -765 -812 -823 -691 122 -180 -59 -34 190
1523 190 -153 303 692 660 177 47 203 458 263 469 -601 -796 48 -760 -785 -832 -459 -1038 -272 76 124
1544 124 -264 216 525 692 269 270 273 168 -76 -309 -296 -103 -371 -487 -715 -810 -153 -827 17 465 -526 371
1566 371 -137 279 615 1 1069 195 237 842 1081 298 -74 -103 -200 -782 -230 -811 -364 -898 -120 -686 -543
1587 -543 -556 183 449 442 521 675 650 475 793 -327 660 526 459 -318 -591 -104 -340 -962 302 535 -131
1608 -131 -267 -6 362 378 488 -321 -281 -196 777 422 582 474 -55 541 -229 110 363 495 -622 -4 -45
1629 -45 -458 -882 -234 -384 -40 89 238 552 1010 390 245 237 186 1089 581 281 -872 -912 41 -246 -1097
1650 -1097 -57 62 -924 554 361 -217 -421 571 36 339 761 407 284 146 302 610 -398 72 63
1669 63 -17 -352 -427 -627 -95 -407 58 -26 -136 137 552 503 535 418 367 346 254 712 213 346 695 -225 -797
1692 -797 -165 -586 -92 -544 -1252 -50 85 238 51 -339 -189 510 722 483 147 245 -202 592 391 125
1712 125 -1101 -743 -877 -598 -501 -165 -837 -2 -415 91 -175 -164 876 667 790 -83 -268 765 551 -435
1732 -435 -145 -335 -365 117 -451 393 -70 -363 -392 -397 -334 -1128 -295 -185 506 -301 -589 683 -14 733 -67
1753 -67 95 -107 133 48 -218 -287 -407 -824 -755 -313 -461 31 108 390 120 209 127 445 438 252 -575 -40 -38 -728
1777 -728 404 -25 -218 55 272 -101 -421 -414 -455 250 -470 -71 693 -128 513 397 758 782 945 -31 -642
1798 -642 658 285 -359 -536 -379 613 -44 320 -1394 -637 -574 -377 -227 106 30 357 100 699 -81 145
1818 145 467 -280 476 -138 659 -346 -526 -740 -44 -450 -597 -86 -384 -118 344 160 601 -6 222 621
1838 621 -97 1031 441 63 75 63 844 241 -288 -956 38 -506 -334 -639 18 -62 -453 92 -92 280 384
1859 384 33 463 601 337 314 -185 366 74 893 233 -255 -243 -276 -227 21 -430 -179 -438 -550 -40 -199
1880 -199 -1083 157 805 536 1066 70 585 416 -49 -819 -244 -612 -655 382 326 22 -20 -165 -1004 127
1900 127 -171 761 -11 123 695 -330 450 455 1088 -229 -289 226 -882 576 -211 -767 -385 -373 719 -545
1920 -545 -231 70 289 864 558 31 -22 752 398 -435 -199 227 -311 -70 -237 -778 587 -167 -502 -164
1940 -164 -1181 -364 -152 -584 -89 -623 -369 -166 715 871 -66 570 300 -34 232 103 401 -145 -386 -188
1960 -188 -249 -903 -105 -593 -365 -299 -242 -541 -226 -398 422 334 -269 162 362 769 49 -469 839 461 99
1981 99 265 -143 -167 -680 157 -396 -509 -180 402 253 -6 539 608 54 415 -481 31 200 -555 339 -142
2002 -142 7 -691 -310 -193 -96 -12 -399 230 74 -375 -58 135 481 606 22 549 -126 195 468 101 186
2023 186 -165 -401 -200 -263 -409 -29 82 451 -46 187 -41 101 142 709 40 191 183 144 180 742 -448 407
2045 407 137 659 -409 -85 -746 -907 -305 206 166 7 153 0 -117 23 247 220 313 -565 454 125
2065 125 -127 243 693 -626 -153 54 -23 -522 -498 -696 -134 -307 -363 67 -44 692 560 -214 780 165 -270
2086 -270 333 -103 448 -235 720 -916 -359 -230 -636 147 -116 -310 -655 -629 -139 299 672 245 301 71
2106 71 185 -103 -489 31 38 -266 174 -320 -208 159 592 192 -415 -716 -314 -264 236 335 675 -441 463
2127 463 818 -464 50 -132 227 -213 106 309 50 -818 -626 -372 -395 221 -31 -8 -575 -244 124 -370
2147 -370 -135 340 395 207 633 683 359 628 -77 58 -147 -351 -298 168 240 -709 -622 400 -382 -121 -499
2168 -499 103 439 146 -223 48 -425 883 267 178 490 -555 -92 20 307 -180 94 -319 -207 -61 -669
2188 -669 -381 41 -357 360 98 -265 -182 -185 -115 6 48 484 456 149 29 269 4 -529 -540 -428 -462 -315 -391
2211 -391 -501 -274 232 508 255 23 343 -126 -38 -29 33 297 480 -38 -83 352 -820 -497 298 -314 364
2232 364 -483 515 169 218 -477 743 159 189 236 425 -388 422 664 121 -541 28 437 744 213 37 204
2253 204 64 210 401 -770 362 346 372 -10 516 -184 100 237 -67 174 96 430 -164 498 -389 404
2273 404 -404 154 -285 8 155 -409 -209 -23 -173 483 587 -100 678 684 12 195 117 -29 -192 -131 -459
2294 -459 -362 174 81 -119 702 182 353 554 -55 -261 -810 -36 -669 461 -322 740 -67 301 777 -718
2314 -718 236 260 -197 -701 -274 -380 -411 -503 -167 -350 -619 -638 138 -48 -85 890 -326 497 -51 -406 134
2335 134 -197 -452 -96 436 535 -707 -430 254 -22 -98 -560 -129 -454 -201 541 -173 199 182 -85 -895 359
2356 359 360 241 330 118 138 286 240 -58 -71 -454 453 -392 95 -333 181 381 263 872 -169 -92 626 471
2378 471 -879 -331 -324 127 -725 38 -275 -418 -75 -304 212 -488 27 399 172 256 112 293 -18 145 11
2399 11 1015 462 264 -187 -282 775 298 462 -320 -328 285 744 -267 532 -290 380 487 -18 352 405 368
2420 368 -294 -300 710 335 269 -130 -154 -440 575 485 -636 -360 -263 -15 -461 -194 608 355 98 756 -215
2441 -215 307 -258 -190 233 -22 551 13 31 217 -686 -514 159 -321 -326 264 -924 123 -26 -69 651 -97
2462 -97 362 -547 406 995 9 223 188 221 275 -487 -358 433 -229 -453 -53 841 -513 -1008 -863 87 643
2483 643 -236 -238 77 -59 24 324 -549 138 412 -124 522 -355 414 -124 -256 255 -619 -256 71 359 -72
2504 -72 58 -90 -517 424 -63 -117 325 252 -116 451 -338 -704 -100 -643 -904 -967 314 -343 112 62 -618
2525 -618 321 101 628 -148 -723 184 -335 214 164 -382 -144 651 278 420 29 7 362 144 162 -262 -231
2546 -231 440 -261 -541 -69 -88 246 359 391 3 238 4 55 316 53 -336 631 322 -193 -395 -277 -126
2567 -126 538 301 -340 -1160 -601 -173 199 898 -370 367 -151 -236 227 601 -279 -711 -302 -142 329 -9
2587 -9 -789 -419 744 -68 795 90 -192 117 -578 233 573 -205 455 369 -38 -172 125 433 153 112 303
2608 303 146 103 289 54 138 -151 409 -177 802 -119 -110 426 279 -213 -111 -82 558 180 39 444 81 -126
2630 -126 -237 610 273 -16 -115 152 -202 -60 -822 -264 -55 82 516 895 -84 67 -198 -114 544 398 135
2651 135 541 76 115 -294 -1035 -311 -811 -41 -36 -479 424 399 124 -85 -769 906 562 -316 -99 -11 -19 309
2673 309 517 69 1075 -492 146 43 -287 852 -262 -72 -396 109 -559 403 -518 -372 -514 -92 545
2692 545 79 -265 -137 -467 -54 -270 -167 50 -403 -751 502 101 0 429 549 922 -797 367 -347
2711 -347 -97 253 91 -273 -21 19 -109 114 87 306 -122 -204 -22 -236 -583 593 -4 -129 633 559 110
2732 110 368 -206 -338 300 319 278 -645 -326 -418 -272 -204 452 309 -181 432 323 376 -158 407 269 -265 -72
2754 -72 291 417 96 523 -279 339 -16 -104 36 418 13 226 -313 -460 520 413 241 -82 763 175 -123
2775 -123 70 -254 -699 -238 -486 532 309 76 -281 -351 76 -216 -655 -552 478 309 -122 544 43 79
2795 79 578 202 -189 716 339 68 30 359 -37 -145 -21 -452 1 -27 57 -179 -314 72 -23 512 -58 -153
2817 -153 -437 -220 366 429 692 112 572 658 -394 336 395 415 1 111 -216 -147 28 37 -358 66 140 345
2839 345 210 249 -32 85 32 735 -489 -365 835 49 -17 -101 7 -103 -309 246 450 208 674 552 148
2860 148 -362 -176 -68 -261 213 286 76 -12 161 437 -726 -116 -265 -102 -300 -49 7 609 -422 -649
2880 -649 324 -340 -177 249 -696 505 -62 -230 65 229 387 -424 334 -336 49 -46 203 -186 -338 -486
2900 -486 594 54 -98 -428 -104 -529 -452 206 -441 -349 -444 158 273 -186 310 39 248 -335 -130 36 -284
2921 -284 -196 -394 -363 -300 315 129 22 262 382 361 999 -38 487 92 -569 324 33 339 -50 -240 483
2942 483 -291 -653 -85 -260 -185 -184 750 19 3 -52 478 275 343 397 146 -6 79 341 8 -106 -55 -200 -358
2965 -358 -11 -72 -391 -418 187 86 255 -47 -208 -222 -511 91 374 168 249 275 -49 75 15 -30 -179 497
2987 497 -178 -90 41 1416 259 -203 -430 478 -348 64 189 515 -369 -80 448 -312 -552 -551 442 391 90
3008 90 622 -449 -37 260 -416 -531 -117 -272 11 -375 246 -397 -189 -291 320 -103 -431 -34 -594 272
3028 272 247 1154 317 391 -538 442 -140 -930 -453 -488 -316 168 -407 100 701 303 25 -119 -396 193 552
3049 552 625 816 540 -567 -146 -14 154 -134 218 280 -155 -153 106 209 305 -8 -341 200 -261 107 27 -493
3071 -493 515 -570 738 -454 103 -175 -440 365 -190 295 13 -153 -383 -132 -327 -18 -106 178 -200
3090 -200 85 318 97 523 -51 -1267 403 1 -438 159 533 -437 -120 -40 -191 104 407 -300 -199 238
3110 238 518 347 494 201 166 -95 -436 -260 -168 -368 -629 822 -249 -688 69 -437 61 54 -45 107 47
3131 47 -481 -323 -546 463 39 157 -171 507 176 -76 -151 75 343 -574 251 -282 7 71 24 -270 -224
3152 -224 -497 -857 -73 671 211 -139 -341 -20 62 -438 61 -137 510 658 -363 -656 419 81 -252 104
3172 104 523 7 66 638 -2 12 -327 203 -424 -291 -64 -194 467 -332 257 -146 -564 -177 17 -215 -231
3193 -231 -222 -107 -616 777 127 -265 52 -460 -576 565 74 463 515 -5 -242 -322 76 24 -565 -240 -280
3214 -280 600 -245 -427 234 -46 545 -22 -210 242 122 242 246 524 551 -33 -518 404 602 274 565 -139
3235 -139 -620 266 -139 -145 896 122 819 549 82 -148 93 -398 508 118 -409 248 650 582 -609 -5
3255 -5 -39 -61 342 -405 49 760 1 586 -149 -324 352 36 436 -391 36 -493 139 94 150 -385 563 476
3277 476 -228 -341 740 -13 -768 174 -84 157 -18 23 -393 -97 130 666 170 -30 -339 -256 -51 42 502
3298 502 850 596 269 227 119 636 762 41 119 -193 -55 401 -82 1004 -52 485 -25 322 315 -62 90
3319 90 -49 338 -566 147 -374 595 302 -253 -49 770 -132 -536 57 91 387 -102 186 436 -519 -84 611
3340 611 8 237 -588 405 -114 -676 242 -661 49 -160 -289 236 -114 -6 -683 75 28 951 485 -98
3360 -98 -176 306 -179 221 171 -269 -553 -285 -286 -377 213 -494 -127 504 256 68 110 208 -78 444 -157 79 351
3383 351 479 48 -255 204 241 -132 28 -536 216 -717 83 -392 660 -184 -93 -369 -142 -290 -347 -6 32
3404 32 127 -19 -462 -293 -231 -547 76 -15 -105 -467 -317 -133 128 -47 -689 -40 303 844 39 -824 -663 -64
3426 -64 966 878 -35 256 -429 146 -142 -761 -113 353 -233 -74 -232 -141 160 317 363 897 119 313 -2
3447 -2 -168 440 497 -180 -205 409 74 -292 -122 151 29 -240 321 -98 129 179 436 184 703 282 -571 365
3469 365 88 356 -163 -389 201 -490 367 -641 299 916 62 -87 188 -408 -414 -557 -543 -364 -47 -66 349
3490 349 543 -307 -698 202 171 86 -143 -401 95 -254 269 245 -218 -125 192 -44 414 -168 -272 -594 -333
3511 -333 477 280 7 335 -214 -89 -177 -188 -1 361 427 -76 -192 -557 -65 -70 97 -463 -218 -232 -389 -563
3533 -563 716 44 174 993 -88 -41 -25 -697 124 -14 851 -328 533 570 257 -304 -520 525 860 483
3553 483 -17 219 397 740 205 178 256 -281 170 19 31 -422 -287 2 -61 145 -137 580 138 -650 336
3574 336 -468 -167 35 289 803 88 -115 -432 437 234 1136 331 195 57 -717 249 9 -683 -589 112
3594 112 -99 -16 217 361 -70 173 -273 -288 402 264 -462 -289 314 -82 193 513 482 231 110 800 -280
3615 -280 7 -382 126 48 111 -210 -144 99 387 400 -133 1199 -218 383 344 740 -150 -382 -123 -6 687
3636 687 -107 -188 -109 603 -530 -172 -327 -457 418 -16 -95 -344 -46 48 334 -1448 -914 107 -136 -39 -403
3657 -403 -506 191 -428 -257 -279 180 183 266 816 -282 81 517 360 335 -149 367 660 -162 -309 241 30
3678 30 -32 -86 455 -229 -174 -180 -708 285 -487 -8 -412 177 -170 -154 220 -67 377 126 -109 -326 -445 132
3700 132 -504 -545 33 211 -496 119 -600 584 103 -87 80 -500 165 -28 -22 477 19 256 -277 -415 128
3721 128 46 157 -555 -163 -120 -274 294 -228 -148 -735 -228 -438 64 615 -43 234 -203 194 557 59 70
3742 70 -852 -436 200 233 471 307 22 -84 -219 -397 260 -555 -438 266 -695 289 236 103 136 50 462 -281
3764 -281 -133 249 -10 -358 1081 352 -279 235 577 -133 -339 63 553 -319 410 136 -153 -328 -429 518
3784 518 10 641 -100 -583 -14 182 108 564 -384 -76 -395 101 -221 65 -201 -311 -279 36 -604 347 362
3805 362 -395 302 254 7 336 192 -106 -233 194 266 640 482 472 358 -132 18 33 188 100 317 -107 -299
3827 -299 191 235 -2 213 923 -549 -66 -400 54 -33 -16 -25 -147 -127 -94 -603 -570 151 -429 -284 262 414
3849 414 -791 -536 80 174 -65 508 292 161 584 343 58 507 414 57 205 204 -51 -172 -451 -769 -435
3870 -435 468 18 856 -124 -314 -420 157 -194 -222 -87 98 -113 65 207 624 472 -146 -297 -50 -101 349
3891 349 -187 -348 -467 -480 143 -228 40 -150 -369 234 18 26 -226 321 201 115 -504 283 441 349 -180 317
3913 317 465 309 451 81 -78 -276 103 294 91 -51 233 176 301 -716 -42 55 -678 -240 -644 160
3933 160 -390 -412 149 -174 -644 565 -5 -219 -357 -522 643 -609 -922 543 312 -128 201 -375 53
3952 53 -174 359 -743 266 -279 77 -46 294 415 -87 728 185 148 468 7 515 25 -314 48 -467
3972 -467 279 -795 186 23 -81 7 148 -1068 -177 -444 -397 86 188 456 -359 -152 320 -102 -8 -224
3992 -224 994 391 8 291 -188 106 -124 292 -213 -188 -29 -217 -229 201 -387 146 6 -87 43 88 420
4013 420 -448 -218 506 445 880 344 464 -275 -297 -38 631 390 -275 -64 289 -21 -1 170 395 -291 158
4034 158 -93 -125 217 -85 -7 -599 419 142 217 526 83 91 -652 -52 524 247 417 169 241 276 -372 148
4056 148 57 -201 702 -215 -645 91 -98 -73 -62 -751 -588 -821 -757 380 -381 -190 365 -24 182 86 373
4077 373 -29 -495 -155 -182 440 597 150 161 -289 329 87 138 -267 -370 674 68 -535 -376 -347 129 125 149
4099 149 -525 -138 -418 889 -19 323 -34 216 -500 -125 53 -276 -389 -37 267 -246 -947 397 59
4118 59 -848 31 -53 390 -66 568 -44 78 -199 29 168 -324 -93 -260 -73 -206 -35 -495 -212 377 606
4139 606 21 -730 529 9 -110 50 -148 409 263 -167 -21 -69 -489 160 -481 -345 624 93 -5 549
4159 549 -221 274 122 404 245 141 456 -71 -233 -711 279 -507 -15 -177 -270 -124 -199 1143 -412 -296
4179 -296 198 1100 -167 211 566 285 -171 -190 49 -256 269 -731 -868 398 229 136 466 569 -350 242
4199 242 -9 -812 -208 -651 -67 -276 -480 350 294 -916 -111 568 -513 464 110 -450 479 -663 -387
4218 -387 114 336 83 -683 -690 -391 312 284 -557 188 317 -35 -365 -469 345 -414 267 240 -561 -44 -285
4239 -285 -380 -191 -572 -677 -609 -147 -659 -314 145 425 128 -654 -584 -85 -315 -395 -276 -431 181 551 -133
4260 -133 -89 -145 -558 -747 -185 -56 114 -367 510 -249 414 286 120 -256 827 796 -294 940 21 355
4280 355 -547 445 82 -41 12 -347 -375 -156 106 233 265 -325 -364 -122 385 -918 337 197 516 126 397
4301 397 16 579 -346 261 643 -109 730 99 -130 -32 447 515 592 780 744 -89 138 -269 452 155 -145
4322 -145 259 -512 687 -257 -32 -455 45 -209 22 -361 52 -261 -514 337 -255 -449 -57 30 -126 405
4342 405 40 -504 -385 -406 83 315 552 -729 601 -187 -324 -151 253 -185 -634 434 451 587 15 -364
4362 -364 -29 110 687 158 -257 1065 -1008 352 509 339 679 733 -14 -179 601 304 -73 474 280
4381 280 877 611 259 221 29 -163 94 180 -350 -63 -52 -791 307 -81 -602 -759 147 -161 -268 -325 106
4402 106 -139 -153 557 -42 -224 -237 718 52 122 109 -91 -7 -202 -661 133 -295 35 -429 -385 479 407 182
4424 182 -225 446 408 -2 193 229 -134 142 -79 -930 281 -98 -659 221 678 328 364 212 525 -878
4444 -878 -561 458 270 400 -563 461 67 26 561 -155 109 -673 -289 637 72 122 -186 130 174 535
4464 535 -41 -141 200 315 556 -476 247 -202 181 72 28 50 402 -10 -89 361 -185 -56 1014 451
4484 451 -265 -186 17 -164 -712 203 303 256 -150 176 -600 537 403 -380 -248 -388 292 1056 238 -80
4504 -80 405 -505 -536 -290 13 133 379 511 359 -84 77 419 -342 345 319 597 -277 184 -313 799 310
4525 310 20 346 -140 256 473 -96 -147 -380 -315 -250 287 -668 75 -590 -640 393 -73 -212 -408 144 -430
4546 -430 198 430 362 -372 378 -254 322 -73 -91 1038 -143 27 243 -416 -257 16 205 492 83 -256
4566 -256 639 164 378 -40 161 383 272 -685 39 395 -47 -336 429 480 -290 -24 -197 -513 582 -148
4586 -148 -121 -423 -87 259 878 121 2 430 -8 39 392 -473 130 48 -519 204 -111 -325 85 -624 255
4607 255 18 -244 57 -43 -689 -74 412 294 -30 -600 -245 770 712 -444 -317 -295 313 92 -288 -1359
4627 -1359 -268 39 -425 -636 -224 78 -34 -528 -179 -75 -124 -704 414 60 -37 28 -492 -18 -233 -4
4647 -4 304 -505 -439 247 -162 343 -341 96 -356 38 557 216 335 269 -101 -140 -189 358 -215 -237 584 174
4669 174 233 -129 -522 -43 309 376 149 -381 -434 -251 -270 -155 124 204 -902 63 823 -150 -161 -181 -162 378
4691 378 2 -44 163 -182 -239 234 55 875 -203 144 -470 186 53 397 -144 329 -247 -362 382 8
4711 8 -641 -437 831 123 45 516 -79 -364 178 -557 -219 295 -249 687 89 171 303 -88 -44 -302 97
4732 97 1226 245 -484 -41 -123 -111 -72 76 -359 -144 -80 100 208 478 -113 -261 -185 -202 -248 -430 70 -231
4754 -231 -50 188 -188 176 -46 440 264 14 45 -49 -268 -166 234 -53 43 -45 184 -152 310 268 178 -268
4776 -268 96 544 428 50 -286 -61 189 -588 21 -279 238 952 -421 234 -473 -136 -115 35 -456 272
4796 272 304 -360 -757 -131 -26 -140 -221 -550 295 -210 114 -44 -120 57 569 -55 -25 -46 -162 -525 -473 -851
4818 -851 -190 60 71 -474 413 428 -527 248 -291 332 451 365 -868 -128 -215 351 975 440 -551 -284 538
4839 538 -56 -317 -82 464 2 -343 -910 -5 -125 -113 -19 -31 200 567 184 -664 280 401 389 845 114
4860 114 705 -305 -877 -6 630 111 -395 291 99 -100 437 -347 418 -67 140 61 630 -40 362 -67
4880 -67 -12 27 690 -839 236 -258 699 -174 -106 188 158 201 198 -447 -175 227 237 -360 -509 648 -247 -340
4902 -340 135 754 365 55 1013 706 -65 631 -162 -260 -204 259 -25 682 450 61 -644 -355 -253 846
4922 846 18 187 -76 79 307 4 -737 -550 170 520 -139 547 -86 -557 -461 -953 -267 566 -607 -838
4942 -838 437 397 540 325 -85 397 -460 401 534 177 -417 18 9 -178 46 -250 153 -334 -190 220 368
4963 368 397 557 -304 -468 -103 -161 -226 -44 -213 -313 75 -30 284 299 72 -354 47 -59 763 -233 250
4984 250 263 252 -238 222 -43 559 -272 113 268 318 -9 235 1068 -571 -214 425 -658 -533 -273 -531
5004 -531 96 -289 30 470 347 -128 -559 -151 283 842 198 75 -194 235 61 -236 816 429 86 653
5024 653 275 -117 99 -151 858 -29 248 -26 -171 -63 66 51 35 215 -117 158 26 -382 -477 234 137
5045 137 100 708 217 868 -139 -205 406 526 -137 2 -825 -18 -293 15 411 -425 465 160 322 50
5065 50 -246 -408 -43 374 -161 241 69 304 -309 -346 48 -126 -471 568 -152 23 8 268 206 -404 -197
5086 -197 -34 35 301 537 -451 72 202 -328 104 302 -237 -335 537 742 -534 -257 381 203 26 275
5106 275 -350 149 -638 -291 292 540 -265 321 795 -87 389 332 21 -40 74 336 82 -81 -446 64 -392
5127 -392 122 577 15 -518 -490 -210 181 490 -517 158 52 -189 15 230 138 607 -274 165 98 787 -264
5148 -264 249 341 -589 386 240 577 -137 117 -308 -320 331 -512 -270 123 -47 90 -290 -157 -219 76 -582
5169 -582 197 495 -108 789 -538 96 304 -460 33 -349 -100 -564 -256 -17 84 124 -90 -535 804 467
5189 467 -84 -339 -145 -403 -348 -508 141 272 122 165 -199 62 327 -234 125 339 -222 -425 -180 -44 602
5210 602 830 -78 -320 -14 83 -177 524 -439 479 913 -41 159 -207 -506 202 -311 -190 -671 723 -102
5230 -102 -2 156 773 309 -416 -144 -500 708 -364 -391 -741 268 254 -406 409 -533 -373 -118 -333 244
5250 244 -270 91 147 360 -5 -208 -106 -454 746 -37 -341 694 -466 -73 -313 284 -503 -418 268 -214
5270 -214 193 507 -355 -66 -271 276 -409 110 -187 475 301 -643 569 -265 -76 -788 -673 7 46 83
5290 83 -302 -217 162 -200 -135 -7 -569 472 -232 -485 396 864 -113 -141 -427 -376 798 -267 100 -85 376
5311 376 347 69 153 122 306 -372 -610 218 -16 -34 217 -13 305 -589 694 310 -190 -392 -330 -198 370
5332 370 -798 -218 59 72 554 14 -185 -337 21 -915 658 -282 15 843 -102 425 47 -139 73 -541
5352 -541 28 166 -889 -196 121 21 -39 510 -158 -286 518 273 -143 147 -20 -84 473 647 -415 -623
5372 -623 -163 -691 62 -252 -274 -58 42 214 78 -478 -301 132 -125 502 626 61 83 279 -370 175 134
5393 134 -193 -67 227 79 683 171 421 -712 -391 -121 -219 15 281 -588 -256 68 408 -114 105 -312
5413 -312 56 86 596 90 -347 5 -419 -278 -204 783 -735 215 181 194 396 -202 857 308 -306 -234 295
5434 295 189 148 199 -278 -139 594 -100 315 201 -368 -160 213 123 -23 -393 547 -504 -693 -42 -89 110
5455 110 499 -204 -256 667 108 -178 132 624 578 -8 -337 366 -379 171 537 -459 -224 -443 -13 -58 -418
5476 -418 -252 -332 -1087 161 -559 81 403 354 -553 192 -771 31 -122 -663 -201 217 -84 642 427 -502
5496 -502 210 -79 65 -5 -19 647 -140 478 329 88 -660 366 -540 114 -126 7 7 -385 327 -70 12
5517 12 181 661 96 -171 387 330 -405 202 -120 -572 783 -163 -265 380 102 55 972 121 -233 -101 -3
5538 -3 -17 -421 191 127 -272 -125 6 -598 234 -138 -132 -236 -299 -60 82 -431 122 167 -160 -164 -420 -266 664
5561 664 507 217 217 -69 131 226 39 120 -449 485 281 -46 77 -101 -590 -337 -147 -64 -274 -783 -25 -357
5583 -357 190 -191 359 1 261 -408 738 444 26 312 426 -770 -448 170 -227 -104 109 210 -107
5602 -107 67 -351 260 421 529 -175 600 57 75 -73 56 -77 -20 -44 283 -474 -276 25 241 -138 390
5623 390 163 -202 502 -553 912 691 -449 -79 -258 108 142 290 631 599 852 0 397 -82 -685 716
5643 716 219 792 185 391 -278 241 -87 -146 151 214 55 876 -725 562 -50 -161 46 -77 139 -246
5663 -246 -112 -526 -277 504 137 -372 -193 104 365 433 -75 601 509 -5 -159 -200 66 438 167 -576 199
5684 199 172 -547 -77 -195 -293 110 68 -543 -79 332 -248 -316 78 611 -144 241 -84 -741 341 314 -44
5705 -44 190 -280 -225 -184 -292 -294 207 352 -265 300 -25 -93 -667 380 471 -159 -297 -27 244 -135 -367 -282
5727 -282 141 -841 54 122 -696 -57 451 -408 135 284 -53 -302 48 -243 -13 191 -440 142 -86 496
5747 496 -693 -526 97 -455 -95 774 310 441 -110 211 -124 28 347 -15 -22 680 -559 -406 -274 -84
5767 -84 -490 -220 190 -220 325 -208 -84 -445 569 903 341 680 499 181 386 -113 307 249 463 -426
5787 -426 413 691 -193 415 201 285 -441 306 -16 -20 364 194 -37 -269 -994 270 362 -187 -354 83 187
5808 187 570 26 -83 -632 146 22 74 -162 43 3 611 203 19 878 -637 -545 -181 -441 -934 635
5828 635 -229 520 -65 -317 323 -87 72 701 -349 45 -419 588 -173 135 -137 -379 -121 -133 -752 379
5848 379 706 -520 591 -413 185 277 382 -299 143 583 -154 -124 -417 226 -265 -135 422 142 -204 -523
5868 -523 411 270 -262 -36 -95 -168 -469 282 467 -259 -176 143 -261 -212 -367 -7 33 195 -143 -469 309 69
5890 69 -309 -256 -426 -226 218 47 -303 275 -149 -142 164 -268 317 -153 -929 -322 13 -684 -186 131 -148
5911 -148 -208 267 360 -53 17 82 110 21 -208 412 -142 -420 390 -223 -180 -5 747 37 -73 507 446 -31 -158
5934 -158 196 -368 339 203 338 385 -445 -293 268 -256 537 -89 88 292 -77 -245 354 202 -88 319
5954 319 -103 -98 -686 121 -45 528 -581 -131 200 41 513 400 -453 -33 -208 539 -46 324 320 -1013 462
5975 462 -415 -231 222 -437 -332 231 -91 -542 -316 390 35 -40 -1346 -394 -571 255 450 -477 -216 -376
5995 -376 -347 598 -395 339 -140 231 162 -199 304 -427 279 314 332 397 -536 -212 -174 -209 -45 308 -104 -442
6017 -442 450 -173 -569 -600 -160 771 -659 258 362 560 55 616 -82 -553 119 313 -52 -510 57 123
6037 123 -17 550 -108 152 265 -156 -170 -613 440 465 422 -115 -89 449 267 -612 -931 -313 231 -237 -717
6058 -717 -8 322 94 -434 408 -435 -442 -359 361 -677 -25 54 -595 -170 79 -915 16 -376 251 -225 330
6079 330 -10 -85 -142 82 -430 -478 384 -314 -211 45 858 67 273 266 116 -176 803 -102 616 -508 846
6100 846 228 527 -322 102 329 -438 -471 496 370 251 -53 -133 -12 -144 277 384 579 -210 270 551 -256
6121 -256 -118 -679 -386 94 588 -426 -715 941 96 215 53 579 60 555 -198 -71 -246 559 197
6140 197 48 -121 186 -379 181 -231 -83 -143 202 -51 -83 156 326 326 444 296 319 -13 164 286 -808
6161 -808 -152 -25 233 -171 2 -194 191 -71 712 -325 440 -416 303 -68 -321 -120 -567 466 173
6180 173 38 -186 50 178 -292 -453 -199 -70 -77 95 -461 -661 -891 -287 -14 -271 -401 -522 -379 -215 208
6201 208 35 313 496 -319 433 -108 -189 52 423 244 -115 351 264 -183 -744 -64 556 403 331 -53 -95
6222 -95 115 282 154 -533 281 -649 -543 249 -240 -235 -114 -220 23 274 -577 -291 349 352 -730 207 451
6243 451 -83 -261 -468 -458 -172 -522 -67 244 -202 -265 -539 -638 -53 1 506 -1088 426 -788 -726 -36 1317
6264 1317 171 -409 795 329 882 -344 -224 226 213 -173 131 -430 -53 -84 -43 -320 125 -1062 491
6283 491 707 122 625 -273 -54 165 965 -816 293 -276 346 -513 135 -332 838 16 -89 286 716
6302 716 -38 -363 11 -220 278 -93 -313 -177 -113 455 -129 -493 331 218 262 141 -558 45 978 583 -635
6323 -635 -274 181 -74 -174 -102 -727 111 691 -641 536 -231 -680 -416 -4 20 157 48 -29 -231 490
6343 490 -144 994 711 -416 355 301 -79 276 97 714 361 -255 71 84 -315 -659 474 76 -121 -330
6363 -330 -122 61 -129 -79 208 -388 -556 309 -181 269 -27 -110 319 -603 -624 177 44 -18 -402 507 -335
6384 -335 559 -220 264 -342 -927 -577 383 -187 -32 146 -177 40 -53 439 -235 121 60 -246 839 -104
6404 -104 -720 -921 115 -491 -464 126 -181 -284 -143 633 162 -331 178 -511 478 207 423 -32 -352 -39
6424 -39 195 -268 -238 -236 79 -292 95 304 45 -438 -551 59 -442 201 168 105 -455 -166 82 -380 -286 -628
6446 -628 -72 568 -798 -855 -53 473 523 506 575 69 170 -692 57 425 417 174 -647 -323 54 87 86 259 186
6469 186 -220 -103 -197 -458 341 204 283 -164 -38 -491 -495 -381 258 214 461 40 324 -141 -230 243 -448 -471
6491 -471 -49 -163 277 104 82 -250 234 43 -402 58 -298 130 -757 150 -351 -277 -41 53 102 -72 -137 -344
6513 -344 -574 -360 -1 -100 144 -428 -161 -86 -499 -165 133 -138 -120 63 -71 -348 -189 554 324 -335 -547
6534 -547 234 271 -82 355 -252 -33 305 290 535 651 -420 380 -360 -101 253 323 79 -326 774 -243
6554 -243 -560 58 336 -103 446 -453 292 75 621 -53 314 425 220 -384 552 568 -705 -103 75 -237
6574 -237 -153 -301 -219 -577 209 -537 489 295 -582 -247 -722 -136 -157 -310 -332 -46 -375 -50 -174 -445 -110
6595 -110 328 -89 -101 -104 -511 225 351 256 -132 295 -254 277 -12 594 -3 -124 -398 2 57 -149 106 -232
6617 -232 -136 847 104 464 662 -562 -366 94 -491 428 -344 -326 -734 -462 -262 -86 -291 11 3 -39 228
6638 228 -295 358 62 -156 36 -104 -215 167 606 -234 -98 40 291 -46 -108 152 -236 -76 -154 68 -34
6659 -34 489 543 440 35 -361 -488 -34 689 -9 -31 257 -527 -753 523 -421 94 357 -88 658 3 -7
6680 -7 618 -87 193 15 -196 332 -572 1193 -7 -2 194 -704 -706 -488 1404 281 96 -589 -189 -399 37
6701 37 -348 -300 -17 -168 563 345 62 61 43 295 -982 -340 -424 196 -579 255 225 -285 231 -461 -48 -313
6723 -313 331 -562 -146 261 -370 253 -33 -274 351 -231 243 242 37 211 4 -603 -6 65 -532 775 -164
6744 -164 285 -412 359 16 -376 191 -121 498 -322 223 108 628 228 149 -276 474 -174 439 406 302 120
6765 120 -282 499 37 526 98 -245 -12 912 160 482 595 -2 75 -259 -746 -395 82 342 -259 -135
6785 -135 -219 -53 72 -98 -40 -505 2 93 237 322 253 439 82 526 -464 200 -226 612 7 18 -46 288
6807 288 77 -191 307 30 -207 68 -157 -443 -110 102 -397 259 -269 -151 -870 289 -536 171 -134 251
6827 251 -103 -345 -67 -139 -132 294 -420 -209 292 229 -360 348 -45 38 -501 -110 824 693 190 236 -7 649
6849 649 207 -441 -106 -481 -116 -27 239 -198 736 -41 316 458 -253 -505 -102 201 -150 105 313 37
6869 37 -215 -413 -791 102 262 58 -63 -166 -21 -737 -131 -635 -177 153 -8 -491 -215 162 843 -317
6889 -317 302 -417 -618 250 530 -68 543 129 -60 84 -485 194 -299 -322 -124 98 160 231 556 -209 41
6910 41 -298 -274 -251 43 50 192 7 -618 -121 -552 -95 95 524 -565 -1076 379 609 -89 597 -178 -198
6931 -198 -259 -758 51 -74 -287 -133 589 50 347 724 201 54 392 -47 -135 -138 -331 97 443 578 567 176
6953 176 106 212 543 -250 477 518 600 -236 -149 67 2 144 101 312 -413 -53 82 896 -512 352 -181 228
6975 228 -41 288 378 308 -249 -156 -265 114 -114 258 241 -206 106 -68 652 175 618 446 322 166 -258
6996 -258 -44 633 -216 -81 84 571 195 -15 -614 -261 153 -350 277 353 206 407 -636 -176 -144 -343
7016 -343 -80 266 322 -295 635 -347 216 -45 -283 481 30 -395 106 545 82 345 155 -234 -561 2
7036 2 77 -39 -64 -413 -206 368 -107 298 110 473 229 518 -494 184 -12 304 -10 -89 -701 -244 451
7057 451 69 133 52 188 -328 18 380 48 -440 334 423 279 -77 -308 -129 85 613 -20 -859 -33 197
7078 197 -614 -361 -436 5 -287 594 -151 -139 -542 350 -222 511 -55 371 629 391 737 -367 -87 -33 -663
7099 -663 -543 106 186 -700 219 296 -218 -185 263 7 -536 -179 -418 252 -172 -81 -429 -209 -18 -52 545 -858
7121 -858 190 -397 60 524 -322 -62 658 871 711 103 -14 35 -735 506 -321 308 -328 -12 -44 -372
7141 -372 -116 23 -62 -493 201 -233 188 -591 -5 309 -113 183 -269 -211 313 -77 -285 -56 122 636 24
7162 24 -702 294 -347 -124 -232 -684 804 -28 170 87 -208 -439 368 -564 359 -548 266 -133 -308 130
7182 130 -440 -255 -407 -417 -211 -256 -118 928 -120 -195 698 -159 -425 -372 123 -13 -351 242 -694 -175 -158
7203 -158 423 249 -575 -298 -8 282 -184 72 282 -125 542 61 -577 -42 18 240 -541 427 -180 -243 444
7224 444 86 203 765 -440 -314 595 432 -58 -636 462 -230 284 -482 -34 79 29 -42 -597 -381 248
7244 248 -133 -284 -107 -373 -123 -130 234 -236 242 727 132 126 -344 -432 557 375 -347 -46 293 -147 -491 -361
7266 -361 -71 344 -534 248 -652 -44 -153 523 -218 -527 -327 110 684 -229 319 910 -373 -314 -320 103 291
7287 291 527 126 -636 -21 49 30 -157 -67 349 -479 24 -245 -405 672 51 -769 337 606 23 460
7307 460 313 -325 147 660 -86 322 -212 -28 -157 232 -388 -253 -59 -447 466 392 154 -303 541 340
7327 340 -402 -204 -447 580 -384 219 87 323 203 -625 -6 -640 -472 414 -762 34 62 -52 402 -942
7347 -942 150 365 81 -144 34 -112 427 -537 551 243 -76 248 232 431 493 355 360 707 -222 -1 507
7368 507 370 406 77 695 -488 781 395 155 -294 161 144 334 -104 233 619 -137 76 370 424 179
7388 179 530 -116 300 632 -422 537 -89 342 214 319 -78 -177 -303 -568 -83 211 -24 -102 -98 191 359
7409 359 738 435 -165 221 440 435 81 -440 -338 -540 400 465 -214 336 49 240 -484 512 65 5 133
7430 133 -21 136 917 -211 -194 135 93 356 387 535 -114 -431 59 96 -296 223 410 130 -140 250 310
7451 310 170 -556 -302 227 -287 -166 -183 227 527 -62 -142 305 322 217 68 -262 -67 -16 180 144 79 -304
7473 -304 517 -225 363 588 -505 412 -359 79 -190 224 -205 -503 433 259 516 346 -214 229 506 623
7493 623 -235 -38 432 -379 210 -583 427 -69 279 322 560 379 204 -80 -421 72 -278 -514 -421 -297
7513 -297 -76 -24 -18 -505 109 581 292 -508 278 -786 -331 -71 -312 256 158 200 115 385 -99 -186 129 -900
7535 -900 -30 -649 -3 -166 -47 78 -88 320 19 -192 -96 279 -7 -119 43 -241 -534 273 -306 -621
7555 -621 -530 365 151 572 140 178 755 191 803 759 -940 111 272 724 -27 92 39 24 -71 -128 -287 -940
7577 -940 142 -12 82 392 -62 -515 169 296 642 -303 173 355 -19 -450 615 -389 -82 -352 181
7596 181 -935 -238 -242 -271 300 -206 809 480 -74 532 272 -313 -558 667 -466 323 -513 -14 -212 149
7616 149 201 -79 561 267 -26 -221 -158 -109 277 15 -347 -94 -1054 -70 417 510 418 -723 157 -155 584
7637 584 402 690 85 285 -259 91 234 318 -50 410 -69 502 -111 -336 -187 136 446 371 523 604 424
7658 424 406 392 420 174 69 252 -190 294 -239 -887 -344 -162 -254 643 -259 -509 527 499 560 -372 -36 206
7680 206 317 234 -27 -468 170 137 -465 -60 71 179 291 484 -103 37 -422 121 211 -324 -318 118 -1424
7701 -1424 208 -206 256 -4 -202 269 -522 142 78 -191 -205 -467 463 422 -414 111 573 415 -55 -234
7721 -234 -382 329 -201 -107 -98 -438 152 133 566 -295 518 84 -40 258 344 108 85 230 -857 -155 -331 -450
7743 -450 -291 114 264 -435 114 -267 707 -439 53 -34 107 252 -749 -574 -112 141 185 118 467 608
7763 608 233 -650 443 268 -34 -111 0 168 -43 -222 782 455 -48 -618 -208 5 -79 621 153 283
7783 283 -562 450 -275 204 529 -194 -670 234 -650 315 182 -194 -510 -296 109 43 -324 320 1258 -210
7803 -210 -404 568 62 -559 764 199 831 -196 -992 -330 -251 -325 -15 566 232 293 410 -631 335 284
7823 284 -348 -354 408 833 -209 -248 458 180 -418 -122 -123 38 254 -525 329 -470 14 -510 -624 123 -149
7844 -149 28 -243 663 -299 -24 274 -287 -637 -215 -167 -99 -653 27 32 -431 4 -237 113 544 -435 -101
7865 -101 50 -403 269 172 -677 -256 -207 -187 -338 2 -31 404 -125 96 -358 -1028 -481 -291 -302 583 -655
7886 -655 243 -30 65 456 -478 -369 -75 455 -696 -371 402 -600 -219 217 215 -268 263 317 -125 -563 512
7907 512 -162 178 -358 -217 4 289 22 -795 366 -191 -411 20 -83 296 76 -173 257 5 151 401
7927 401 612 438 75 275 -82 1077 168 168 -401 201 592 308 -356 328 -274 -263 -400 -664 -276 303 261
7948 261 239 458 30 7 -717 -229 -63 -197 289 208 -37 -248 -355 117 -128 302 -105 244 206 239 -1042
7969 -1042 -570 404 213 478 531 -444 -468 274 -312 -550 -45 -152 -195 557 306 -160 -337 -191 -257 -164 -362
7990 -362 -384 89 -71 -57 347 61 253 -73 49 453 72 -556 366 38 -528 639 113 65 168 244 -205
8011 -205 -645 -46 530 269 -506 -508 708 53 69 -575 -583 182 -265 -877 -722 -246 406 -273 18 -412 -101
8032 -101 477 -711 359 -144 104 64 29 -228 120 333 235 66 315 -521 254 -235 82 -390 23 -50 37
8053 37 -114 131 303 -562 330 -10 -573 -1037 587 218 260 -324 809 281 514 -436 177 372 -150 114
8073 114 -61 -404 -64 482 267 -79 20 552 175 -254 -130 125 -56 79 -146 26 -239 -336 -269 -336 -131
8094 -131 163 361 -463 29 -426 -313 -799 -121 -151 50 -165 -164 -10 210 -153 792 231 86 0 -24 -162 -279
8116 -279 162 225 584 474 -415 -840 227 -447 531 -246 491 319 172 -128 197 64 198 -308 354 -805
8136 -805 346 461 -497 121 80 -266 -632 -23 -179 538 -401 -365 630 273 -648 147 290 -12 354 -23
8156 -23 -54 -177 -356 -129 -65 315 466 361 350 291 -312 -32 258 403 -8 -650 -164 -208 583 370 -218 -839
8178 -839 921 388 -395 302 390 -154 -524 463 64 212 -427 -287 264
8191B64
$$ Imaginary data points
##PAGE= N=2
##DATA TABLE= (X++(I..I)), XYDATA
0 0 0 0 0 0 0 0 0 0 0 0 0 0 0 0 0 0 0 0 48 -64 64 -64 64 -64 73 -128 128 -128 191 -192 221 -256 287 -322
34 -322 380 -415 460 -517 581 -655 726 -809 898 -992 1103 -1219 1348 -1483 1632 -1795 1975
51 1975 -2177 2403 -2653 2931 -3243 3598 -4006 4483 -5043 5713 -6535 7564 -8917 10752
65 10752 -13417 17644 -25492 45067 -230312 -164970 87215 -87871 -51451 45628 12889 -62668
77 -62668 72246 122926 60178 68382 140296 35552 -47738 18010 43507 -46525 -13582 52651
89 52651 -29263 -127597 -71843 -37067 -89615 -73337 25097 16912 -36995 23095 87514 40849
101 40849 45153 118849 92943 16446 25690 24522 -50606 -78628 -40205 -52126 -75720 -33669 -11937
114 -11937 -55791 -34550 37196 28532 -2510 41569 68922 24751 4199 27806 21589 1143
126 1143 16365 26218 -5235 -24831 -18787 -34113 -47802 -26031 -10715 -27219 -23582 2230 6364
139 6364 996 23365 44863 37602 32595 37081 14620 -13426 -8902 -5545 -23449 -27279 -18993 -23731
153 -23731 -25532 -11214 -2221 446 14956 25438 14211 9218 16451 9260 -2641 3253 8122 -4646
167 -4646 -11144 -5741 -8013 -12674 -9371 -6926 -5287 -1282 2720 1082 361 9875 16634 11948 9627
182 9627 14128 9483 -1786 -5696 -8714 -15911 -18292 -14716 -14494 -15669 -8534 925 5859 11057 18510
197 18510 21540 19327 19840 13380 5095 2010 -2930 -11109 -14929 -14623 -16807 -19098 -15472 -11449 -7671
212 -7671 -3379 -287 4519 11462 15053 12973 14936 21845 20689 11041 8509 7235 -2725 -11105 -14113
227 -14113 -19621 -24274 -22878 -19261 -18765 -12407 -1393 4961 8640 17952 25512 21872 18716 21143 17272
242 17272 6350 3109 186 -9518 -16077 -14185 -16500 -22253 -19233 -10849 -11095 -11587 -1982 4997 6658
257 6658 11729 18133 18230 17664 21223 16967 7470 5653 4539 -7847 -17540 -14146 -15749 -23068 -20377 -12763
273 -12763 -9925 -7685 1470 7679 10120 14586 17396 14290 12116 14727 11127 1573 6 1061 -5327
288 -5327 -10595 -9364 -9887 -12837 -10767 -7796 -8092 -7566 -499 2687 2001 6585 11483 11231 10381 12009 10110
305 10110 5606 2835 -724 -5791 -6006 -5688 -10646 -12493 -6094 -2194 -5970 -3899 2640 4668 2640
320 2640 4029 5111 3469 3868 4653 1838 226 3865 3271 -2304 -634 1371 -1272 -4769 -1883 -524
336 -524 -4649 -3629 -1182 -2430 -2453 1297 1842 -557 1428 3905 1288 -1511 1578 1928 -237 25 1795
353 1795 770 1523 4508 3130 -314 971 2429 -1988 -5072 -3630 -3745 -6007 -5570 -4508 -3355 -1963
369 -1963 2577 3006 3489 6099 7203 5049 5601 7398 4005 -35 -958 -716 -3984 -6286 -6207 -6927 -7047
386 -7047 -5852 -5350 -5035 -3000 1178 1838 2763 5630 7628 8750 8781 7656 4958 2919 3301 -252 -4826
403 -4826 -6642 -7165 -9110 -10073 -7972 -6910 -5793 -2779 722 2262 5231 7769 8356 7753 10078 9155
419 9155 5098 3154 3398 57 -4724 -5047 -5832 -8673 -7957 -7268 -7095 -6416 -2345 -884 -128 2260 6028
436 6028 6746 5714 8223 8455 7293 5139 3555 957 -1994 -2619 -4553 -8238 -9216 -7039 -7279 -6620 -3776
453 -3776 -928 -327 2272 5341 6076 7114 7157 5908 3893 5218 4912 605 -2523 -1874 -2450 -4874 -5926
470 -5926 -5942 -5402 -3568 -3019 -3745 -1802 966 2385 2386 4489 5700 5045 3609 4326 4223 1603 477 -490
488 -490 -2066 -2949 -2946 -3890 -4464 -1670 -2326 -3314 -2632 -551 739 -27 1645 3032 1970 2796 4024 1981
506 1981 638 2447 3537 -486 -1682 -289 -654 -3111 -1314 -1780 -2915 -1990 -183 -2374 -3645 -82
522 -82 1611 -1308 471 3714 1946 55 2411 5201 1188 552 3506 1923 -1355 -1263 -694 -3706 -3348
539 -3348 -1203 -3078 -4924 -2686 -69 -1768 -1205 2214 1642 422 3284 4867 2046 2352 4676 3855
555 3855 867 480 1525 -1536 -4299 -2582 -2280 -5285 -4667 -2974 -3197 -3715 -404 666 948 3808 5681
572 5681 3722 3126 5767 4668 1648 1179 1630 115 -3910 -4075 -4535 -5701 -5897 -3546 -3313 -4057 -1511
589 -1511 7 783 1605 3557 4637 4470 4751 5047 3781 2218 2066 776 -1253 -2825 -3460 -3966 -5898
606 -5898 -5899 -4311 -3961 -4245 -1152 981 1507 1406 3768 5509 4662 4182 4909 3263 1756 804 -612 -2360
624 -2360 -3044 -2886 -5340 -4888 -3819 -3170 -4357 -2621 156 981 896 2410 4105 3754 3391 4915 3578
641 3578 2145 2260 981 -708 -2460 -2907 -3195 -3827 -3282 -3463 -3110 -2329 -752 -1066 -1094 1810 3419 2355
659 2355 1490 3195 2983 1439 1847 2673 1503 -559 -888 -1596 -3014 -2757 -2292 -2469 -3001 -1257 -1587 -1994
677 -1994 670 2561 1427 1008 1922 3380 1963 1693 1856 1288 407 833 830 -1269 -1515 -1026 -1442 -2197 -1855
696 -1855 -2639 -2329 -958 -302 -1463 -318 1857 1267 1138 2586 3028 1578 1995 2198 1620 381 189 -841
714 -841 -1625 -749 -1786 -2862 -2205 -1573 -1201 -1847 -1728 1121 187 -257 1919 2976 2367 2385 3049 3003 1766
733 1766 1539 799 -649 -1395 -1846 -2212 -3495 -2839 -2222 -3473 -2155 -1017 -938 -373 1547 2036 1668 2094
751 2094 4765 2980 1501 1629 1674 316 -1060 -890 -1457 -2356 -3406 -3004 -3657 -2308 -2015 -2073 -1786 596
769 596 329 947 2009 3919 2770 2107 3344 3571 1869 -472 -425 -1274 -2773 -2871 -3473 -3203 -2546 -2279 -2312
788 -2312 -810 -399 485 1800 2177 2876 2424 2777 3566 3751 1656 1337 870 383 -1329 -1931 -3002 -3057 -3494
807 -3494 -3121 -2287 -1426 -348 -1050 1022 2752 2742 2007 2604 3161 2837 1470 1769 971 9 -943 -1724 -1594
826 -1594 -2370 -1823 -2435 -2141 -1818 -1375 -1840 -386 203 1551 1598 1723 2792 2441 1994 1927 1193 915 -746
845 -746 -320 -414 -1833 -2171 -2252 -1967 -1886 -2179 -632 331 1002 -247 21 1187 1147 1678 696 1318 1546 1489 930
866 930 972 414 139 -544 -1235 -1436 -1089 -1620 -2097 -1910 -1246 -1106 -84 590 549 623 1403 1310 1134 2038 1387
887 1387 613 -110 661 603 -775 -770 -1156 -1070 -1869 -900 -1696 -2284 -1157 -254 -729 -420 908 1346 1300 423 1138
908 1138 1731 1174 1656 1264 356 -508 -138 -1138 -952 -1176 -1038 -1760 -1261 -1130 -965 -916 -29 262 105 1472
928 1472 1233 1291 1947 1718 1667 1825 844 347 -730 -769 -981 -1248 -2530 -2179 -1833 -1502 -2067 -324 -633 273
948 273 426 1820 1911 2196 2452 2186 1057 1059 867 -77 -215 -1480 -1691 -1787 -1244 -2261 -2465 -1564 -1547 -858 -1379
969 -1379 827 873 1306 1767 2254 2524 1944 1578 1393 177 254 -410 -1351 -1372 -1539 -1842 -2257 -1579 -1193 -922
989 -922 -1451 -107 469 398 1429 2489 1704 1906 2205 1703 886 655 350 141 -1290 -1830 -803 -1610 -1748
1008 -1748 -1616 -2297 -1330 669 648 411 982 1141 2291 1531 1631 1701 1416 1056 793 227 -669 -837 -774 -1981
1028 -1981 -1672 -1721 -758 -1170 -440 -763 175 -17 96 830 1331 918 2341 1734 656 1655 1357 346 -357
1047 -357 -767 -985 -1098 -1161 -76 -1410 -1508 -152 310 -1022 -278 214 -17 975 1077 920 394 584 1368
1066 1368 551 -72 -315 674 -581 -1203 -1177 -543 -1758 -289 -529 -902 -991 -419 250 -281 505 1025 514
1085 514 1243 1167 1482 458 355 523 609 -774 -238 267 -967 -378 18 -806 -1693 -1403 -961 -623 -353 1010
1105 1010 -267 745 1141 853 393 1837 1657 259 -162 -376 409 -1833 -1691 -1203 -573 -2203 -1167
1122 -1167 260 -800 -764 265 975 232 748 1702 1179 1920 1356 1293 1093 552 45 -115 -1061 -651 -741 -1713
1142 -1713 -2030 -537 -1208 -1308 -158 -23 365 1256 1287 1106 1657 1199 848 803 1188 131 -417 -274 -271 -1168
1162 -1168 -1060 -1070 -1567 -1116 -1905 -971 -8 -499 -32 460 860 966 947 1172 1557 871 333 627 -581 -96
1182 -96 -42 -1082 -1949 -1034 -1335 -735 -1690 -477 253 -73 713 685 528 1284 1499 1520 1827 732 225 713
1202 713 191 -535 -1282 -192 -584 -1532 -1029 -748 -1265 -489 -498 -279 928 466 915 751 1636 906 1326 1681
1222 1681 884 413 43 -176 -673 381 -983 -1620 -884 -1369 -1241 -519 -1391 116 84 801 824 1060 1079 1002
1242 1002 1284 398 331 425 566 -167 -274 -554 -25 -1031 -890 -1192 -821 -34 -350 -71 -917 -681 424 176
1262 176 609 1140 280 250 683 1169 1231 -151 66 138 -567 -483 -738 -794 -542 -926 -764 -531 -452 -430 340 557
1284 557 669 1181 1163 214 976 375 -156 550 583 146 -335 -501 -604 -378 -714 -714 -531 -1503 219 -670 777
1305 777 246 583 659 571 1592 908 1060 720 371 472 -478 -785 -492 -967 -1681 -1273 -1029 -1036 -1138 -843 -344
1326 -344 629 1116 266 684 398 773 1119 1145 226 323 144 582 -877 -548 -623 -923 -861 -756 -467 -95 -137
1347 -137 139 151 420 383 543 304 954 766 474 -301 134 -126 326 -435 -621 -650 -1040 -1026 -906 392 186
1368 186 -178 -999 220 15 450 11 1384 1011 1111 974 974 610 937 568 -911 -211 152 -1110 -696
1387 -696 -879 -285 -840 -888 -725 258 -35 625 81 407 1287 707 908 823 581 -37 -149 -279 -939 -485 -1400
1408 -1400 -536 -765 -1178 -417 -336 -577 35 642 653 686 1168 247 327 1267 625 933 -131 818 -749 -460
1428 -460 -749 -684 -1319 -1366 -344 -752 -284 134 -548 -406 472 5 884 368 195 1089 516 1223 957 281
1448 281 47 -886 -620 25 -44 -188 -653 -586 -1059 -1385 65 170 86 745 -98 614 565 1001 793 998 144
1469 144 -90 -154 -23 -1042 -1539 -825 -960 -594 -411 -466 -1085 -832 -978 -618 593 916 654 707 1561 537
1489 537 -128 965 145 708 164 -768 -620 -631 -986 -83 -438 -602 -104 -543 30 -13 -210 692 -143 239
1509 239 918 1222 176 489 404 -300 -78 366 -162 -716 -468 -900 -209 -1574 70 -83 -367 415 -38
1528 -38 -93 284 310 329 26 529 419 598 108 -54 285 292 124 42 -406 -812 -590 -800 151 -155 -232 -84 -258
1551 -258 150 802 908 987 385 580 326 628 -68 -151 246 -580 -683 -589 -761 -424 -865 -749 -175 261 -4
1572 -4 -55 -109 491 721 859 804 118 606 180 -241 -150 67 -54 -311 18 -629 -160 -473 -220 -206 -601 -138
1594 -138 -691 -35 183 1281 763 127 825 308 563 224 206 -459 -826 -167 353 648 -242 216 -613 -905
1614 -905 -717 284 210 827 -659 483 1 -240 496 412 406 812 330 -396 5 159 -677 -669 -92 -22 176
1635 176 -345 -575 255 709 -407 740 554 808 -46 -23 416 370 403 209 -123 -385 -270 -96 -564 -253
1655 -253 -1143 -593 -825 -361 -426 459 -76 167 35 363 184 484 309 -107 -195 -255 61 41 52 -367 -262 -414
1677 -414 -58 -833 451 316 356 -9 67 86 888 222 -283 429 109 723 80 123 385 90 251 -73 -371
1698 -371 -466 -109 -674 -1056 -956 157 -504 428 176 -73 753 339 178 824 -234 35 144 305 10 120
1718 120 -397 -557 -13 220 -454 -568 -292 37 71 311 692 574 581 752 567 919 -236 -400 43 314 120
1739 120 206 61 -236 -284 -405 70 -1127 90 -661 -48 -18 -80 448 225 482 343 475 179 -321 354 97
1760 97 111 -829 -204 -152 -299 213 -467 -131 -1268 -474 -458 -94 -414 -186 520 789 86 5 1461 492 456
1781 456 1105 -343 1010 -21 -182 -752 -223 -528 -226 -940 -324 -499 -4 40 491 -177 688 188 95 572
1801 572 -175 492 -235 -652 137 592 159 -386 -57 -372 -243 -592 -345 -286 132 31 -35 85 -198 663 60
1822 60 531 -14 459 -486 182 12 -190 -95 73 -555 -229 311 -74 229 55 278 214 -137 548 382 582
1843 582 31 150 202 -153 385 966 -125 -664 -451 -140 -597 -860 -449 -591 157 -517 138 -242 -249 83 -489
1864 -489 -21 -213 -23 458 169 14 84 90 323 134 229 84 144 -555 -732 -106 -86 492 70 392 -553 -38
1886 -38 437 -156 -154 849 -728 378 235 117 -327 -183 94 370 -555 -688 408 -538 -191 26 124 -363
1906 -363 821 198 446 436 367 561 744 -266 802 285 -465 -2 -388 -170 101 448 -453 237 201 -198
1926 -198 -189 -391 338 529 -370 275 142 158 259 959 602 778 -88 -150 -188 107 472 -30 255 -545 -88 -584
1948 -584 179 -56 -669 211 616 -208 644 204 537 243 332 128 178 835 257 404 -380 -203 -499 -277 -357
1969 -357 -34 60 98 479 -555 7 90 231 -1 253 -103 154 791 95 499 238 643 356 -100 -826 -90
1990 -90 -137 -599 -65 184 11 -196 254 1205 -310 78 454 -272 412 -379 153 -181 232 -190 -603 156
2010 156 -285 -246 -553 -102 -371 -783 -692 -348 345 92 -604 178 -34 539 474 708 -277 -50 -696 -82 -364
2031 -364 -239 188 523 -967 -161 -937 -662 -854 -400 167 -268 -286 -229 1023 -98 286 430 7 -329 -443
2051 -443 267 -500 58 382 13 98 -152 -721 -529 -175 -602 136 -354 -378 340 -193 380 263 324 179 479
2072 479 -123 -101 35 -712 -97 -490 1088 -127 -609 102 -812 53 -316 -15 -293 592 391 -328 412 192
2092 192 227 701 603 327 610 -313 -380 469 -611 -201 -568 -393 117 -594 -437 -114 37 -305 -153 694 678
2113 678 421 -164 -351 -480 118 148 798 519 -335 488 410 -632 148 -193 495 -30 -129 810 279 563 607
2134 607 257 371 318 41 -124 143 228 780 74 9 51 -921 -204 262 93 -829 295 -322 369 -310 48
2155 48 215 -174 714 -15 -116 -98 42 32 445 -655 115 -409 -612 -281 599 50 -100 305 -249 382 -257
2176 -257 -387 43 438 -213 943 446 -428 192 -51 280 1014 -577 -600 -413 -283 -17 -115 92 -5 -154
2196 -154 577 -164 257 280 301 390 454 852 -12 -282 488 314 -17 157 -445 272 -963 -220 -724 441 -249
2217 -249 -177 465 -116 -111 426 -84 239 387 -353 239 506 -102 493 555 250 66 -147 105 -558 196 230 -520
2239 -520 -78 15 -333 31 417 358 -330 -133 921 505 418 18 300 73 -197 -396 47 -588 -52 -433 -141
2260 -141 -92 -13 457 -36 -455 169 137 -247 342 -263 628 -100 -77 414 170 210 251 -15 -419 -36 55 -795
2282 -795 -15 -683 -604 157 -21 -129 257 256 179 13 616 92 47 -250 -370 -741 718 569 -48 -70 -291 -83
2304 -83 68 1 -68 -34 484 259 -438 -587 274 372 490 138 -81 698 -205 -294 12 147 -603 338 641 -754
2326 -754 341 -234 -192 281 486 -495 -452 161 453 142 369 107 110 148 84 176 260 -455 401 -74 392 -270
2348 -270 -921 -123 -309 207 -216 37 407 423 -90 199 153 -959 56 35 129 656 394 583 135 -44 -471
2369 -471 23 -269 -886 -24 -600 154 -220 -104 -14 -55 418 206 646 0 41 -19 10 218 -252 224 650 -213
2391 -213 -39 698 82 -110 -502 336 -335 921 -485 55 351 388 -263 237 302 64 259 284 -195 -143 -167
2412 -167 439 -294 -665 208 -721 495 -57 46 -316 322 216 380 285 1032 -159 389 246 -19 234 380
2432 380 -279 -645 140 -532 -276 408 34 -351 -88 -650 -216 -39 170 -312 640 -109 -176 -236 9 -131 -12
2453 -12 -364 123 -822 -341 -60 411 -144 -1237 22 -752 -25 -636 463 -106 451 713 232 -110 -206 489
2473 489 326 590 378 412 627 -397 -2 367 133 -240 25 236 507 -647 293 -637 -260 -623 506
2492 506 663 -224 -108 262 322 -468 -158 98 177 -250 -615 -76 -135 -272 -202 -241 -101 -347 -239 -245 -143 774
2514 774 -785 223 3 -525 315 21 407 -337 495 200 -279 -195 865 -255 621 -81 71 141 204 113
2534 113 470 272 -416 346 -592 -347 443 -149 176 -2 -747 -397 -78 389 50 152 -495 307 264 -631
2554 -631 -263 270 -70 -93 1078 605 524 729 -232 57 343 -370 -401 -26 -642 243 -21 -564 -304 -249 -190
2575 -190 98 1170 -76 -754 -73 -347 -45 563 521 116 -642 158 240 446 818 474 -355 125 677 -34
2595 -34 -1 330 302 6 -575 -532 65 -330 -119 -373 323 388 1037 566 -60 -491 8 382 -171 -401 239 494
2617 494 -313 339 -305 664 -97 345 92 -576 -563 -118 386 379 476 -504 -364 -361 291 413 -407 -455 -479 259 671
2640 671 -306 -146 -334 -552 63 -68 -391 498 348 -58 391 215 -214 818 194 30 -333 261 255 -824
2660 -824 -392 178 747 -336 -481 237 -94 -167 546 452 -321 89 -98 -385 626 461 225 114 -199 -331
2680 -331 94 -94 -297 -70 69 -6 -517 -130 -400 464 -428 -49 453 -67 782 -386 -25 326 322 -422 -446
2701 -446 -421 224 -263 -247 138 -605 -956 -239 -396 159 39 -153 -100 1101 407 -114 623 95 199 383 -259
2722 -259 522 274 -324 -1026 -345 -29 -642 143 454 36 405 -134 182 553 328 -425 -176 63 -184 -140
2742 -140 -322 326 -918 512 -70 135 -358 270 11 156 -308 172 4 -29 430 98 321 -260 -215 552
2762 552 -971 286 -129 -168 -86 365 -512 -226 -34 289 -225 -808 59 93 -398 143 -291 44 -578 55
2782 55 56 26 -354 -231 385 349 295 -91 281 91 -143 101 94 -299 200 -408 -138 -355 100 186 365 -277 318
2805 318 54 575 -157 94 -214 -132 373 247 -269 313 689 276 486 152 478 206 122 95 166 638 328
2826 328 -30 -675 -181 557 -134 -731 -267 45 -391 115 77 -942 68 -957 -805 -25 437 -339 244
2845 244 183 -209 102 893 176 270 -8 -74 -249 -111 -319 -143 100 107 -174 44 191 137 -178 -156 -464 97
2867 97 125 -237 270 -285 -201 144 -513 108 -754 -15 190 -294 510 -407 107 119 -272 441 48 -254 110
2888 110 368 -113 461 -398 128 367 512 127 -304 -127 5 -101 -74 33 -279 937 -123 -42 -77 -18 562
2909 562 -304 -220 -85 -237 -83 -638 34 -6 -152 293 -172 -7 198 548 -55 -737 -69 -67 -186 245 407
2930 407 -153 109 320 -47 488 422 255 95 55 400 55 383 -824 651 322 203 204 -298 -276 -358 -50
2951 -50 -253 -472 -273 -95 -661 997 -515 126 -418 9 442 220 494 246 237 -166 237 29 186 -199
2971 -199 6 92 -333 173 319 -447 -26 -639 359 88 437 -351 -247 136 612 -70 41 -211 504 24
2991 24 -89 304 265 -534 -864 -388 -51 -12 -402 -84 -782 735 -15 378 540 202 632 -69 47 -68 439
3012 439 -589 169 -431 135 -475 -238 -971 -153 -483 16 -624 418 -172 -214 244 196 -143 -296 27 -80
3032 -80 -786 -189 413 -346 705 694 171 6 -64 -174 257 -981 -600 62 -68 -151 257 157 59 -525 -366
3053 -366 -119 773 -196 -776 -461 464 -552 707 170 -361 -21 -153 123 -226 -12 115 265 522 254
3072 254 303 -21 -223 -685 -267 107 -401 62 527 218 -513 658 50 185 -221 -805 -563 -487 374 428 400
3093 400 -496 547 73 -91 20 -368 402 173 -195 215 -423 498 -539 -182 -573 234 608 -259 149
3112 149 -153 138 183 58 48 383 -559 88 617 252 -153 -44 -535 -586 32 -694 225 -43 -94 62 53 244
3134 244 -117 46 30 -519 74 -415 331 115 58 191 -332 -145 410 83 -97 166 111 522 1 -203 -383
3155 -383 -458 -76 752 345 -568 -529 -424 112 38 55 285 177 -346 -48 78 -94 -499 -214 222 -55 17 -375
3177 -375 -89 343 -740 -48 -156 293 -232 416 -395 -146 -125 -161 -473 449 -731 115 -465 -422 686 553
3197 553 -400 -243 -216 435 -284 60 133 -129 227 -53 -409 -148 -151 370 -55 43 -261 -127 96 -134 524 -167
3219 -167 40 302 359 -1252 -340 -266 101 -221 249 760 -655 -158 -108 -739 -698 240 -127 -580 -174 239 -11
3240 -11 567 23 -723 -43 -119 -197 -112 -670 91 144 477 296 287 142 -295 32 -391 -505 -40 -30 360 -573 -212
3263 -212 456 460 -234 12 47 -11 19 138 -70 -289 -254 -211 739 415 -544 465 -196 -355 -773 312 639 384
3285 384 -108 388 -430 219 -303 306 -340 197 648 -436 -279 -266 391 790 189 92 -44 102 89 -546 -1051
3306 -1051 -403 -334 64 528 493 453 -127 -287 -106 155 -631 -389 -695 498 -529 -35 427 -115 444 -361
3326 -361 983 133 157 292 337 -217 265 887 501 -281 424 449 67 -315 -16 121 296 503 -73 243 -3
3347 -3 71 -672 -168 139 -485 475 -97 -295 -179 217 48 -67 -466 24 215 362 -564 -419 -130 235 -399
3368 -399 -35 309 -178 231 183 -827 -348 234 -27 -131 -328 311 431 108 -330 -152 624 -66 -375 -335
3388 -335 294 307 -103 198 -846 -247 33 -361 -289 486 -247 -367 195 473 -200 -738 344 -111 -164 -364
3408 -364 -91 -729 -225 -440 -87 169 -168 166 17 -508 255 -59 362 -31 -62 145 292 143 166 -365 218
3429 218 -265 305 374 -71 30 40 -72 -168 956 14 -105 203 122 -259 822 -121 -71 -417 -103 -594 19
3450 19 -222 490 -23 477 -183 -50 -43 -82 205 -286 681 -38 -621 -321 -662 190 267 382 -110 -363 -63 -144
3472 -144 311 -233 410 682 54 -342 -272 117 -163 -381 -225 -1093 -113 276 -255 -323 97 496 130 255 -107
3493 -107 271 317 140 179 494 -183 270 -376 -368 -58 1143 -587 43 -647 161 652 -17 741 -156 -47 196
3514 196 76 -269 116 -66 136 -376 413 134 -123 240 -117 42 -310 608 586 -215 602 -170 -875 354
3534 354 -57 102 -471 -253 128 -13 688 567 -686 54 -401 283 -223 529 269 -486 173 366 -366 -619
3554 -619 -54 375 415 -148 281 -48 -30 811 175 429 -28 21 63 355 118 -423 192 -238 -680 86 311
3575 311 185 -433 21 308 291 323 981 218 -127 -776 668 130 103 416 -393 -134 188 3 -232 9 191
3596 191 -41 122 -162 507 -515 -395 655 564 22 -119 -382 -416 100 119 216 -210 -281 -196 524 170 -17
3617 -17 376 187 -227 -362 415 673 197 676 -361 -419 -113 -208 528 259 56 -80 -278 34 290 239 -276
3638 -276 -16 -633 380 95 333 -643 -276 -802 -209 -290 -272 101 407 91 -471 -61 -661 162 -366 -390 810
3659 810 -420 -253 -465 237 -52 62 -122 -43 81 -322 -158 241 -172 -11 499 -81 12 -537 183 572
3679 572 -138 -554 54 -277 205 489 -557 -161 453 108 184 29 -539 -137 335 -213 -48 -352 345 225
3699 225 838 -192 -190 312 -915 395 231 354 -266 227 490 -451 -976 -77 609 312 724 178 -803 -50
3719 -50 -10 -444 -709 163 -57 141 51 41 61 -591 -117 468 -146 669 -79 -48 -297 334 -455 565 44 -74
3741 -74 791 -247 312 247 7 185 37 12 113 -301 456 -639 -276 196 -588 503 338 258 642 100
3761 100 759 -267 -217 227 -113 189 286 -105 -126 -143 596 84 464 36 -173 354 -128 -454 -80 324 -380
3782 -380 -741 4 90 -260 -346 -206 107 -2 124 114 -277 459 -152 290 1098 -519 163 -23 -686 697
3802 697 32 626 477 -222 80 263 -606 -275 -312 -191 311 -3 225 -5 562 81 471 495 443 1067 -461
3823 -461 -36 695 -460 -121 -334 -209 -377 -65 422 -107 -188 620 46 -340 -551 -102 109 20 204 -129
3843 -129 -398 270 361 449 -93 9 89 161 390 -102 1 -319 -620 271 -66 -410 181 51 -288 -230 -55 105
3865 105 -170 -275 -38 -475 410 91 580 -37 643 302 -341 475 297 19 -5 -33 -807 159 6 33 163
3886 163 -427 -35 -480 -434 -76 -293 195 125 203 -127 358 175 846 65 113 -245 60 -160 -182 2 44 394
3908 394 -500 -342 -918 -596 -356 -254 -164 -20 -279 520 116 -64 -231 -17 318 718 552 -342 -347 -20 -90
3929 -90 -314 -473 291 382 524 -262 -247 -25 150 -48 -594 531 -487 -18 -258 -943 -178 79 -414 -24
3949 -24 -291 104 307 -452 644 -453 -474 -529 -672 94 -64 58 -462 -645 -238 -39 -88 -148 290 135 176
3970 176 -476 291 678 701 764 -122 124 530 -14 267 -206 -289 3 -83 322 319 -616 -90 -76 188 107 732 -17
3993 -17 1 90 -222 -177 193 -143 425 -521 -653 113 -307 -979 351 73 -489 417 505 11 -453 640 -211
4014 -211 104 80 654 368 273 -574 -195 318 -178 -281 -4 -150 224 -104 827 146 -7 345 31 332 116
4035 116 169 281 -63 103 189 280 -28 107 462 635 -164 18 116 -773 -164 341 218 -561 -114 -14 189
4056 189 -479 -444 533 321 498 27 428 4 -432 -134 393 -176 64 -151 -127 -633 -336 94 158 -632 -192
4077 -192 189 -297 222 299 697 528 190 -276 211 -420 79 -88 -431 451 145 -61 31 -243 145 461 -221
4098 -221 -115 -7 34 195 -574 -386 49 359 -249 99 -287 -459 375 464 -735 71 -11 -81 311 244 26
4119 26 262 -135 -444 190 225 -635 82 148 33 -90 162 223 27 -941 415 244 -88 -53 -517 -135 23
4140 23 274 358 -19 -534 -209 123 360 312 634 47 -349 251 -544 -167 -423 227 -192 230 298 -278 -149
4161 -149 568 192 -22 -251 93 153 358 468 -17 17 388 51 -117 619 -269 -661 329 -377 -221 -328 -697
4182 -697 -30 347 -5 -444 28 270 242 -221 389 -123 -626 -19 97 71 708 730 -193 -70 182 16 -266
4203 -266 472 -7 381 -405 415 -6 -198 372 34 -477 26 149 -282 599 348 -37 -131 73 -131 -94 -350
4224 -350 518 -950 -557 150 -427 -18 102 523 -156 61 465 427 72 438 254 521 610 529 -7 -674 -136
4245 -136 224 -576 164 -311 335 730 76 -363 315 460 505 -254 -75 160 -781 -184 142 156 95 487 -92
4266 -92 -275 -423 45 185 99 -580 -130 -345 -316 -550 409 -83 50 942 203 306 496 -231 55 -756 191
4287 191 388 -424 514 436 382 131 225 -451 -396 542 286 -425 -151 277 -473 -264 -284 -202 574 -452 439 249
4309 249 -391 -37 -354 -589 -250 242 98 115 180 -391 285 -732 204 -302 385 138 283 504 358 385 292
4330 292 -773 -488 -469 579 255 -64 -563 -52 473 -441 -225 -1 106 326 -72 -177 332 21 488 133
4350 133 97 64 323 78 495 -277 132 53 -553 -246 77 -510 301 -142 -33 338 192 212 746 -127 -88 -192
4372 -192 -40 -2 101 240 167 -75 588 727 -793 76 -224 76 -546 223 -321 -391 -187 58 -362 210 -128
4393 -128 257 -23 -45 -45 -203 -646 -366 -203 112 223 -825 392 -46 -102 671 -423 159 -604 51 -73
4413 -73 -797 33 473 -87 -226 -75 292 140 185 -404 563 110 -723 170 -232 52 48 31 -673 274 -48 -294
4435 -294 -658 459 176 -67 -57 687 -171 -223 -96 149 -55 127 221 465 -274 122 -453 428 -123 178 -587
4456 -587 206 1397 47 -450 138 242 -114 302 -135 566 40 -126 -244 680 158 -181 -343 116 -161
4475 -161 519 -377 253 211 763 212 -248 700 261 -9 -367 644 178 -243 849 -12 259 159 -482 -343
4495 -343 365 443 -237 -653 -403 650 -142 251 105 -374 -213 405 99 -519 113 -57 -315 185 533 963
4515 963 74 86 -372 335 -1 -329 -161 391 -289 480 -325 171 367 177 675 396 -53 22 -57 -135 382
4536 382 -131 -595 -25 101 278 -108 207 719 712 789 -254 16 -591 -365 -302 41 -57 -362 200 370 94
4557 94 151 137 193 -694 90 -184 455 113 -343 -410 -984 -65 -73 291 215 -827 -260 -388 -447 -177 -83 -226 161
4580 161 465 -39 209 -174 662 295 410 -271 -274 188 -369 -288 -340 465 -845 543 126 -14 -720 -429 453
4601 453 85 -241 -173 -5 -103 -513 -53 -286 -191 56 67 -54 348 6 -4 154 18 -199 95 -82 98 28
4623 28 -108 127 126 286 513 -89 -170 370 428 -60 66 -488 612 -325 486 176 -392 -190 -33 -46 238 53
4645 53 62 -40 -637 481 268 843 229 -513 -206 -737 -835 273 -33 -451 226 281 -66 201 760 576 -129
4666 -129 119 -80 -30 -144 -36 5 -248 -130 -378 -1184 -362 106 -48 -386 1032 152 178 34 183 461 -364
4687 -364 -484 -109 -79 -603 24 -182 -102 -212 429 602 -225 -325 -24 224 382 373 -89 666 304 206 782 95
4709 95 -143 -67 85 189 59 -342 38 -21 407 -281 37 24 430 159 52 110 168 96 -47 -155 978 272
4731 272 125 492 48 617 206 149 286 -183 723 116 543 167 -82 -17 -203 440 507 370 119 -97 252
4752 252 -142 -49 175 430 -21 133 467 405 280 -169 -596 -72 464 32 512 12 -352 -255 -83 144 -319
4773 -319 437 266 340 223 248 295 352 315 -261 -471 115 -741 146 202 -789 -557 32 34 -452 151 472 -61 249
4796 249 109 14 -15 111 17 -11 203 69 553 -386 -718 356 -109 641 -209 -920 -168 -832 -293 -152 -65
4817 -65 -248 -151 -147 -294 607 -42 -286 -254 43 -393 -193 -142 -792 -658 485 24 -838 -322 -310 -139 545 624
4839 624 340 113 -337 -122 -17 227 270 -491 230 -144 -712 -5 -420 117 16 -436 -108 -584 -21 -371
4859 -371 405 704 49 -355 -283 351 358 -115 359 -52 176 382 -304 582 -78 581 33 -362 -112 57 133
4880 133 114 -303 -752 632 108 99 73 91 155 31 538 -75 34 -259 -175 273 -447 -471 -109 -215 200 162 171
4903 171 155 680 -57 -221 400 117 82 323 880 -130 -299 -364 518 402 -566 182 -121 263 -7 -203 255
4924 255 -434 -134 894 149 -140 -1014 465 722 381 -415 309 473 -62 -178 -17 -195 247 -110 420
4943 420 417 -189 -128 -70 -274 -366 -309 -63 -30 -411 147 269 -227 -85 650 -160 213 607 -404 40 -408 -300
4965 -300 -640 346 -486 -11 115 713 561 183 -328 -228 -525 -33 -95 -442 659 -708 -388 -442 115 733
4985 733 -15 968 385 193 176 161 794 -379 131 2 199 -568 -257 -661 -80 143 321 -19 -292 -710
5005 -710 528 36 -87 18 45 -343 -239 -936 -274 756 -189 191 556 525 847 -157 -400 -609 85 -6
5025 -6 -409 119 332 -262 -280 463 -56 178 849 -351 244 -748 540 -42 337 -123 -414 276 295 231 -457
5046 -457 306 69 136 -596 -188 -237 578 83 -468 -510 -368 521 279 504 292 106 119 -223 501 -301 332
5067 332 -681 -605 498 -241 439 -234 3 705 -192 -443 79 117 468 -76 979 97 140 138 162 456 -56
5088 -56 233 166 528 183 -605 260 178 -395 223 -392 -93 675 95 240 -427 -492 163 -474 -232 -459 -183
5109 -183 164 -106 -193 -210 -357 -12 206 -435 200 2 340 42 -291 770 -383 -324 -688 379 -547 292
5129 292 137 191 705 413 63 120 437 340 -324 572 137 642 380 551 115 -215 488 -61 157 171 -74
5150 -74 172 -341 114 104 -316 -466 -295 207 -195 441 -15 -102 15 154 712 -101 -180 -125 347 535 698 75
5172 75 -70 -182 291 -264 92 176 456 263 -204 -342 -532 -53 152 51 632 96 70 592 -30 612 392
5193 392 -93 -273 -907 -28 -67 -15 237 257 441 232 -92 52 -165 -40 -265 288 -83 126 309 584 458
5214 458 -136 178 -487 53 -206 -176 448 -224 277 763 -20 55 379 435 91 -6 131 -459 -173 194 128 18
5236 18 -319 -366 359 -52 101 584 581 28 -498 -45 -181 -69 56 -339 -563 -218 -637 -9 -26 -363 8 583
5258 583 -265 945 -344 -503 630 233 567 161 565 329 -617 109 89 -65 -852 875 144 -657 242
5277 242 213 46 -298 406 -331 -492 220 -293 440 -241 369 669 294 -254 -69 361 798 593 -518 -170
5297 -170 -589 -129 89 79 367 -10 -331 203 316 244 -254 122 -324 -357 -75 -767 -125 300 424 134 9
5318 9 -400 15 -264 90 -57 77 -294 -461 -93 162 -6 93 88 -105 13 -121 -312 -24 -219 713 -119 694
5340 694 -225 827 170 109 355 -416 135 66 -92 872 177 412 23 33 -15 -257 275 112 -392 -207 367
5361 367 518 206 5 -35 379 19 -593 -93 472 -175 -374 613 506 -394 -419 -198 -174 -606 -242 -508 290
5382 290 335 -326 -406 87 27 265 330 444 -34 523 1 -244 -81 18 355 369 -103 608 201 63 148 -249
5404 -249 -114 17 161 594 198 233 784 -313 -45 -671 96 52 -209 -334 -791 -593 1055 -216 -154 125
5424 125 -217 -82 -548 -489 -5 566 -227 932 -299 30 117 204 -61 -1014 339 -168 212 62 331 68
5444 68 119 771 400 50 778 160 -113 126 -104 26 373 262 460 -111 79 -84 324 -104 -770 3 173
5465 173 450 -239 315 791 588 -263 578 -345 459 -141 -691 -279 -811 732 -779 -219 538 -72 -214
5484 -214 -7 278 239 528 373 -525 61 350 -169 -311 245 294 222 86 -234 -186 442 -5 -485 -454 382 474
5506 474 245 -167 58 -301 104 -443 -261 99 158 -114 -170 -103 43 -442 299 -134 207 561 -159 -684 239
5527 239 -86 409 -286 -163 -180 46 667 315 -267 -345 -326 119 -26 -355 -514 95 -256 -319 445 212 275 403
5549 403 -128 8 -14 -248 -221 -36 18 573 237 -173 610 32 -185 126 257 -193 -125 669 195 -222 260
5570 260 -395 -194 -680 -140 -251 -164 -382 -248 250 332 76 205 -301 365 142 521 -564 74 536 -82
5590 -82 72 -107 381 500 228 -208 -308 -475 -597 -437 -318 196 -364 255 31 149 304 90 182 310 261
5611 261 -184 -212 21 -106 -112 -218 -205 -301 -156 -120 -201 -262 303 -296 -47 403 610 -72 -101 417 -369 234 -570
5634 -570 24 128 304 101 -58 747 150 -321 -106 774 214 341 173 284 121 -233 486 -1 -310 -864
5654 -864 81 705 743 -22 406 547 -218 0 793 -221 204 91 6 74 -30 162 118 251 95 13 -535
5675 -535 -734 -43 274 -95 -211 -780 483 444 69 450 -35 -738 19 376 -100 180 69 63 -188 696 -664
5696 -664 -973 -375 207 -712 -98 -373 -220 -192 -278 -343 53 -121 -513 382 97 -398 325 611 113 -529 -113
5717 -113 -435 251 175 -87 524 692 -209 -555 430 523 8 -264 -313 -310 291 10 338 471 -454 -294 -358 -173
5739 -173 -401 -67 269 410 199 794 -187 589 -14 602 918 263 287 -187 73 -363 -161 -162 262 -91 227
5760 227 122 -62 -344 78 -445 -239 -122 264 129 -671 10 417 -407 -223 -369 406 580 1 17 383
5780 383 -69 -221 -641 -632 296 228 132 269 97 -363 -162 64 57 -755 417 -21 176 -297 -208 182 1073 -644
5802 -644 -613 110 -421 639 -9 -360 529 85 -163 -570 469 451 188 807 622 -253 259 111 438 -74
5822 -74 244 -70 24 162 97 -102 -126 392 -746 -1310 319 -679 469 489 -170 -198 -82 149 -442 -165 -104
5843 -104 278 353 135 479 286 -128 -285 80 571 222 102 46 409 -311 -261 -466 -285 -294 -902 -166 -133 -235
5865 -235 441 -255 260 -494 -199 -200 61 156 -182 172 -195 -888 572 249 -679 414 -13 866 171 45
5885 45 376 -33 -215 -142 -265 -522 -176 -410 182 -480 329 111 255 -826 -256 114 371 -487 -200 828
5905 828 447 -150 271 -51 220 -144 -16 242 122 -565 -142 526 -88 -174 188 -507 -78 -495 -1080 211
5925 211 -319 114 440 -13 165 169 -452 -21 415 -169 -499 52 -303 -219 463 903 669 -36 -534 161 975
5946 975 -620 104 -375 -60 -438 155 24 -32 -209 -610 -81 146 -258 -52 -365 -75 -557 792 599 -392
5966 -392 186 -20 174 446 -772 -465 93 218 2 174 431 -210 -348 -87 -579 -760 -99 784 -827
5985 -827 -516 149 -398 593 -9 -39 -42 73 -220 -401 -252 -47 446 -259 -4 1048 -172 186 75 -153
6005 -153 -664 -448 323 -932 -290 170 148 -463 33 455 38 -351 -146 2 -64 -352 -702 111 -352 630
6025 630 45 -308 -813 -249 -479 -532 271 -27 -278 -397 162 -236 -43 78 -90 579 -126 379 347 144 -20
6046 -20 -802 -319 -122 -303 190 -633 -348 -294 360 166 140 125 -283 169 400 -302 -18 617 690 -510 901
6067 901 528 -216 192 -279 147 260 621 -399 -601 250 -360 489 381 292 -470 -159 299 -336 -551 185
6087 185 -369 322 -103 503 237 -398 454 -382 -384 90 -60 -70 454 48 266 -358 8 -55 571 -85 -181 1
6109 1 -433 242 -296 -803 -279 -579 -317 -110 -2 -159 450 484 -672 233 63 443 342 66 136 -166 -534
6130 -534 179 -294 209 496 183 -132 250 357 680 42 -208 -193 -419 583 656 460 345 52 179 -347
6150 -347 -108 149 -321 570 333 148 -52 234 -269 -402 134 364 243 250 773 703 194 -372 188 -548 219
6171 219 -640 257 262 -98 -254 117 -1171 -445 383 442 423 1 -22 -116 825 -656 -84 256 -166 -292 324
6192 324 373 -20 29 476 -519 274 -862 -32 463 467 -53 142 599 18 171 -97 380 561 -19 359 187
6213 187 635 261 -540 -45 -327 -306 -283 -158 373 -527 -488 202 -276 -460 -613 -358 392 538 -248 -54 -148
6234 -148 169 -465 614 449 252 156 -419 -272 427 -30 -260 -416 724 114 -344 84 361 -195 -128 256
6254 256 -604 802 -37 164 -309 611 433 -274 111 -141 173 239 168 13 128 605 194 -327 301 136
6274 136 174 -251 239 -516 521 -281 -193 217 42 501 609 586 -17 144 283 194 -418 -146 665 -77 -736
6295 -736 302 75 274 -304 -24 751 -313 -213 -294 -234 138 258 20 88 83 -285 -144 197 -15 268 -25
6316 -25 136 661 419 229 32 16 -247 688 -70 62 614 536 -12 86 653 -492 152 100 793 155 178 425
6338 425 65 378 53 13 67 -93 -504 262 -143 -121 257 -42 359 -438 -813 367 -387 -14 -78 172 521
6359 521 182 -298 579 246 132 -183 -345 -89 36 -194 -644 202 -466 -299 276 410 -60 -129 -140 75 232
6380 232 -570 274 -449 -327 -218 488 -102 -122 258 -74 448 131 -404 -395 109 532 277 -175 -67 -848 -522
6401 -522 548 508 -106 268 -41 -181 -268 -3 -22 618 -127 -199 -32 59 543 -259 -306 114 9 -27 90 234
6423 234 -51 238 422 -139 -325 -223 -323 279 -178 -645 294 57 65 281 557 -237 355 547 636 -106 -57
6444 -57 325 354 190 229 944 -104 483 1188 559 770 375 84 -21 -240 305 859 -92 -29 101 -241 76
6465 76 -450 648 11 -336 -298 -425 -637 186 182 609 -279 -22 483 98 70 503 450 -181 534 -100 -120 308
6487 308 -353 293 1297 136 243 248 -81 -200 217 302 -30 -384 329 40 -45 534 -141 -123 -229 -306 -129
6508 -129 -483 832 320 -725 320 255 -360 -775 290 -57 336 -330 666 414 -630 276 195 -314 -351
6527 -351 -286 -123 742 52 314 -223 11 3 272 -105 -765 -390 294 26 285 113 -521 403 283 212 512
6548 512 -118 -450 558 -413 -342 -246 527 121 -250 -641 -266 67 -867 -152 337 363 -56 -196 -123 -20 -511
6569 -511 -118 -512 -370 -213 -893 531 193 282 -286 229 128 19 992 381 62 -29 -446 -16 -455 72
6589 72 -411 605 -13 -237 198 386 112 -383 -360 208 40 -627 -15 -9 -611 -89 598 -125 -837 -486 57
6610 57 -34 377 -74 423 6 -508 -379 -762 102 212 115 -206 -142 -153 -380 -387 -318 -49 266 -21 244 -747 -444
6633 -444 -229 280 -118 184 -65 -264 -298 90 -455 -96 -318 313 0 -262 93 110 -552 51 -298 -515 735
6654 735 441 -677 -438 -489 332 -50 -219 612 -102 333 116 134 597 -179 398 1050 -257 269 -56 218
6674 218 581 -171 -40 -532 -224 299 -799 -20 374 -179 -281 380 181 190 146 -180 -323 498 90 -319 614
6695 614 -342 410 -221 692 612 641 -459 679 454 -227 -839 774 356 -54 69 -73 -564 -752 133 216
6715 216 -151 263 126 -172 252 44 -464 153 -261 -198 675 -87 -608 169 175 146 18 76 -227 -250 105 615
6737 615 264 99 363 -889 33 462 -128 -97 525 637 -146 16 468 -127 -550 601 412 -161 -14 -443
6757 -443 417 628 -154 -28 -285 -145 103 -283 302 -274 310 -262 -695 -303 -731 -512 -523 2 -78 -40 -61
6778 -61 262 -356 -31 279 -76 410 94 168 246 -343 11 -338 -410 107 -279 -420 -625 -258 670 -183 88
6799 88 -371 130 -193 -105 592 281 213 191 325 -657 198 -421 249 -632 -515 585 -21 -105 -201 -335 -253 41
6821 41 1104 -151 -146 -278 -409 108 -278 305 463 -371 -191 382 234 382 -22 -8 -258 128 -604 468
6841 468 -206 466 -76 -385 -262 -585 -214 -394 251 -404 105 -74 12 -216 -19 117 -183 -169 387 -223 787
6862 787 296 518 227 326 438 537 -281 -568 406 -600 290 454 48 536 247 -383 -204 77 509 145
6882 145 275 555 -262 -641 -279 -167 -410 146 19 352 467 -210 82 65 -304 43 -592 930 -363 284
6902 284 529 279 -383 -14 -120 -538 -312 -139 -508 -28 362 -166 308 -148 613 -639 141 -141 94 568
6922 568 251 -310 147 36 111 334 -268 -618 6 -291 55 -189 -604 -38 -278 664 -505 -60 -134 207
6942 207 491 -86 703 -662 78 -70 66 -23 -566 666 -5 160 616 -282 1079 -282 -86 -370 210
6961 210 -323 198 -395 -308 626 249 -116 -157 52 -57 -612 -946 741 -128 126 -212 229 370 -134 13
6981 13 -165 154 -176 231 355 -76 -253 -441 634 -111 84 278 -64 46 37 -62 -496 200 151 203 29 -18
7003 -18 45 195 -686 68 370 -177 118 305 -92 118 -625 -26 -485 448 441 135 -120 -495 -58 -642 -21
7024 -21 -315 -72 -859 -153 -224 -434 31 -133 86 -141 223 481 -946 59 -66 179 424 114 -81 73
7044 73 -245 358 713 536 818 83 -362 -189 579 591 175 -79 560 -216 -197 -323 301 -69 116 -401 338
7065 338 418 518 -197 153 120 -445 -327 116 368 255 934 -254 413 -281 -7 138 298 -285 -207 283 -359
7086 -359 89 -712 -113 -148 375 -68 -159 96 -287 153 -3 -139 645 159 170 -152 -30 -230 666 13 -67
7107 -67 411 -595 -85 257 -200 509 156 -268 -225 205 286 16 -304 -233 -587 -122 498 -161 276 417 507
7128 507 35 411 203 -742 312 440 -255 468 -136 -382 66 -518 -40 26 3 -221 -924 -81 -90 312 192
7149 192 -10 350 -287 -291 -411 498 -2 -637 -17 106 3 247 -172 25 289 -63 125 369 -195 468 246
7170 246 1358 638 -213 -294 -831 539 568 217 120 130 472 473 -477 -249 47 -585 -425 775 -330 -262 849
7191 849 -47 -247 510 -438 -197 333 301 547 -100 148 118 -204 -370 -31 256 -292 505 -360 -53 108 -594
7212 -594 89 -623 -389 -446 -362 -528 242 -6 239 -272 -309 809 -1096 216 -65 24 -424 -548 -245 307
7232 307 -321 267 280 -523 87 -1 213 429 557 97 -191 -312 65 -191 433 140 308 116 318 -252 -115
7253 -115 317 130 -151 344 719 291 238 -596 -783 385 193 -192 313 23 585 1138 -563 -237 35 -22
7273 -22 -329 428 54 -69 -601 -303 220 -105 -213 -37 15 -65 17 -49 -113 471 -457 205 198 -21 358 -67 -447
7296 -447 -672 16 191 -302 -542 -337 205 -215 -490 -76 -100 684 -158 157 -424 293 550 509 -171 -114 -165
7317 -165 85 198 670 213 283 -93 21 248 -252 -176 -205 -238 202 136 -607 -115 80 -206 912 -68 -689
7338 -689 -145 682 -259 -250 -314 -719 176 -20 -355 387 0 292 -226 -281 -1003 -400 -561 -267 -232 -965 -354 -18
7360 -18 -294 -42 -181 -409 610 -377 -425 90 428 -421 150 -265 410 415 -295 227 -308 345 -155 183 -220
7381 -220 106 105 -147 -428 255 11 -157 211 287 -21 -22 -309 -421 198 437 282 -526 356 420 60 510 188
7403 188 -429 208 -940 117 -610 512 244 3 57 -136 362 1 -194 -313 -490 -396 730 662 -215 431
7423 431 -170 -274 -535 -323 564 119 56 -400 -144 -595 -154 587 564 356 -94 -467 55 290 180 29 347
7444 347 -683 -59 117 146 -62 -283 68 119 -290 -176 205 83 -118 47 726 82 -3 -954 427 -266
7464 -266 530 551 264 410 99 236 154 86 144 -525 102 -299 128 -540 500 265 -165 384 -711 357
7484 357 -67 -446 -143 -487 -510 -30 596 -375 248 626 -353 -487 -429 -475 442 165 -449 59 -153 151 128
7505 128 569 -3 -459 -511 -13 -584 -411 791 547 215 -332 -1 219 175 -92 324 509 -5 -210 491
7525 491 375 -195 5 -293 -379 25 -589 -201 -86 -155 -398 361 -20 96 -31 497 -749 339 425 -937
7545 -937 -108 548 837 385 -245 196 -10 -152 -202 -215 170 430 74 84 44 -407 473 -330 136 -277 655
7566 655 -279 -151 491 -525 148 -259 139 -191 -17 304 287 18 -433 -119 510 -574 89 45 67 -215
7586 -215 392 405 -298 659 227 221 935 -120 838 -422 -773 200 839 546 -407 -473 59 -104 67 182 -166
7607 -166 150 -61 490 216 838 60 -578 -483 -403 -142 167 -484 538 -610 161 -771 -54 661 362 126
7627 126 -644 -608 -84 -24 -98 154 451 39 117 -251 -190 -546 -556 -377 -415 352 -179 -45 76 -176 314 307 -93
7650 -93 -345 299 -154 -550 -814 291 -433 448 -6 -320 41 208 305 -31 -502 -298 376 350 107 493 -444
7671 -444 141 200 -158 -46 764 -28 -193 550 247 -88 -168 -27 -37 -20 -862 -41 -284 -185 338 -137 146 -282
7693 -282 -382 -960 -41 -1078 -455 125 278 -121 594 386 -45 -241 502 630 887 -762 -328 438 326
7712 326 -214 186 383 108 69 95 131 -371 -74 -435 -369 -107 -401 208 208 25 -423 134 237 350 -251 -762
7734 -762 336 -21 34 73 -110 -223 -30 -127 -500 326 17 -400 -152 -76 314 157 -70 24 450 453 -162 -387
7756 -387 196 39 78 -636 -567 626 375 113 153 343 -135 -106 -523 307 79 -176 -130 -344 -342 64 -3 -135
7778 -135 -210 -29 -345 -138 151 -106 168 177 263 263 283 -66 228 310 157 310 -224 -655 154 115 297 588 340
7801 340 100 86 -573 461 135 -88 247 354 549 -175 -693 -776 360 628 599 244 -314 272 -332 60
7821 60 -29 422 -184 123 -92 -339 -71 211 135 -21 229 382 -786 -307 139 -555 336 367 -105 -20 -475
7842 -475 104 876 -31 -185 685 -190 225 673 -310 452 115 179 299 78 -211 1060 225 -120 -283 638
7862 638 192 -40 52 47 32 237 -122 -226 -511 -236 59 -230 189 -110 9 -139 -344 -267 337 -352 -151 -470
7884 -470 1 575 63 -695 604 -339 -588 -630 93 476 -369 -158 -381 -72 -387 502 51 -108 -433 -316
7904 -316 644 -630 -532 7 -1291 -281 892 168 -263 -868 139 41 13 -165 185 611 412 57 -352
7923 -352 212 -87 119 -111 72 275 206 -640 545 -294 364 385 -11 452 599 210 -67 157 -149 -553
7943 -553 15 -435 -41 -100 -473 552 783 371 458 167 -385 -419 303 243 329 375 172 -382 -150 -155 76 262
7965 262 -354 114 24 -65 -515 635 166 799 -537 346 -211 24 -484 -8 -115 564 -667 485 98
7984 98 128 67 -80 401 -493 589 -33 98 50 -599 -473 142 -257 416 -705 -117 -847 -645 914 371
8004 371 189 383 -222 -342 539 -183 -389 80 -99 33 443 -197 0 78 -493 88 -809 -352 362 -358
8024 -358 334 -261 -800 -354 112 -12 71 458 -10 -348 -894 86 90 192 -252 190 -68 106 -466 -310 97
8045 97 -385 -5 76 -431 -127 423 125 385 206 -280 842 -205 249 -185 290 589 601 -333 549 502 247
8066 247 665 506 -1027 -282 -54 -494 83 208 -65 155 -354 423 -47 483 -213 -178 176 88 -267 -144
8086 -144 55 115 469 128 -901 -245 -507 290 221 -158 37 -201 586 -629 -471 -336 -98 -646 163 244
8106 244 10 -263 384 -394 47 128 -641 209 324 -274 -8 -26 267 -263 -298 -192 -99 -357 -100 924 21
8127 21 353 339 490 -607 -1114 -225 358 7 299 -119 24 471 313 -759 587 769 37 -450 -141 211
8147 211 -431 62 -466 263 -115 255 -241 -50 -118 -162 -212 437 409 86 403 -224 -709 146 -228 -436 70
8168 70 440 -146 248 -273 320 -247 -166 -206 706 -654 316 -218 -258 137 301 385 366 -87 -158 331 -198 -79
8190 -79 -396
8191c96
##END NTUPLES=NMR FID
##END=
