##TITLE=1H_DE-31k
 D2O
 8 sc, 
 12.2.2024
##JCAMPDX= 6.0         $$ Bruker NMR JCAMP-DX V2.0
##DATA TYPE= NMR FID
##DATA CLASS= NTUPLES
##ORIGIN= UXNMR, Bruker Analytische Messtechnik GmbH
##OWNER= root
$$ XWIN-NMR		Version 3.5
$$ Mon Feb 12 16:03:07 2024 Russian Standard Time (UT+4h)  she@DPX200
##.OBSERVE FREQUENCY= 200.1313
##.OBSERVE NUCLEUS= ^1H
##.DELAY= (6, 6)
##.ACQUISITION MODE= SIMULTANEOUS
##.ACQUISITION SCHEME= undefined
##.AVERAGES= 8
##.DIGITISER RES= 18
##SPECTROMETER/DATA SYSTEM= spect
##.PULSE SEQUENCE= zg30
##.SOLVENT NAME= D2O
##.SHIFT REFERENCE= (INTERNAL, D2O, 0, 15.7039)
##AUDIT TRAIL= $$ (NUMBER, WHEN, WHO, WHERE, WHAT)
$$ ##TITLE= Audit trail, XWIN-NMR		Version 3.5
$$ ##JCAMPDX= 5.01
$$ ##ORIGIN= Bruker BioSpin GmbH
$$ ##OWNER= she
$$ F:/spectra/data/she/nmr/H-F/1/audita.txt
$$ ##AUDIT TRAIL=  $$ (NUMBER, WHEN, WHO, WHERE, WHAT)
(   1,<2024-02-12 16:01:52.28 +0400>,<she>,<DPX200>,
      <created by zg, POWCHK disabled, PULCHK disabled
       configuration hash MD5:
       00 E9 B6 7A A2 85 ED C7 34 08 36 98 17 FE 4E 26
       data hash MD5: 16K
       B9 E3 2C E9 49 95 E3 B6 7F 43 44 1B 24 63 B5 08>)
$$ ##END=
$$ 
$$ hash MD5
$$ F3 9A D9 15 B5 76 72 CC 47 7A 5D 30 91 2E E9 27
##$RELAX= 
##$RELAX= 
##$RELAX= 
##$RELAX= 
##$RELAX= 
##$RELAX= 
$$ Bruker specific parameters
$$ --------------------------
##$DU= <F:/spectra>
##$EXPNO= 1
##$NAME= <H-F>
##$PROCNO= 1
##$TYPE= <nmr>
##$USER= <she>
##$AMP= (0..31)
100 100 100 100 100 100 100 100 100 100 100 100 100 100 100 100 100 100 
100 100 100 100 100 100 100 100 100 100 100 100 100 100 
##$AQSEQ= 0
##$AQ_mod= 1
##$AUNM= <au_zg>
##$AUTOPOS= <>
##$BF1= 200.13
##$BF2= 200.13
##$BF3= 200.13
##$BF4= 200.13
##$BF5= 200.13
##$BF6= 200.13
##$BF7= 200.13
##$BF8= 200.13
##$BYTORDA= 1
##$CFDGTYP= 0
##$CFRGTYP= 5
##$CHEMSTR= <none>
##$CNST= (0..31)
1 1 145 1 1 1 1 1 1 1 1 1 1 1 1 1 1 1 1 1 1 1 1 1 1 1 1 1 1 1 1 1 
##$CPDPRG= <>
##$CPDPRG1= <>
##$CPDPRG2= <>
##$CPDPRG3= <>
##$CPDPRG4= <mlev>
##$CPDPRG5= <mlev>
##$CPDPRG6= <mlev>
##$CPDPRG7= <mlev>
##$CPDPRG8= <mlev>
##$CPDPRGB= <>
##$CPDPRGT= <>
##$D= (0..31)
0 1.2 0 0 0 0 0 0 0 0.06 0 0.03 0 0 0 0 0.0002 0 0 0 0 0 0 0 0 0 0 0 0 
0 0 0 
##$DATE= 1707739311
##$DBL= (0..7)
120 120 120 120 120 120 120 120 
##$DBP= (0..7)
150 150 150 150 150 150 150 150 
##$DBP07= 0
##$DBPNAM0= <>
##$DBPNAM1= <>
##$DBPNAM2= <>
##$DBPNAM3= <>
##$DBPNAM4= <>
##$DBPNAM5= <>
##$DBPNAM6= <>
##$DBPNAM7= <>
##$DBPOAL= (0..7)
0.5 0.5 0.5 0.5 0.5 0.5 0.5 0.5 
##$DBPOFFS= (0..7)
0 0 0 0 0 0 0 0 
##$DE= 6
##$DECBNUC= <off>
##$DECIM= 32
##$DECNUC= <off>
##$DECSTAT= 4
##$DIGMOD= 1
##$DIGTYP= 9
##$DL= (0..7)
0 120 120 120 120 120 120 120 
##$DP= (0..7)
150 150 150 150 150 150 150 150 
##$DP07= 0
##$DPNAME0= <>
##$DPNAME1= <>
##$DPNAME2= <>
##$DPNAME3= <>
##$DPNAME4= <>
##$DPNAME5= <>
##$DPNAME6= <>
##$DPNAME7= <>
##$DPOAL= (0..7)
0.5 0.5 0.5 0.5 0.5 0.5 0.5 0.5 
##$DPOFFS= (0..7)
0 0 0 0 0 0 0 0 
##$DQDMODE= 0
##$DR= 18
##$DS= 0
##$DSLIST= <SSSSSSSSSSSSSSS>
##$DSPFIRM= 0
$$ [...]
##$SUBNAM2= <"">
##$SUBNAM3= <"">
##$SUBNAM4= <"">
##$SUBNAM5= <"">
##$SUBNAM6= <"">
##$SUBNAM7= <"">
##$SUBNAM8= <"">
##$SUBNAM9= <"">
##$SW= 18.0517328524113
##$SWIBOX= (0..15)
0 0 2 0 0 0 0 0 0 0 0 0 0 0 0 0 
##$SW_h= 3612.71676300578
##$TD= 16384
##$TD0= 1
##$TE= 0
##$TE2= 300
##$TE3= 300
##$TEG= 300
##$TL= (0..7)
0 120 120 120 120 120 120 120 
##$TP= (0..7)
150 150 150 150 150 150 150 150 
##$TP07= 0
##$TPNAME0= <>
##$TPNAME1= <>
##$TPNAME2= <>
##$TPNAME3= <>
##$TPNAME4= <>
##$TPNAME5= <>
##$TPNAME6= <>
##$TPNAME7= <>
##$TPOAL= (0..7)
0.5 0.5 0.5 0.5 0.5 0.5 0.5 0.5 
##$TPOFFS= (0..7)
0 0 0 0 0 0 0 0 
##$TUNHIN= 0
##$TUNHOUT= 0
##$TUNXOUT= 0
##$USERA1= <user>
##$USERA2= <user>
##$USERA3= <user>
##$USERA4= <user>
##$USERA5= <user>
##$V9= 5
##$VALIST= <valist>
##$VCLIST= <CCCCCCCCCCCCCCC>
##$VD= 0
##$VDLIST= <DDDDDDDDDDDDDDD>
##$VPLIST= <PPPPPPPPPPPPPPP>
##$VTLIST= <TTTTTTTTTTTTTTT>
##$WBST= 1024
##$WBSW= 4
##$XGAIN= (0..3)
0 0 0 0 
##$XL= 0
##$YL= 0
##$YMAX_a= 70627
##$YMIN_a= -110800
##$ZGOPTNS= <>
##$ZL1= 120
##$ZL2= 120
##$ZL3= 120
##$ZL4= 120
##$ABSF1= 10
##$ABSF2= 0
##$ABSG= 5
##$ABSL= 3
##$ALPHA= 0
##$AQORDER= 0
##$ASSFAC= 0
##$ASSFACI= 0
##$ASSFACX= 0
##$ASSWID= 0
##$AUNMP= <proc_1d>
##$AZFE= 0.1
##$AZFW= 0.1
##$BCFW= 1
##$BC_mod= 2
##$BYTORDP= 1
##$COROFFS= 0
##$CY= 11.3945322036743
##$DATMOD= 1
##$DC= 2
##$DFILT= <>
##$DTYPP= 0
##$F1P= 15.7292609196834
##$F2P= 12.9074282941183
##$FCOR= 0.5
##$FTSIZE= 0
##$FT_mod= 4
##$GAMMA= 1
##$GB= 0.15
##$INTBC= 1
##$INTSCL= 1
##$ISEN= 128
##$LB= 0.24
##$LEV0= 0
##$LPBIN= 0
##$MAXI= 10000
##$MC2= 0
##$MEAN= 0
##$ME_mod= 0
##$MI= 1.114404
##$NCOEF= 0
##$NC_proc= 0
##$NLEV= 6
##$NOISF1= 3.799351
##$NOISF2= 2.8
##$NSP= 1
##$NTH_PI= 0
##$NZP= 0
##$OFFSET= 15.70392
##$PC= 1
##$PHC0= -24949.88
##$PHC1= 9.652697
##$PH_mod= 1
##$PKNL= yes
##$PPARMOD= 0
##$PSCAL= 0
##$PSIGN= 0
##$REVERSE= no
##$SF= 200.130013532006
##$SI= 16384
##$SIGF1= 3
##$SIGF2= 2
##$SINO= 400
##$SIOLD= 16384
##$SREGLST= <1H.CDCl3>
##$SSB= 0
##$STSI= 0
##$STSR= 0
##$SW_p= 3612.71676300578
##$SYMM= 0
##$S_DEV= 0
##$TDeff= 0
##$TDoff= 0
##$TI= <>
##$TILT= no
##$TM1= 0
##$TM2= 0
##$TOPLEV= 0
##$USERP1= <user>
##$USERP2= <user>
##$USERP3= <user>
##$USERP4= <user>
##$USERP5= <user>
##$WDW= 1
##$XDIM= 8192
##$YMAX_p= 0
##$YMIN_p= 0
$$ End of Bruker specific parameters
$$ ---------------------------------
##NTUPLES= NMR FID
##VAR_NAME=  TIME,          FID/REAL,        FID/IMAG
##SYMBOL=    X,             R,               I
##VAR_TYPE=  INDEPENDENT,   DEPENDENT,       DEPENDENT
##VAR_FORM=  AFFN,          ASDF,            ASDF
##VAR_DIM=   8192,          8192,            8192
##UNITS=     SECONDS,       ARBITRARY UNITS, ARBITRARY UNITS
##FACTOR=    0.0002768,     1,               1
##FIRST=     0,             0,               0
##LAST=      2.2672688,     0,               0
##MIN=       0,             -110800,         0
##MAX=       2.2672688,     70627,           0
$$ Real data points
##PAGE= N=1
##DATA TABLE= (X++(R..R)), XYDATA
$$ [...]
$$ plain form
2331 -5 1343 2033 2215 1308 345 -1046 -1931 -2098 -1624 -395 1167 2214 2151 1699 573 -840 -1972 -2285
2349 -2285 -1603 -469 769 1537 2236 1870 666 -758 -1694 -2177 -1865 -1000 336 1508 1933 2106 882
2366 882 -338 -1738 -2181 -1781 -1090 -141 1210 2338 2119 1167 -182 -1254 -1715 -1929 -1264 -281 1039 2078
2384 2078 2298 1442 467 -925 -1896 -2103 -1508 -457 887 2015 2012 1494 566 -728 -1576 -2174 -1524 -741 991
2403 991 1735 2248 1582 846 -399 -1666 -2041 -1693 -765 397 1175 1831 1856 939 -37 -1492 -2086 -1756 -1046
2422 -1046 138 1172 1844 2110 1081 76 -1495 -2112 -1710 -1012 75 888 1783 2334 1171 -217 -1041
2439 -1041 -1741 -1840 -1273 -378 945 1892 2147 1459 585 -1101 -1569 -1883 -1573 -765 484 1520 2004 1656 982
2458 982 -424 -1189 -1944 -1571 -866 324 1540 1669 1801 832 145 -1195 -1894 -2024 -1146 -10 1073 1535
$$ packed form
2331eJ348O90J82r07r63j391q85j67M74J229J562J047o3m52j126j413j132l13
2349b285O82J134J238P68O99l66j204j424r36m83L12Q65J336J172M25J73j224
2366H82j220j400m43M00O91R49J351J128k19r52j349j072m61k14O65R83J320J039
2384B078K20q56r75j392r71k07N95J051J344J128ln18r28j294q48n98O50P83J732
2403I91P44N13o66p36j245j267l75L48R28J162P78O56K5r17r76j455n94L30P10
2422a046J184J034O72K66j029j005j571o17M02O98J087Q13Q95N51j163j388q24
2439a041p00r9N67Q95J323R47K55o88q74j686m68l14L10Q08J249J036M84l48o74
2458I82j406p65p55L73P05J190J216J29J32r69o87j340o99j30Q78J136J083M62
$$ plain form
2476 1535 1595 1366 6 -1029 -1778 -1994 -1165 -257 928 1496 1849 1386 204 -1047 -1796 -1952 -1312 -372
2494 -372 535 1656 2041 1820 502 -621 -1503 -1900 -1531 -867 387 1443 2143 1828 982 -352 -1256 -1944
2512 -1944 -1969 -947 71 1266 2162 1890 1073 -302 -979 -1829 -1858 -1262 64 1168 1921 1780 1239 102
2530 102 -924 -1918 -1930 -1086 -80 978 1674 1967 1245 336 -546 -1571 -1843 -1329 -270 821 1404 1820
2548 1820 1377 880 -430 -1909 -2015 -1303 -639 295 1346 1865 1577 887 -523 -1307 -1680 -1562 -828 -138
2566 -138 1382 1840 1660 1045 -112 -1140 -1527 -1634 -1162 -258 1084 1994 1772 1406 359 -934 -1599 -1891
2584 -1891 -1218 -544 953 1757 1560 1022 413 -675 -1379 -1661 -1080 -596 389 1452 1708 1437 830 -303
2602 -303 -1334 -1750 -1652 -624 271 1541 1543 1691 944 -69 -1257 -1788 -1538 -985 -37 1137 1444 1841 1198
$$ packed form
2476A535O0k29j360j035p49k16Q29R08J185N68L53m63j182j251p49j56O40R40
2494c72R07J121L85k21j318j123q82l97L69O64J254J056P00l15q46j334r04o88
2512a944k5J022J018J195Q96k72q17j375o77q50k9N96J326J104P53j41n41j137
2530A02j026r94j2Q44J006J058O96K93p22r09q82j025k72N14J059J091N83M16
2548A820m43m97j310j479j06P12O64R34J051N19k88o90j410p84l73J18P34O90
2566a38J520M58j80o15j157j028l87j07M72R04J342R10k22l66j047j293o65k92
2584a891O73O74J497Q04j97n38o09j088p04k82N81M84R85J063K56k71o07j133
2602c03j031m16R8J028Q95J270KJ48p47j013j188n31K50N53R48J174L07L97o43
$$ plain form
2621 1198 -10 -884 -1583 -1437 -996 -147 718 1598 1722 1305 107 -955 -1563 -1721 -1186 -410 635 1487
2639 1487 1769 1384 276 -557 -1305 -1863 -1485 -735 549 1326 1682 1472 831 -282 -1517 -1859 -1662 -903
2657 -903 188 1058 1549 1702 895 -69 -911 -1647 -1830 -793 100 1066 1752 1963 1009 -60 -913 -1478 -1841
2676 -1841 -947 -328 757 1367 1606 1019 236 -682 -1318 -1586 -1227 -98 832 1564 1678 1347 806 -363 -1468
2695 -1468 -1709 -1614 -592 356 1227 1785 1481 789 -415 -1007 -1552 -1520 -819 162 785 1352 1507 602 96 -1100
2715 -1100 -1542 -1588 -1011 -209 893 1424 1755 805 48 -955 -1587 -1544 -1089 -59 685 1482 1662 1237 337
2734 337 -311 -1264 -1541 -1404 -249 188 1221 1434 1289 587 -203 -1348 -1650 -1570 -849 381 1104 1559 1386
2753 1386 838 81 -1071 -1492 -1443 -934 344 1134 1489 1578 729 12 -957 -1557 -1604 -865 -173 779 1672 1414
$$ packed form
2621A198j208q74o99J46M41Q49Q65Q80J24m17j198j062o08j58N35P76J045Q52
2639A487K82l85j108q33p48n58L78P50J284P77L56k10o41j113j235l42J97P59
2657i03J091Q70M91J53q07r64q42p36j83J037Q93R66O86K11r54j069q53n65l63
2676a841Q94O19J085O10K39n87p83r18o36k68L59J129R30P32J14l31n41j169j105
2695a468k41R5J022R48Q71N58l04o92j204n92n45L2P01R81O23N67J55r05n06j196
2715a100m42m6N77Q02J102N31L31r50p57j003o32M3M55J030P44P97J80m25r00
2734C37o48r53k77J37J155M37J033K13j45p02p90j145l02Q0P21J230P23M55j73
2753A386n48p57j152m21M9N09J278P90L55Q9q49p17r69o00m7P39O92R52Q93k58
$$ plain form
2773 1414 1167 338 -762 -1339 -1720 -985 -226 418 1509 1865 1427 358 -325 -1207 -1723 -1357 -642 654
2791 654 1281 1528 1329 574 -253 -1040 -1634 -1476 -555 431 1058 1855 1247 731 -20 -1281 -1577 -1609 -790 -52
2811 -52 1055 1443 1596 896 123 -835 -1472 -1466 -914 25 662 1542 1342 1204 365 -726 -1315 -1474 -983 -421
2831 -421 585 1124 1436 1253 410 -548 -1322 -1631 -1154 -499 205 1246 1492 1341 506 -230 -1196 -1269 -1461 -1018
2851 -1018 88 943 1445 1199 741 0 -614 -1348 -1267 -1126 -216 549 1296 1601 994 242 -533 -1194 -1701 -1354
2871 -1354 -101 708 1320 1293 1196 455 -479 -1271 -1518 -1128 -482 512 1267 1654 1057 517 -373 -947 -1857 -1378
2891 -1378 -477 267 1207 1526 1485 697 -173 -711 -1402 -1351 -772 51 874 1513 1367 978 -31 -837 -1244 -1465
2911 -1465 -968 -369 687 1440 1369 1190 261 -691 -1185 -1162 -1151 -369 731 1284 1500 1096 295 -482 -1155 -1503
$$ packed form
2773A414k47q29j100n77l81P35P59O44J091L56m38j069o83q82n16L66P15J296
2791F54O27K47j99p55q27p87n94J58R21R86O27P97o08n16p51j261k96l2Q19P38
2811e2J107L88J53p00p73r58o37ON52R39O37Q80k00j38q39j091n89j59M91N62
2831d21J006N39L12j83q43r58p74l09M77O55P04J041K46j51q35p36r66p3j92M43
2851a018J106Q55N02k46m58p41o14p34Q1J41R10P65P47L05o07p52p75o61n07L47
2871a354J253Q09O12k7r7p41r34p92k47L90O46R94P55L87n97n40q90n74r10M79
2891a378R01P44R40L19m1p88q70n38o91N1N79Q23Q23O39j46l89j009q06m07k21
2911a465M97N99J056P53p1j79r29r52m94K3J1P82J100N53K16m04q01p77o73l48
$$ plain form
2931 -1503 -1349 -475 525 1321 1465 1217 1038 -199 -970 -1453 -1618 -605 341 1245 1332 1447 851 -264 -867
2950 -867 -1417 -1329 -703 -138 746 1306 1298 1053 93 -965 -1348 -1046 -815 -103 518 1129 1638 701 185 -659 -1307
2971 -1307 -1546 -1069 -334 568 1122 1413 1016 359 -412 -931 -1227 -1031 -596 397 1079 1449 1304 584 -318 -915
2991 -915 -1485 -1104 -560 -2 1148 1413 1214 891 11 -1034 -1414 -1249 -603 297 921 1229 1402 868 143
3010 143 -763 -1291 -1591 -1094 -250 419 1145 1376 917 363 -331 -1246 -1265 -1228 -336 314 1241 1582 1139 568 -91
3031 -91 -1275 -1374 -1269 -433 221 1306 1103 1239 664 -316 -910 -1367 -1341 -793 297 710 1365 1404 602 -50
3051 -50 -673 -1238 -1341 -878 -237 1126 1506 1285 567 98 -757 -1306 -1370 -1100 -371 784 1433 1498 1023 379
3071 379 -369 -1062 -1412 -1121 -600 480 892 1474 1069 286 -227 -1228 -1177 -1051 -550 291 742 1281 1279 357
$$ packed form
2931a503J54Q74J000P96J44k48j79j237p71m83j65J013R46R04Q7J15n96j115o03
2950h67n50Q8O26N65Q84N60qk45r60j058l83L02K31P12O21O11N09r37n16q44o48
2971a307k39M77P35R02N54K91l97o57p71n19k96J96M35R93O82L70j45p20r02n97
2991i15n70L81N44N58J150K65j99l23q80j045l80J65O46R00O24L08J73n34p25
3010A43r06n28l00M97Q44O69P26K31m59n54o94r15j9L7Q92O50R27L41m43n71o59
3031i1j184r9J05Q36O54J085k03J36n75r80n94m57K6N48J090M13O55L9q02o52
3051e0o23n65j03M63O41J363L80k21p18m69q55n49o4K70P29J155O49O5m75o44
3071C79p48o93l50K91N21J080M12N82m05p83n13j001N1J26N01Q41M51N39kr22
$$ plain form
3091 357 -203 -825 -1345 -1482 -729 -25 636 1244 996 810 36 -1002 -1224 -1321 -1011 -281 452 1371 1048 900
3111 900 63 -710 -1243 -1376 -1088 -216 411 997 1328 918 279 -469 -927 -1063 -1248 -550 446 909 1309 1238
3131 1238 410 -149 -994 -1438 -1147 -686 421 791 1262 1006 834 -126 -890 -1086 -1269 -795 -402 710 1299
3150 1299 1248 843 -77 -677 -1450 -1127 -1030 -184 526 1000 1256 1067 11 -458 -1064 -1247 -959 -182 438 1204
3170 1204 1479 1221 189 -402 -1078 -1203 -1018 -417 142 1036 1549 1158 333 -271 -881 -1292 -1240 -688 252 1071
3190 1071 1040 1062 863 -119 -564 -1191 -1228 -842 141 680 1262 1218 730 176 -545 -1187 -1381 -1024 -313 467 1010
3211 1010 1334 1024 449 -653 -1039 -1062 -943 -296 576 693 1217 1157 856 -198 -1023 -1475 -1167 -803 320
3230 320 829 1220 1013 324 198 -804 -1175 -1184 -724 171 720 990 1146 671 100 -869 -1104 -1339 -994 -176
$$ packed form
3091C57n60o22n20j37P53P04O61O08k48j86p74j038k22r7L10P30P33R19l23j48
3111I00q37p73n33j33K88Q72O27N86L31m10o39p48m58j36j85O98R96M63M00p1
3131A238q28n59q45m44K91M61J107L70M71k56j72r60p64j96j83M74L93J112N89
3150A299n1m05r20o00p73L23R7Q46P10M74K56j89j056m69o06j83K88P77O20P66
3170A204K75k58j032n91o76j25J85O01N59Q94N13l91q25o04o10m11N2N52R40Q19
3190A071l1K2j99r82m45o27l7L86R83N39N82m4m88n54p21o42j94L57P11P80N43
3211A010L24l10n75j102l86k3J19O47Q72J17N24o0l01j054q25m52L08L64J123
3230C20N09L91k07o89j26j002l71rM60Q95N49K70J56m75n71r69k35k35L45Q18
$$ plain form
3250 -176 502 1225 1328 1037 180 -279 -1059 -1366 -946 -138 508 1053 1431 932 652 -247 -984 -1396 -1116 -254
3270 -254 484 745 1333 1241 705 -128 -900 -1413 -1098 -562 266 915 1071 999 759 -58 -879 -1269 -1065 -692 -56
3291 -56 601 1142 1156 732 189 -573 -931 -1421 -771 150 490 1189 1175 945 154 -496 -1185 -1228 -814 -349 262
3312 262 1048 1218 912 496 -402 -844 -1162 -1317 -345 359 932 1224 1086 540 -149 -981 -1193 -1172 -678 61
3332 61 948 1329 992 676 -135 -423 -1004 -1196 -784 89 566 1028 1321 836 98 -692 -1236 -1069 -961 -330
3352 -330 387 867 1210 806 467 -364 -777 -1342 -1019 -358 563 885 1152 1089 577 -451 -879 -1184 -906 -650
3372 -650 347 832 1191 1003 707 -325 -704 -1293 -881 -619 126 649 812 1339 691 2 -781 -1179 -1168 -714
3392 -714 -31 621 1204 1038 674 310 -454 -774 -1357 -830 -225 386 1142 1325 976 355 -330 -936 -1456 -907
$$ packed form
3250a76O78P23J03k91q57m59p80l07M20Q08O46N45L78m99k80q99p37m12K80Q62
3270b54P38K61N88r2n36q33p72n13L15N36Q28O49J56p2k40q17q21l90K04L73O36
3291e6O57N41J4m24n43p62l58m90O50R21L40O99j4k30p91o50o89m3M14M65O11
3312B62P86J70l06m16q98m42l18j55R72P04N73K92j38n46o89q32k12K1M94P39
3332F1Q87L81l37l16q11k88n81j92M12Q73M77M62K93m85p38p90n44J67J08O31
3352c30P17M80L43m04l39q31m13n65L23O61R21L22K67o3n12j028m28l05K78K56
3372f50R97M85L59j88k96j032l79n89M12K62P45N23J63N27o48o89p83l98J1M54
3392g14O83O52N83j66l64l64p64l20n83N27O05O11P56J83l49o21o85o06n20N49
$$ plain form
3412 -907 -611 317 1051 1265 1029 375 -293 -832 -1268 -1010 -537 136 663 1017 1214 733 79 -734 -1056 -1166
3432 -1166 -603 82 618 1129 1113 866 25 -692 -982 -982 -830 75 512 1050 1187 774 166 -664 -754 -1241 -959
3453 -959 -251 344 858 1386 857 526 -290 -763 -1411 -912 -526 319 964 1257 856 609 -230 -767 -1017 -1088
3473 -1088 -534 244 839 1174 1008 705 65 -795 -1012 -1082 -643 -48 564 883 1263 882 157 -523 -1220 -1416
3493 -1416 -855 -85 512 1208 1092 732 174 -431 -1080 -1126 -975 -506 254 955 1283 1005 368 -350 -1007 -1183
3513 -1183 -1013 -580 141 915 1137 1172 643 -194 -678 -1222 -807 -821 262 608 1319 1058 630 92 -430 -1219
3533 -1219 -1164 -775 -11 494 994 1170 672 46 -498 -969 -1113 -701 -232 308 994 1037 989 338 -412 -970 -1429
3554 -1429 -854 -351 234 449 1242 734 538 -126 -832 -1179 -832 -789 416 927 1322 1068 358 -111 -861 -848
$$ packed form
3412i07K96R28P34K14k36o54o68n39m36K58M73O73N27L54J97m81o54q13l22j10
3432a166N63O85N36N11j6k47q41p17k90%J52R05M37N38J37m13o08q30r0m87K82
3453i59P08N95N14N28n29l31q16m73o48M99L86Q45O45K93m01k47q39n37k50p1
3473a088N54P78N95L35j66l03o40q60k17p0M39N95O12L19L80l81p25o80o97j96
3493a416N61P70N97O96j16l60n58o05o49m6J51M69P60P01L28k78o37p18o57j76
3513a183J70M33P21P74K22L5n29q37m84n44M15j4J083L46P11k61m28n38n22p89
3533a219N5L89P64N05N00J76m98o26n44m71j44M12M69N40O86M3m8o51p50n58m59
3554a429N75N03N85K15P93n08j96o64p06l47L47M3J205N11L95k54p10m69p50J3
$$ plain form
3574 -848 -1113 -314 -190 651 1137 1060 541 150 -628 -891 -934 -750 -54 667 1182 1014 648 -11 -411 -761 -1361
3595 -1361 -657 -296 448 972 1016 625 498 -358 -828 -1066 -1107 -379 258 1076 1183 921 468 -1 -835 -1162
3615 -1162 -1119 -478 93 799 1234 832 295 -92 -551 -1046 -1135 -613 -95 511 1223 1194 628 144 -477 -1036 -1131
3636 -1131 -597 1 262 701 1256 710 192 -389 -694 -994 -626 -344 258 838 960 1045 129 -423 -1045 -1159
3656 -1159 -1012 -596 97 666 947 855 443 -50 -994 -1152 -873 -498 -2 870 889 1061 680 -127 -774 -794 -1024
3677 -1024 -689 61 706 1047 1107 688 -143 -505 -1028 -1060 -844 -38 520 950 1131 715 204 -608 -938 -764
3697 -764 -799 -345 292 603 1023 1022 382 -132 -1146 -867 -965 -441 157 729 927 1038 544 -37 -724 -1131 -672
3718 -672 -609 -43 655 1100 963 634 132 -597 -1053 -988 -392 -157 383 1074 859 711 71 -763 -989 -1026 -969
$$ packed form
3574h48k65P99J24Q41M86p7n19l91p78k63m3J84O96P21N15j68l66o59m00l50o00
3595a361P04L61P44N24M4l91j27q56m70k38m1P28O37Q18J07k62m53m69q34l27
3615a162M3O41N71P06M35m02n37l87m59m95q9N22N18O06P12k9n66m84o21n59r5
3636a131N34N98K61M39N55n46n18n81l05l00L68K82O02N80J22Q5r16n52o22j14
3656a159J47M16O93N69K81r2m12m93r44j58K79L75M96Q72J9J72l81q07o47k0k30
3677a024L35P50O45L41O0m19q31l62n23l2K16Q06N58M30J81m16n11q12l30J74
3697g64l5M54O37L11M20jo40n14j014K79r8N24N98N72J98J11m94n81o87m07M59
3718f72O3N66O98M45j37l29n02p29m56O5N96K35N40O91k15j48o40q34k26l7N7
$$ plain form
3739 -969 -145 450 1027 1216 689 412 -377 -973 -1123 -886 -484 429 739 1013 771 474 -250 -1065 -1160 -720
3759 -720 -727 97 828 1080 640 750 -86 -468 -896 -823 -488 60 645 922 1177 736 1 -884 -795 -934 -603
3780 -603 -62 652 1119 1203 705 -132 -500 -725 -993 -676 -213 552 1106 1113 741 241 -404 -901 -1206 -795 -297
3801 -297 349 853 1157 1084 290 -117 -834 -1271 -900 -389 86 761 948 905 685 -104 -566 -944 -989 -527 -63
3822 -63 516 774 784 683 45 -422 -1027 -998 -940 -214 433 1202 1135 988 59 -435 -735 -849 -758 -179 253 768
3844 768 908 945 550 -240 -997 -1075 -797 -503 265 845 980 812 271 -193 -605 -1025 -1044 -477 113 859 1133
3865 1133 912 282 -16 -566 -825 -802 -858 17 221 866 888 689 -117 -596 -923 -725 -645 7 422 766 878
3886 878 957 -135 -574 -605 -921 -657 -308 547 730 833 729 453 -526 -769 -1042 -940 -373 151 676 942
$$ packed form
3739i69Q24N95N77J89n27k77p89n96j50K37M02R13L10K74k42k97p24q15r5M40
3759g20pQ24P31K52m40J10q36l82m28P3L35N48N85K77K55m41p35q85Q9j39L31
3780f03N41P14M67Q4m98q37l68k25k68L17M63P65N54Pl72n00o45m97l05M11M98
3801b97O46N04L04p3p94m07p17m37L71N11M75O75J87m3k20p89m62l78m5M62M64
3822f3N79K58J0j01o38m67o05K9N8P26O47P69o7j47r29m94l00j14R1N79M32N15
3844G68J40L7l95p90p57p8K78K94P68N80J35j68n41m64m12m20j9N67N90P46K74
3865A133k21o30k98n50k59K3n6Q75K04O45K2j99q06m79l27J98Q0O52M15L44J12
3886H78P9j092m39l1l16K64L49Q55J83J03j04k76r79k43k73J02N67N24N25K66
$$ plain form
3906 942 524 532 -137 -545 -1070 -1007 -503 189 805 767 883 635 97 -371 -928 -848 -484 -40 492 783 730 664
3928 664 158 -681 -678 -1121 -568 -164 254 880 1030 835 228 -289 -874 -967 -601 -446 303 690 900 668 550
3949 550 -341 -724 -925 -675 -271 29 652 972 1098 235 -167 -779 -1148 -785 -682 53 452 838 1028 663
3969 663 -78 -522 -930 -935 -735 11 626 779 653 702 -114 -894 -835 -1011 -689 -421 714 827 1084 754 454
3990 454 82 -914 -1042 -778 -142 212 813 1041 909 396 -58 -824 -997 -945 -580 77 773 1034 748 519
4010 519 21 -731 -1011 -768 -516 -54 580 979 744 622 23 -309 -1190 -919 -603 114 697 826 908 782
4030 782 425 -150 -727 -842 -431 -290 552 605 1172 383 222 -310 -840 -857 -732 -343 124 808 681 863 342
4051 342 -93 -421 -801 -689 -362 -124 619 849 1007 512 63 -548 -746 -916 -638 -52 466 866 720 726 -122
$$ packed form
3906I42m18Qo69m08n25O3N04O92O16l8J16k48n38m68n57Q0L64M44N32K91n3o6
3928F64n06q39Lm43N53M04M18O26J50j95o07n17n85r3L66J55P49L87K10k32j18
3949E50q91l83k01K50M04L00O23L20J26q63m02o12l69L63J03P35L99L86J90l65
3969F63p41m44m08nK00P46O15J53j26M9q16p80N9j76L22K68J135J13K57l30l00
3990D54l72r96j28K64O36L54O01K28j32n13m54p66j73N2L65O57O96K61k86k29
4010E19m98p52k80K43K52M62O34L99k35j22n99l32q81K71L16P17N83J29Q2j26
4030G82l57n75n77j15M11J41Q42N3N67p89j61n32n30j7J25L89M67O84j27J82n21
4051C42m35l28l80J12L27K38P43K30J58m95m49o11j98j70K78N86N18M00j46Oq48
$$ plain form
4072 -122 -319 -936 -912 -738 45 279 697 930 407 182 -521 -650 -1103 -910 -350 463 530 757 584 445 -366
4093 -366 -868 -1168 -664 -599 74 552 1009 855 402 -158 -527 -1069 -975 -469 198 662 633 881 721 -22 -697
4114 -697 -900 -769 -511 144 402 884 845 564 26 -288 -790 -806 -713 41 305 1047 930 663 264 -164 -671
4135 -671 -1003 -484 -319 311 522 998 505 416 -285 -579 -854 -663 -282 116 470 906 770 336 -222 -605
4155 -605 -983 -768 -541 -90 606 775 696 337 -128 -538 -764 -1049 -600 78 565 729 527 442 218 -350 -836
4176 -836 -1064 -651 -75 128 639 784 636 59 -375 -695 -774 -494 -207 213 655 823 726 426 -21 -607 -608
4197 -608 -896 -362 227 661 1089 975 414 75 -553 -997 -799 -513 8 466 878 970 544 63 -511 -813
4217 -813 -782 -485 -117 331 877 910 678 164 -306 -834 -996 -567 -60 249 772 785 799 197 -314 -595 -834
$$ packed form
4072a22j97o17K4J74P83K34M18K33n23k25p03j29m53J93N60Q13O7K27j73j39q11
4093c66n02l00N04O5O73M78M57j54m53n60l69n42R4N06O67M64k9K48j60p43o75
4114f97k03J31K58O55K58M82l9k81n38l14n02j6R3P54K64P42j17k67l99m28n07
4135f71l32N19J65O30K11M76m93q9p01k94k75J91L81L98L54M36j36m34n58l83
4155f05l78K15K27M51O96J69p9l59m65m10k26k85M49O78M87J64k02q5k24n68m86
4176h36k28M13N76K03N11J45j48n77m34l20p9K80K87M20M42J68r7l00m47n86j
4197f08k88N34N89M34M28j14n61l39o28m44J98K86N21M58M12R2m26m81n74l02
4217h13L1K97L68M48N46L3k32n14m70n28j62M29N07L09N23J3J4o02n11k81k39
$$ plain form
4238 -834 -753 -503 374 617 933 951 213 -122 -523 -874 -905 -360 108 432 912 682 404 -143 -491 -900 -698
4259 -698 -499 -141 362 918 960 516 122 -364 -900 -788 -725 -58 100 707 968 439 267 -689 -856 -1038 -605
4280 -605 -186 464 425 651 858 559 -402 -649 -926 -604 -413 96 751 727 680 358 -198 -647 -885 -764 -68
4301 -68 137 814 884 871 69 -381 -656 -744 -859 -690 -30 683 813 826 541 147 -502 -802 -761 -719 -203 511
4323 511 635 908 595 79 -204 -629 -622 -504 -320 438 564 574 663 268 -132 -302 -773 -751 -12 205 730 638
4345 638 616 320 -256 -709 -1009 -771 -307 126 456 761 707 218 146 -430 -747 -824 -467 -234 419 931 799
4366 799 519 -52 -511 -694 -884 -669 -8 204 723 711 644 287 -166 -645 -892 -521 -22 185 498 856 460
4387 460 240 65 -664 -905 -745 -299 28 705 870 793 330 103 -369 -789 -876 -342 36 540 809 613 390
$$ packed form
4238h34Q1K50Q77K43L16J8p38l35m01l51l1N45M68L24M80k30k78n47l48m09K02
4259f98J99L58N03N56M2m44l94m86n36J12O3O67J58O07K61n29j72r56j67j82M33
4280f05M19O50l9K26K07k99r61k47k77L22J91N09O55k4m7l22n56m49k38J21O96
4301f8K05O77P0j3q02m50k75q8j15J69O60P13J30J3k85l94o49l00M1M2N16P14
4323E11J24K73l13n16k83m25PJ18J84P58J26J0Q9l95m00j70m71K2P39K17N25r2
4345F38k2k96n76m53l00K38M64M33L30L05n4m89p2n76l17p7L57K33O53N12j32
4366G99k80n71m59j83j90K15O61K12N19j2o7l57m53m79k47L71M99K07L13L58l96
4387D60k20j75p29k41J60M46L27O77J65p7m63k27m72m20q7N34L78N04K69j96k23
$$ plain form
4408 390 -49 -663 -888 -674 -607 -25 401 766 792 421 10 -487 -759 -809 -455 -244 283 879 765 562 422
4429 422 -316 -550 -571 -562 -6 299 420 756 761 291 -135 -638 -910 -524 -417 255 394 615 803 585 -87 -765
4451 -765 -970 -931 -477 -13 619 949 834 353 -82 -450 -622 -784 -501 78 213 653 757 504 113 -397
4471 -397 -698 -819 -402 -92 420 560 509 434 351 -529 -503 -702 -644 -318 -44 567 759 637 544 -162 -571 -629
4493 -629 -1040 -353 339 361 718 611 527 114 -278 -749 -495 -275 -79 252 965 615 247 6 -240 -763 -594
4514 -594 -370 -246 489 620 632 521 221 -197 -724 -607 -401 -384 343 378 701 855 334 -413 -529 -885 -687
4535 -687 -249 133 581 648 573 304 48 -491 -805 -458 -560 -140 538 541 591 108 268 -427 -671 -689 -300 24
4557 24 240 674 713 425 -26 -393 -804 -870 -424 195 350 639 705 321 426 -328 -616 -766 -251 -308 86 505
$$ packed form
4408C90m39o14k25K14O7N82M26L65K6l71m11m97k72n0L54K11N27N96j14k03j40
4429D22p38k34k1RN56L05J21L36Nm70m26n03k72L86J07O72J39K21J88k18o72o78
4451g65k05L9M54M64O32L30j15m81m35l68j72j62K83N79J35M40J04k53l91n10
4471c97l01j21M17L10N12J40n1p5q3q80K6j99N8L26K74O11J92j22r3p06m09n8
4493f29m11O87O92K2L57j07q4m13l92m71K54K20J96L31P13l50l68k41k46n23J69
4514e94K24J24P35J31J2j11l00m18n27J17K06J7P27L5L23J54n21p47j16l56J98
4535f87M38L82M48O7p5k69k56n39l14L47j02M20O78LN0m83J60o95k44j8L89L24
4557B4K16M34L9k88m51l67m11o6M46O19J55K89O6l84J05p54k88j50N15n7L94M19
$$ plain form
4579 505 684 806 173 -393 -669 -763 -684 -464 93 682 826 603 100 -88 -326 -650 -641 -272 14 504 501 879
4601 879 382 202 -563 -508 -643 -481 -79 459 869 548 622 171 -271 -828 -699 -400 -108 189 526 638 533
4622 533 84 -244 -877 -650 -752 -239 219 543 556 809 257 -420 -608 -744 -494 -150 201 590 594 723 131
4643 131 24 -584 -706 -758 -306 -35 435 719 571 457 130 -414 -718 -619 -291 55 203 791 645 398 261
4664 261 -503 -561 -678 -460 -42 221 834 757 731 259 -99 -511 -673 -559 -301 300 548 605 553 155 46 -433
4686 -433 -735 -660 -70 41 274 641 570 537 -22 -359 -720 -949 -450 -39 334 408 644 473 -3 -445 -594
4707 -594 -563 -566 -117 132 645 463 177 162 -251 -491 -569 -335 -154 95 645 563 184 -61 -305 -531 -326 -524
4729 -524 -324 190 720 720 575 30 -172 -328 -555 -435 -423 -95 497 639 282 340 23 -552 -569 -642 -379 247
$$ packed form
4579E05J79J22o33n66k76r4P9K20N57N89J44k23n03j88k38l24RL69K86M90lL78
4601H79m97j80p65N5j35J62M02N38M10l21P4m51m42n57J29K99K92K97L37J12j05
4622E33m49l28o33K27j02N13M58L24J3K53n52o77j88j36K50L44L51L89MJ29n92
4643A31j07o08j22n2M52K71M70K84j48j14l27n44l04R9L28L46J48N88j46k47j37
4664B61p64n8j17K18M18K63O13p7k6m72l58m12j62J14K58O01K48N7n2l98j09m79
4686d33l02P5N90J11K33L67p1l3n59l37l61k29M99M11L73P4K36j71m76m42j49
4707e94L1lM49K49N13j82k86j5m13k40p8K34J81K49N50q2l79k45k44k26K05j98
4729e24K00N14N30%j45n45k02j56k27J20J2L28N92J42l57N8l17n75j7p3K63O26
$$ plain form
4751 247 170 676 455 456 -97 -453 -843 -759 -375 68 412 552 579 345 132 -166 -656 -825 -311 -284 269 489
4773 489 454 627 200 -231 -457 -586 -341 -530 48 576 394 691 229 -284 -658 -627 -606 -275 -62 277 732
4794 732 552 540 -216 -652 -650 -491 -117 231 601 646 619 367 -43 -565 -636 -690 -434 -48 213 551 666 366
4816 366 101 -163 -557 -822 -556 -93 214 461 717 561 55 -88 -482 -447 -452 -23 193 477 659 574 262
4837 262 -337 -498 -770 -483 -167 86 555 329 370 330 -285 -491 -567 -444 -242 -37 520 414 596 210 134
4858 134 -407 -566 -570 -533 -32 225 921 624 503 19 13 -510 -607 -312 -64 211 585 637 413 -165 -167 -449 -543
4881 -543 -423 -229 198 398 692 478 48 -155 -633 -487 -517 -100 118 450 553 596 340 134 -437 -648 -698
4902 -698 -447 2 295 605 552 549 -2 -96 -198 -649 -487 -250 65 451 763 149 92 -108 -585 -571 -377 -75
$$ packed form
4751B47p7N06k21Jn53l56l90Q4L84M43L44J40K7k34k13k98m90j69N14K7N53K20
4773D89l5J73m27m31k26j29K45j89N78N28j82K97m62n13l74L1K1L31K13L39M55
4794G32j80j2p56m36KJ59L74L48L70M5k7k52m10n22p1n4K56L86K61L38J15l00
4816C66k65k64l94k65K66M63L07K47K56j56n06j43l94L5nM29K16K84J82q5l12
4837B62n99j61k72K87L16K53M69k26M1m0o15k06p6J23K02K05N57j06J82l86p6
4858A34n41j59mL7N01K57O96k97j21m84on23r7K95K48K75L74N2k24n78kk82r4
4881e43J20J94M27K00K94k14m30k03m78J46l0M17K18L32J03M3k56k06n71k11n0
4902f98K51M49K93L10n3ln51r4j02m51J62K37L15L86L12o14n7k00m77J4J94L02
$$ plain form
4924 -75 -60 493 615 635 5 -292 -446 -640 -201 -214 8 557 550 474 145 -227 -438 -544 -517 -178 224 269 572
4947 572 409 316 -50 -554 -208 -690 -550 114 435 375 560 324 -52 -530 -678 -776 -577 -139 215 443 416
4968 416 556 64 -208 -369 -453 -520 -65 196 430 555 670 277 -193 -405 -790 -670 -162 119 200 427 448
4989 448 63 8 -351 -568 -474 -523 81 4 677 645 586 -14 -451 -415 -426 -17 -49 259 276 446 370 -148 -331 -451
5013 -451 -362 -425 -95 245 426 805 471 166 -251 -449 -440 -550 125 245 579 575 524 281 -233 -233 -661 -352 -281
5036 -281 39 173 467 286 131 -74 -379 -717 -234 -418 -18 406 544 342 148 56 -489 -407 -521 -516 55
5057 55 302 499 554 212 120 -334 -424 -401 -309 -435 210 460 490 438 91 -126 -459 -143 -238 -88 11 289 479
5080 479 425 117 -141 -189 -711 -514 -390 57 547 434 580 95 -241 -471 -651 -541 -154 77 514 666 340
$$ packed form
4924g5J5N53J22K0o30k97j54j94M39j3K22N49pp6l29l72k11j06K7L39M02M5L03
4947E72j63r3l66n04L46m82J40O64L21o0J85k36l76m78j48r8J99M38L54K28k7
4968D16J40m92k72j61q4o7M55K61K34J25J15l93m70k12l85J20N08K81Q1K27K1
4989D48l85n5l59k17R4m9O04p7O73l2n9o00m37L6j1M09l2L08J7J70p6n18j83j20
5013d51Q9o3L30L40J81L79l34l05m17j98Rj10O75J20L34mn1k43n14%m28L09P1
5036b81L20J34K94j81j55k05l05l38M83j84M00M24J38k02j94r2n45Q2j14NN71
5057E5K47J97N5l42r2m54r0K3R2j26O45K50L0n2l47k17l33L16r5J50R9K78J90
5080D79n4l08k58m8n22J97J24M47M90j13J46m85l36k30j80J10L87K31M37J52l26
$$ plain form
5101 340 465 103 -223 -585 -581 -422 -62 168 255 739 432 54 -292 -508 -606 -411 -172 239 496 394 443 343
5123 343 -374 -654 -649 -445 18 246 646 376 136 201 -102 -330 -569 -352 -278 135 261 432 476 442 -125 -658
5145 -658 -381 -422 -101 87 287 208 380 319 158 -205 -495 -596 -53 -180 306 519 481 227 280 -227 -353 -320
5167 -320 -411 -239 290 160 174 761 176 -142 -476 -438 -296 -218 275 257 611 321 290 -15 -404 -577 -679 -155
5189 -155 81 470 421 429 242 26 -286 -905 -744 -400 67 253 587 475 371 149 -235 -179 -462 -760 -155
5210 -155 89 521 449 436 87 -287 -360 -640 -378 -52 223 565 647 422 -68 -196 -536 -402 -279 -329 98 182
5232 182 543 524 109 -210 -506 -381 -403 -186 49 407 554 472 264 -83 -302 -522 -528 -178 32 484 415 426
5254 426 497 238 -227 -287 -470 -111 84 202 539 497 328 226 68 -144 -295 -187 -70 114 327 577 248
$$ packed form
5101C40J25l62l26l62MJ59L60K30Q7M84l07l78l46k16r8J95K39M11K57j02M9j00
5123C43p17k80NK04M63K28M00k70k40O5l03k28k39K17P4M13J26J71M4l4n67n33
5145f58K77m1L21J88K00p9J72o1j61l63k90j01N43j27M86K13l8k54N3n07j26L3
5167c20r1J72N29j30J4N87n85l18l34L8J42P8M93j8L54k90l1l05l89j73j02N24
5189a55K36L89m9Qj87k16l12o19J61L44M67J86L34j12j04k22l84N6k83k98O05
5210a55K44M32p2j3l49l74p3k80K62L26K75L42Q2k25m90j28l40J34J23n0M27Q4
5232A82L61j9m15l19k96J25k2K17K35L58J47q2k08l47k19k20oL50K10M52o9J1
5254D26P1k59m65o0j83L59J95J18L37m2j69j02j58k12j51J08J17J84K13K50l29
$$ plain form
5275 248 72 -83 -253 -378 -351 -329 105 223 249 380 158 -173 -34 -394 -364 -21 -41 400 336 621 104 -12
5297 -12 -233 -398 -613 -378 -80 285 536 394 425 178 -158 -209 -462 -514 -164 96 213 478 316 -25 -218
5318 -218 -443 -648 -266 -98 146 259 255 134 198 -130 -276 -325 -348 -85 12 144 525 445 187 -37 -231 -410
5340 -410 -208 -356 26 325 576 170 283 37 -394 -443 -502 -552 -143 160 277 511 159 63 63 8 -378 -257
5362 -257 5 384 400 435 425 152 -153 -394 -534 -345 -288 253 666 385 191 -77 -336 -453 -142 -237 -418 146
5384 146 124 443 244 259 25 -221 -138 -309 -179 33 328 225 722 194 -203 -152 -361 -385 -217 132 41 407
5406 407 360 446 225 -317 -499 -409 -226 -115 150 290 569 149 19 -261 -293 -591 -489 -79 95 90 337 453
5428 453 167 46 -201 -461 -239 -233 164 369 418 455 67 142 -203 -157 -469 -85 217 298 414 260 591 77
$$ packed form
5275B48j76j55j70j25K7K2M34J18K6J31k22l31J39l60L0L43k0M41o4K85n17j16
5297a2k21j65k15K35K98L65K51j42L1k47l36n1k53n2L50K60J17K65j62l41j93
5318b18k25k05L82J68K44J13mj21O4l28j46m9k3K63R7J32L81q0k58k24j94j79
5340d10K02j48L82K99K51m06J13k46m31m9n9n0M09L03J17K34l52r6%n5l86J21
5362b57K62L79J6L5j0k73l05k41j40J89N7N41M13k81j94k68k59j17L11r5j81N64
5384A46k2L19j99J5k34k46Q3j71J30K12K95j03M97n28l97N1k09k4J68L49r1L66
5406D07m7Q6k21n42j82R0J83J11K65J40K79m20j30k80l2k98J02M10J74nK47J16
5428D53k86j21k47k60K22OL97K05M9L7l88P5l45M6l12L84L02Q1J16j54L31n14
$$ plain form
5450 77 -403 -435 -510 -252 103 203 329 477 136 7 -117 -286 -447 -549 -224 133 58 341 249 30 16 -263
5472 -263 -215 -516 -221 -45 314 183 279 210 -95 -271 -222 -536 -126 -56 407 -39 446 315 47 -135 -456 -452
5494 -452 -153 -101 222 331 531 36 -519 -52 -426 -281 -351 -218 54 382 314 143 -210 -25 -523 -535 -420
5515 -420 -72 129 382 529 461 122 -222 -184 -388 -410 -78 -56 487 254 57 133 -284 -354 -338 -324 -178 -61 285
5538 285 399 502 168 -124 -351 -473 -190 -354 5 267 631 127 165 -218 -391 -240 -295 -386 -163 106 341
5559 341 307 227 70 -208 -277 -328 -212 -233 113 206 429 556 340 -128 -526 -313 -268 -224 233 274 620 565 -79
5582 -79 121 -393 -220 -491 -251 -12 231 208 154 337 -127 -426 -191 -316 -372 43 282 196 479 140 94 -138
5604 -138 -570 -244 -472 -323 -43 392 420 192 24 -15 -359 -244 -159 -3 -15 340 464 219 89 -68 -211
$$ packed form
5450G7m80l2p5K58L55J00J26J48l41j29j24j69j61j02L25L57p5K83r2k19j4k79
5472b63M8l01K95J76L59j31R6o9l05j76M9l14M10P0M63m46M85j31k68j82l21M
5494d52K99N2L23J09K00m95n55M67l74J45p0J33K72L28o8j71l53J85m98j2J15
5515d20L48K01K53J47o8l39l44L8k04k2L32K2N43k33j97P6m17p0J6J4J46J17L46
5538B85J14J03l34k92k27j22K83j64L59K62L64n04L8l83j73J51n5r1K23K69K35
5559C41l4q0j57k78o9n1J16k1L46R3K23J27k16m68l98K13M5M4M57M1L46n5o44
5582g9K00n14J73k71K40K39K43k3n4J83m64k99K35j25n6M15K39q6K83l39m6k32
5604a38m32L26k28J49K80M35K8k28j68l9l44J15Q5J56j2L55J24k45j30j57j43
$$ plain form
5625 -211 -434 -359 -274 95 398 246 192 129 -70 105 -188 -502 -153 -145 24 537 329 235 -145 -307 -216 -207 -277 -29
5649 -29 319 341 235 224 21 -214 -259 -94 -99 103 396 284 461 206 117 -185 -10 -458 -236 -72 131 143 624
5672 624 216 45 -294 -339 -534 -479 -223 -16 179 211 193 97 -20 -90 -276 -447 -202 -67 413 286 249 266 301
5695 301 -403 -370 -527 -144 -14 325 199 223 187 18 -393 -208 -318 -307 31 47 203 106 249 223 93 -419
5717 -419 -318 -416 -63 143 310 306 31 99 -131 -153 -241 -401 45 37 19 142 253 220 -55 -296 -320 -330 -336 70 274
5742 274 85 129 138 26 -434 -479 -324 -243 168 251 66 474 330 -137 -160 -433 -182 -222 170 237 162 282 216 -89
5766 -89 -256 -238 -452 -295 -8 -245 201 177 301 155 67 -212 -325 -261 -279 91 322 316 111 14 162 -164 -76
5789 -76 -335 -251 47 239 111 355 416 17 -103 -391 -182 -107 141 128 335 192 87 118 -186 -337 -440 -327
$$ packed form
5625b11k23P5Q5L69L03j52n4o3j99J75k93l14L49QJ69N13k08r4l80j62R1Rp0K48
5649b9L48K2j06j1k03k35m5J65nK02K93j12J77k55q9l02J75m48K22J64K03J2M81
5672F24m08j71l39m5j95N5K56K07J95L2j8r6j17p0j86j71K45J35M80j27l7J7L5
5695C01p04L3j57L83J30L39j26K4l6j69m11J85j10J1L38J6J56r7J43k6j30n12
5717d19J01r8L53K06J67mk75O8k30k2q8j60M46qj8J23J11l3k75k41k4j0oM06K04
5742B74j89M4Rj12m60m5J55Q1M11Q3j85M08j44m67k3k73K51m0L92O7p5J20o6l05
5766h9j67J8k14J57K87k37M46k4J24j46q8k79j13O4j8L70K31ok05r7J48l26Q8
5789g6k59Q4K98J92j28K44O1l99j20k88K09P5K48j3K07j43j05L1l04j51j03J13
$$ plain form
5811 -327 -84 89 265 192 177 62 -338 -267 -285 -228 -135 219 309 163 312 65 79 -199 -167 -171 -38 106 -93 416
5835 416 529 97 -76 77 -249 -367 -369 -51 207 145 180 -56 224 -365 -229 31 -227 268 239 365 267 341
5857 341 -16 -401 -326 -346 -212 -24 29 46 329 36 305 -247 -62 -306 -427 -32 112 353 129 286 293 -121
5879 -121 -268 -209 -267 -185 -92 177 143 257 214 81 124 -263 -113 36 96 86 67 324 233 -14 -268 -217 -157 -305
5903 -305 262 218 417 66 102 114 207 -354 -138 -225 -12 127 160 52 92 107 204 -208 -282 -342 85 91 -8 454 233
5928 233 -117 -26 -197 -109 -224 -36 36 359 128 174 52 -198 76 -201 -27 25 139 439 356 224 203 -46
5950 -46 -106 -257 -236 -284 -81 72 72 290 168 -198 73 -175 -296 -203 -224 -91 132 -104 22 44 -197 -331 -217
5973 -217 -42 -139 101 324 224 317 34 25 -314 -447 -307 -240 -246 306 132 267 89 -164 -70 -357 -151 -68 -59 143
$$ packed form
5811c27K43J73J76p3j5j15m00P1j8N7R3L54R0j46J49k47J4k78L2mJ33J44j99N09
5835D16J13m32j73J53l26j18kL18K58o2L5k36K80n89J36K60k58M95k9J26r8P4
5857C41l57l85P5k0J34J88N3J7K83k93K69n52J85k44j21L95J44K41k24J57Pm14
5879a21j47N9n8Q2R3K69l4J14m3j33M3l87J50J49O0j0j9K57r1k47k54N1O0j48
5903c05N67m4J99l51L6J2R3n61K16q7K13J39L3j08M0J5R7m12p4o0M27Or9M62k21
5928B33l50R1j71Q8j15J88P2L23k31M6j22k50K74k77J74N2J14L00q3j32k1k49
5950d6o0j51K1m8K03J53%K18j22l66K71k48j21R3k1J33K23k36J26K2k41j34J14
5973b17J75r7K40K23j00R3k83rl39j33J40O7oN52j74J35j78k53R4k87K06Q3RK02
$$ plain form
5997 143 152 155 200 10 64 -410 -273 -296 -82 68 133 132 312 166 -138 -328 -310 -81 -66 -16 178 -36 205 -203
6021 -203 -292 -377 -399 -270 64 16 61 301 0 355 -94 -417 -250 -314 -221 -50 16 253 137 89 76 -249 106
6044 106 -192 -191 316 44 336 27 217 108 -174 -250 -289 -144 1 -83 26 227 193 142 -278 -314 -202 -240 51
6067 51 -8 122 228 244 217 -111 -157 -147 -163 -117 -109 155 350 65 23 -72 -235 -424 -193 -225 27 241 179 586 240
6092 240 -26 -133 -353 -92 -51 -48 152 264 455 247 -64 8 -292 -159 -62 -12 203 166 412 208 112 136 -244
6115 -244 -247 -143 128 -151 199 96 81 346 -76 35 -374 -113 -381 37 159 78 354 57 124 -170 -136 -158
6137 -158 -221 -156 5 224 136 -34 -41 -284 -292 -69 111 -94 138 67 191 89 342 85 -199 -280 -188 -178 259 138
6161 138 300 255 30 -180 -277 -145 78 -45 -46 561 168 208 321 -30 -51 -103 6 -66 -185 31 3 404 -23
$$ packed form
5997A43RLM5j90N4m74J37k3K14J50O5jJ80j46l04j90J8K29J5N0J94k14K41m08
6021b03q9q5k2J29L34m8M5K40l01L55m49l23J67o4R3J71O6K37j16m8j3l25L55
6044A06k98JN07k72K92l09J90j09k82p6l9J45J45q4J09K01l4n1m20l6J12l8K91
6067E1n9J30J06J6k7l28m6J0j6M6QK64J95k85m2r5j63j89K31l2K52K14o2M07l46
6092B40k66j07k20K61M1LK00J12J91k08l11P2l00J33R7N0K15l7K46k04r6K4l80
6115b44lJ04K71k79L50j03j5K65m22J11m09K61k68M18J22q1K76k97O7k94L4k2
6137a58o3O5J61K19q8j70pk43qK23J80k05K32p1J24j02K53k57k84q1R2J0M37j21
6161A38J62m5k25k10r7J32K23j23jO07l93M0J13l51k1n2J09p2j19K16k8M01m27
$$ plain form
6184 -23 -64 -193 -53 -228 -166 111 270 -127 178 46 471 -12 75 -113 -132 -110 68 201 255 189 13 -110 -497
6207 -497 -288 -141 236 17 71 340 136 -51 -94 -342 -389 -266 -94 -71 311 227 164 112 -81 99 -94 -57 -166
6230 -166 -31 22 331 306 241 -107 -163 -41 -330 63 -131 43 161 240 42 66 -118 -60 46 94 -115 100 427
6253 427 342 -44 21 -202 22 19 -331 -85 6 90 158 304 -67 121 -294 -222 -72 -216 -169 96 118 115 302 -32
6277 -32 -331 38 -228 194 -24 160 266 148 120 25 -50 -163 -15 -202 243 89 139 220 277 -101 -97 -114 -392
6300 -392 -67 -237 26 172 -119 254 160 159 -83 -238 37 156 79 180 292 310 284 -202 -55 -304 -92 145
6322 145 197 32 261 203 263 -207 -118 -269 -167 213 -130 128 -46 49 130 147 -270 -160 -429 -28 -36 -310 65
6345 65 -93 88 -4 -203 -253 -88 -387 -22 167 162 100 300 -64 -295 70 -134 -139 -19 232 394 308 227 192 282
$$ packed form
6184b3m1j29J40j75O2K77J59l97L05j32M25m83Q7j88j9K2J78J33N4o6j76j23l87
6207d97K09J47L77k19N4K69k04j87m3k48m7J23J72K3L82q4o3n2j93J80j93L7j09
6230a66J35N3L09k5o5l48n6J22k89L93j94J74J18P9j98K4j84N8J06M8k09K15L27
6253D27q5l86O5k23K24ll50K46R1Q4O8J46l71J88m15P2J50j44M7K65K2lJ87l34
6277c2k99L69k66M22k18J84J06j18k8r5p5j13J48j87M45j54N0Q1N7l78Mj7k78
6300c92L25j70K63J46k91L73r4jk42j55K75J19p7J01J12J8k6m86J47k49K12K37
6322A45N2j65K29n8O0m70Q9j51J02L80l43K58j74R5Q1J7m17J10k69M01qk74L75
6345F5j58J81r2j99n0J65k99L65J89no2K00l64k31L65k04nJ20K51J62q6q1l5R0
$$ plain form
6369 282 -96 -385 -146 -178 358 -197 168 143 109 148 -65 -236 -256 63 -124 -154 -115 92 10 48 -75 -100 8
6392 8 32 114 26 51 107 -14 7 -43 -279 -165 -64 107 174 144 214 61 87 -16 -42 -204 -276 -101 -97 -33 105 225
6418 225 -116 28 -96 -248 -142 12 -114 -76 -93 138 233 -267 -197 -201 -100 -160 32 -84 87 31 94 -9 88
6441 88 11 1 110 187 -93 68 62 128 154 9 19 -57 -116 57 -138 8 199 12 13 0 -178 -213 -192 -227 -75 68
6467 68 -111 234 63 131 15 -135 -327 -249 144 246 251 133 -12 -191 83 -200 -96 -211 -2 283 423 138
6489 138 59 -39 22 -22 -253 -262 124 124 307 190 97 -49 -22 -220 82 -70 -63 -10 -7 192 19 -171 1 -33 -248
6514 -248 -368 25 -251 69 69 109 115 -91 -64 -296 -229 -299 95 111 -37 205 -36 71 64 -239 -165 -132 189 44
6538 44 125 53 -86 287 -252 -164 -25 -335 -67 89 -26 -38 390 200 54 126 -94 47 145 -218 212 117 -2
$$ packed form
6369B82l78k89K39l2N36n55L65k5l4L9k13j71k0L19j87l0L9K07q2L8j23k5J08
6392HK4Q2q8K5N6j21K1n0k36J14J01J71O7l0P0j53K6j03k6j62p2J75MO4J38J20
6418B25l41J44j24j52J06J54j26L8j7K31R5n00P0mJ01o0J92j16J71n6O3j03R7
6441H8p7j0J09P7k80J61oO6K6j45J0p6n9J73j95J46J91j87Jj3j78l5K1l5J52J43
6467F8j79L45j71O8j16j50j92P8L93J02Nj18j45j79K74k83J04j15K09K85J40k85
6489A38p9r8O1m4k31rL86%J83j17r3j46K7j98L02j52PN3LJ99j73j90J72l4k15
6514b48j20L93k76L20%M0Ok06K7k32O7p0L94J6j48K42k41J07pl03P4L3L21j45
6538D4Q1p2j39L73n39Q8J39l10K68J56j15j2M28j90j46P2k20J41R8l63M30r5j19
$$ plain form
6561 -2 350 -122 -94 -195 -237 -21 -87 -44 461 316 256 -71 -86 -173 -360 92 -56 61 68 98 185 232 -170 38 -454
6586 -454 -35 -52 -195 56 100 78 -83 -47 -212 -303 -162 -84 -35 231 219 -138 115 -194 -339 -80 -131 -32 -82 27
6610 27 139 376 158 -5 -70 -38 -131 -144 54 340 345 -82 -8 6 -118 -183 157 -64 -55 -80 66 181 -52 85
6634 85 -117 65 -60 -89 88 -54 254 130 131 -5 -108 -185 -251 -83 -27 -80 -123 88 103 -119 -57 -70 -33 306
6658 306 -254 -6 113 377 276 -104 -99 -70 -237 -423 -173 -11 289 5 154 113 -118 -66 -107 42 -48 242
6680 242 -151 -6 314 25 13 -200 114 -105 97 -184 21 185 -16 160 150 -285 -163 -211 -252 -56 -122 25
6702 25 -14 214 -111 -10 -228 -333 -235 200 75 -27 315 168 -161 46 -48 -331 -270 62 83 -212 219 142
6724 142 187 50 62 -134 -2 167 -116 128 148 196 -20 61 177 21 -19 -196 -141 113 102 -45 168 268 -18
$$ packed form
6561bL52m72K8j01m2K16o6M3N05j45o0l27j5q7j87M52j48J17PL0Q7M7m02K08m92
6586d54M19j7j43K51M4k2j61L6j65r1J41P8M9K66j2l57K53l09j45K59n1R9n0J09
6610B7J12K37k18j63o5L2r3j3J98K86Nm27P4J4j24o5L40k21Rk5J46J15k33J37
6634H5k02J82j25k9J77j42L08j24Jj36j03p7o6J68N6n3m3K11J5k22O2j3L7L39
6658C06n60K48J19K64j01l80NK9j67j86K50J62L00k84J49m1k31N2m1J49r0K90
6680B42l93J45L20k89j2k13L14k19K02k81K05J64k01J76j0m35J22m8m1J96o6J47
6702B5l9K28l25J01k18j05R8M35j25j02L42j47l29K07r4k83O1L32K1k95M31p7
6724A42M5j37J2j96J32J69k83K44K0M8k16Q1J16j56m0j77N5K54j1j47K13J00k86
$$ plain form
6747 -18 -88 -235 -133 -182 66 293 136 107 -115 56 -234 -82 -93 -68 117 108 136 275 -146 -47 -150 -291 -15
6770 -15 -124 -311 67 163 -72 95 92 8 -201 65 -59 135 -314 60 121 207 261 -146 -350 -55 -97 -295 39
6793 39 75 -145 164 169 -55 132 -209 -88 -244 44 126 -207 -106 69 187 15 -25 -189 -179 50 41 385 -105
6816 -105 121 115 -30 -41 -56 -99 -19 -24 118 42 114 -43 81 -177 -111 85 -254 287 -99 398 75 156 21 -256
6840 -256 -234 254 -48 122 171 173 161 113 -142 163 10 -104 -341 51 -48 60 347 -129 92 82 -146 9 66
6863 66 -82 -77 45 231 -40 66 -50 195 -293 -52 -158 124 196 -35 138 -26 -115 47 -188 -168 -195 264
6885 264 -92 134 140 77 243 -3 41 -166 -130 123 76 136 60 122 362 -83 32 -70 -194 -269 -69 155 -3
6908 -3 107 51 71 -65 -44 -162 -8 -181 -38 96 -29 -40 27 -53 -96 -150 93 19 13 -117 285 139 -304 229
$$ packed form
6747a8p0j47J02m9K48K27j57k9k22J71k90J52j1K5J85rK8J39m21R9j03j41K76
6770a5j09j87L78R6k35J67lq4k09K66j24J94m49L74O1Q6N4m07k04K95m2j98L34
6793C9L6k20L09Nk24J87l41J21j56K88Q2l33J01J75J18j72m0j64J0K29rL44m90
6816a05K26oj45j1j5m3Q0nJ42p6P2j57J24k58O6J96l39N41l86M97l23Q1j35k77
6840b56K2M88l02J70M9Kj2m8k55L05j53j14k37L92r9J08K87m76K21j0k28J55N7
6863F6j48NJ22J86k71J06j16K45m88K41j06K82P2k31J73j64q9J62k35K0k7M59
6885B64l56K26Oo3J66k46M4k07L6K53m7O0p6O2K40m45J15j02j24p5K00K24j58
6908cJ10n6K0j36K1j18J54j73J43J34j25j1O7q0m3n4K43p4oj30M02j46m43N33
$$ plain form
6932 229 -115 -297 -129 137 -45 -59 42 166 -7 -249 -154 30 199 -155 -2 -21 -2 -57 -131 -47 -60 -215 -117
6955 -117 -128 -127 -28 201 74 194 -33 -142 -78 -153 98 -98 -78 68 292 -284 83 187 -199 -46 -81 -9 58
6978 58 178 -5 -55 195 -277 -184 7 130 9 -70 -86 296 136 -30 121 -66 -203 -155 42 217 129 63 101
7001 101 51 -51 85 -45 -10 -210 -124 160 29 165 97 308 50 -281 14 -176 -49 65 -5 9 -200 116
7023 116 -58 -20 -316 -58 -17 71 80 -10 31 23 -209 -129 -412 -104 7 20 -102 144 307 164 15 -201 -89 -333
7047 -333 173 250 95 -192 114 -31 168 68 98 -316 -135 28 43 50 292 -89 202 -126 -39 77 68 -17 185
7070 185 318 83 211 100 -122 -223 230 -239 -159 75 75 129 -43 129 -126 -55 -77 -20 67 221 159 65 261
7093 261 145 -114 -65 -88 -76 -144 -29 124 339 53 155 -131 -54 -206 -55 74 -82 116 11 265 -64 -10
$$ packed form
6932B29l44j82J68K66j82j4J01J24j73k42R5J84J69l54J53j9J9n5p4Q4j3j55R8
6955a17j1JR9K29j27J20k27j09O4p5K51j96K0J46K24n76L67J04l86J53l5P2O7
6978E8J20j83n0K50m72R3J91J23j21p9j6L82j60j66J51j87j37M8J97J75q8o6L8
7001A01n0j02J36j30L5k00Q6K84j31J36o8K11k58l31K95j90J27J14p0J4k09L16
7023A16j74L8k96K58M1Q8Rr0M1qk32Q0k83L08J11J3j22K46J63j43j49k16J12k44
7047c33N06P7j55k87L06j45J99j00L0m14J81J63J5PK42l81K91l28Q7J16rq5K02
7070A85J33k35J28j11k22j01M53m69Q0K34%N4j72J72k55P1k2N7Q7J54o2r4J96
7093B61j16k59M9k3J2o8J15J53K15k86J02k86P7j52J51J29j56J98j05K54l29N4
$$ plain form
7115 -10 219 -26 89 202 298 7 106 -7 121 -223 -154 -36 -381 -22 4 148 -32 323 132 63 205 -133
7137 -133 -229 83 30 -212 164 19 112 -31 202 -173 185 -125 -189 -28 150 71 163 -54 114 -113 33 -86
7159 -86 -294 -163 -171 81 -147 249 58 1 0 -303 -99 152 -84 -24 128 49 105 367 -159 -24 -302 62 26
7182 26 193 -19 45 -174 -183 95 -276 45 54 58 124 27 217 102 54 -40 -167 -38 141 -1 125 187 135 52 -134
7207 -134 -169 -108 -132 -19 167 -125 91 66 -155 233 -13 7 -43 -199 56 -91 192 297 39 76 -207 43
7229 43 -83 -28 -54 121 125 -33 -20 222 32 -115 -93 -27 34 -71 75 -16 184 -217 100 -161 -69 -256 -77 6
7253 6 144 -128 169 26 -107 -344 105 -218 -61 -95 13 167 269 -61 239 -100 -96 -127 -24 -111 -212 -140 110
7276 110 68 -25 -204 -314 -196 24 -88 182 47 27 122 82 -89 -36 -258 153 47 -66 -146 -92 105 266 -133
$$ packed form
7115a0K29k45J15J13R6k91R9j13J28l44O9J18l45L59K6J44j80L55j91o9J42l38
7137a33r6L12n3k42L76j45R3j43K33l75L58l10o4J61J78p9R2k17J68k27J46j19
7159h6k08J31qK52k28L96j91n7jl03K04K51k36O0J52p9N6K62n26J35k78L64l6
7182B6J67k12O4k19rK78l71L21RMO6r7J90j15m8r4j27J29J79j42J26O2n2q3j86
7207a34l5O1k4J13J86k92K16k5k21L88k46K0n0j56K55j47K83J05k58L7k83K50
7229D3j26N5k6J75Mj58J3K42j90j47K2O6O1j05J46r1K00m01L17k61R2j87J79Q3
7253FJ38k72K97j43j33k37M49l23J57l4J08J54J02l30L00l39Ml1J03q7j01P2K50
7276A10m2r3j79j10J18K20j12K70j35k0R5m0j71N3k22M11j06j13q0N4J97J61l99
$$ plain form
7299 -133 -220 -22 -243 -422 -121 154 26 70 229 -42 -200 -86 -166 -65 -50 36 350 187 5 124 -25 -94
7321 -94 138 -233 -68 203 33 12 285 46 -156 -67 -175 -132 -115 22 172 172 -118 173 103 48 -117 -344 118
7344 118 153 364 20 56 -13 183 178 -297 -52 -53 -102 137 -59 243 1 80 303 -125 -20 54 -131 228 105
7367 105 14 -233 -130 273 -68 -150 -461 80 -9 -59 15 141 -16 -212 82 -48 -95 -2 -103 -62 9 -206 94
7390 94 -167 181 40 -78 -119 -25 57 168 -61 131 59 -235 -288 98 40 136 -82 197 152 -200 156 -43 -202
7413 -202 151 -181 -157 -42 -23 69 68 -19 -59 286 -229 -95 38 20 72 77 185 37 280 77 -224 -190 -73 204
7437 204 108 2 135 -98 -94 -183 75 0 -437 -140 128 172 38 -42 0 3 -120 18 -78 23 209 26 83 -183
7461 -183 275 -159 18 181 105 -112 -121 124 38 -34 -16 -83 -76 -80 -21 233 57 57 -81 -85 67 -181 -351 -299 60 -122
$$ packed form
7299a33q7J98k21j79L01K75j28M4J59k71j58J14q0J01J5Q6L14j63j82J19j49o9
7321i4K32l71J65K71j70k1K73k39k02Q9j08M3J7J37J50%k90K91p0n5j65k27M62
7344A18L5K11l44L6o9J96nm75K45jm9K39j96L02k42P9K23m28J05P4j85L59j23
7367A05r1k47J03M03l41q2l11N41q9n0P4J26j57j96K94j30m7R3j01M1P1k15L00
7390I4k61L48j41j18m1R4Q2J11k29J92p2k94n3L86n8R6k18K79m5l52L56j99j59
7413b02L53l32K4J15J9R2jq7m0L45n15J34J33j8N2NJ08j48K43k03l01L4J17K77
7437B04r6j06J33k33Mq9K58p5m37K97K68M4j34q0M2Lj23J38r6J01J86j83N7k66
7461a83M58m34J77J63p6k17rK45q6p2J8o7PmN9K54j76%j38mJ52k48j70N2L59j82
$$ plain form
7487 -122 93 30 298 144 117 21 -255 -159 -78 -194 -83 -44 93 82 55 -28 211 -76 -169 -136 -146 93 89 -18 -151
7512 -151 184 6 -41 -75 -127 -227 286 135 219 343 242 -17 -29 -80 98 -48 166 -137 88 291 -156 -193
7534 -193 44 -32 -148 -94 -83 5 -201 287 -95 171 -159 -59 -338 -57 118 115 -34 98 27 -153 107 -129
7556 -129 86 -79 -156 -75 -6 28 24 88 79 -106 -41 -332 -30 -11 131 -76 23 57 -90 -47 -33 -99 -145 -1 -53 24
7582 24 -149 153 304 -188 -180 -54 -106 63 159 68 219 -106 -158 40 -64 -117 -109 131 179 -66 331 -147 78 -189
7606 -189 -44 -98 -175 264 29 35 -29 35 -38 75 -220 -106 0 -89 32 -70 -91 22 283 -125 19 0 -145
7629 -145 139 -149 248 -78 113 -2 -92 -129 -273 4 -253 2 184 -211 -200 93 -98 -133 32 36 -116 0
7651 0 118 -1 232 322 -109 -115 -181 -150 69 -87 245 145 171 84 -62 -67 -80 -51 -113 -54 96 93 57 5 200 -63
$$ packed form
7487a22K15o3K68j54k7r6k76R6Q1j16J11L9J37j1k7q3K39k87r3L3j0K39mj07j33
7512a51L35j78m7l4n2j00N13j51Q4J24j01k59j2n1J78j46K14l03K25K03m47l7
7534a93K37p6j16N4J1Q8k06M88l82K66l30J00k79K81J75lj49J32p1j80K60k36
7556a29K15j65p7Q1O9L4mO4rj85O5k91L02J9J42k07R9L4j47M3J4o6m6J44n2P7
7582B4j73L02J51m92QJ26n2J69R6r1J51l25n2J98j04n3QK40M8k45L97m78K25k67
7606a89J45n4p7M39k35Oo4O4p3J13k95J14J06q9J21j02k1J13K61m08J44j9j45
7629a45K84k88L97l26J91j15r0l7j44K77k57K55J82l95J1K93j91l5J65Mj52J16
7651@J18j19K33R0m31oo6L1K19j56L32j00K6q7j46nj3K9o2N9J50ll6n2J95k63
$$ plain form
7677 -63 -54 2 80 -70 -34 135 194 118 170 31 -143 -54 85 -56 186 60 216 -8 -107 66 81 -48 -134 279
7701 279 -28 -3 55 140 -44 45 127 34 -280 -44 -100 -103 209 227 -8 157 76 35 -243 -34 23 30 -56 96 191 -134
7727 -134 101 -39 -65 -182 -59 82 294 77 -146 40 116 77 -74 -103 -130 107 215 102 131 -56 76 157
7749 157 100 -118 -67 -223 32 68 111 419 2 -198 -167 -247 -354 262 -130 -22 278 -47 -19 -63 -126 -92 -55 208
7773 208 -101 95 187 176 -25 -317 181 -45 -63 154 137 101 195 161 111 -111 39 -17 -96 -132 -11 119 213 141
7797 141 272 152 25 -5 -149 -96 -10 -47 237 132 53 -94 -8 107 118 63 13 153 230 -74 -164 98 149 130
7821 130 -307 -224 -151 -24 66 -124 171 94 231 -71 18 -185 -125 -6 -37 286 165 175 -42 -532 -1 129 -89
7844 -89 71 -203 93 21 154 -23 -233 -73 -60 33 -173 -221 -13 84 -311 88 103 141 86 59 2 -237 151 91
$$ packed form
7677f3RN6P8j50L6J69N9p6N2j39j74Q9J39j41K42j26J56k24r9J73J5j29q6M13
7701B79l07K5N8Q5j84Q9Q2r3l14K36n6lL12J8k35J65q1m1k78K09N7Pq6J52R5l25
7727a34K35j40k6j17J23J41K12k17k23J86P6l9j51k9k7K37J08j13K9j87J32Q1
7749A57n7k18N1j56K55L6M3L08m17k00L1q0j07O16l92J08L00l25K8m4o3L4L7K63
7773B08l09J96R2j1k01k92M98k26j8K17j7l6R4l4n0k22J50n6p9l6J21J30R4p2
7797A41J31j20j27l0j44N3Q6l7K84j05p9j47Q6J15J1n5n0J40P7l04r0K62N1j9
7821A30m37Q3P3J27R0j90K95p7J37l02Q9k03O0J19l1L23j21J0k17m90N31J30k18
7844h9J60k74K96p2J33j77k10J60J3R3k06m8K08R7l95L99J5L8n5k7n7k39L88o0
$$ plain form
7868 91 35 156 -75 -26 43 -96 39 43 -140 156 218 34 233 -236 -63 -177 -215 38 -58 153 205 25 173
7891 173 173 -58 -46 125 -111 87 -99 244 -279 241 23 -91 -87 -328 156 278 103 -27 -4 -63 -123 -59 -155
7914 -155 23 172 73 238 160 -93 -171 103 -283 82 -62 149 -92 -2 283 125 10 116 141 -158 26 -36
7936 -36 2 159 10 -98 -47 121 148 -133 326 -43 -102 108 197 153 -26 50 -146 37 -36 -11 119 185 8 207
7960 207 121 240 81 -108 -37 -71 -111 -16 66 -144 119 -109 -185 -223 10 74 1 64 27 18 -86 -4 -46 -146 -47 -195
7986 -195 11 -62 -105 104 62 179 354 194 76 28 -120 -133 65 170 146 6 19 -65 -8 -182 -224 -73 -8 -30
8010 -30 143 -55 -36 -163 -72 144 -190 -7 43 -97 98 -255 34 -159 35 -63 -14 144 -12 -136 40 -222
8032 -222 186 -46 -81 -213 -228 -17 41 87 158 60 -216 -11 98 -55 -262 17 30 73 14 -52 101 251 -73
$$ packed form
7868I1n6J21k31M9O9j39J35Mj83K96O2j84J99m69J73j14l8K53r6K11N2j80J48
7891A73%k31J2J71k36J98j86L43n23N20k18j14Mk41M84J22j75j30K3n9o0O4r6
7914a55J78J49r9J65p8k53p8K74l86L65j44K11k41R0K85j58j15J06K5k99J84o2
7936c6L8J57j49j08N1J68K7k81M59l69n9K10Q9m4j79P6j96J83p3K5J30O6j77J99
7960B07q6J19j59j89P1l4m0R5Q2k10K63k28p6l8K33O4p3O3l7rj04Q2m2j00R9j48
7986a95K06p3m3K09m2J17J75j60j18m8j48j3J98J05k4j40J3q4N7j74m2J51O5k2
8010c0J73j98J9j27R1K16l34J83N0j40J95l53K89j93J94r8M9J58j56j24J76k62
8032b22M08k32l5j32j5K11N8M6P1r8k76K05J09j53k07K79J3M3n9o6J53J50l24
$$ plain form
8055 -73 -230 -60 -31 62 -84 154 134 9 186 -105 -147 -102 -118 83 269 24 10 -18 216 -122 -62 113 -100
8078 -100 -77 7 206 128 137 -90 107 -183 -309 12 1 -107 83 94 186 -80 -275 -199 -96 70 -180 10 43
8101 43 101 -34 -165 -41 217 -160 -194 -23 -90 299 45 181 -180 -75 -275 -266 -165 -45 -125 279 -9 -21 -84
8124 -84 98 42 41 54 -89 129 2 -23 249 75 -32 86 -64 174 -288 -120 147 65 177 26 170 -41
8146 -41 -251 -236 -293 27 84 -17 356 67 259 256 -119 -91 -254 102 118 -25 -162 -11 213 61 -118 17 40
8169 40 -189 -214 147 89 135 -160 -312 174 -210 24 -162 -126 15 137 52 277 -55 76 -286 -206 -111 -58
$$ packed form
8055g3j57J70K9R3j46K38k0j25J77k91m2M5j6K01J86k45j4k8K34l38O0J75k13
8078a00K3Q4J99p8Rk27J97k90j26L21j1j08J90J1R2k66j95P6J03J66k50J90L3
8101D3N8j35j31J24K58l77l4J71o7L89k54J36l61J05k00RJ01J20q0M04k88j2o3
8124h4J82n6jJ3j43K18j27k5K72j74j07J18j50K38m62J68K67q2J12j51J44k11
8146d1k10J5n7L20N7j01L73k89J92ll75K8j63L56J6j43j37J51K24j52j79J35K3
8169D0k29k5L61n8M6k95j52M86l84K34j86L6J41J22q5K25l32J31l62Q0R5N3
8191e8
$$ Imaginary data points
##PAGE= N=2
##DATA TABLE= (X++(I..I)), XYDATA
$$ plain form
0 0 0 0 0 0 0 0 0 0 0 0 0 0 0 0 8 -8 8 -8 8 -14 16 -16 23 -24 30 -32 40 -46 51 -59 67 -78 89 -99 113 -127
36 -127 143 -159 179 -199 220 -244 274 -303 335 -369 407 -447 494 -545 601 -664 729 -805 891
55 891 -985 1095 -1219 1363 -1534 1738 -1990 2308 -2721 3287 -4111 5432 -7886 14053 -68829
70 -68829 -62713 60632 35520 4811 24705 70627 40064 -18853 -60582 -55617 -34401 1544
82 1544 29139 40486 30831 35040 38589 2624 -66364 -80777 -32042 980 -6401 12384 58413
95 58413 65739 19005 -22740 -33309 -29807 -30395 -27029 -3910 38738 63211 43806 4064 -16136
108 -16136 -19291 -25858 -42915 -49140 -18686 35577 59365 33170 2811 1397 1609 -19157 -43915
121 -43915 -44207 -10009 38955 56355 28331 1977 7282 8577 -24393 -56953 -47530 -6183 25560
$$ packed form
0@%%%%%%%%%%%%%%Qj6J6j6J6k2L0l2L9m7N4o2P2q6R7j10J26j45J67j88K12k40
36a27K70l02L38l78M19m64N18n77O38p04P76q54R41j039J146j265J393j534J696
55H91j876K080k314K582k897L272l728M298n029O008p398R543j3318K1939q2882
70f8829O116J23345k5112l0709J9894M5922l0563n8917m1729M965K1216L5945
82A544K7595J1347r655M209L549l5965o8988j4413M8735L3022p381J8785M6029
95E8413P326m6734m1745j0569L502n88L366K3119M2648K4473j9405l9742k0200
108a6136l155o567j7057o225L0454N4263K3788k6195l0359j414K12k0766k4758
121d3915k92L4198M8964J7400k8024k6354N305J295l2970l2560R423M1347L1743
$$ plain form
134 25560 26085 15949 20225 26056 7086 -27418 -41898 -29367 -6130 12743 21976 24866 32106
147 32106 31506 3111 -34663 -43509 -24450 -11511 -9110 2429 26489 41893 28587 -4712 -25963
160 -25963 -22387 -15012 -18908 -16670 7406 36763 45781 27369 -1925 -18676 -18736 -22436 -34672 -28839
174 -28839 4429 35865 38307 18579 770 -5034 -10495 -25193 -36849 -21208 14552 36608 32460
187 32460 20033 12965 5116 -13686 -36989 -43552 -21540 9080 22680 20774 21429 21881 8775 -16983
201 -16983 -37077 -35031 -12768 10054 19163 22159 29198 29896 10048 -20715 -38573 -31900 -14697
214 -14697 -2628 4385 18395 33090 29596 4333 -20224 -28160 -23668 -16391 -6594 7859 25563
227 25563 37074 29627 5561 -16689 -23521 -22681 -22506 -17298 729 23984 32900 20870 2495 -8650
$$ packed form
134B5560N25j0136M276N831j8970l4504j4480J2531K3237J8873R233K890P240
147C2106o00k8395l7774q846J9059J2939K401J1539K4060J5404j3306l3299k1251
160b5963L576P375l896K238K4076K9357R018j8412k9294j6751o0l700j2236N833
174b8839L3268L1436K442j9728j7809n804n461j4698j1656J5641L5760K2056m148
187C2460j2427p068p849j8802k3303o563K2012L0620J3600j906O55M52j3106k5758
201a6983k0094K046K2263K2822R109K996P039O98j9848l0763j7858O673J7203
214a4697J2069P013J4010J4695l494k5263k4557p936M492P277R797J4453J7704
227B5563J1511p447k4066k2250o832Q40J75N208J8027K3255Q916j2030j8375j1145
$$ plain form
241 -8650 -14960 -22666 -25814 -15075 6432 25820 31227 22369 8123 -1323 -10549 -23751 -30819 -19012
255 -19012 4252 19049 20163 16607 13013 3851 -12281 -25270 -26249 -14675 2146 15405 21887
268 21887 21693 18046 9789 -6693 -23928 -27609 -15385 -2038 4747 11562 20949 21400 7636 -10431
282 -10431 -20432 -20955 -16702 -8159 3671 16126 24560 24140 13442 -3246 -16328 -20039 -17865 -13709
296 -13709 -4357 10957 22814 21327 9834 -2097 -12009 -19159 -21594 -15775 -2572 12460 23396
309 23396 24892 16647 4022 -7957 -17041 -22762 -20227 -7115 8752 18870 20002 15315 5993 -7077
323 -7077 -19075 -24142 -19147 -7721 7279 20230 24488 20371 10374 -2230 -15190 -23779 -21914 -10137
337 -10137 4277 14676 19800 19181 11384 -2728 -16912 -23734 -20955 -11416 2138 15484 23135 22212
$$ packed form
241h650o310p706l148J0739K1507J9388N407q858j4246r446r226j3202p068J1807
255a9012K3264J4797J114l556l594r162j6132j2989r79J1574J6821J3259O482
268B1887j94l647q257j6482j7235l681J2224J3347O785O815R387M51j3764j8067
282a0431j0001n23M253Q543J1830J2455Q434m20j0698j6688j3082l711K174M156
296a3709R352J5314J1857j487j1493j1931r912p150k435N819J3203J5032J0936
309B3396J496q245j2625j1979r084n721K535J3112J5867J0118J132m687r322j3070
323g077j1998n067M995J1426J5000J2951M258m117r997j2604j2960q589J865J1777
337a0137J4414J0399N124o19p797j4112j4184o822K779R539J3554J3346P651r23
$$ plain form
351 22212 14206 2070 -11955 -21798 -22351 -12717 384 11147 17209 20054 15258 1649 -13995 -22397
365 -22397 -20410 -13482 -3345 8809 19604 23282 17502 5221 -8349 -17562 -19754 -14723 -5284 5469
379 5469 15380 20797 17117 4565 -9737 -17263 -18146 -16122 -9738 2956 16342 22744 17999 7453
393 7453 -2994 -10756 -16168 -17803 -11103 1769 13842 18549 15577 7380 -1403 -9976 -17370 -20346
407 -20346 -14035 53 12675 17778 16135 11896 5781 -4696 -16065 -20155 -13002 -209 8853 12651
421 12651 14698 13984 6398 -6562 -17972 -20744 -14113 -4023 4660 11210 17079 18862 11002 -3410
435 -3410 -15048 -17591 -12452 -5769 237 8702 17932 19753 9567 -5361 -14073 -16230 -15227 -12095
449 -12095 -3975 9404 20222 20987 10980 -803 -8304 -12867 -15960 -14185 -5272 9406 20185 18756
$$ packed form
351B2212q006j2136j4025r843n53R634J3101J0763O062K845m796j3609j5644q402
365b2397J987O928J0137J2154J0795L678n780j2281j3570r213k192N031R439J0753
379E469R911N417l680j2552j4302p526q83K024O384J2694J3386O402m745j0546
393G453j0447p762n412j635O700J2872J2073M707k972q197q783q573p394k976
407b0346O311J4088J2622N103j643m239o115j0477j1369m090P153J2793R062L798
421A2651K047p14p586j2960j1410k772O631J0090Q683O550N869J783p860j4412
435c410j1638k543N139O683O006Q465R230J821j0186j4928q712k157J003L132
449a2095Q120J3379J0818P65j0007j1783p501m563l093J775Q913J4678J0779j429
$$ plain form
463 18756 8838 159 -5476 -13191 -20522 -18383 -5507 9240 17778 17368 11669 5543 -1379 -11536
477 -11536 -20602 -18481 -4594 9406 14300 13989 13543 10651 -870 -16507 -22958 -15572 -4969 2653
491 2653 9408 16359 17574 11154 26 -12694 -19860 -15216 -4343 2064 5473 13756 21935 15813
505 15813 -3189 -17246 -16170 -9891 -10234 -8523 4778 19804 20416 10274 -93 -7838 -13749 -14089
519 -14089 -9969 -5017 3403 15321 20958 13320 -543 -8177 -9934 -12984 -17198 -11212 5186 17081
533 17081 15394 9064 6468 1305 -9947 -18140 -15647 -4911 5595 11123 12602 12891 10529 1449
547 1449 -11190 -18873 -16042 -7039 2088 6942 9764 13145 14661 6373 -9594 -19847 -15172 -4450
561 -4450 1663 2771 8016 17061 18286 4443 -12037 -16930 -12075 -8221 -5691 742 10350 16448 15269
$$ packed form
463A8756r918q679n635p715p331K139J2876J4747Q538m10n699o126o922j0157
477a1536r066K121J3887J4000M894l11m46k892j1521j5637o451P386J0603P622
491B653O755O951J215o420j1128j2720p166M644J0873O407L409Q283Q179o122
505A5813j9002j4057J076O279l43J711J3301J5026O12j0142j0367p745n911l40
519a4089M120M952Q420J1918N637p638j3863p634j757l050m214N986J6398J1895
533A7081j687o330k596n163j1252q193K493J0736J0506N528J479K89k362r080
547A449j2639p683K831R003R127M854K822L381J516q288j5967j0253M675J0722
561d450O113J108N245R045J225j3843j6480m893M855L854K530O433R608O098j179
$$ plain form
576 15269 5895 -5946 -12927 -13170 -10327 -6689 -73 10262 18043 15794 5518 -3980 -8444 -12834
590 -12834 -16635 -11911 1902 12843 14639 10571 7521 3276 -5454 -15496 -18010 -9901 2598 10490
604 10490 12052 11107 10389 6049 -3693 -15869 -20411 -11736 1837 8849 8808 10005 13088 9240 -4208
619 -4208 -17296 -18523 -8943 323 4376 7613 13399 15712 8303 -4302 -13989 -15450 -10920 -4979 691
634 691 7700 14685 15486 7544 -3859 -11152 -12412 -10973 -8531 -1455 9495 17345 14666 5669 -2041
649 -2041 -6433 -10466 -14122 -12134 -2299 9364 14723 11965 6339 1341 -3470 -9953 -15079 -13408 -2524
664 -2524 9306 13757 11356 7652 4952 -991 -10465 -17059 -13078 -2264 6447 9394 9920 10911 7924
679 7924 -918 -10884 -15268 -11357 -3470 3120 7116 11173 13130 9630 -839 -11198 -13891 -10547 -5673
$$ packed form
576A5269r374j1841o981k43K843L638O616J0335P781k249j0276r498m464m390
590a2834l801M724J3813J0941J796m068l050m245q730j0042k514Q109J2499P892
604A0490J562r45p18m340r742j2176m542Q675J3573P012m1J197L083l848j3448
619d208j3088j227R580R266M053L237N786K313p409j2605r687j461M530N941N670
634F91P009O985Q01p942j1403p293j260J439K442P076J0950P850k679q997p710
649b041m392m033l656J988R835J1663N359k758n626m998m811o483n126J671J0884
664b524J1830M451k401l704k700n943r474o594L981J0814Q711K947N26R91k987
679G924q842r966m384L911P887O590L996M057J957l500j0469j0359k693L344M874
$$ plain form
694 -5673 -1187 4713 12284 14948 8996 -1298 -8992 -11138 -10248 -8150 -3515 4648 13227 15357 8964
709 8964 -310 -6050 -8876 -11157 -11567 -5619 4970 13012 13462 8226 2523 -3022 -8130 -12943 -12480 -5269
725 -5269 4333 11333 12095 8944 4894 -329 -7187 -13610 -13374 -5636 3882 8720 10034 10047 8111 1097
741 1097 -8294 -13997 -12673 -5575 1122 6294 9934 12033 9666 1737 -7683 -12763 -11401 -6278 -1181
756 -1181 4263 9665 12841 10442 1808 -6679 -10966 -10932 -8144 -3842 2657 10129 13647 10580 2618 -4793
772 -4793 -8925 -10513 -9836 -6064 1897 9961 13032 9422 3678 -2227 -7339 -10775 -11276 -6818 1332 9089
788 9089 12076 9906 5189 156 -5900 -10955 -11944 -7466 458 7711 10261 9887 6986 2031 -4937 -11122
804 -11122 -12069 -7418 -509 5475 8849 10545 8953 3300 -4741 -10316 -11269 -8145 -2574 2975 8510
$$ packed form
694e673M486N900P571K664n952j0294p694k146Q90K098M635Q163Q579K130o393
709H964r274n740k826k281m10N948J0589Q042M50n236n703n545n108m813M63P211
725e269R602P000P62l151m050n223o858o423K36P738R518M838J314J3j936p014
741A097r391n703J324P098O697N172L640K099k367p929r420n080J362N123N097
756a181N444N402L176k399q634q487m287L4K788M302O499P472L518l067p962p411
772d793m132j588O77L772P961Q064L071l610n744n905n112l436n01M458Q150P757
788I089K987k170m717n033o056n055r89M478P924P253K550l74k901m955o968o185
804a1122r47M651O909N984L374J696j592n653q041n575r53L124N571N549N535
$$ plain form
819 8510 11136 9673 4162 -3369 -9000 -10912 -8811 -3901 1619 7527 11036 10509 4939 -2546 -8204
834 -8204 -9843 -9163 -5952 185 7196 11522 10597 5623 -797 -6058 -9757 -10337 -7065 -762 5925 10328
850 10328 10171 6554 932 -4913 -8908 -10576 -8390 -1890 5154 9819 10021 7053 2711 -3172 -8567
865 -8567 -10835 -8618 -3186 3611 8353 9955 8515 3734 -2265 -7580 -10751 -9012 -3988 2498 7396
880 7396 9696 9021 5459 -918 -7140 -10533 -9440 -4956 911 5888 9327 9304 6334 132 -6090 -9865
896 -9865 -9594 -5893 -601 4687 8804 9883 7357 1280 -5219 -8683 -9303 -6685 -2082 3361 8511 10264
912 10264 7816 2157 -3665 -7994 -9540 -8038 -3343 2392 7526 10033 8150 3011 -2628 -6477 -9072
927 -9072 -8489 -4840 1694 7498 10067 8122 3784 -873 -5342 -9197 -9764 -5443 918 6264 9155 8550
$$ packed form
819H510K626j463n511p531n631j912K101M910N520N908L509n27n570p485n658
834h204j639O80L211O137P011M326r25m974o420n261l699n80L272O303O687M403
850A0328j57l617n622n845l995j668K186O500P044M665K02k968m342n883n395
865h567k268K217N432O797M742J602j440m781n999n315l171J739N024O486M898
880G396K300o75l562o377o222l393J093M484N867M977L439k3k970o202o222l775
896i865K71L701N292N288M117J079k526o077o499l464o20K618M603N443N150J753
912A0264k448n659n822m329j546J502M695N735N134K507j883n139n639l849k595
927i072N83L649O534N804K569j945m338m657m469l855n67M321O361N346K891o05
$$ plain form
943 8550 5174 489 -4520 -8675 -9886 -6275 10 5332 8186 8312 6457 2144 -3819 -9034 -10330
958 -10330 -6419 -1197 3444 6881 9242 7819 3242 -3155 -8451 -9685 -6531 -2141 1842 6051 9151
973 9151 8833 3680 -2637 -7636 -8550 -6792 -4604 -126 6063 9838 8498 4187 -1263 -5934 -8150 -7514
989 -7514 -5204 -822 5190 9926 8917 4071 -720 -4255 -6717 -8677 -7219 -1562 5497 8942 7671
1004 7671 4661 2035 -2375 -7595 -9597 -6990 -1619 3883 7608 8157 5907 3178 -1751 -7078 -9411
1019 -9411 -7217 -2476 2803 6545 6992 6927 4682 -1028 -7412 -9662 -6560 -2542 814 4578 8065 8778
1035 8778 5565 -1238 -6510 -7917 -6554 -4816 -1056 3928 7973 8777 5684 -114 -5687 -7095 -6120
1050 -6120 -5414 -2824 2813 8622 9849 5812 383 -3834 -5493 -7317 -7706 -3920 3071 7981 8343 5857
$$ packed form
943H550l376m685n009m155j211L611O285N322K854J26j855m313n963n215j296
958a0330L911N222M641L437K361j423m577o397n296j234L154M390L983M209L100
973I151l18n153o317m999r14J758K188M478O189L775j340m311n450m671k216O36
989g514K310M382O012M736j009m846m791l535k462j960J458N657P059L445j271
1004G671l010k626m410n220k002K607N371N502L725N49k250k729m929n327k333
1019i411K194M741N279L742M47o5k245n710o384k250L102M018L356L764L487P13
1035H778l213o803n272j407J363J738L760M984M045Q04l093n798n573j408R75
1050f120P06K590N637N809J227m037n429m217j659j824l89L786O991M910L62k486
$$ plain form
1066 5857 1926 -2061 -5433 -7767 -7940 -3639 2754 6880 7371 6225 3706 -421 -5159 -8418 -8182 -3781
1082 -3781 1969 5193 6274 7122 5700 543 -5398 -8752 -7227 -3367 770 3286 5888 8671 7140
1097 7140 784 -5652 -7583 -6713 -4159 -1076 1778 5902 9122 7587 1303 -4834 -6714 -6460 -5059
1112 -5059 -2876 1015 5960 9155 7084 1057 -3359 -5090 -6278 -6590 -4003 1292 6279 8093 6484
1127 6484 2290 -1094 -3865 -6940 -7756 -4326 1168 5535 7356 6154 3289 927 -2875 -7473 -8744
1142 -8744 -4319 1198 4500 5432 6126 5418 2265 -3018 -7763 -8370 -4486 -48 2880 4905 6660 6395
1158 6395 3139 -2326 -7667 -7886 -4260 -1387 947 4365 7649 7401 2646 -2635 -6046 -6780 -5413 -2944
1174 -2944 305 4480 7738 7632 3300 -1652 -5001 -5608 -5731 -4889 -1171 4758 8028 6318 2960 -40
$$ packed form
1066E857l931l987l372k334j73M301O393M126M91j146k519m127m738l259K36M401
1082c781N750L224J081Q48j422n157n941l354J525L860M137K516K602K783j531
1097G140o356o436j931Q70K554L083K854M124L220j535o284o137j880K54J401
1112e059K183L891M945L195k071o027m416j731j188l12K587N295M987J814j609
1127F484m194l384k771l075q16L430N494M367J821j202k865k362l802m598j271
1142h744M425N517L302R32O94p08l153n283m745o07L884M438K928K025J755k65
1158F395l256n465n341k19L626K873K334L418L284k48m755n281l411p34J367K469
1174b944L249M175L258j06m332m952l349o07j23Q42L718N929L270j710l358l000
$$ plain form
1190 -40 -2951 -6002 -7127 -5477 -866 3927 7162 6744 3795 1201 -1791 -5303 -7483 -6171 -1346 3830
1206 3830 5786 5367 4965 2990 -1370 -6259 -7858 -5671 -1470 2211 4863 5908 5729 3890 -600 -5985
1222 -5985 -7839 -5307 -2126 969 3530 6196 7047 4192 -719 -5067 -6452 -5285 -3444 -776 2958
1237 2958 6367 7073 4567 -259 -4116 -5567 -5658 -4304 -1992 2777 6694 7101 4395 203 -2625 -4898
1253 -4898 -5778 -5839 -2738 2449 6419 6463 4320 1723 -1422 -4286 -6589 -6163 -2573 2132 5330 6078 5053
1270 5053 2514 -357 -4104 -6641 -6538 -2936 1574 4197 5123 5125 4126 637 -4054 -6620 -5887 -3265 174
1287 174 3035 5364 6270 4609 828 -3389 -6190 -5801 -3434 -878 1807 4623 6760 5178 1011 -3045
1303 -3045 -5289 -5374 -4472 -2142 1394 4898 6552 5288 1645 -1947 -4516 -5184 -4769 -3186 953 5106
$$ packed form
1190d0k911l051j125J650M611M793L235m18k949k594k992l512k180J312M825N176
1206C830J956m19m02j975m360m889j599K187M201L681K652J045j79j839m490n385
1222e985j854K532L181L095K561K666Q51k855m911m348j385J167J841K668L734
1237B958L409P06k506m826l857j451r1J354K312M769L917M07k706m192k828k273
1253d898q80o1L101N187L970M4k143k597l145k864k303M26L590M705L198P48j025
1270E053k539k871l747k537J03L602M510K623R26Kr99l489m691k566P33K622L439
1287A74K861K329R06j661l781m217k801L89K367K556K685K816K137j582m167m056
1303c045k244q5R02K330L536L504J654j264l643l592k569o68M15J583M139M153
$$ plain form
1319 5106 6794 5239 1908 -854 -3296 -5227 -6005 -3898 417 4401 6076 5086 3004 113 -3132
1334 -3132 -5360 -6246 -4087 225 3776 5245 5103 3715 1297 -2171 -5340 -6203 -3969 -570 2418 4620
1350 4620 5506 4630 1697 -1987 -4930 -5924 -4503 -1104 1668 4209 5533 5256 2212 -1752 -4897 -5580
1366 -5580 -4492 -2284 673 3939 5875 5145 2605 -1048 -3796 -4982 -4952 -2694 -116 3278 5630 5307
1382 5307 2984 -417 -2963 -4727 -4982 -3949 -783 3070 5642 5280 3300 567 -2204 -4582 -5485 -4211
1398 -4211 -1217 2210 4984 5354 4108 1295 -1683 -4119 -5524 -4676 -1989 1967 4289 5108 4189 2450
1414 2450 -809 -4127 -5860 -4776 -2121 902 3513 4836 4684 3198 -323 -3840 -5406 -4976 -2889
1429 -2889 422 2858 4926 5235 3678 352 -3556 -5021 -4921 -3233 -706 2193 4838 5253 4101 574
$$ packed form
1319E106J688j555l331k762k442j931p78K107M315L984J675r90k082k891l245
1334c132k228q86K159M312L551J469j42j388k418l468l169q63K234L399K988K202
1350D620Q86q76k933l684k943r94J421L399K772K541J324k77l044l964l145o83
1366e580J088K208K957L266J936p30k540l653k748j186L0K258K578L394K352l23
1382E307k323l401k546j764k55J033L166L853K572l62j980k733k771k378r03J274
1398d211K994L427K774L70j246k813k978k436j405Q48K687L956K322Q19r19j739
1414B450l259l318j733J084K655L023K611J323j52j486l521l517j566M30K087
1429b889L311K436K068L09j557l326l908j465J00J688K527K899K645M15j152l527
$$ plain form
1445 574 -2767 -4608 -4925 -4012 -1555 1810 4590 5269 4014 970 -2122 -4005 -4716 -4237 -1839 1366
1461 1366 4123 5261 4324 2053 -1269 -3563 -4673 -5054 -2524 1034 3939 4866 4102 2266 -441 -2819
1477 -2819 -4495 -4968 -2962 537 3286 4248 4326 3227 793 -2392 -4766 -5107 -3296 -317 2504 3898
1493 3898 4621 3726 1113 -1995 -4393 -4717 -3219 -971 1759 3595 4772 4282 1637 -1701 -4292 -4685
1509 -4685 -3652 -1541 637 3233 5057 4623 1679 -1346 -3146 -4489 -4076 -2536 310 3086 4862
1524 4862 4798 2447 -600 -2648 -4069 -4247 -3419 -491 2552 4760 4471 2609 126 -1988 -3845 -4839
1540 -4839 -3633 -470 2230 4228 4299 3193 1158 -1275 -3770 -5348 -4020 -871 1851 3752 4341 3603
1556 3603 2002 -922 -3764 -5181 -4041 -1422 1262 3049 4375 4219 2421 -306 -3599 -5054 -3784
$$ packed form
1445E74l341j841l17R13K457L365K780O79j255l044l092j883p11M79K398L205
1461A366K757J138r37k271l322k294j110l81K530L558K905R27p64j836k707k378
1477b819j676m73K006L499K749R62P8j099k434l185k374l41J811K979K821J394
1493C898P23q95k613l108k398l24J498K248K730J836J177m90k645l338k591l93
1509d685J033K111K178K596J824m34k944l025j800j343M13J540K846K776J776
1524D862o4k351l047k048j421j78Q28K928L043K208k89j862k483k114j857r94
1540d839J206L163K700J998P1j106k035k433k495j578J328L149K722J901N89p38
1556C603j601k924k842j417J140K619K684J787J326j56j798k727l293j455J270
$$ plain form
1571 -3784 -2364 160 2151 4545 4595 2446 -286 -3021 -4252 -3890 -2621 -572 2319 4431 4943 2782
1587 2782 141 -2315 -3912 -3976 -3521 -1459 1514 4267 4789 2764 388 -1270 -3259 -4242 -3863 -1621
1603 -1621 1538 4211 4113 3233 1481 -624 -3041 -4489 -3967 -1901 974 3341 4218 3027 2193 30
1619 30 -2852 -4615 -4117 -1958 657 2356 3687 4088 2974 497 -2593 -4082 -4057 -2609 -38 1810
1635 1810 3465 4129 3337 584 -2370 -3922 -3696 -2506 -1062 1047 3379 4605 3574 902 -1951 -3137
1651 -3137 -3434 -3264 -1579 816 3141 4500 3396 1278 -1386 -2725 -3535 -3946 -2507 616 3139 4219
1667 4219 3465 1817 -126 -1914 -3559 -3910 -2611 235 2784 3958 3318 2258 580 -1931 -4072 -4414
1683 -4414 -2839 -205 2297 3255 3674 3250 1415 -1421 -3807 -4400 -2804 -733 1494 2808 3781 3549
$$ packed form
1571c784J420K524J991K394N0k149k732k735j231L62J269K049K891K112N12k161
1587B782k641k456j597o4M55K062K973K753N22k025k376j658j989r83L79K242
1603a621L159K673r8q80j752k105k417j448N22K066K875K367Q77j191q34k163
1619C0k882j763M98K159K615J699J331M01j114k477l090j489K5J448K571J848
1635A810J655O64p92k753k954j552K26J190J444K109K332J226j031k672k853j186
1651c137k97J70J685K395K325J359j104k118k664j339q10m11J439L123K523J080
1667D219p54j648j943j788j645l51J299K846K549J174o40j060j678k511k141l42
1683d414J575K634K502R58M19m24j835k836k386n93J596K071K227J314R73k32
$$ plain form
1699 3549 1697 -1591 -3359 -3982 -3205 -1345 992 2983 4042 3901 2048 -844 -3271 -3668 -3142 -2090
1715 -2090 -67 2245 4030 3849 1708 -642 -2465 -3444 -3496 -2580 -266 2160 4021 4048 2366 57 -1847
1732 -1847 -3169 -3672 -2982 -697 2395 3530 3252 2563 956 -1055 -3333 -4197 -3186 -1014 1450 2938
1748 2938 3684 2849 1170 -478 -2818 -4038 -3275 -737 1309 2489 2904 3285 1954 -749 -2977 -3518
1764 -3518 -3151 -1528 495 2218 3277 3575 2181 209 -2318 -3802 -3145 -1956 -570 1440 3356 3993
1780 3993 2504 95 -1877 -3036 -3327 -2687 -833 1207 3029 3532 2683 940 -1327 -2797 -3501 -2957
1796 -2957 -1228 1162 3031 3795 2591 1005 -487 -2367 -3312 -3535 -1627 766 2487 3399 2979 1852
1812 1852 -55 -2026 -3566 -3560 -1743 377 2415 3258 3173 2160 373 -1864 -3579 -3554 -2157 -21 1448
$$ packed form
1699C549j852l288j768o23P77J860K337J991J059j41j853k892k427l97N26J052
1715b090K023K312J785j81k141k350j823r79n2R16K314K426J861K7j682k309j904
1732a847j322n03O90K285L092J135k78o89j607k011k278q64J011K172K464J488
1748B938P46q35j679j648k340j220P63K538K046J180M15L81j331k703k228n41
1764c518L67J623K023J723J059K98j394j972k527j484O57J189J386K010J916O37
1780C993j489k409j972j159k91O40J854K040J822N03q49j743k267j470p04N44
1796b957J729K390J869P64j204j586j492j880r45k23J908K393J721R12m20j127
1812A852j907j971j540OJ817K120K038Q43q5j013j787k237j715K5J397K136J469
$$ plain form
1829 1448 2839 3211 2501 844 -1422 -3079 -3184 -2097 -561 1597 2967 3319 2962 925 -1412 -2851
1845 -2851 -3308 -2693 -1153 460 2675 3531 3032 1281 -1001 -2323 -3080 -3030 -1774 447 2573 3579 2805
1862 2805 1364 -363 -2001 -3248 -3183 -1803 -163 2188 3194 3098 1916 174 -1786 -2908 -3353 -2369
1878 -2369 -185 2183 2986 2739 2176 1144 -1190 -2974 -3523 -2348 -409 1286 2552 2831 2527 737
1894 737 -1167 -2631 -3321 -2633 -965 911 2130 2936 2893 1454 -580 -2469 -3192 -2713 -1481 75 1845
1911 1845 2932 3187 1481 -477 -1747 -2599 -2655 -1784 -256 1830 2905 2983 1983 290 -1452 -3019 -2917
1928 -2917 -2302 -701 1302 2990 3186 1994 358 -892 -2538 -3305 -2711 -844 1235 2490 3226 2207
1944 2207 849 -546 -2070 -3077 -2719 -1262 713 2337 2587 2613 1665 -328 -2011 -3123 -2682 -1466
$$ packed form
1829A448J391L72p10j657k266j657j05J087J536K158J370L52l57k037k337j439
1845b851m57O15J540J613K215Q56m99j751k282j322p57N0J256K221K126J006p74
1862B805j441j727j638j247O5J380J640K351J006r6j182j742j960j122m45R84
1878b369K184K368Q03k47n63j032k334j784n49J175J939J695J266K79l04j790
1894G37j904j464o90O88J668J876J219Q06m3j439k034j889p23M79J232J556J770
1911A845J087K55j706j958j270q52n6Q71J528K086J075P8j000j693j742j567J02
1928b917O15J601K003J688J96j192j636j250j646p67N94J867K079J255P36j019
1944B207j358j395j524j007L58J457J975J624K50K6r48j993j683j112M41J216
$$ plain form
1960 -1466 384 1833 2805 2908 1793 -66 -1907 -3062 -2753 -1662 -352 1487 2633 3225 2132 190
1976 190 -1818 -2536 -2858 -1948 -499 918 2520 3166 2385 611 -1306 -2614 -2789 -2307 -1112 978 2525
1993 2525 3032 2515 425 -1022 -2127 -2733 -2662 -1383 633 2148 2826 2306 1333 -227 -1697 -2639 -2619 -1596
2011 -1596 509 2063 2663 2518 1466 61 -1906 -2859 -2820 -1709 -73 1463 2399 2702 1828 124 -1153
2028 -1153 -2680 -3172 -1894 -489 938 2340 2859 2348 919 -1132 -2408 -2955 -1970 -1025 626 2096
2044 2096 2832 2632 1176 -611 -2109 -2729 -2128 -1192 92 1659 2992 2541 1320 -540 -1874 -2692 -2532
2061 -2532 -1294 251 1622 2813 2976 1648 114 -1411 -2485 -2755 -1976 -240 1259 2576 2375 1725
2077 1725 636 -930 -2160 -2799 -2298 -737 1162 2400 2589 2113 974 -818 -2129 -2796 -2247 -667
$$ packed form
1960a466J850J449R72J03j115j859j841j155L09J091J310J839J146N92j093j942
1976A90k008p18l22R10J449J417J602O46p81j774j917j308j75M82J195K090J547
1993B525N07n17k090j447j105o06P1J279K016J515O78n20r73j560j470r42K0J023
2011a596K105J554O00j45j052j405j967r53L9J111J636J536R36L03q74j704j277
2028a153j527m92J278J405J427J402N19n11j429k051j276n47R85R45J651J470
2044B096P36k00j456j787j498o20O01R36J284J567J333m51j221j860j334q18J60
2061b532J238J545J371J191J63j328j534j525j074k70P79J736J499J317k01o50
2077A725j089j566j230o39N01J561J899J238J89m76j139j792j311o67N49J580
$$ plain form
2093 -667 611 1982 2485 2037 1416 -406 -1996 -2812 -2386 -1353 432 1996 2735 2508 1586 -202 -1898
2110 -1898 -2674 -2428 -1635 -101 1339 2779 2964 1902 81 -1500 -2542 -2415 -1695 -586 1222 2533
2126 2533 2557 1778 498 -1003 -2160 -2554 -2157 -954 997 2288 2752 2138 839 -749 -1999 -2751 -2431
2143 -2431 -1384 657 1988 2326 2392 1400 -371 -1691 -2497 -2467 -1452 207 1583 2248 2299 1630 -202 -1570
2161 -1570 -2513 -2580 -1501 121 1299 2119 2509 1946 302 -1308 -2572 -2474 -1712 -488 919 2280 2411
2178 2411 2007 551 -1166 -2156 -2395 -1916 -772 609 2053 2734 2097 751 -639 -1773 -2458 -2355 -1222
2195 -1222 261 1680 2274 2229 860 -281 -1793 -2035 -2535 -1254 322 1339 2424 2370 1380 72 -1155
2212 -1155 -2340 -2319 -1418 -199 1410 1998 2454 1730 166 -856 -2170 -2557 -1628 -159 1258 1741 2476
$$ packed form
2093f67J278J371N03m48o21j822j590q16M26J033J785J564P39k27r22j788j696
2110a898p76K46P93J534J440J440J85j062j821j581j042J27P20J109J808J311
2126B533K4p79j280j501j157l94L97J203J951J291M64o14j299j588j250p52L20
2143b431J047K041J331L38O6r92j771j320q06L0J015J659J376O65N1o69j832j368
2161a570r43o7J079J622J178Q20L90n63j644j610j264R8P62J224J407J361J31
2178B411m04j456j717r90k39M79J144J381J444O81o37j346j390j134o85J03J133
2195a222J483J419N94m5j369j141j512k42n00J281J576J017J085n4r90j308j227
2212a155j185K1R01J219J609N88M56p24j564j022j314l87R29J469J417M83P35
$$ plain form
2229 2476 1944 481 -795 -2044 -2419 -1937 -751 544 1800 2304 2159 975 -628 -2068 -2491 -1898 -847
2246 -847 98 1555 2359 2332 1226 -97 -1450 -2331 -2120 -1380 -119 1432 2733 2307 1199 37 -1249
2263 -1249 -2193 -2125 -1410 -474 1057 2314 2456 1556 214 -816 -2029 -2138 -1926 -604 1036 1984 2131 1897
2281 1897 470 -295 -1871 -2052 -2043 -841 831 1766 2394 2000 978 -364 -1826 -2607 -1922 -717 456
2298 456 1634 2082 1936 1327 -297 -1611 -2296 -2171 -1264 -80 1277 2101 2266 1497 180 -1148 -2141 -2277
2316 -2277 -1473 -345 678 1702 2381 1659 201 -784 -1946 -2177 -1549 -585 839 2117 2240 1931 770
2333 770 -763 -1820 -2359 -2009 -1057 230 1381 2309 2017 667 -497 -1618 -2039 -2016 -1208 570 1535 1945
2351 1945 1909 1167 201 -1164 -1984 -2203 -1403 -273 1105 1914 2215 1071 17 -899 -2013 -2265 -1627 -290
$$ packed form
2229B476n32j463j276j249l75M82J186J295J256N04j45j184j603j440m23N93J051
2246h47R45J457Q04k7j106j323j353q81K11P40J261J551J301m26j108j162j286
2263a249r44O8P15R36J531J257J42r00j342j030j213j09K12J322J640R48J47k34
2281A897j427p65j576j81RJ202J672R35O28l94j022j342j462p81O85J205J173
2298D56J178M48j46o09j624j314o85J25R07J184J357Q24J65p69j317j328r93j36
2316b277Q04J128J023J024O79p22j458r85j162k31O28R64J424J278J23l09j161
2333G70j533j057n39L50R52J287J151R28k92j350j164j121m21K3Q08J778R65M10
2351A945l6p42r66j365q20k19Q00J130J378Q09L01j144j054r16j114k52O38J337
$$ plain form
2369 -290 968 1753 1996 1534 572 -1025 -2120 -2092 -1356 -458 536 1506 2199 1857 662 -579 -1643 -1921
2387 -1921 -1670 -854 125 1456 1937 1880 1031 -325 -1297 -1779 -1870 -1053 -42 1402 1977 2038 1054 186 -1083
2406 -1083 -1758 -2084 -1269 -133 1256 1804 1923 1377 345 -838 -1788 -2139 -1667 -641 1058 1967 1916 1644
2424 1644 702 -277 -1659 -2335 -1847 -504 721 1473 2052 1740 1029 -519 -1418 -2219 -1870 -766 301 1332
2442 1332 1826 1606 939 90 -1471 -1907 -1874 -951 1 1283 2116 1823 1315 112 -1290 -2015 -2020 -1490 -271
2461 -271 599 1758 2033 1518 301 -859 -2020 -2032 -1598 -750 587 1946 1844 1395 723 -415 -1403 -2117
2479 -2117 -1499 -602 477 1506 1819 1631 646 -569 -1326 -2073 -1883 -835 478 1043 1633 1703 1049 -23
2497 -23 -1151 -2055 -1930 -838 77 915 1633 1773 1297 173 -996 -1648 -1779 -1083 -428 714 1678 1726 1565
$$ packed form
2369b90J258P85K43m62r62j597j095K8P36Q98R94R70O93l42j195j241j064k78
2387a921K51Q16R79J331M81n7q49j356r72m82r1Q17J011J444N75O1r84q68j269
2406a083o75l26Q15J136J389N48J19n46j032j183r50l51M72J026J699R09n1k72
2424A644r42r79j382o76M88J343J225P52N79l12p11j548q99q01L49J104J067J031
2442A332M94k20o67q49j561m36L3R23R52J282Q33k93n08j203j402p25nN30J219
2461b71Q70J159K75n15j217j160j161j2M34Q48J337J359j02m49o72j138r88p14
2479b117O18Q97J079J029L13j88r85j215p57p47J90J048J313N65N90P0o54j072
2497b3j128r04J25J092R15Q38P18J40m76j124j169o52j31O96O55J142R64M8j61
$$ plain form
2516 1565 289 -775 -1821 -1971 -1302 -495 437 1365 1811 1690 649 -534 -1439 -1643 -1647 -1001 224 1370
2534 1370 2164 1712 750 -104 -1171 -1749 -1826 -1121 187 1293 1708 1736 947 109 -870 -1942 -2117 -1194 102
2553 102 990 1662 1798 1398 280 -940 -1853 -1874 -973 -100 883 1756 1885 1250 419 -868 -1597 -1785 -1680
2572 -1680 -335 713 1533 1948 1612 314 -258 -1157 -1597 -1625 -441 556 1271 2014 1861 720 -546 -1176
2590 -1176 -1815 -2136 -981 285 1073 1862 1593 965 -96 -897 -1558 -1602 -1240 -106 870 1663 1693 1218 308
2609 308 -696 -1370 -1883 -1485 -231 954 1330 1869 1321 495 -137 -1338 -1821 -1526 -553 680 1299 1753
2627 1753 1520 733 -374 -1199 -2022 -1385 -799 206 972 1710 1365 1018 -204 -1129 -1831 -1530 -715 4 654
2646 654 1746 1676 1043 164 -651 -1502 -1615 -1035 -238 568 1570 1719 1235 218 -710 -1439 -1567 -1398 -530
$$ packed form
2516A565j276j064j046j50O69Q07R32R28M46j21j041j183r05k04mO46J225J146
2534A370P94m52r62q54j067n78p7P05J308J106M15K8p89q38r79j072j75R23J296
2553A02Q88O72J36m00j118j220r13k1R01Q73R83Q73J29o35q31j287p29j88J05
2572a680J345J048Q20M15l36j298n72q99m40k8J184R97P15P43j53j141j266o30
2590a176o39l21J155J266P88P89k69o28j061q01o61m4L62J134R76P93L0m75r10
2609C08j004o74n13L98J254J185L76N39n48q26o32j201m83K95R73J233O19M54
2627A753k33p87j107q25q23O37N86J005P66P38l45l47j222r25p02L01Q15P19O50
2646F54J092p0o33q79q15q51j13N80P97Q06J002J49m84j017r28p29j28J69Q68
$$ plain form
2665 -530 394 1539 1767 1041 460 -187 -1066 -1764 -1325 -692 446 1291 1699 1430 661 -238 -1046 -1724 -1478
2684 -1478 -846 190 1101 1611 1407 977 181 -899 -1624 -1757 -1211 -340 787 1680 1776 1268 418 -714 -1550
2703 -1550 -1506 -1193 -3 871 1396 1584 1548 349 -633 -1429 -1647 -1318 -847 315 1367 1777 1386 700 -471
2722 -471 -1233 -1482 -1513 -1031 468 1113 1537 1447 745 -259 -1073 -1562 -1559 -952 24 981 1566 1647 906 -80 -892
2743 -892 -1636 -1836 -1032 -133 934 1431 1479 1100 313 -666 -1451 -1560 -1338 -366 334 1058 1577 1245 464 -548
2763 -548 -1325 -1656 -1178 -467 435 1296 1763 1441 675 -437 -1168 -1549 -1427 -986 36 866 1558 1369 978
2782 978 -202 -1263 -1625 -1417 -792 -114 845 1491 1413 1032 187 -599 -1397 -1789 -1294 -85 588 1573 1553 1041
2802 1041 196 -649 -1254 -1623 -1137 -240 731 1477 1438 1236 659 -462 -1372 -1505 -1650 -860 219 885 1703
$$ packed form
2665e30R24J145K28p26n81o47q79o98M39O33J138Q45M08k69p69q99q08o78K46
2684a478O32J036R11N10k04m30p96j080p25j33N46Q71J127Q93R6n08q50j132q36
2703a550M4L13J190Q74N25J88l6j199r82p96k18L29M71J162J052M10l91o86j171
2722d71p62k49l1M82J499O45M24r0p02j004q14m89LO07R76R57N85Q1p41r86q12
2743h92p44k00Q04Q99J067M97M8l79p87r79p85j09K22R72P00P24N19l32p81j012
2763e48p77l31M78P11R02Q61M67l22p66j112p31l81J22M41J022Q30O92j89l91
2782I78j180j061l62K08O25O78R59O46p8l81q45p86p98l92M95J209O73R85k0n12
2802A041q45q45o05l69M86Q97R71P46l9k02n77j121r10j33j45P90J079O66Q18
$$ plain form
2821 1703 1323 817 -218 -1067 -1616 -1686 -635 181 1068 1628 1510 818 96 -784 -1522 -1340 -1185 210 804
2840 804 1406 1466 822 310 -799 -1381 -1425 -1003 -629 621 994 1840 859 225 -495 -1160 -1655 -1323 -330 367
2860 367 1303 1520 1539 403 -436 -1263 -1442 -1209 -636 88 1100 1691 1116 432 -194 -932 -1573 -1441 -638 171
2880 171 896 1465 1592 805 -127 -1042 -1151 -1357 -921 -141 1046 1589 1474 781 285 -735 -1323 -1549 -1151
2899 -1151 -507 413 1242 1228 1294 431 -340 -1189 -1718 -1115 -469 304 1131 1371 1462 743 -95 -1037 -1477 -1214 -358
2920 -358 95 893 1224 1418 835 -150 -1012 -1574 -1160 -942 -29 549 1319 1259 886 166 -832 -1250 -1194 -1114 36
2941 36 680 1266 1371 1091 311 -624 -1198 -1652 -1149 -524 719 1228 1609 1264 515 -427 -1091 -1241 -1337 -345
2961 -345 348 1155 1323 1252 631 -106 -1222 -1191 -1126 -500 99 902 1636 1348 1030 -167 -868 -1481 -1353 -790
$$ packed form
2821A703l80n06j035q49n49p0J051Q16Q87N60j18o92p22q80p38J82J55J395N94
2840H04O02O0o44n12j109n82m4M22L74J250L73Q46r81o34p20o65m95L32R93O97
2860C67R36K17J9j136q39q27j79K33N73P24J012N91n75o84o26p38o41J32Q03Q09
2880A71P25N69J27p87r32r15j09k06M36P80J187N43j15o93m96j020n88k26L98
2899a151O44R20Q29j4O6q63p71q49n29O03O46P73Q27K40R1p19q38r42m40K63Q56
2920c58M53P98L31J94n83r85q62n62M14K18R13N78P70o0l73p20r98m18N6Q0J150
2941C6O44N86J05k80p80r35n74m54N03O25J243N09L81l45p49r42o64j50r6R92
2961c45O93Q07J68p1o21p37j116L1O5O26N99Q03P34k88l18j197p01o13J28N63
$$ plain form
2981 -790 -155 745 1156 1633 927 162 -678 -1461 -1318 -1017 -439 790 1629 1346 975 145 -503 -1114 -1491 -1121
3001 -1121 -394 445 1200 1552 912 425 -554 -872 -1275 -1346 -773 141 1213 1405 1036 778 -466 -893 -1504
3020 -1504 -1344 -678 114 1187 1442 1371 1066 286 -609 -1552 -1554 -900 97 951 1133 1236 877 83 -680 -948
3040 -948 -1371 -818 -137 366 1053 900 1167 423 -684 -962 -1547 -1061 -497 376 840 1336 1282 559 -379 -929
3060 -929 -1369 -1184 -659 342 905 1479 1065 442 -5 -696 -1149 -1113 -994 148 626 1447 1111 687 85 -536
3080 -536 -1271 -1479 -999 -156 873 1077 1257 931 437 -503 -1175 -1276 -984 -338 490 1041 1051 1028 526 -163
3100 -163 -1004 -1598 -992 -467 440 778 1421 1492 616 -430 -1015 -1094 -1010 -496 18 1002 1242 1122 760 -97 -1035
3121 -1035 -1432 -1224 -733 15 719 1390 1306 786 149 -713 -1071 -1100 -1030 -266 707 1174 1114 647 62 -361 -1186
$$ packed form
2981g90O35R00M11M77p06p65q40p83J43L01N78J229Q39k83l71q30o48o11l77L70
3001a121P27Q39P55L52o40m87r79l18m03p1N73R14J072J92l69k58j244m27o11
3020a504J60O66P92J073K55p1l05p80q95r43kO54R97Q54J82J03l59p94p63k68
3040i48m23N53O81N03O87j53K67p44j107k78n85M86N64Q73M64M96n4p23r38n50
3060i29m40J85N25J001N63N74m14o23m47o91m53L6J19J142M78Q21l36m24o02o21
3080e36p35k08M80Q43J029K04J80l26m94r40o72j01K92O46Q28N51J0k3n02o89
3100a63q41n94O06N25R07L38O43P1q76j046n85p9Q4N14N14R84K40j20l62q57r38
3121a035l97K08M91P48P04O71q4n20o37q62l58k9P0P64R73M67o0m67n85m23q25
$$ plain form
3142 -1186 -1166 -1134 -377 562 1230 1196 1214 638 -420 -784 -1308 -981 -446 425 885 1085 1129 481 -113 -1007 -1137
3163 -1137 -1214 -696 178 757 1063 1279 895 -163 -752 -1243 -1175 -807 -168 792 1062 1341 766 55 -519 -1232
3183 -1232 -1208 -1051 -175 450 1254 1305 893 584 -475 -1215 -1115 -1058 -234 367 1048 1278 1135 484 -206 -963
3203 -963 -1484 -1234 -680 436 907 1230 1166 592 -249 -860 -1057 -1286 -668 -8 778 1039 1007 686 35 -799
3223 -799 -1069 -1395 -879 -97 845 1122 1007 779 408 -635 -1165 -1279 -698 -421 506 1144 1498 1119 432 -548
3243 -548 -1202 -1208 -862 -410 458 1138 1178 1189 505 -234 -970 -1302 -1207 -665 154 753 1263 1267 543 -303 -744 -1429
3265 -1429 -1351 -970 -124 894 1266 1443 482 160 -563 -1066 -1330 -936 -200 638 1150 1184 1028 108 -525 -1020
3285 -1020 -1410 -1028 -321 461 672 994 1153 269 -260 -1361 -971 -992 -733 376 684 1096 1041 424 -392 -982
$$ packed form
3142a186K0L2P57R39O68l4J8n76j058l64n24L27N35Q71M60K00M4o48n94q94j30
3163a137p7N18Q74N79L06K16l84j058n89m91O8L68O39R60K70K79n75p11n74p13
3183a232K4J57Q76O25Q04N1m12l09j059p40J00N7Q24O01O81K30j43o51o90p57
3203i63n21K50N54J116M71L23o4n74q41o11j97k29O18O60P86K61l2l21o51q34
3223g99k70l26N16P82R42K77j15k28l71j043n30j14N81K77R27O38L54l79o87r80
3243e48o54oL46M52Q68O80M0J1o84p39p36l32R5N42Q19N99N10Mp24q46m41o85
3265a429P8L81Q46J018L72J77r61l22p23n03k64L94P36Q38N12L4j56r20o33m95
3285a020l90L82P07P82K11L22J59q84n29j101L90k1K59J109L08M12n5o17q16n90
$$ plain form
3305 -982 -1062 -1253 -536 132 1003 1298 1056 611 14 -634 -1059 -1251 -689 133 658 1068 1043 919 76 -709 -1200
3326 -1200 -1374 -851 -222 447 914 1248 1020 335 -419 -967 -1307 -1153 -501 320 838 932 1040 291 -412 -1040
3346 -1040 -1206 -915 -369 179 869 1226 1147 538 46 -778 -1126 -1485 -805 84 873 1268 1175 785 47 -589
3366 -589 -1209 -1223 -753 -173 615 1037 1085 876 130 -594 -1225 -1026 -991 -315 487 969 1147 1327 351 -341 -1122
3387 -1122 -1507 -1239 -625 264 891 952 965 464 -333 -775 -1095 -1086 -619 173 914 1616 1160 622 -128 -843 -1213
3408 -1213 -980 -543 -58 480 1080 1166 901 114 -606 -1178 -906 -818 -160 355 900 1143 1047 119 -437 -1195 -1217
3429 -1217 -1023 -263 540 751 1088 1118 197 -358 -894 -1478 -971 -504 175 963 1014 1078 593 -201 -853 -1103 -955
3450 -955 -510 -63 449 1211 1313 522 -18 -654 -1220 -1037 -794 -71 577 980 1155 664 59 -667 -993 -931
$$ packed form
3305i82q0j91P17O68Q71K95k42m45n97o48m25j92N62Q22N25M10k5j24q43p85m91
3326a200j74N23O29O69M67L34k28o85p54n48l40J54O52Q21N18R4J08p49p03o28
3346a040j66K91N46N48O90L57p9o09m92q24l48l59O80Q89P89L95r3l90p38o36
3366e89o20j4M70N80P88M22M8k09p46p24o31J99L5O76Q02M82J78J80r76o92p81
3387a122l85K68O14Q89O27O1J3n01p97m42l20RM67P92P41P02m56n38p50p15l70
3408a213K33M37M85N38O00Q6k65p87p20n72K72Q8O58N15N45K43r6r28n56p58k2
3429a217J94P60Q03K11L37L0r21n55n36n84N07M67O79P88N1O4m85p94o52k50J48
3450i55M45M47N12P62J02p91n40o36n66J83K43P23O48M03J75m91o05p26l26O2
$$ plain form
3470 -931 -935 -48 546 987 819 927 180 -842 -915 -1204 -847 -425 352 884 1599 1110 441 38 -918 -1187 -935
3491 -935 -476 -29 1051 986 936 569 4 -587 -1254 -1388 -710 323 645 1163 1395 593 -204 -663 -1160 -1215
3511 -1215 -720 -186 457 1028 1177 729 44 -598 -1032 -1005 -665 -366 318 1134 1224 726 407 -486 -935 -835
3531 -835 -818 -682 166 1036 1095 681 162 -194 -782 -1138 -894 -243 61 983 1289 1185 727 4 -881 -991 -1087
3552 -1087 -657 252 594 1231 1103 814 66 -364 -941 -1154 -785 -224 360 952 1030 778 189 -359 -1067 -1047
3572 -1047 -927 -285 427 793 921 854 293 -406 -774 -1053 -1037 -533 404 951 1015 1076 614 -264 -752 -1108 -786
3593 -786 -496 -79 988 1028 797 570 67 -616 -1062 -1158 -660 46 625 1049 989 538 124 -587 -1073 -944 -714
3614 -714 89 523 1039 1292 1004 168 -525 -735 -1188 -913 -231 482 844 1134 1063 331 -430 -885 -876 -866 -592
$$ packed form
3470i31mQ87N94M41j68J08p47j022p3k89L57M22P77N32P15m89o69m03r56k69K52
3491i35M59M47J080o5n0l67n65n91o67j34O78J033L22N18K32q02p97m59m97n5
3511a215M95N34O43N71J49m48o85o42m34K7L40K99O84Q16R0m98l19q93m49J00
3531h35J7J36Q48Q70N9m14n19l56n88l56K44O51L04R22L06j04m58p23q85j10r6
3552a087M30R09L42O37j28k89p48m30n77k13L69N61N84N92P8k52n89n48p08K0
3572a047J20O42P12L66J28o7n61o99l68k79J6N04R37N47O4O1m62q78m88l56L22
3593g86K90M17J067M0k31k27n03o83m46r6M98P06N79M24o0m51m14p11m86J29K30
3614g14Q03M34N16K53k88q36o93k10m53K75O82P13L62K90p1p32p61m55RJ0K74
$$ plain form
3635 -592 391 651 917 1011 645 -360 -948 -956 -768 -718 55 818 1014 1251 743 -126 -537 -981 -1113 -623 242
3656 242 734 981 1168 929 266 -205 -955 -1072 -673 -53 357 1135 1151 634 343 -319 -1029 -1267 -753 -344
3676 -344 268 741 1219 1186 484 -78 -404 -988 -1013 -688 59 522 1113 920 553 197 -739 -1052 -1276 -573 -81
3697 -81 831 996 978 492 108 -648 -1103 -942 -717 120 468 851 1099 987 -84 -602 -1029 -733 -733 -162 339
3718 339 817 928 874 122 -313 -1028 -1115 -930 -430 209 795 1145 1039 211 -462 -471 -1140 -1028 -336 226 696
3739 696 1055 829 481 -161 -727 -1089 -1092 -521 -52 789 1028 805 675 209 -584 -974 -1006 -615 115 488 1014
3760 1014 1064 494 106 -388 -890 -964 -885 -227 714 1020 808 939 365 -220 -853 -1141 -1016 -358 266 556 1073
3781 1073 983 428 -498 -779 -1007 -1056 -436 -190 785 665 1018 580 -124 -510 -1042 -649 -513 80 589 838
$$ packed form
3635e92R83K60K66R4l66j005n88qJ88N0P73P63J96K37n08q69m11m44j32M90Q65
3656B42M92K47J87k39o63m71p50j17L99O20M10P78J6n17k91o62p10k38N14M09
3676c44O12M73M78l3p02n62l26n84k5L25P47M63N91j93l67l56r36l13k24P03M92
3697h1R12J65j8m86l84p56m55J61K25Q37L48L83K48j12j071n18m27K96%N71N01
3718C39M78J11n4p52m35p15q7J85N00O39N86L50j06q28o73ro69J12O92N62M70
3739F96L59k26l48o42n66l62lN71M69Q41K39k23j30m66p93l90l2L91P30L73N26
3760A014N0n70l88m94n02p4P9O58R41L06k12J31n74n85o33k88J25O58O24K90N17
3781A073r0n55r26k81k28m9O20K46R75j20L53m38p04l86n32L93J36N93N09K49
$$ plain form
3801 838 987 672 -60 -595 -1154 -1015 -825 -212 462 910 1092 743 89 -484 -899 -1099 -854 -266 462 909
3821 909 1019 759 461 -372 -926 -1194 -915 -95 339 673 909 932 661 -19 -552 -967 -857 -449 -34 582
3841 582 969 897 439 -120 -439 -1007 -1116 -696 -129 461 781 914 568 141 -671 -878 -1050 -784 -206 258
3861 258 1095 860 611 462 -243 -1036 -963 -797 -118 459 904 1193 945 369 -408 -876 -1079 -791 -430 257
3881 257 871 909 890 730 -356 -715 -915 -793 -357 24 612 967 916 580 30 -254 -715 -948 -424 -71 542
3902 542 771 878 642 -142 -321 -1011 -865 -782 -123 540 746 1160 698 297 -154 -883 -800 -757 -90 245 897
3923 897 949 742 276 -451 -761 -1184 -820 -430 -33 627 1106 750 333 -417 -307 -1060 -836 -503 281 480
3943 480 1165 882 502 263 -341 -629 -822 -919 -86 470 865 1042 584 85 -415 -830 -838 -869 -216 407 447 975
$$ packed form
3801H38J49l15p32n35n59J39J90O13O74M48J82l49o54n73m15k00K45N88P28M47
3821I09J10k60k98q33n54k68K79Q20M34L34K36K3k71o80n33m15J10M08M15O16
3841E82L87p2m58n59l19n68j09M20N67N90L20J33l46m27q12k07j72K66N78M64
3861B58Q37k35k49j49p05p93P3J66O79N77M45K89k48n76p77m68k03K88L61O87
3881B57O14L8j9j60j086l59k00J22M36L81N88L55n1l36n50k84m61k33N24L53O13
3902E42K29J07k36p84j79o90J46Q3O59O63K06M14m62m01m51p29Q3M3O67L35O52
3923H97N2k07m66p27l10m23L64L90L97O60M79l56m17p50J10p53K24L33P84J99
3943D80O85k83l80k39o04k88j93r7Q33N56L95J77m58m99n00m15ql1O53O23M0N28
$$ plain form
3965 975 579 407 -180 -826 -1000 -811 -321 240 772 611 966 397 -150 -589 -1111 -763 -501 289 816 1004
3985 1004 969 470 39 -642 -687 -622 -695 -15 524 1037 831 597 -103 -560 -944 -938 -709 -229 395 707 1119 675
4007 675 101 -133 -1013 -992 -762 -167 196 635 897 978 323 -87 -474 -957 -753 -171 314 886 975 745 389
4028 389 -167 -919 -818 -862 -609 300 376 916 723 432 82 -483 -890 -827 -708 250 759 917 758 719 224
4049 224 -527 -893 -1205 -785 -353 444 923 770 881 401 -312 -772 -1131 -712 -244 203 724 1032 653 110
4069 110 -7 -573 -732 -804 -649 134 625 1061 721 313 -141 -689 -933 -947 -489 46 587 718 763 534 166
4090 166 -288 -746 -837 -822 -143 540 756 844 727 76 -526 -815 -963 -615 -473 404 836 999 519 241 -422
4111 -422 -731 -976 -858 -232 190 925 803 789 402 -357 -577 -746 -611 -533 293 570 853 927 495 -47 -626
$$ packed form
3965I75l96j72n87o46j74J89M90N61N32j61L55n69n47m39n22L48K62P90N27J88
3985A004l5m99m31o81m5O5p3O80N39N13k06k34p00m57l84OK29M80O24L12M12m44
4007F75n74k34q80K1K30N95L63M39K62Q1o55m10l87m83K04N82M85N72Q9k30l56
4028C89n56p52J01m4K53R09P6N40j93k91l50n65m07O3J19R58N09J58j59l9m95
4049B24p51l66l12M20M32P97M79j53J11m80p13m60l59M19M68M47N21L08l79n43
4069A10j17n66j59p2J55P83M91M36l40m08m54n48k44j4M58N35N41J31M5k29l68
4090A66m54m58r1J5O79O83K16Q8j17o51o02k89j48L48J42Q77M32J63m80k78o63
4111d22l09k45J18O26M22P35j22j4l87p59k20j69J35P8Q26K77K83P4m32n42n79
$$ plain form
4132 -626 -779 -793 -564 50 549 721 929 496 -47 -505 -939 -709 -609 -48 479 685 858 594 171 -427
4152 -427 -1012 -559 -564 -396 323 824 823 554 233 -221 -685 -1029 -820 -145 196 395 959 757 117 -212 -548
4173 -548 -987 -900 -304 80 747 740 746 503 -12 -576 -727 -704 -497 -36 699 956 908 226 -95 -591 -901 -630
4195 -630 -691 28 533 701 854 514 392 -364 -806 -575 -531 -303 119 859 773 705 249 -332 -664 -878 -768
4216 -768 -258 154 670 776 855 195 -99 -716 -615 -785 -554 205 693 815 789 290 -269 -616 -988 -925 -683
4237 -683 81 528 769 739 498 148 -455 -798 -952 -865 -73 442 878 823 369 333 -414 -821 -893 -585 -237 248
4259 248 444 843 535 322 -371 -788 -769 -809 -246 409 616 860 643 384 -14 -693 -708 -520 -567 -9 313
4280 313 753 827 482 -101 -585 -794 -990 -512 -104 534 981 885 485 122 -409 -888 -881 -642 -83 453 779
$$ packed form
4132f26j53j4K29O14M99J72K08m33n43m58m34K30J00N61N27K06J73k64m23n98
4152d27n85M53nJ68P19N01jk69l21m54m64l44K09O75L41J99N64k02o40l29l36
4173e48m39Q7N96L84O67pOk43n15n64j51K3K07M61P35K57m8o82l21m96l10K71
4195f30o1P19N05J68J53l40j22p56m42K31M4K28M22P40q6o8m56n81l32k14J10
4216g68N10M12N16J06P9o60k94o17J01j70K31P59M88J22k6m99n59l47l72O3K42
4237f83P64M47K41l0k41l50o03l43j54Q7P92N15M36n5m54l6p47m07p2L08L48M85
4259B48J96L99l08k13o93m17J9m0N63O55K07K44k17k59l98o79j5J88m7N58L22
4280C13M40P4l45n83m84k09j96M78M08O38M47r6m00l63n31m79PK39N59N36L26
$$ plain form
4301 779 944 600 201 -546 -815 -842 -868 97 480 620 896 966 332 -199 -420 -839 -690 -395 166 466 979
4322 979 892 121 -48 -517 -773 -879 -439 -216 316 783 796 454 -219 -639 -705 -787 -583 67 428 938 878 638
4344 638 250 -406 -709 -806 -884 -166 361 713 887 614 209 -457 -635 -1003 -570 -217 53 597 897 885 418
4365 418 -99 -639 -831 -840 -286 318 294 742 861 423 81 -579 -670 -707 -516 126 499 1040 826 505 -21 -452
4387 -452 -774 -680 -421 -140 295 643 688 646 54 -354 -479 -532 -257 -368 240 529 825 532 347 -73 -590
4408 -590 -916 -587 -303 54 648 886 711 337 -334 -718 -892 -701 -184 84 741 728 813 488 -162 -629 -751
4429 -751 -871 -641 -57 304 550 752 571 3 -278 -657 -747 -665 -174 626 731 766 540 190 -327 -639 -450
4450 -450 -764 48 212 907 759 659 252 -207 -583 -915 -698 -453 597 670 695 643 260 -172 -550 -818 -663
$$ packed form
4301G79J65l44l99p47k69k7k6R65L83J40K76P0o34n31k21m19J49K95N61L00N13
4322I79q7p71j69m69k56j06M40K23N32M67J3l42o73m20o6q2K04O50L61N10o0k40
4344F38l88o56l03r7p8P18N27L52J74k73m05o66j78l68M33L53K70N44L00j2m67
4365D18n17n40j92rN54O04k4M48J19m38l42o60r1l7J91O42L73N41k14l21n26m31
4387d52l22R4K59K81M35L48M5m2n92m08j25n3K75j11O08K89K96k93j85m20n17
4408e90l26L29K84L57N94K38j75l74o71l84j74J91N17K68O57j3Q5l25o50m67j22
4429g51j20K30N84L61K46K02j81n68k81l79r0Q2M91Q00J05L5k26l50n17l12J89
4450d50l14Q12J64O95j48j00m07m59l76l32K17K45J050P3K5n2l83m32l78k68J55
$$ plain form
4471 -663 -202 -99 499 803 650 475 -44 -684 -892 -761 -575 -123 506 832 1040 475 245 -503 -697 -738
4491 -738 -363 -180 206 676 434 381 266 -84 -622 -1010 -531 -290 170 659 950 683 126 -235 -682 -752 -669
4512 -669 -153 399 485 523 851 624 -221 -531 -787 -367 -242 -49 507 436 680 536 -30 -420 -823 -880 -589
4533 -589 -17 513 555 898 298 -57 -420 -633 -868 -377 84 326 647 624 639 -61 -198 -680 -686 -799 -113 361
4555 361 587 500 597 331 -167 -480 -599 -389 -235 260 304 759 435 73 -147 -349 -859 -694 -334 35 539
4576 539 661 353 413 -116 -567 -671 -858 -550 -186 526 732 731 550 40 -491 -675 -719 -466 53 146 849 944
4598 944 400 263 -476 -654 -785 -537 -405 470 508 732 453 287 -49 -336 -504 -556 -192 -39 420 605 552
4619 552 398 -1 -540 -584 -599 -321 45 356 549 556 333 -82 -466 -868 -633 -415 56 411 758 712 317 -133
$$ packed form
4471f63M61J03N98L04j53j75n19o40k08J31J86M52O29L26K08n65k30p48j94m1
4491g38L75J83L86M70k42n3j15l50n38l88M79K41M60M89K91k67n57l61m47p0Q3
4512f69N16N52Q6L8L28k27q45l10k56M20J25J93N56p1K44j44n66l90m03n7K91
4533e89N72N30M2L43o00l55l63k13k35M91M61K42L21k3J5p00j37m82oj13O86M74
4555C61K26q7R7k66m98l13j19K10J54M95M4M55l24l62k20k02n10J65L60L69N04
4576E39J22l08O0n29m51j04j87L08L64P12K06jj81n10n31j84m4K53N19R3P03R5
4598I44n44j37p39j78j31K48J32Q75L8K24k79j66l36k87j68n2L64J53M59J85n3
4619E52j54l99n39m4j5K78L66L11J93Pk23m15l84m02K35K18M71L55L47m6l95m50
$$ plain form
4641 -133 -266 -837 -516 -651 -293 220 637 515 446 133 -130 -574 -684 -306 -307 218 522 801 540 298 -398
4662 -398 -502 -723 -567 -494 76 545 522 453 598 -186 -346 -659 -994 -247 -44 379 517 523 412 2 -190 -769
4684 -769 -644 -544 -300 481 366 802 580 -44 -156 -498 -648 -497 -217 90 484 402 537 256 -201 -194 -606
4705 -606 -454 82 118 355 893 323 240 -206 -576 -761 -414 43 257 524 491 459 114 -84 -455 -762 -655
4726 -655 -424 -198 485 585 658 485 27 -556 -693 -761 -443 -151 257 620 677 464 106 -353 -461 -598 -642
4747 -642 -92 243 506 687 257 412 -462 -434 -377 -546 42 21 513 467 558 442 -308 -615 -626 -551 -276 19
4769 19 705 644 588 260 -366 -236 -797 -622 -278 -47 206 534 536 292 166 -306 -686 -581 -505 -215 234 503
4791 503 425 176 361 -215 -622 -670 -411 -125 155 435 739 637 262 -311 -499 -569 -734 -96 -82 511 529 663
$$ packed form
4641a33j33n71L21j35L58N13M17j22o9l13k63m44j10L78jN25L04K79k61k42o96
4662c98j04k21J56P3N70M69k3o9J45p84j60l13l35P47K03M23J38Oj11m10j92n79
4684g69J25J00K44P81j15M36k22o24j12l42j50J51K80L07L94q2J35k81m57Pm12
4705f06J52N36L6K37N38n70q3m46l70j85L47M57K14K67l3l2l45j98l71l07J07
4726f55K31K26O83J00P3j73m58n83j37o8L18K92M08L63N7k13l58m59j08j37m4
4747f42N50L35K63J81m30J55q74K8N7j69N88k1M92m6R1j16p50l07j1P5K75K95
4769A9O86o1n6l28o26J30n61J75L44K31K53L28Kk44j26m72l80J05P6K90M49K69
4791E03p8k49J85n76m07m8K59K86K80K80L04j02l75n73j88p0j65O38J4N93J8J34
$$ plain form
4813 663 361 -113 -535 -739 -461 -195 72 493 709 623 429 118 -366 -636 -595 -424 129 411 581 776 312
4834 312 -269 -413 -475 -455 -602 -123 140 606 782 509 143 -159 -469 -566 -503 -222 355 362 622 453 295 -218
4856 -218 -573 -791 -390 -150 247 608 845 514 397 -146 -351 -662 -632 -234 143 529 635 612 206 -165 -540
4877 -540 -695 -508 -365 44 335 695 436 469 138 -294 -429 -877 -462 -166 307 379 765 409 138 -61 -601
4898 -601 -615 -678 -99 395 563 570 361 323 -34 -389 -681 -508 -140 133 520 693 613 271 4 -213 -769 -784
4920 -784 -401 252 455 617 566 361 -137 -192 -674 -712 -340 -4 289 383 644 434 190 -287 -497 -535 -437 28
4942 28 467 396 577 351 -8 -501 -333 -598 -551 -201 26 637 562 567 45 -41 -503 -589 -549 -260 -76 321 390
4965 390 266 196 193 -346 -490 -282 -86 86 327 606 623 294 44 -354 -377 -460 -16 304 144 594 684 367
$$ packed form
4813F63l02m74m22k04K78K66K67M21K16q6j94l11m84k70M1J71N53K82J70J95m64
4834C12n81j44o2K0j47M79K63M66J76k73l66l02l10r7O3K81N77PK60j69j58n13
4856b18l55k18M01K40L97L61K37l31j17n43k05l11L0L98L77L86J06k3m06l71l75
4877e40j55J87J43M09K91L60k59L3l31m32j35m48M15K96M73P2L86l56k71j99n40
4898f01j4o3N79M94J68Pk09l8l57l55k92J73L68K73L87J73q0l42k67k17n56j5
4920g84L83O53K03J62n1k05m98n5m82l8L72L36K93R4K61k10k44m77k10l8R8M65
4942B8M39p1J81k26l59m93J68k65M7L50K27O11p5Nn22q6m62q6M0K89J84L97O9
4965C90j24p0ln39j44K08J96J72K41K79J7l29k50l98k3q3M44L20j60M50R0l17
$$ plain form
4987 367 -49 -52 -459 -532 -314 -71 315 444 682 606 223 -73 -646 -304 -395 -147 123 198 692 665 318 -185
5009 -185 -277 -477 -697 -315 83 448 623 705 294 -338 -400 -367 -561 -443 -159 209 553 245 412 81 -326
$$ packed form
4987C67m16lm07p3K18K43L86J29K38p6l83k96n73L42r1K48K70P5M94k7l47n03
5009a85r2k00k20L82L98L65J75Q2m11o32o2L3j94J18K84L68L44l08J67l31m07
$$ [...]
8190cQ0
8191G7
##END NTUPLES=NMR FID
##END=
