##TITLE=1H_DE-30_oil
 D2O
 8 sc, 
 7.2.2024
##JCAMPDX= 6.0         $$ Bruker NMR JCAMP-DX V2.0
##DATA TYPE= NMR FID
##DATA CLASS= NTUPLES
##ORIGIN= UXNMR, Bruker Analytische Messtechnik GmbH
##OWNER= root
$$ XWIN-NMR		Version 3.5
$$ Wed Feb  7 14:17:17 2024 Russian Standard Time (UT+4h)  she@DPX200
##.OBSERVE FREQUENCY= 200.1313
##.OBSERVE NUCLEUS= ^1H
##.DELAY= (6, 6)
##.ACQUISITION MODE= SIMULTANEOUS
##.ACQUISITION SCHEME= undefined
##.AVERAGES= 8
##.DIGITISER RES= 18
##SPECTROMETER/DATA SYSTEM= spect
##.PULSE SEQUENCE= zg30
##.SOLVENT NAME= D2O
##.SHIFT REFERENCE= (INTERNAL, D2O, 0, 15.7039)
##AUDIT TRAIL= $$ (NUMBER, WHEN, WHO, WHERE, WHAT)
$$ ##TITLE= Audit trail, XWIN-NMR		Version 3.5
$$ ##JCAMPDX= 5.01
$$ ##ORIGIN= Bruker BioSpin GmbH
$$ ##OWNER= she
$$ F:/spectra/data/she/nmr/H-F/1/audita.txt
$$ ##AUDIT TRAIL=  $$ (NUMBER, WHEN, WHO, WHERE, WHAT)
(   1,<2024-02-07 14:16:13.31 +0400>,<she>,<DPX200>,
      <created by zg, POWCHK disabled, PULCHK disabled
       configuration hash MD5:
       00 E9 B6 7A A2 85 ED C7 34 08 36 98 17 FE 4E 26
       data hash MD5: 16K
       D7 7B 25 48 9E 65 96 5C 18 E3 63 A6 93 C8 E2 F6>)
$$ ##END=
$$ 
$$ hash MD5
$$ 15 E2 DD D0 AA E5 09 72 DE 16 DD 38 A4 B8 10 AC
##$RELAX= 
##$RELAX= 
##$RELAX= 
##$RELAX= 
##$RELAX= 
##$RELAX= 
$$ Bruker specific parameters
$$ --------------------------
##$DU= <F:/spectra>
##$EXPNO= 1
##$NAME= <H-F>
##$PROCNO= 1
##$TYPE= <nmr>
##$USER= <she>
##$AMP= (0..31)
100 100 100 100 100 100 100 100 100 100 100 100 100 100 100 100 100 100 
100 100 100 100 100 100 100 100 100 100 100 100 100 100 
##$AQSEQ= 0
##$AQ_mod= 1
##$AUNM= <au_zg>
##$AUTOPOS= <>
##$BF1= 200.13
##$BF2= 200.13
##$BF3= 200.13
##$BF4= 200.13
##$BF5= 200.13
##$BF6= 200.13
##$BF7= 200.13
##$BF8= 200.13
##$BYTORDA= 1
##$CFDGTYP= 0
##$CFRGTYP= 5
##$CHEMSTR= <none>
##$CNST= (0..31)
1 1 145 1 1 1 1 1 1 1 1 1 1 1 1 1 1 1 1 1 1 1 1 1 1 1 1 1 1 1 1 1 
##$CPDPRG= <>
##$CPDPRG1= <>
##$CPDPRG2= <>
##$CPDPRG3= <>
##$CPDPRG4= <mlev>
##$CPDPRG5= <mlev>
##$CPDPRG6= <mlev>
##$CPDPRG7= <mlev>
##$CPDPRG8= <mlev>
##$CPDPRGB= <>
##$CPDPRGT= <>
##$D= (0..31)
0 1.2 0 0 0 0 0 0 0 0.06 0 0.03 0 0 0 0 0.0002 0 0 0 0 0 0 0 0 0 0 0 0 
0 0 0 
##$DATE= 1707300972
##$DBL= (0..7)
120 120 120 120 120 120 120 120 
##$DBP= (0..7)
150 150 150 150 150 150 150 150 
##$DBP07= 0
##$DBPNAM0= <>
##$DBPNAM1= <>
##$DBPNAM2= <>
##$DBPNAM3= <>
##$DBPNAM4= <>
##$DBPNAM5= <>
##$DBPNAM6= <>
##$DBPNAM7= <>
##$DBPOAL= (0..7)
0.5 0.5 0.5 0.5 0.5 0.5 0.5 0.5 
##$DBPOFFS= (0..7)
0 0 0 0 0 0 0 0 
##$DE= 6
##$DECBNUC= <off>
##$DECIM= 32
##$DECNUC= <off>
##$DECSTAT= 4
##$DIGMOD= 1
##$DIGTYP= 9
##$DL= (0..7)
0 120 120 120 120 120 120 120 
##$DP= (0..7)
150 150 150 150 150 150 150 150 
##$DP07= 0
##$DPNAME0= <>
##$DPNAME1= <>
##$DPNAME2= <>
##$DPNAME3= <>
##$DPNAME4= <>
##$DPNAME5= <>
##$DPNAME6= <>
##$DPNAME7= <>
##$DPOAL= (0..7)
0.5 0.5 0.5 0.5 0.5 0.5 0.5 0.5 
##$DPOFFS= (0..7)
0 0 0 0 0 0 0 0 
##$DQDMODE= 0
##$DR= 18
##$DS= 0
##$DSLIST= <SSSSSSSSSSSSSSS>
##$DSPFIRM= 0
$$ [...]
##$SUBNAM2= <"">
##$SUBNAM3= <"">
##$SUBNAM4= <"">
##$SUBNAM5= <"">
##$SUBNAM6= <"">
##$SUBNAM7= <"">
##$SUBNAM8= <"">
##$SUBNAM9= <"">
##$SW= 18.0517328524113
##$SWIBOX= (0..15)
0 0 2 0 0 0 0 0 0 0 0 0 0 0 0 0 
##$SW_h= 3612.71676300578
##$TD= 16384
##$TD0= 1
##$TE= 0
##$TE2= 300
##$TE3= 300
##$TEG= 300
##$TL= (0..7)
0 120 120 120 120 120 120 120 
##$TP= (0..7)
150 150 150 150 150 150 150 150 
##$TP07= 0
##$TPNAME0= <>
##$TPNAME1= <>
##$TPNAME2= <>
##$TPNAME3= <>
##$TPNAME4= <>
##$TPNAME5= <>
##$TPNAME6= <>
##$TPNAME7= <>
##$TPOAL= (0..7)
0.5 0.5 0.5 0.5 0.5 0.5 0.5 0.5 
##$TPOFFS= (0..7)
0 0 0 0 0 0 0 0 
##$TUNHIN= 0
##$TUNHOUT= 0
##$TUNXOUT= 0
##$USERA1= <user>
##$USERA2= <user>
##$USERA3= <user>
##$USERA4= <user>
##$USERA5= <user>
##$V9= 5
##$VALIST= <valist>
##$VCLIST= <CCCCCCCCCCCCCCC>
##$VD= 0
##$VDLIST= <DDDDDDDDDDDDDDD>
##$VPLIST= <PPPPPPPPPPPPPPP>
##$VTLIST= <TTTTTTTTTTTTTTT>
##$WBST= 1024
##$WBSW= 4
##$XGAIN= (0..3)
0 0 0 0 
##$XL= 0
##$YL= 0
##$YMAX_a= 164235
##$YMIN_a= -190003
##$ZGOPTNS= <>
##$ZL1= 120
##$ZL2= 120
##$ZL3= 120
##$ZL4= 120
##$ABSF1= 10
##$ABSF2= 0
##$ABSG= 5
##$ABSL= 3
##$ALPHA= 0
##$AQORDER= 0
##$ASSFAC= 0
##$ASSFACI= 0
##$ASSFACX= 0
##$ASSWID= 0
##$AUNMP= <proc_1d>
##$AZFE= 0.1
##$AZFW= 0.1
##$BCFW= 1
##$BC_mod= 2
##$BYTORDP= 1
##$COROFFS= 0
##$CY= 11.3945322036743
##$DATMOD= 1
##$DC= 2
##$DFILT= <>
##$DTYPP= 0
##$F1P= 15.7292609196834
##$F2P= 12.9074282941183
##$FCOR= 0.5
##$FTSIZE= 0
##$FT_mod= 4
##$GAMMA= 1
##$GB= 0.15
##$INTBC= 1
##$INTSCL= 1
##$ISEN= 128
##$LB= 0.24
##$LEV0= 0
##$LPBIN= 0
##$MAXI= 10000
##$MC2= 0
##$MEAN= 0
##$ME_mod= 0
##$MI= 1.114404
##$NCOEF= 0
##$NC_proc= 0
##$NLEV= 6
##$NOISF1= 3.799351
##$NOISF2= 2.8
##$NSP= 1
##$NTH_PI= 0
##$NZP= 0
##$OFFSET= 15.70392
##$PC= 1
##$PHC0= -24603.4
##$PHC1= 17.45268
##$PH_mod= 1
##$PKNL= yes
##$PPARMOD= 0
##$PSCAL= 0
##$PSIGN= 0
##$REVERSE= no
##$SF= 200.130013532006
##$SI= 16384
##$SIGF1= 3
##$SIGF2= 2
##$SINO= 400
##$SIOLD= 16384
##$SREGLST= <1H.CDCl3>
##$SSB= 0
##$STSI= 0
##$STSR= 0
##$SW_p= 3612.71676300578
##$SYMM= 0
##$S_DEV= 0
##$TDeff= 0
##$TDoff= 0
##$TI= <>
##$TILT= no
##$TM1= 0
##$TM2= 0
##$TOPLEV= 0
##$USERP1= <user>
##$USERP2= <user>
##$USERP3= <user>
##$USERP4= <user>
##$USERP5= <user>
##$WDW= 1
##$XDIM= 8192
##$YMAX_p= 0
##$YMIN_p= 0
$$ End of Bruker specific parameters
$$ ---------------------------------
##NTUPLES= NMR FID
##VAR_NAME=  TIME,          FID/REAL,        FID/IMAG
##SYMBOL=    X,             R,               I
##VAR_TYPE=  INDEPENDENT,   DEPENDENT,       DEPENDENT
##VAR_FORM=  AFFN,          ASDF,            ASDF
##VAR_DIM=   8192,          8192,            8192
##UNITS=     SECONDS,       ARBITRARY UNITS, ARBITRARY UNITS
##FACTOR=    0.0002768,     1,               1
##FIRST=     0,             0,               0
##LAST=      2.2672688,     0,               0
##MIN=       0,             -190003,         0
##MAX=       2.2672688,     164235,          0
$$ Real data points
##PAGE= N=1
##DATA TABLE= (X++(R..R)), XYDATA
$$ plain form
0 0 0 0 0 0 0 0 0 0 0 0 0 0 0 0 0 0 8 -8 8 -8 8 -8 16 -16 16 -23 24 -28 32 -37 42 -48 54 -62 69 -78 87 -98
38 -98 109 -122 136 -151 167 -185 203 -224 248 -273 301 -332 365 -402 443 -491 543 -602 670 -746
58 -746 838 -947 1079 -1244 1452 -1733 2126 -2718 3711 -5676 11097 -60115 -190003 -110473
72 -110473 -64138 -58753 34211 164235 163528 99344 61118 11261 -75001 -119172 -111650 -68236 -757
85 -757 56196 79876 92344 58646 -29210 -93676 -99958 -100127 -77215 11113 94889 104428 95268 84911
99 84911 21175 -56697 -75224 -63110 -51173 -9648 49258 73423 64591 44448 -2259 -65386
111 -65386 -96943 -95371 -72171 -16440 48453 85477 93503 72772 21163 -31643 -57582 -65106 -56081
124 -56081 -11740 45309 69525 69055 60832 24039 -36907 -82226 -90809 -73787 -41379 5234 54796
$$ packed form
0@%%%%%%%%%%%%%%%%Qj6J6j6J6j6K4l2L2l9M7n2O0o9P9r0J02j16J31j47J65j85
38i8K07k31K58k87L18l52L88m27M72n21N74o33O97p67Q45r34J034j145J272j416
58g46J584j785K026k323K696l185L859m844O429r387J6773p1212j29888P9530
72a10473M6335N385R2964J30024p07o4184l8226m9857q6262m4171P522M3414O7479
85g57N6953K3680J2468l3698q7856o4466o282j69K2912Q8328Q3776R539r160j0357
99H4911o3736p7872j8527J2114J1937M1525N8906K4165q832k0143m6707o3127
111f5386l1557J572K3200N5731O4893L7024Q026k0731n1609n2806k5939p524R025
124e6081M4341N7049K4216m70q223l6793o0946m5319q583J7022L2408M6613M9562
$$ plain form
137 54796 80772 68509 32048 -4292 -35278 -63166 -61386 -19806 22324 45789 64476 69554
149 69554 38037 -12030 -45637 -61167 -68386 -53751 -11330 30499 50121 49490 35137 9068 -27758
162 -27758 -53986 -47843 -21576 3405 29757 58527 64500 37059 3065 -19846 -44781 -61484
174 -61484 -45259 -10396 15948 32961 43950 36461 6136 -25634 -41747 -45409 -35921 -10272 23082
187 23082 49209 54158 41803 21515 -6602 -36880 -48846 -37781 -18048 2542 26088 43169
199 43169 34927 10699 -11594 -30311 -45883 -43120 -19358 9336 30097 42349 45170 29892 1421
212 1421 -22213 -32493 -33195 -24576 -3608 22353 34548 29665 18880 1453 -23306 -40533 -38689
225 -38689 -23277 -5530 14082 33927 39634 26290 7163 -9201 -23576 -30989 -23931 -3244 15785
$$ packed form
137E4796K5976j2263l6461l6340l0986k7888J780M1580M2130K3465J8687N078
149F9554l1517n0067l3607j5530p219J4635M2421M1829J9622o31j4353k6069l6826
162b7758k6228O143K6267K4981K6352K8770N973k7441l3994k2911k4935j6703
174f1484J6225L4863K6344J7013J0989p489l0325l1770j6113l662R488K5649L3354
187B3082K6127M949j2355k0288k8117l0278j1966J1065J9733K0590K3546J7081
199D3169q242k4228k2293j8717j5572K763K3762K8694K0761J2252K821j5278k8471
212A421k3634j0280p02Q619K0968K5961J2195m883j0785j7427k4759j7227J844
225c8689J5412J7747J9612J9845N707j3344j9127j6364j4375p413P058K0687J9029
$$ plain form
238 15785 25592 29297 25313 6958 -16979 -30958 -32252 -27922 -15632 7290 26598 29966 23449
251 23449 13572 -2446 -20863 -28497 -20356 -6628 6402 21626 31107 26664 10795 -6623 -19334
264 -19334 -28720 -29807 -17475 1846 15788 21773 23261 16388 -379 -17225 -22583 -19202 -13332 200
278 200 18126 27948 24376 14753 3778 -11696 -25391 -25816 -15810 -4325 7398 18624 22904 15268
292 15268 1002 -10772 -18090 -22297 -17399 -2606 12551 20704 22283 20216 9432 -7184 -18401
305 -18401 -20193 -17042 -9171 3434 16132 19565 13815 5554 -4157 -15792 -22249 -17387 -6483 4132
319 4132 13307 20790 20704 10054 -1883 -10243 -15698 -17357 -10195 2207 12055 15019 14439 9499 -2122
334 -2122 -14063 -18480 -16092 -10635 -1763 10234 18313 17037 10493 2561 -6438 -14729 -16504 -9146 663
$$ packed form
238A5785R807L705l984j8355k3937j3979j294M330J2290K2922J9308L368o517
251B3449r877j6018j8417p634Q141J3728J3030J5224R481m443j5869j7418j2711
264a9334r386j087J2332J9321J3942N985J488o873j6767j6846n358L381N870J3532
278B00J7926R822l572r623j0975j5474j3695m25J0006J1485J1723J1226M280p636
292A5268j4266j1774p318m207M898J4793J5157Q153J579k067j0784j6616j1217
305a8401j792L151P871J2605J2698L433n750q261r711j1635o457M862J0904J0615
319D132R175P483q6j0650j1937q360n455j659P162J2402R848K964n80m940j1621
334b122j1941m417K388N457Q872J1997Q079j276o544p932q999q291j775P358R809
$$ plain form
349 663 7779 13716 16673 11403 -40 -9696 -14333 -16882 -14470 -4434 7193 13295 14273 12611 6358
364 6358 -4485 -12868 -13647 -9865 -4373 4082 13056 16324 11749 4540 -2907 -10616 -16190 -14493 -6154
379 -6154 1752 7796 12414 13066 6626 -2486 -8423 -10594 -11387 -6938 2544 9817 12406 11385 7887 656
395 656 -8392 -12910 -11192 -7293 -1854 5335 11074 10948 5688 -202 -5444 -10593 -12345 -6985 949 6544
411 6544 10163 12157 9867 1827 -5662 -9273 -10494 -9079 -3299 4571 9418 9821 7590 2665 -4122
426 -4122 -10420 -11721 -8025 -3026 2422 8852 12380 10007 3893 -1369 -6302 -10397 -9580 -3891 1989
441 1989 5840 8904 9143 4719 -2207 -7211 -8960 -9094 -5779 -103 6242 9175 8317 5812 1357 -4603
457 -4603 -8473 -7660 -4178 -25 3839 8516 8707 4438 -321 -4149 -7894 -9514 -6353 -651 3733 6308
$$ packed form
349F63P116N937K957n270j1443r656m637k549K412J0036J1627O102R78j662o253
364F358j0843q383p79L782N492Q455Q974L268m575p209p447p709n574J697Q339
379f154P906O044M618O52o440r112n937k171p93M449R482P273K589j021l498p231
395F56r048m518J718L899N439P189N739j26n260n890n242n149j752N360P934N595
411F544L619J994k290q040p489l611j221J415N780P870M847M03k231m925o787
426d122o298j301L696M999N448O430L528k373o114n262m933m095Q17N689N880
441A989L851L064K39m424o926n004j749j34L315N676O345K933q58k505m455n960
457d603l870Q13L482M153L864M677J91m269m759l828l745j620L161N702M384K575
$$ plain form
473 6308 8083 6428 1824 -3612 -6617 -6841 -5840 -2080 3470 7713 8077 5777 2386 -2243 -7086 -9051
489 -9051 -6331 -2270 1104 5189 8073 6774 2284 -1439 -4813 -7289 -6979 -2916 2029 5491 7164
504 7164 7007 4173 -596 -5175 -6809 -6318 -4631 -897 4249 6640 5536 3579 558 -3668 -6405 -6188
520 -6188 -3572 -214 3102 5936 6893 4573 376 -2993 -4903 -6094 -4977 -1302 3036 4726 4937 4537
536 4537 1434 -3002 -5503 -5219 -4429 -2149 2030 5347 5888 4778 2278 -1094 -4301 -5712 -4565 -1527
552 -1527 1454 3569 5525 5043 1843 -1638 -3998 -5317 -5650 -3023 1336 3927 4775 4989 3457 -185
568 -185 -3258 -4623 -4308 -3298 -294 3181 5285 4602 2444 334 -2701 -5257 -5437 -3235 -525 2028
584 2028 3892 5208 3788 607 -1983 -3259 -4008 -3501 -639 2615 3941 4304 3566 1358 -1566 -4038
$$ packed form
473F308J775j655m604n436l005k24J001L760N550M243L64k300l391m629m843j965
489i051K720M061L374M085K884j299m490l723l374k476L10M063M945L462J673
504G164j57k834m769m579j634M91J687L734N146K391j104j957l021m226k737K17
520f188K616L358L316K834R57k320m197l369j910j191J117L675M338J690K11m00
536D537l103m436k501K84P90K280M179L317N41j110k500l372l207j411J147L038
552a527K981K115J956m82l200l481k360j319l33K627M359K591Q48K14j532l642
568a85l073j365L15J010L004L475K104o83k158k110l035k556j80K202K710K553
584B028J864J316j420l181k590j276p49N07K862L254J326L63p38k208k924k472
$$ plain form
600 -4038 -4393 -3378 -1663 975 3511 4330 3265 1193 -733 -2786 -4238 -3520 -1042 1066 2838 4316
616 4316 3905 1759 -974 -2502 -3808 -4218 -2439 397 3070 3526 3346 2249 -126 -2448 -3821 -3411
632 -3411 -2067 -121 2154 4129 3909 2005 376 -1399 -3447 -3960 -2203 -344 1146 2717 3537 2529
648 2529 229 -1769 -2809 -3374 -2945 -844 1659 3161 2929 2849 1309 -761 -2824 -3308 -2240 -1094 597
665 597 2613 3439 2236 643 -652 -2530 -3370 -2866 -1196 667 1954 3101 2726 1560 -484 -2029
681 -2029 -2629 -2484 -1599 527 2418 2832 2200 1379 -171 -2238 -2946 -2716 -1435 -110 1527 3052 2812
698 2812 1339 7 -1092 -2545 -2701 -1658 411 1399 2234 2615 2088 352 -1499 -2288 -2584 -2104 -799
715 -799 1070 2244 2312 2011 767 -855 -2396 -2298 -1396 -377 748 2077 2530 1764 734 -663 -1679
$$ packed form
600d038l55J015J715K638K536Q19j065k072j926k053j452P18K478K108J772J478
616D316m11k146k733j528j306m10J779K836K673M56j80j097k375k322j373M10
632c411J344J946K275J975k20j904j629j775k048n13J757J859J490J571Q20j008
648B529k300j998j040n65M29K101K503J502k32q0j540k070k063m84J068J146J691
665E97K016Q26j203j593j295j878q40N04J670J863J287J147l75j166k044j545
681b029o00J45Q85K126J891M14o32q21j550k067p08K30J281J325J637J525k40
698B812j473j332j099j453j56J043K069R88Q35L81n27j736j851p89k96M80J305
715g99J869J174O8l01j244j622j541R8R02J019J125J329M53p66j030j397j016
$$ plain form
732 -1679 -2428 -2473 -667 642 1534 2099 2063 1082 -638 -1732 -2031 -1749 -1227 202 1563 2115 1786 917 190
751 190 -1409 -2290 -1795 -908 -31 1007 2065 1898 1071 -293 -1064 -1684 -1897 -1300 178 1141 1714 1963 1663
770 1663 183 -1009 -1715 -1600 -1154 -468 860 1688 1774 940 583 -669 -1859 -1932 -1325 -174 444 1536
788 1536 2140 1407 617 -467 -1394 -1716 -1519 -723 434 1132 1314 1350 682 -451 -1172 -1653 -1460 -785 434
807 434 1307 1715 1407 728 -73 -893 -1465 -1551 -603 255 979 1499 1593 970 -383 -955 -1355 -1487 -1135 -24
827 -24 747 1349 1125 930 296 -867 -1327 -1277 -749 -101 764 1428 1496 779 291 -432 -1332 -1394 -1020 -134 501
848 501 1147 1362 1015 548 -440 -904 -1199 -1226 -719 604 1083 1340 1003 672 -226 -1045 -887 -1141 -530 -6
868 -6 755 1277 911 245 -179 -598 -1128 -1084 -763 -64 493 1001 1041 579 -114 -809 -815 -1173 -778 -43 722 912
$$ packed form
732a679p49m5J806J309Q92N65l6r81j720j094k99K82N22J429J361N52l29q69p27
751A90j599q81M95Q87Q77J038J058j67q27j364p71o20k13N97J478R63N73K49l00
770A663j480j192p06J15M46O86J328Q28Q6q34l57j252j190p3O07J151O18J092
788A536O04p33p90j084r27l22J97P96J157O98J82L6o68j133p21m81J93O75J219
807D34Q73M08l08o79q01q20n72q6R48Q58P24N20R4o23j353n72m00j32L52J111
827b4P71O02k24j95o34j163m60N0N28O48Q65O64O8p17m88p23r00o2L74Q86O35
848E01O46K15l47m67r88m64k95k7N07J323M79K57l37l31q98q19J58k54O11N24
868fP61N22l66o66m24m19n30M4L21O99N57N08M0m62o93o95ol58L95P35P65J90
$$ plain form
890 912 934 605 44 -407 -1293 -1273 -640 -155 169 938 1112 788 74 -335 -691 -1064 -623 -244 337 849 992
911 992 817 82 -573 -924 -707 -763 -561 291 635 873 377 424 -149 -879 -746 -545 -226 39 597 1008 752
932 752 303 -220 -585 -958 -528 -566 231 315 727 781 413 175 -753 -622 -743 -308 68 605 706 341 507
953 507 208 -352 -809 -849 -282 -3 270 601 860 386 -110 -183 -712 -741 -584 -18 156 732 805 491 283 -319
975 -319 -495 -663 -673 -529 322 674 628 380 394 -27 -670 -648 -330 12 -132 573 757 625 542 -21 -146 -440
997 -440 -478 -507 -113 418 526 487 531 -109 -489 -444 -418 -285 -73 397 296 224 103 52 -91 -784 -602 -505 -299
1020 -299 149 262 566 467 51 -90 -478 -594 -609 -216 256 371 456 545 373 -173 -502 -336 -282 -460 50 298
1042 298 483 324 281 102 -595 -662 -151 -300 -84 477 762 620 151 -64 -214 -294 -464 -492 49 154 343
$$ packed form
890I12K2l29n61m51q86K0O33M85L24P69J74l24p14m09l56l73M41L79N81N12J43
911I92j75p35o55l51K17n6K02Q52L44K38m96M7n73p30J33K01L19K65N58M11k56
932G52m49n23l65l73M30l8P97Q4M12N4l68k38r28J31j21M35L76N37J01l65J66
953E07k99n60m57m0N67K79K73L31K59m74m96p3n29k9J57N66J74N76P3l14k08o02
975c19j76j68j0J44Q51L52m6k48J4m21o43K2L18L42j44P05J84j32q3n63j25k94
997d40l8k9L94N31J08l9M4o40l80M5K6J33K12M70j01p2j21n1j43o93J82R7K06
1020b99M48J13L04r9m16j41l88j16j5L93M72J15Q5Q9j72n46l29J66N4j78N10K48
1042B98J85j59m3j79o97o7N11j49K16N61K85j42m69k15j50q0j70k8N41J05J89
$$ plain form
1063 343 274 230 89 -208 -366 -127 -105 252 140 341 402 118 -33 59 -374 -614 -446 16 142 473 401 200
1085 200 316 123 -263 -209 -56 -102 51 389 242 282 194 -53 132 -288 -286 -84 -7 470 314 199 18 -213
1107 -213 -259 -205 -101 -120 83 285 315 337 48 -113 -268 54 -209 -279 196 219 428 323 215 141 146 -507 -182
1130 -182 21 -93 299 55 -7 -72 184 108 -169 -48 5 79 98 155 117 143 -10 -48 -161 85 -63 -68 -31 41 211
1155 211 -8 -162 -223 -425 -324 -18 -161 92 87 453 144 187 141 -151 -14 -195 -10 17 268 60 97 -71
1177 -71 -109 -278 -90 -290 -172 6 165 133 242 31 -371 -150 -304 -101 -125 224 34 259 124 182 -60 -182
1199 -182 36 -444 -75 -146 60 71 232 -82 85 -417 -120 -41 151 -73 -89 212 61 105 -17 -29 -291 -317
1221 -317 -109 99 119 237 447 181 -60 -34 62 -88 26 60 13 419 10 -70 -119 -116 18 57 -330 50 -43 208
$$ packed form
1063C43o9m4j41k97j58K39K2L57j12K01O1k84j51R2m33k40J68M62J26L31p2k01
1085B00J16j93l86N4J53m6J53L38j47M0q8k47J85m20KK02P7M77j56j15j81k31
1107b13m6N4J04j9K03K02L0K2k89j61j55L22k63p0M75K3K09j05j08p4No53L25
1130a82K03j14L92k44o2o5K56p6k77J21N3P4J9N7l8K6j53l8j13K46j48nL7P2J70
1155B11k19j54o1k02J01L06j43K53nL66l09M3m6k92J37j81J85K7K51k08L7j68
1177g1l8j69J88k00J18J78J59l2J09k11m02K21j54K03k4L49j90K25j35N8k42j22
1199a82K18m80L69p1K06J1J61l14J67n02K97P9J92k24j6L01j51M4j22j2k62k6
1221c17K08K08K0J18K10k66k41K6R6j50J14L4m7M06m09q0m9LJ34L9l87L80r3K51
$$ plain form
1245 208 175 160 112 -126 33 -140 -41 -126 0 -100 -144 145 15 160 -217 208 -66 120 61 12 22 283 -20
1268 -20 -109 -215 -24 -213 -99 -2 57 240 108 13 -29 32 -136 -1 -111 138 113 60 302 239 156 -49 -332 142
1292 142 -134 132 129 266 14 13 135 25 -323 105 -209 -174 138 157 146 130 -160 -94 -166 29 -226 -132 -239 209
1316 209 132 147 10 -42 -166 -56 0 -230 -195 142 -130 137 154 -38 -108 -148 15 -181 -202 111 -203 197 184
1339 184 -120 39 -73 -150 -9 -42 81 21 -36 74 68 178 12 47 -70 -42 228 5 9 -68 -221 -144 -15 -149
1363 -149 9 -42 -76 53 -222 -43 46 76 38 -125 -328 39 -64 -48 -59 135 52 -20 236 -185 137 -252 28
1386 28 104 -177 135 -78 -134 -65 -187 -208 -45 -144 -66 -98 389 -166 -200 184 84 -69 -141 -9 61 -144 190 -175
1410 -175 93 -110 -35 -156 -193 -12 -58 218 56 29 41 42 84 -70 34 -101 61 96 -150 31 -75 -34 -153
$$ packed form
1245B08l3j5m8k38J59j73R9q5J26j00m4K89j30J45l77M25k74J86n9m9J0K61l03
1268b0q9j06J91j89J14R7N9J83j32r5m2O1j68J35j10K49k5n3K42o3q3k05k83M74
1292A42k76K66lJ37k52jJ22j10l48M28l14L5L12J9j1j6k90O6p2J95k55R4j07M48
1316B09p7J5j37n2j24J10N6k30L5L37k72K67J7j92p0m0J63j96k1L13l14M00j3
1339A84l04J59j12p7J41l3J23o0n7J10oJ10j66L5j17K8K70k23Mp7j53P7J29j34
1363a49J58n1l4J29k75J79Q9L0l8j63k03L67j03J6j1J94q3p2K56m21L22l89K80
1386B8P6k81L12k13n6O9j22k1J63r9P8l2M87n55l4L84j00j53p2J32P0k05L34l65
1410a75K68k03P5j21l7J81m6K76j62k7J2JM2j54J04j35J62L5k46J81j06M1j19
$$ plain form
1433 -153 280 56 233 -18 195 26 184 60 12 17 136 28 -33 -154 -12 267 110 49 -98 -130 -177 -214 -53
1456 -53 -14 42 131 127 -22 -121 -31 -23 85 -135 92 306 -85 158 84 -105 -66 -11 -84 -173 98 156 -242 -124 43
1481 43 111 22 182 59 195 -202 130 146 80 204 61 18 21 -219 -119 -17 -139 -148 -186 102 42 57 -86 180
1505 180 25 -83 -135 288 126 139 25 226 46 -14 -132 7 72 -88 59 -122 -3 -59 285 53 126 -98
1527 -98 -39 241 246 47 104 -77 42 -253 4 -101 -80 -232 244 -7 -184 192 -126 1 -186 -53 -56 3 -24
1550 -24 26 283 91 74 23 66 -138 20 -81 31 8 108 122 46 22 -33 -287 4 -112 84 147 -92 58 11
1574 11 94 47 -232 -168 -16 -62 -8 106 199 -86 133 2 129 75 123 -176 228 157 -62 118 -30 -12 -41 134
1598 134 -238 -6 54 -75 -50 -49 -109 130 20 -42 39 -178 189 75 273 64 57 3 -106 64 -189 -22 24 14
$$ packed form
1433a53M33k24J77k51K13j69J58j24m8NJ19j08o1j21J42K79j57o1j47l2m7l7J61
1456e3L9N6Q9mj49r9R0QJ08k20K27K14l91K43p4j89L9N5p3q9K71N8l98J18J67
1481D3O8q9J60j23J36l97L32J6o6J24j43m3Lk40J00J02j22rl8K88o0J5j43K66
1505A80j55j08n2M23j62J3j14K01j80o0j18J39O5j60J47j81J19n6L44k32P3k24
1527i8N9K80Nj99N7j81J19k95K57j05K1j52M76k51j77L76l18J27j87J33lN9k7
1550b4N0K57j92j7n1M3k04J58j01J12k3J00J4p6k4n5k54K91j16J96O3k39J50m7
1574A1Q3m7k79O4J52m6N4J14R3k85K19j31J27n4M8k99M04p1k19J80j48J8k9J75
1598A34l72K32O0j29K5Jo0K39j10o2Q1k17L67j14J98k09pn4j09J70k53J67M6j0
$$ plain form
1622 14 253 -59 82 -80 -144 70 -247 54 95 55 119 -43 -109 -231 67 -69 190 79 -12 124 232 126
1644 126 71 -10 -191 -79 -10 63 35 -140 -125 43 -28 -180 109 -1 14 156 -88 15 -10 -1 58 -171 -54 395
1668 395 -12 127 278 -260 90 -58 -418 238 -234 67 153 -55 -41 3 105 -107 75 156 7 -112 -100 47
1690 47 126 44 -191 118 -75 118 8 -147 -304 15 -113 -121 -118 142 -74 232 37 12 103 31 -90 -107 57 260
1714 260 -100 -106 -119 150 110 -168 -86 138 151 -140 10 11 -46 97 -151 50 126 -98 -59 -41 -72 17 -51 -54 -162 -22
1740 -22 -91 -303 0 -26 20 50 128 -66 -12 -74 206 -79 -32 -78 343 -1 -9 -113 -101 18 -179 85 -79 -131 34
1765 34 -44 -269 -255 15 -146 -66 -178 63 107 -176 -2 -208 14 -192 -11 -74 86 -114 159 -66 36 132
1787 132 -151 73 47 -200 -60 297 55 -77 -67 118 -132 280 -84 31 49 -34 276 46 -121 -31 -179 -53
$$ packed form
1622A4K39l12J41j62o4K14l17L01M1m0O4j62o6j22K98j36K59j11r1J36J08j06
1644A26n5q1j81J12O9P3k8j75J5J68p1j52K89j10J5J42k44J03k5RN9k29J17M49
1668C95m07J39J51n38L50j48l60O56m72L01Q6k08J4M4J02k12J82Q1j49j19J2J47
1690D7P9q2k35L09j93J93j10j55j57L19j28qLK60k16L06j95k5R1p2j21j7J64K03
1714B60l60oj3K69m0k78Q2K24J3k91J50Jn7J43k48K01P6k24L9J8l1Q9o8lj08J40
1740b2o9k12L03k6M6L0P8j94N4o2K80k85M7m6M21l44qj04J2J19j97K64j64n2J65
1765C4p8k25J4K70j61Q0j12K41M4k83J74k06K22k06J81o3J60k00K73k25J02R6
1787A32k83K24k6k47J40L57k42j32J0J85k50M12l64J15J8q3L10k30j67R0j48J26
$$ plain form
1809 -53 -42 81 19 141 71 -64 -65 -188 -41 41 183 111 -35 1 106 13 -221 191 169 -226 -287 -126 -12 -50
1833 -50 -112 -1 -169 -27 -60 -10 -62 4 -96 -119 89 -205 81 170 207 -134 -122 -309 -102 -119 36 237 191 -102
1857 -102 -48 134 -257 140 62 235 33 68 92 61 -48 56 22 90 68 179 -69 53 -22 10 150 -79 -107 -29
1881 -29 99 -227 20 188 201 -39 19 -94 95 -7 -82 314 -198 -97 -140 -225 172 -28 -40 -169 14 107 -4
1904 -4 -172 4 -57 198 -156 -37 102 80 85 -97 2 120 70 -8 1 -22 -67 -95 -87 42 146 74 -39 153 110 24
1930 24 164 -71 102 128 -28 -76 185 60 127 15 -83 154 -167 112 235 -25 -12 68 274 97 -73 -53 43
1953 43 121 75 -114 -51 155 -103 1 -123 102 -190 -162 -63 -129 57 187 54 169 119 -151 -167 -118 -91 153 106
1977 106 -3 -14 198 -86 -345 -32 111 -82 -130 -28 183 -57 -37 -220 131 -80 -101 159 -285 -93 -154 56
$$ packed form
1809e3J1J23o2J22p0j35jj23J47Q2J42p2j46L6J05r3k34M12k2l95o1J61J14l8
1833e0o2J11j68J42l3N0n2O6j00k3K08k94K86Q9L7l41J2j87K07j7J55K01m6k93
1857a02N4J82l91L97p8J73k02L5K4l1j09J04l4O8k2J11k48J22p5L2J40k29k8P8
1881b9J28l26K47J68J3k40N8j13J89j02p5L96n12J01m3q5L97k00j2j29J83R3j11
1904dj68J76o1K55l54J19J39k2Nj82R9J18n0p8Rk3m5k8QJ29J04p2j13J92m3q6
1930B4J40k35J73K6j56m8K61j25O7j12r8K37l21K79J23k60J3Q0K06j77j70K0R6
1953D3P8m6j89O3K06k58J04j24K25k92K8R9o6J86J30j33J15n0k70j6M9K7K44m7
1977A06j09j1K12k84k59L13J43j93m8J02K11k40K0j83L51k11k1K60m44J92o1K10
$$ plain form
1999 56 31 91 -163 -165 -47 -81 -109 -162 11 152 16 -48 107 -70 99 -76 43 -84 60 113 -28 -80 120 -35
2023 -35 -18 -91 -1 182 105 246 -59 -33 -203 -200 -52 -90 68 -63 -131 -19 80 256 -14 -95 -182 -95 184 156 98
2048 98 251 -16 48 -128 -22 -223 -8 177 51 119 -18 -84 -107 -67 309 -175 75 139 144 272 -193 -28 -188
2071 -188 -1 -8 -202 36 22 -5 41 244 140 199 0 -160 269 -101 -128 -136 228 45 -86 315 95 10 -302
2094 -302 156 143 13 68 63 144 -86 12 -303 -62 94 -180 -147 -33 162 9 107 142 -119 144 -12 -30 -22 172
2118 172 -194 -244 235 -36 12 -13 123 1 -215 145 109 50 -161 -20 2 -120 108 -5 -6 224 229 170 13 96
2142 96 -58 -179 55 -14 218 13 22 112 292 7 73 4 9 -76 -240 -61 -14 220 86 241 -4 -58 104 -129
2166 -129 -36 -308 139 -14 -25 -48 -181 46 37 -37 -164 12 -16 57 116 49 -24 -204 -100 -120 -207 151 1 -17 78
$$ packed form
1999E6k5O0k54kJ18l4k8n3J73J41j36o4J55j77J69j75J19j27J44N3j41n2K00j55
2023c5J7p3R0J83p7J41l05K6j70LJ48l8J58j31o8J12R9J76k70q1q7Q7K79k8n8
2048I8J53k67O4j76J06k01K15J85j26O8j37o6k3M0L76m84K50O4NJ28m65J65j60
2071a88J87pj94K38j4k7M6K03j04N9j99j60M29l70k7qL64j83j31M01k20q5l12
2094c02M58j3j30N5nQ1k30R8l15K41J56k74L3J14J95j53R8L5k61K63j56j8QJ94
2118A72l66n0M79k71M8k5J36j22k16L60l6n9k11J41K2j22K28j13jK30Nn9j57Q3
2142I6j54j21K34o9K32k05RR0J80k85O6o9Nq5j64J79M7K34j34J55k45n4J62k33
2166a29R3k72M47j53j1k3j33K27rp4j27J76k8P3N9o7p3j80J04k0q7L58j50j8R5
$$ plain form
2191 78 -120 -80 -64 99 16 40 56 -122 -18 221 57 57 -10 196 -49 77 31 191 -104 81 151 59 92 103 -66
2216 -66 -238 -62 43 170 33 -352 30 29 -27 -50 -169 -62 83 -137 108 108 -72 9 3 -133 -105 239 -215 -15
2240 -15 71 114 91 120 -223 -253 -123 127 103 -174 210 142 -80 -188 -53 1 -105 -102 149 -69 2 -13 -142 78
2264 78 -86 45 122 19 -74 -40 31 -91 -136 -190 57 275 -18 -324 70 -245 90 160 -37 183 126 147 102 91
2288 91 218 -166 45 183 -70 44 204 -196 -208 68 -105 23 -130 -42 123 221 186 -246 66 -83 -27 142
2310 142 75 -174 178 12 21 -95 -296 -178 -152 -214 -61 217 -2 -262 310 222 -64 33 158 67 56 32 -147
2333 -147 118 125 -51 -46 -69 10 173 171 130 -8 12 145 -228 -171 303 224 -139 75 -138 -16 42 -93 -245 69
2357 69 108 13 -30 -118 -54 -91 48 -275 90 189 151 180 28 236 -83 38 24 22 -119 5 -69 68 67 137 56 182
$$ packed form
2191G8j98M0J6J63q3K4J6j78J04K39j64%o7K06k45J26m6J60k95J85P0r2L3J1j69
2216f6j72J76J05J27j37l85L82jn6k3j19J07J45k20K45%j80Q1oj36K8L44m54K00
2240a5Q6M3k3K9l43l0J30K50k4k77L84o8k22j08J35N4j06LK51k18P1j5j29K20
2264G8j64J31P7j03r3L4P1j22m5n4K47K18k93l06L94l15L35P0j97K20n7K1m5j1
2288I1J27l84K11J38k53J14J60m00j2K76j73J28j53Q8J65R8l5m32L12j49N6J69
2310A42o7k49L52j66Rj16k01J18K6o2J53K78k19k60N72q8k86R7J25r1j1k4j79
2333a47K65Pj76Nk3P9J63km1j38K0J33l73N7M74p9l63K14k13J22N8j35j52L14
2357F9L9r5m3q8O4l7J39l23L65R9l8K9j52K08l19J21j4kj41J24p4J37jP0q1J26
$$ plain form
2383 182 9 -316 159 114 86 -176 90 376 -175 275 145 -77 -11 266 131 78 -92 -116 74 -74 105 41
2405 41 -199 2 10 12 86 15 -9 109 5 24 100 52 -114 18 107 -154 114 -245 -136 53 246 224 204 -166 -80
2430 -80 17 -47 19 -94 -130 -83 -150 -49 -147 -79 87 -34 -95 65 -37 -199 112 16 37 26 -83 -138 133 64 212
2455 212 -81 126 -87 -173 -66 95 176 165 -70 -49 145 -93 344 -237 -343 118 57 -93 -18 3 83 225 1
2478 1 -276 -26 -150 -126 189 39 -130 -42 18 103 -135 -30 -25 51 9 2 170 215 105 84 144 125 -84 -192 -36
2503 -36 -72 -11 40 -118 49 76 -135 10 -105 -25 5 46 -123 227 -84 -132 -51 219 -213 7 39 -36 -82 84
2527 84 91 -31 -7 -3 -28 -186 -95 -116 -122 168 204 141 -100 -133 -161 144 -233 6 225 -14 13 -158 -105 -96 -47 20 83
2554 83 -60 -66 190 118 22 90 180 0 -248 217 102 156 -139 -91 78 22 57 60 41 362 -145 101 267 200 346
$$ packed form
2383A82j73l25M75m5k8k62K66K86n51M50j30k22O6K77j35n3j70k4J90j48J79o4
2405D1k40K01QKP4p1k4J18j04J9P6m8j66J32Q9k61K68l59J09J89J93k2k0l70Q6
2430h0R7o4O6j13l6M7o7J01r8O8J66j21o1J60j02j62L11r6K1j1j09n5K71o9J48
2455B12k93K07k13q6J07J61Q1j1k35K1J94k38M37n81j06M61o1j50P5K1Q0J42k24
2478Ak77K50j24K4L15j50j69Q8O0Q5k38J05NP6m2pJ68M5j10k1O0j9k09j08J56
2503c6l6O1N1j58J67K7k11J45j15Q0L0M1j69L50l11m8Q1K70m32K20L2p5m6J66
2527H4Pj22K4Mk5j58R1k1oK90L6o3k41l3k8L05l77K39K19k39K7j71N3RM9O7O3
2554H3j43oK56p2r6O8R0j80k48M65j15N4k95M8J69n6L5Lj9L21n07K46J66o7J46
$$ plain form
2579 346 116 -72 -117 -6 -46 87 -188 -121 124 -91 -224 -248 -175 231 84 107 63 175 -63 -58 222 -83 124
2602 124 69 48 -155 -383 9 -156 89 80 15 103 14 44 72 79 45 45 93 -130 81 -70 20 58 133 75 -105 -62 -12
2629 -12 -3 127 -12 259 120 -75 26 -141 76 -316 155 46 140 240 -67 -59 29 125 136 125 -221 87 -96
2652 -96 81 -128 -377 -29 -178 -137 304 174 106 -324 -40 220 36 -162 332 -65 -171 88 -165 227 60
2673 60 0 104 -41 125 224 184 -89 48 -91 -46 81 138 -149 -113 21 93 -117 157 -33 -26 -97 -74 -51 47 -68
2698 -68 166 54 103 158 53 11 4 209 133 -67 -28 -49 34 -24 -13 -293 -21 57 59 328 -5 -63 -90 -55 -118 -148 -359
2725 -359 46 190 19 -161 -66 29 35 -13 11 29 160 113 -2 -23 63 -140 -212 144 -210 -41 77 88 -1 75 106
2750 106 127 -58 87 173 57 79 104 -58 255 203 -30 -88 121 49 -46 -38 -49 -116 34 -273 101 83 -94 -23 -72
$$ packed form
2579C46k30j88m5J11m0J33k75O7K45k15j33k4P3M06j47K3m4J12k38NK80l05K07
2602A24n5k1k03k28L92j65K45ro5Q8q9L0K8Pl4%M8k23K11j51R0L8P5n8j80M3N0
2629a2RJ30j39K71j39j95J01j67K17l92M71j09R4J00l07QQ8R6J1j1l46L08j83
2652i6J77k09k49L48j49M1M41j30o8m30K84K60j84j98M94l97j06K59k53L92j67
2673F0o0J04j45J66R9m0k73J37j39M5J27N7k87L6J34P2k10K74j90Pp1K3K3R8j15
2698f8K34j12M9N5j05m2pK05p6k00L9k1Q3n8J1k80K72P8KK69l33n8k7L5o3l0k11
2725c59M05J44j71j80R5R5Om8K4J8J31m7j15k1Q6k03p2L56l54J69J18J1q9P6L1
2750A06K1j85J45Q6j16K2K5j62L13n2k33n8K09p2r5Qj1o7J50l07L74j8j77P1m9
$$ plain form
2775 -72 72 -202 135 0 33 108 342 -103 75 -39 -61 212 -50 -92 -280 35 130 410 -5 95 68 -36
2797 -36 -4 -12 65 -157 -118 14 170 -34 -118 -230 12 100 -97 75 280 135 62 250 138 -139 127 25 18 84
2821 84 -203 254 -85 67 12 149 158 -140 117 -91 -257 -25 72 133 -37 -89 38 31 170 -162 189 26 67
2844 67 84 -130 -3 -208 -39 105 -68 -33 65 179 -24 -187 66 -99 -134 127 103 -77 20 -117 24 -34 -242
2867 -242 98 -55 -262 10 82 2 -1 -18 -100 82 49 25 2 68 -20 215 -66 -61 -30 104 64 76 -43 -110 46 -30
2893 -30 -174 -204 23 245 -108 -41 3 -8 -7 -67 -79 -2 196 -181 -174 -65 39 -28 136 -37 11 118 273 99 61
2918 61 199 -117 -124 189 -8 -162 -4 71 -30 133 -130 106 -79 20 69 28 -75 47 -32 44 154 -59 125
2941 125 -156 -78 230 175 113 -122 -11 29 -178 -40 37 21 102 74 -184 363 1 126 0 9 -35 5 -10 -171
$$ packed form
2775g2J44k74L37j35L3P5K34m45J78j14k2K73k62m2j88L15R5K80m15J00k7j04
2797c6L2qP7k22L9J32J56k04q4j12K42Q8j97J72K05j45p3J88j12k77K66j02pO6
2821H4k87M57l39J52n5J37Rk98K57k08j66K32R7O1j70n2J27pJ39l32L51j63M1
2844F7J7k14J27k05J69J44j73L5R8J14k03j63K53j65l5K61k4j80R7j37J41n8k08
2867b42L40j53k07K72P2q0lj7q2J82l3k4k3O6q8K35k81NL1J34m0J2j19o7J56p6
2893c0j44l0K27K22l53O7M4j1Jo0j2P7J98l77PJ09J04o7J64j73M8J07J55j74l8
2918F1J38l16pL13j97j54J58P5j01J63k63K36j85R9M9m1j03J22p9P6J10k13J84
2941A25k81P8L08n5o2k35J11M0k07J38P7j6Q1k8k58N47l62J25j26Rm4M0j5j61
$$ plain form
2965 -171 243 -47 -54 -9 -131 -94 35 130 64 -157 87 112 -98 -18 33 5 104 75 -151 -167 -90 21 40 -131 -126 -14
2991 -14 171 97 232 10 -7 183 145 -277 -100 -21 153 75 247 144 25 7 319 -58 254 60 89 248 -91
3014 -91 18 -5 -82 144 25 -100 145 20 -130 63 218 8 -1 -74 20 98 -258 161 31 9 272 62 68 -14
3038 -14 -51 60 99 -19 234 -144 51 -179 78 164 -76 131 -172 -42 -61 -21 57 -89 8 15 -223 242 -67
3061 -67 -91 -88 242 -199 62 152 -93 97 107 -35 -136 166 -75 -12 -277 -21 -203 57 32 220 93 -120 -155
3084 -155 -111 23 68 208 116 -91 -139 -150 -40 -205 -34 190 -71 83 188 203 134 -66 52 104 14 44 191
3107 191 134 119 120 5 112 -143 -197 -251 -40 -72 -158 131 -193 78 -201 -55 -125 -67 -160 -47 42 130 -181 55
3131 55 -132 136 343 79 -52 208 -150 102 -9 -35 7 4 75 139 -183 48 -159 26 113 -57 -57 188 36
$$ packed form
2965a71M14k90pM5j22L7J29R5o6k21K44K5k10Q0N1k8R9k9k26j6P7J11J9j71NJ12
2991a4J85p4J35k22j7J90l8m22J77P9J74p8J72j03j19j8L12l77L12j94K9J59l39
3014i1J09k3p7K26j19j25K45j25j50J93J55k10rp3R4P8l56M19j30k2K63k10Oq2
3038a4l7J11L9j18K53l78J95k30K57Q6k40K07l03J30j9M0P8j46R7Pk38M65l09
3061f7k4LL30m41K61R0k45J90J0j42j01L02k41O3k65K56j82K60k5J88j27k13l5
3084a55M4J34M5J40r2k07m8j1J10j65J71K24k61J54J05J5o9k00J18N2r0L0J47
3107A91n7j5Jj15J07k55n4n4K11l2q6K89l24K71k79J46p0N8r3J13Q9Q8l11K36
3131E5j87K68K07k64j31K60l58K52j11k6M2lP1O4l22K31k07J85Q7j70%K45j52
$$ plain form
3154 36 -121 -27 -113 96 -166 -52 144 171 -71 -142 140 -15 76 67 -25 85 -122 116 23 5 -119 -192 -24 79
3178 79 -115 35 70 207 313 276 68 -173 -10 -60 -96 -98 100 11 -279 56 228 14 48 -73 -179 -48 215
3201 215 -65 -170 264 25 -47 95 -22 -136 -34 -299 -9 -100 6 -33 48 113 -161 129 126 26 -85 209
3223 209 -214 -110 -134 162 -88 171 -244 140 36 -133 -205 50 -70 -100 -21 -255 -154 -180 7 -42 -143 69
3245 69 -66 -84 119 -69 -114 -73 -43 -160 77 -185 4 122 62 -83 134 178 16 210 375 -71 64 15 -100
3268 -100 -37 -162 77 -63 31 -17 -18 99 14 -168 1 -76 55 10 -135 -1 63 -54 -308 67 154 -116 -6
3291 -6 -9 180 -241 -191 -276 57 44 61 -18 -181 124 109 -34 -40 10 2 14 59 -86 -110 -218 337 44 80 45 -32 49
3318 49 238 -239 -55 -179 -343 62 48 143 71 59 -108 -143 -90 40 -99 -138 86 -56 59 126 -44 -173 -82
$$ packed form
3154C6j57R4q6K09k62J14J96K7k42p1K82j55R1rr2J10k07K38r3j8j24p3J68J03
3178G9j94J50L5J37J06l7k08k41J63n0l6kJ98q9k90L35J72k14L4j21j06J31K63
3201B15k80j05M34k39p2J42j17j14J02k65K90r1J06l9Q1O5k74K90lj00j11K94
3223B09m23J04k4K96k50K59m15L84j04j69p2K55j20l0P9k34J01k6J87m9j01K12
3245F9j35j8K03j88m5M1L0j17K37k62J89J18o0j45K17M4j62J94J65m46J35m9j15
3268a00O3j25K39j40R4m8jJ17q5j82J69p7J31m5j45J34O4j17k54L75Q7k70J10
3291flJ89m21N0q5L33j3J7p9j63L05j5j43oN0qJ2M5j45k4j08N55k93L6l5p7Q1
3318D9J89m77J84j24j64M05j4R5p2j2j67l5N3J30j39l9K24j42J15O7j70j29R1
$$ plain form
3341 -82 150 -61 215 177 -198 -56 352 91 51 83 -20 162 196 -127 21 72 -108 -86 9 -186 24 -78 -99
3364 -99 -346 67 26 32 50 123 161 -28 -160 297 53 -28 78 130 141 42 -4 83 73 0 194 -8 150 98 67 190
3390 190 87 -154 -144 -133 -64 165 -46 -410 45 264 271 76 -141 220 -344 85 51 -359 160 -48 -131 146
3412 146 62 -159 90 -151 -46 246 15 -49 49 21 141 96 -7 112 -71 -82 -47 -239 13 -100 68 262
3434 262 2 66 117 228 -45 -90 -22 69 -12 211 12 115 40 165 -16 -16 55 -60 4 -15 179 153 61 65 72 84
3460 84 -153 -161 18 67 -129 -104 -171 -22 86 -41 -79 -141 -80 242 334 131 124 -111 -51 28 -143 80 203 -53 112
3485 112 6 125 67 -145 -123 193 139 -24 76 16 182 5 -56 150 196 38 260 45 106 192 252 204 13
3508 13 0 216 149 -312 232 10 -139 -34 183 -198 104 294 -95 -98 44 -19 0 50 45 73 -87 -37 -310 250
$$ packed form
3341h2K32k11K76l8l75J42M08k61m0L2j03J82L4l23J48N1j80K2R5j95K10j02k1
3364i9k47M13m1OJ8P3L8j89j32M57k44q1J06N2J1r9m6Q7j0p3J94k02J58n2l1J23
3390A90j03k41J0J1O9K29k11l64M55K19Pj95k17L61n64M29l4m10N19k08q3K77
3412A46q4k21K49k41J05K92k31o4R8k8J20m5j03J19j83j1L5j92K52j13J68J94
3434B62k60O4N1J11k73m5O8R1q1K23j99J03p5J25j81%P1j15O4j9J94k6r2MPJ2
3460H4k37qJ79M9j96K5o7J49J08j27l8o2O1L22R2k03pk35O0P9j71K23J23k56J65
3485A12j06J19n8k12K2L16n4j63J00o0J66j77o1K06M6j58K22k15O1Q6O0m8j91
3508A3j3K16o7m61N44k22j49J05K17l81L02J90l89lJ42o3J9N0nK8j60N0k73N60
$$ plain form
3532 250 -222 -104 51 -139 33 205 -105 83 -173 87 -58 -103 -151 -96 -22 148 82 61 -96 74 65 -160 11
3555 11 71 12 95 -81 54 37 135 76 -263 -133 -14 162 180 156 85 4 56 50 4 -77 80 -139 -21 249 -126
3580 -126 -100 -114 -68 -51 186 -129 169 8 -8 39 66 0 42 71 -44 -99 168 32 -33 123 -2 104 -7 -113
3604 -113 -77 -140 -343 -141 9 -37 -222 -50 87 30 -212 -106 -274 -196 -84 25 -95 53 -96 46 60 218
3626 218 -122 61 -71 52 141 176 -262 174 -14 -186 -157 -21 -34 -119 12 43 -22 93 -295 2 -112 35
3648 35 12 -290 -58 159 -37 -113 22 102 -148 225 8 -17 -116 11 -5 98 163 92 -5 49 -39 20 96 -94 -33
3673 -33 -316 -105 -50 -330 -221 -200 0 26 -19 229 276 -32 18 247 -25 131 142 -92 -17 53 7 31 -143 80
3697 80 -225 60 87 50 -213 98 95 45 231 131 186 126 68 -321 85 -100 -46 -100 -15 160 137 -84 -146 -160 -16
$$ packed form
3532B50m72J18J55j90J72J72l10J88k56K60j45m5m8N5P4J70o6k1j57J70rk25J71
3555A1O0n9Q3j76J35j7R8n9l39J30J19J76J8k4p1q1N2om6q1J57k19J18K70l75
3580a26K6j4M6J7K37l15K98j61j6M7K7o6M2K9j15n5K67j36o5J56j25J06j11j06
3604a13L6o3k03K02J50m6j85J72J37n7k42J06j68P8J12J09j20J48j49J42J4J58
3626B18l40J83j32J23Q9L5m38M36j88j72K9J36j3q5J31L1o5J15l88K97j14J47
3648C5k3l02K32K17j96p6J35Q0k50L73k17k5r9J27j6J03O5p1r7N4q8N9P6j90O1
3673c3k83K11N5k80J09K1K00K6m5K48M7l08N0K29k72J56J1k34P5P0m6K4j74K23
3697H0l05K85K7l7k63L11ln0J86j00N5o0n8l89M06j85N4n4Q5J75k3k21o2j4J44
$$ plain form
3722 -16 -70 -75 175 -76 -26 -202 92 -141 -173 -97 -71 55 -47 -143 -91 -231 5 126 -56 -66 -70 -182 -126 97 105
3747 105 -112 -82 -1 34 28 -72 86 47 73 346 -5 -57 10 -112 101 -42 10 -88 -241 219 104 117 -65 -126
3771 -126 -25 103 114 135 243 -140 125 219 -77 33 222 -94 -92 -6 7 28 -281 -86 68 6 -35 -188 17
3794 17 -243 69 -49 163 -14 138 -6 -76 -304 -180 28 -161 -100 -137 -186 -3 -178 301 -99 68 6 228
3816 228 132 3 20 -35 97 -37 50 113 -137 -72 186 86 -56 107 243 -52 -31 -112 -192 84 18 -115 34
3839 34 -80 -92 161 2 -122 41 -48 -129 -203 130 -253 269 125 -198 41 -76 -95 56 64 82 -79 -17 305
3862 305 5 77 -320 230 -1 48 -183 -179 -133 -24 218 -102 170 131 -238 -80 74 -34 -97 -167 -54 158 19
3885 19 -13 223 -124 -81 175 -232 18 131 20 -79 -13 40 38 -48 82 -51 51 136 88 79 -79 48 -166 -15
$$ packed form
3722a6n4nK50k51N0j76K94k33l2P6K6J26j02r6N2j40K36J21j82j0mj12N6K23Q
3747A05k17L0Q1L5oj00J58l9K6K73l51n2O7j22K13j43N2r8j53M60j15J3j82o1
3771a26J01J28J1K1J08l83K65R4k96J10J89l16KQ6J3K1l09J95J54o2m1j53K05
3794A7k60L12j18K12j77J52j44p0k28J24K08j89O1l7m9J83j75M79m00J67o2K22
3816B28r6j29J7n5J32j34Q7O3k50O5K58j00j42J63J36k95K1q1q0K76o6j33J49
3839C4j14j2K53j59j24J63q9q1p4L33l83N22j44l23K39j17j9J51QJ8j61O2L22
3862C05l00P2l97N50k31M9k31MM6J09K42l20K72l9l69J58J54j08o3p0J13K12j39
3885A9l2K36l47M3K56m07K50J13j11r9O6N3kq6J30j33J02Q5m8rj58J27k14J51
$$ plain form
3909 -15 41 133 -65 -51 -157 -120 139 78 29 -55 28 -22 -231 -60 213 265 195 29 -183 -162 27 44 -215 -10 -57
3934 -57 -9 -20 -66 75 -1 -132 104 -254 -94 -306 -63 -167 -179 -80 -124 85 -29 -68 44 -166 -251 -83 -207
3957 -207 19 -19 85 -64 -262 174 -75 161 53 170 -119 200 71 86 28 125 142 -57 126 -35 306 -215
3979 -215 -186 -146 -347 -16 0 357 -193 251 147 30 169 -140 -104 1 68 -8 -114 -128 -37 284 -95 -111 160
4002 160 -29 142 -5 159 258 -27 -19 119 -137 -44 -105 -30 119 39 173 -149 -43 -49 -63 -176 107 -132 147
4025 147 -202 -113 71 93 -44 -8 -18 -82 194 49 -143 -4 68 45 -83 -32 -100 -65 -3 63 0 -120 -60 -5 -9 -88
4051 -88 -179 -41 -28 283 98 -138 -132 121 -61 63 31 164 -39 94 -3 -76 31 -94 -212 -20 -26 205 -23
4074 -23 -44 97 53 23 31 85 -41 -91 -34 197 121 91 -319 -41 28 20 -37 152 21 -27 121 -142 89 -75 -316
$$ packed form
3909a5N6R2j98J4j06L7K59o1m9q4Q3n0k09J71K73N2p0j66k12K1J89J7k59K05m7
3934e7M8j1m6J41p6j31K36l58J60k12K43j04j2R9m4K09j14l9J12k10q5J68j24
3957b07K26l8J04j49j98M36k49K36j08J17k89L19j29J5n8R7J7j99J83j61L41n21
3979b15K9M0k01L31J6L57n50M44j04j17J39l09L6J05O7p6j06j4R1L21l79j6K71
4002A60j89J71j47J64R9k85QJ38k56R3o1P5J49q0J34l22J06oj4j13K83k39K79
4025A47l49Q9J84K2j37L6j0o4K76j45j92J39P2k3j28N1o8L5O2O6o3j20O0N5mp9
4051h8r1J38J3L11j85k36OK53j82J24l2J33k03J33r7p3J07j25j18J92oK31k28
4074b3k1J41m4l0QN4j26n0N7K31p6l0m10K78O9qn7J89j31m8J48k63K31j64k41
$$ plain form
4099 -316 216 3 -81 103 84 -61 120 138 -62 -75 216 46 72 17 5 -184 -150 -23 -49 168 -6 287 15
4122 15 21 -75 -139 -63 -146 212 14 111 94 -200 182 -176 62 -106 -104 -185 -79 206 -201 -25 36 75 132 -84 -54
4147 -54 -61 166 -25 -78 -13 57 130 27 94 -24 -31 34 -280 -10 21 29 -93 139 -60 -2 146 -60 -145 -126 131 -61
4173 -61 15 10 -20 -115 -168 -32 -90 127 4 -143 -114 -51 93 -167 11 -194 -170 -66 -10 -52 126 128 176 58 -101
4198 -101 74 -39 229 94 43 261 83 -38 -225 -109 -8 16 -123 103 -104 48 -145 -60 1 -184 60
4219 60 -31 -102 91 -93 196 188 324 -25 16 12 44 -38 -188 319 11 178 242 230 -137 -58 40 -23 38 -24 -76 -271
4245 -271 107 33 -76 -25 -184 -213 -59 -133 76 -86 -109 5 -6 129 -220 165 101 -135 -154 -96 149 -96 -3
4268 -3 85 141 93 229 231 -150 -192 158 53 -253 -71 168 111 151 -40 190 47 -173 211 87 -63 -37 88 29
$$ packed form
4099c16N32k13q4J84j9j45J81J8k00j3K91j70K6n5j2j89L4J27k6K17j74K93k72
4122A5Or6o4P6q3L58j98R7j7k94L82l58K38j68Kq1J06K85m07J76O1L9N7k16L0
4147e4pK27j91n3O5P0P3j03O7j18pO5l14K70L1Qj22K32j99N8J48k06q5J9K57j92
4173f1P6nl0r5n3J36n8K17j23j47K9O3J44k60J78k05K4J04N6m2J78KM8j18j59
4198a01J75j13K68j35n1K18j78j21j87J16J01K4j39K26k07J52j93Q5O1j85K44
4219F0r1p1J93j84K89qJ36l49M1mL2q2j50N07l08J67O4j2l67P9R8o3O1o2n2j95
4245b71L78p4j09N1j59k9J54p4K09j62k3J14j1J35l49L85o4k36j9N8K45k45R3
4268cQ8N6m8J36Kl81m2L50j05l06J82K39n7M0j91K30j43k20L84j24j50K6J25n9
$$ plain form
4292 29 112 -58 132 116 95 117 -18 20 -3 71 321 3 13 30 -105 141 105 -164 265 58 -226 -8 11 210
4316 210 -56 63 142 110 -64 -123 -78 -232 -74 13 46 11 164 -1 120 215 -138 -170 -47 5 -94 -34 -188 -50
4340 -50 -84 -138 67 -178 -7 102 180 35 103 168 143 -27 225 -143 -247 106 -53 -36 -137 -13 35 -252 147
4363 147 -49 139 5 -96 90 -109 150 114 -125 -152 -266 -29 -139 -86 -250 -61 65 -78 91 -63 112
4384 112 147 41 39 -157 251 17 208 86 -25 238 109 161 -203 17 26 -17 135 283 129 137 -146 109 164
4407 164 -170 64 24 20 -93 29 -174 -107 -176 -52 -23 69 -59 -129 -157 11 -141 25 -7 -40 39 162 34 18
4431 18 -69 10 -4 34 21 69 -6 -19 70 -254 -103 34 -52 -1 24 47 -143 3 -67 -155 -155 -102 93 -322 -200 249
4457 249 -68 -218 193 120 175 23 207 13 151 5 -44 150 -156 87 -43 76 17 -196 96 -31 158
$$ packed form
4292B9Q3j70J90j6k1K2j35L8k3P4K50l18J0J7j35K46l6k69M29k07k84K18J9J99
4316B10k66J19P9l2j74n9M5j54J58Q7L3l5J53j65J21R5l53l2J23N2r9O0j54J38
4340e0l4n4K05k45J71J09P8j45O8O5k5j70K52l68j04L53j59J7j01J24M8k87L99
4363A47j96J88j34j01J86j99K59l6k39k7j14K37j10N3j64J89J26j43J69j54J75
4384A12L5j06kj96M08k34J91j22j11K63j29N2l64K20Rm3J52J48j54Qk83K55N5
4407A64l34K34m0mj13J22k03O7o9J24K9R2j28p0k8J68j52J66l2l3P9J23j28j6
4431A8q7P9j4L8j3M8p5j3Q9l24J51J37q6N1K5K3j90J46p0q8%N3J95m15J22M49
4457B49l17j50M11p3N5j52J84j94J38j46m9J94l06K43j30J19n9k13K92j27J89
$$ plain form
4478 158 9 -3 96 -345 17 -42 123 44 109 -102 -288 36 -165 -50 26 -54 -12 -100 -70 97 76 -245 306 -90
4502 -90 -105 237 -44 -189 90 -74 69 -96 -39 -52 -45 -158 -154 -4 -226 -25 138 293 -51 -69 -181 192 -109
4525 -109 57 31 17 -23 115 271 113 141 245 -172 -56 -37 -75 66 -169 47 -32 154 -152 -185 -55 -17 305
4548 305 -35 134 -12 -100 27 61 -81 97 2 68 13 -17 202 77 84 72 -85 69 165 84 -4 -137 75 -95
4572 -95 114 109 -259 -106 -165 -44 1 53 87 -61 -531 -51 127 -129 -77 64 113 -87 173 -106 -121 -139 169 156
4596 156 10 218 48 158 -51 37 -23 248 164 -110 -39 -6 134 -44 -58 1 43 92 -56 -141 -137 -213 -95 61
4620 61 114 54 -44 170 -46 -198 -17 207 -162 23 -154 -266 57 -154 -192 54 -210 -7 -56 -92 -203 -168 -37
4643 -37 124 283 -56 -22 -156 66 -231 -96 122 -95 193 123 59 -96 -85 342 32 41 -144 -7 -187 -221 23
$$ packed form
4478A58j49j2R9m41L62n9J65p9O5k11j86L24k01J15P6q0M2q8L0J67k1l21N51l96
4502i0j5L42k81j45K79j64J43j65N7j3Pj13MJ50k22K01J63J55l44j8j12L73l01
4525a09J66k6j4m0J38J56j58K8J04m17J16J9l8J41k35K16p9J86l06l3J30L8L22
4548C05l40J69j46q8J27L4j42J78r5O6n5l0K19j25Pj2j57J54R6q1q8j33K12j70
4572i5K09nl68J53n9J21M5N2L4j48m70M80J78k56N2J41M9k00K60k79j5j8L08j3
4596A56j46K08j70J10k09Q8o0K71q4k74P1L3J40j78j4N9M2M9j48q5Mp6J18J56
4620F1N3o0r8K14k16j52J81K24l69J85j77j12L23k11l8K46k64K03m9l6j11L5J31
4643c7J61J59l39L4j34K22k97J35K18k17K88p0o4j55J1M27l10Rj85J37j80l4K44
$$ plain form
4666 23 -83 189 -63 -77 -16 133 -107 -7 -136 46 -69 5 -161 246 50 -80 -51 -190 -31 -13 -149 54
4688 54 135 -136 58 211 -13 -102 237 -53 -5 -63 -160 43 114 -192 84 -191 97 65 293 41 52 -245 -39
4711 -39 30 13 -243 -129 -130 -6 160 -179 -21 186 241 -87 121 -31 -118 184 87 -189 27 387 226 -76 -88
4734 -88 102 -281 -21 -96 3 -118 100 29 -51 171 -36 172 -15 167 77 -31 0 -1 -100 70 -56 82 -147
4757 -147 -138 252 122 -116 111 -209 52 -109 97 132 -161 6 62 302 65 7 -52 172 233 -257 -39 -16 134
4780 134 -17 -63 280 -121 -38 76 -155 136 -31 8 66 -223 105 203 -222 45 -4 -155 62 104 -27 76
4802 76 47 -126 55 -102 -200 -68 -145 159 -74 15 171 1 63 88 -203 266 177 57 199 196 235 -173 75 127
4826 127 85 130 160 -92 -79 -65 48 -62 -4 -35 15 117 -270 36 -240 92 66 53 1 -106 -10 -278 115 132
$$ packed form
4666B3j06K72k52j4O1J49k40J00j29J82j15P4j66M07j96j30K9j39J59J8j36K03
4688E4Q1k71J94J53k24q9L39k90M8n8r7K03P1l06K76k75K88l2K28k52J1k97K06
4711c9O9j7k56J14jJ24J66l39J58K07N5l28K08j52q7L02r7k76K16L60j61l02j2
4734h8J90l83K60p5R9j21K18p1q0K22k07K08j87J82r0j08L1jr9J70j26J38k29
4757a47RL90j30k38K27l20K61j61K06L5k93J67N6K40k37n8n9K24O1m90K18K3J50
4780A34j51m6L43m01Q3J14k31K91j67L9N8k89L28R8m25K67m9j51K17M2j31J03
4802G6k9j73J81j57r8J32p7L04k33Q9J56j70O2K5k91M69q9j20J42lL9m08K48N2
4826A27m2M5L0k52J3J4J13j10N8l1N0J02l87L06k76L32k6j3n2j07R6k68L93J7
$$ plain form
4850 132 174 -83 102 -117 119 73 112 48 26 -1 -159 6 39 190 335 138 -128 105 -124 -86 -50 37 117 -225
4874 -225 291 39 96 71 95 255 -3 -32 -5 -208 15 204 107 240 -15 -3 -30 178 -110 110 75 -141 -200
4897 -200 -4 -44 294 61 -151 47 -101 26 -56 -77 71 257 189 -79 -27 -295 -155 72 -165 -262 -177 54
4919 54 203 51 43 101 -41 31 271 -53 -79 154 -171 -103 -53 63 -5 -164 3 -11 307 -61 -273 -90 51
4942 51 66 -63 150 217 25 3 -153 3 -72 54 -54 -326 69 218 15 140 -27 -10 -21 -142 -61 21 216
4965 216 183 13 69 186 195 -42 -114 92 -300 -76 -80 84 -285 31 150 149 -130 -125 -42 32 45 181 -15 -33 -196
4990 -196 -310 3 -111 -63 32 -106 -110 -163 15 -126 -167 170 -303 -271 12 -257 -24 -53 155 -78 82 219 -217
5013 -217 -13 19 123 -107 14 -82 26 -17 -314 -108 -92 141 100 -148 -81 -31 -128 -199 -197 -156 -239 -262 71 75 111 134
$$ packed form
4850A32M2k57J85k19K36m6L9o4k2k7j58J65L3J51J45j97k66K33k29L8L6Q7Q0l42
4874b25N16k52N7k5K4J60k58k9K7k03K23J89r7J33k55J2k7K08k88K20l5k16n9
4897b00J96m0L38k33k12J98j48J27q2k1J48J86o8k68N2k68J40K27k37r7Q5K31
4919E4J49j52qN8j42P2K40l24k6K33l25O8N0J16o8j59J67j4L18l68k12J83J41
4942E1J5j29K13O7j92k2j56J56p5J26j08k72L95J49k03J25j67J7j1j21Q1Q2J95
4965B16l3j70N6J17Rk37p2K06l92K24mJ64l69L16J19jk79NQ3P4J3J36j96j8j63
4990a96j14L13j14M8R5j38mn3J78j41m1L37m73L2K83k69K33k9K08k33J60J37m36
5013b17K04L2J04k30J21r6J08m3k97K06J6K33m1k48O7N0r7p1KM1q3k3L33ML6K3
$$ plain form
5039 134 -108 223 12 -195 152 49 84 -113 1 -82 29 -101 -407 23 95 -152 -256 -98 43 173 -15
5060 -15 29 8 54 43 87 -59 80 225 -93 16 -134 45 -131 -132 126 59 69 105 -184 74 318 34 65 317
5084 317 -173 -12 -232 -16 -36 -67 -100 106 211 -364 149 -18 -210 -100 50 102 139 26 14 145 11 -80
5106 -80 -181 -84 18 -433 -123 121 101 11 -39 -57 167 -58 167 116 -269 84 -97 52 -106 -120 174 152 75
5129 75 20 -276 -89 -141 -204 133 128 258 -61 -131 -204 -182 -181 -99 -148 144 -93 5 91 274 -134 88 188 -39 39
5154 39 317 -23 -10 184 -98 -54 185 -32 84 -55 -54 155 -280 24 80 141 -249 66 32 151 51 -201 -156
5177 -156 -61 -37 27 -50 -136 112 -117 -131 14 110 -123 54 -115 -136 116 -101 -72 -11 174 -281 62 -96 102
5200 102 217 94 71 227 183 -101 -161 -30 93 -189 -58 80 54 -398 -38 -101 216 -63 13 -126 304 -19
$$ packed form
5039A34k42L31k11k07L47j03L5j97J14q3J11j30l06M30P2k47j04J58J41J30j88
5060a5M4k1M6j1M4j46J39J45l18J09j50J79j76jK58o7J0L6k89K58K44k84L1K52
5084C17m90J61k20K16k0l1l3K06J05n75N13j67j92J10J50N2L7j13j2J31j34r1
5106h0j01R7J02m51L10K44k0r0n0j8K24k25K25n1l85L53j81J49j58j4K94k2p7
5129G5n5k96J87n2o3L37nJ30l19p0p3K2JQ2m9K92k37R8Q6J83m08K22J00k27P8
5154C9K78l40J3J94k82M4K39k17J16j39JK09m35L04N6O1l90L15l4J19j00k52M5
5177a56R5K4O4p7q6K48k29j4J45R6k33J77j69k1K52k17K9O1J85m55L43j58J98
5200A02J15j23k3J56m4k84o0J31J23k82J31J38k6m52L60o3L17k79P6j39M30l23
$$ plain form
5222 -19 83 -33 -33 105 0 114 81 -166 -55 110 -109 -35 -93 -69 -145 -27 267 66 -111 6 144 232 -159
5245 -159 70 86 -5 85 170 85 48 -165 -118 -152 -116 -164 -254 -83 33 48 224 -49 -117 285 40 241 65 60 99
5270 99 -106 356 8 102 115 -102 108 19 37 -62 92 301 -119 87 239 -296 -204 -161 41 173 142 -189 157
5293 157 18 -32 -133 82 28 28 -7 55 155 -282 -65 -145 95 -338 -113 -233 -186 -139 106 173 -204 155 -36
5316 -36 250 248 144 -137 156 55 -175 26 212 32 72 -13 231 -3 125 23 -351 150 -100 -27 -229 292
5338 292 52 43 4 -18 -27 88 222 76 123 -26 204 -191 51 30 106 -2 -14 92 106 -86 -50 23 -138 54
5362 54 150 -97 149 73 140 171 11 45 -129 386 -150 -25 -190 -173 -25 -116 143 102 162 -26 -37 -7 -379 141
5386 141 46 -76 -15 -23 109 -104 -11 -66 26 -59 51 -52 -311 -201 117 109 -221 -125 -79 62 235 225 -104 114
$$ packed form
5222a9J02j16%J38j05J14l3k47J11J65k19P4n8K4p6J18K94k01j77J17J38Q8l91
5245a59K29J6r1R0Q5q5l7k13M7l4L6m8r0J71J16J5J76k73o8M02k45K01j76nL9
5270I9k05M62l48R4J3k17K10q9J8r9J54K09m20K06J52n35R2M3K02J32l1l31L46
5293A57j39n0j01K15n4%l5O2J00m37K17q0K40m33K25j20M7M7K45O7l77L59j91
5316c6K86kj04k81K93j01k30K01J86j80M0q5K44k34J28j02l74N01k50P3k02N21
5338B92k40rl9k2rJ15J34j46M7j49K30l95K42k1P6j08j2J06J4j92L6P3j61J92
5362E4R6k47K46p6O7L1j60L4j74N15n36J25j65J7J48r1K59m1O0j88j1L0l72N20
5386A41r5j22O1qJ32k13R3n5R2q5J10j03k59J10L18ql30R6M6J41J73j0l29K18
$$ plain form
5410 114 -94 74 108 86 -94 -121 -208 152 -59 22 26 -180 -142 -39 -197 -91 -245 90 -201 25 51 -53 275
5433 275 -12 -90 -47 -143 -168 52 -148 -45 76 -75 101 -1 -91 128 35 120 -28 -106 -2 -240 -22 205 130
5456 130 102 -4 176 134 -52 -50 -168 -212 -46 31 -85 149 68 -89 41 108 17 -151 -36 -57 29 184 54 44
5480 44 41 -102 -181 -128 -20 154 19 -117 96 4 171 165 -11 73 42 111 -59 -15 -44 19 79 100 -1 83 -95 -52
5506 -52 -51 -198 -154 -32 121 149 119 -8 61 94 64 -248 -92 59 130 57 155 -97 -72 8 65 41 80 24 -209 21
5532 21 -30 -16 95 -83 218 -96 -21 55 -131 -2 -120 -27 -55 -100 -106 187 -112 -206 8 26 296 153 41 92
5556 92 87 42 -19 -122 62 -10 202 37 21 57 85 243 123 70 45 19 198 -32 132 191 -162 -1 -69 126 -116
5581 -116 -76 21 108 96 -170 233 -206 153 -106 -271 241 26 -56 14 -31 -145 57 54 58 -200 139 182 -71 5
$$ packed form
5410A14k08J68L4k2j80k7q7L60k11Q1Mk06L8J03j58J06j54L35k91K26K6j04L28
5433B75k87p8M3r6k5K20k00J03J21j51J76j02r0K19r3Q5j48p8J04k38K18K27p5
5456A30k8j06J80m2j86Kj18m4J66P7j16K34q1j57J30O7r1j68J15k1Q6J55j30j0
5480D4lj43p9N3J08J74j35j36K13r2J67oj76Q4l1O9j70M4k9O3O0K1j01Q4j78M3
5506e2Jj47M4J22J53K8l0j27O9L3l0l12J56J51P1p3R8k52K5Q0N7k4L9n6k33K30
5532B1n1J4J11j78L01l14P5P6j86J29j18R3k8m5oK93k99r4K14J8K70j43j12N1
5556I2nm5o1j03J84p2K12j65j6L6K8J58j20n3k5k6J79k30J64N9l53J61o8J95k42
5581a16M0R7Q7j2k66M03m39L59k59j65N12k15q2P0m5j14K02lMk58L39M3k53P6
$$ plain form
5605 5 8 -10 -124 86 131 30 117 -83 192 98 158 50 52 132 -9 103 44 -81 -27 100 97 -119 198 -25 -47 -53
5631 -53 13 27 -44 87 -26 242 2 70 -187 -23 -78 53 -51 156 160 -116 -15 120 -24 -8 67 -47 43 71
5655 71 47 -71 72 -245 -80 -197 15 8 -36 299 -259 341 -171 40 -216 74 31 -153 178 -217 94 -78
5677 -78 99 38 -135 -89 166 123 97 121 -25 -94 144 171 312 -14 11 -140 -183 6 -277 172 218 150 -22 32
5701 32 -36 54 -32 -2 -117 -5 -146 -70 210 67 30 -7 -181 -77 -3 43 -182 78 -70 22 132 40 -48 146
5725 146 79 -129 -130 85 304 -101 181 -34 -89 -234 105 374 83 160 -160 5 23 158 252 -66 208 -74
5747 -74 81 -167 -44 -217 -40 -119 290 97 127 -173 16 3 -206 -80 97 -39 -53 -95 12 10 -13 17 -105
5770 -105 -7 160 -141 144 98 -78 -72 135 -95 -97 -54 47 129 -89 11 290 95 -103 294 188 146 102 -175
$$ packed form
5605ELj8j14K10M5j01Q7k00K75r4O0j08KQ0j41J12n9j25N4J27lk16L17k23k2o
5631e3O6J4p1J31j13K68k40O8k57J64n5J31j04K07Mk76J01J35j44J6P5j14R0K8
5655G1k4j18J43l17J65j17K12pm4L35n58O00n12K11k56K90m3j84L31l95L11j72
5677g8J77o1j73M6K55m3k6K4j46o9K38K7J41l26K5j51m3J89k83M49M6o8j72N4
5701C2o8R0q6L0j15J12j41P6K80j43l7l7j74J04P4M6k25K60j48R2J10r2q8J94
5725A46o7k08jK15K19m05K82k15n5j45L39K69k91P7l20J65J8J35R4l18K74k82
5747g4J55k48J23j73J77p9M09j93L0l00J89j3k09J26J77j36j4m2J07kk3L0j22
5770a05R8J67l01K85m6j76OK07k30kM3J01Q2k18J00K79j95j98L97j06m2m4k77
$$ plain form
5793 -175 -44 -42 -96 -88 -32 61 -211 172 -84 -74 -73 64 -30 32 -104 68 39 115 -110 176 -94 -75 -256 159 -89
5818 -89 -142 120 -122 206 -56 237 89 -88 16 0 -246 112 94 87 81 171 -13 229 -97 152 -127 -92 -170 172
5842 172 -1 40 -151 72 95 22 10 129 -19 -228 194 86 -74 -102 -30 34 -98 -37 -103 247 -58 -215 194
5865 194 -144 -151 52 341 -195 -87 -59 -289 -88 101 286 107 14 46 -162 -46 -59 -109 -25 137 13 -101 106
5888 106 68 -37 -130 65 -25 49 73 -103 13 -243 -218 154 169 210 127 155 121 -221 82 171 87 -251 78 -132
5912 -132 68 -52 -146 168 222 57 197 -104 -71 -3 -55 -232 37 23 -205 -195 -252 85 -11 -88 -107 -75 -247 92
5936 92 119 -170 13 -74 189 -19 220 82 -144 335 60 90 -49 189 78 70 -162 48 166 -85 -18 -46 88
5959 88 21 168 -35 -97 56 174 -1 -209 86 -129 170 183 -48 84 -100 140 -4 -155 3 -107 -178 50
$$ packed form
5793a75J31Kn4QN6R3k72L83k56J0JJ37r4O2j36J72k9P6k25K86k70J9j81M15k48
5818h9n3K62k42L28k62K93j48j77J04j6k46L58j8poR0j84K42l26K49k79L5p8L42
5842A72j73M1j91K23K3p3j2J19j48k09M22j08j60k8P2O4j32O1o6L50l05j57M09
5865A94l38pK03K89n36J08K8k30K01J89J85j79r3L2k08J16j3n0Q4J62j24j14K07
5888A06l8j05r3J95r0P4K4j76J16k56K5L72J5M1q3K8l4l42L03Q9q4l38L29k10
5912a32K00j20r4L14N4j65J40l01L3O8n2j77K69j4k28J0n7L37r6p7j9L2j72L39
5936I2K7k89J83q7K63k08K39j38k26M79k75L0j39K38j11qk32K10J18k51O7k8J34
5959H8o7J47k03o2J53J18j75k08K95k15K99J3k31J32j84K40j44j51J58j10p1K28
$$ plain form
5981 50 39 -127 -78 134 92 182 -90 50 92 33 202 79 -98 246 -19 103 -13 -224 -41 -174 86 -14
6003 -14 166 -32 83 49 99 36 -176 266 41 135 43 13 -108 -33 184 -1 84 140 -70 105 46 122 -174 -49
6027 -49 32 -140 -57 52 -174 18 51 193 75 141 178 -192 -68 100 -113 249 281 -71 -300 -75 86 6 2
6050 2 -124 108 51 221 -3 84 -132 -12 -13 -133 18 218 260 -2 -178 210 57 -256 181 66 -57 -64 76
6073 76 69 53 -207 -418 -52 -15 120 -57 5 62 29 77 164 309 -127 96 57 -22 -2 70 68 -25 -194 49 -12 1
6099 1 66 -164 -136 -37 -194 73 204 54 -184 -31 -7 -34 -263 22 60 -212 327 128 -67 21 82 -140 131
6122 131 -141 56 200 -5 121 141 -72 55 -24 -76 17 -70 151 33 89 253 28 -32 58 -286 -10 126 -341
6145 -341 110 264 -20 -125 -26 -24 -180 -44 89 123 -3 -131 -21 121 -115 239 156 -100 -71 -24 96 164 217
$$ packed form
5981E0j1j66M9K12m2R0k72J40M2n9J69j23j77L44k65J22j16k11J83j33K60j00
6003a4J80j98J15l4N0o3k12M42k25R4r2l0j21P5K17j85Q5N6k10J75n9P6k96J25
6027d9Q1j72Q3J09k26J92L3J42j18O6L7l70J24J68k13L62L2l52k29K25J61q0m
6050Bj26K32n7J70k24Q7k16J20jj20J51K00M2k62j76L88j53l13M37j15j23pJ40
6073G6pj6k60k11L66L7J35j77O2N7l3M8Q7J45m36K23l9p9K0P2kr3j69K43o1J3
6099AO5k30K8R9j57K67J31j50k38J53K4k7k29K85L8k72N39j99j95Q8O1k22K71
6122A31k72J97J44k05J26K0k13J27p9n2R3q7K21j18N6J64k25o0R0l44K76J36m67
6145c41M51J54k84j05R9Kj56J36J33L4j26j28J10J42k36L54q3k56K9M7J20O8N3
$$ plain form
6168 217 -192 -114 50 -129 -243 -243 -144 172 259 147 79 -54 25 42 2 -164 -78 38 -49 142 7 -140 -313 74
6192 74 -10 -152 19 -44 59 -63 -100 -31 218 113 11 -12 327 -67 69 87 196 -5 168 0 248 142
6214 142 62 220 -88 -88 95 52 40 23 18 -51 -47 44 -240 -104 -122 -196 94 -125 170 115 -21 245 -75 -314 65
6239 65 59 134 214 -92 -4 183 -42 181 -113 -39 179 84 34 -59 62 50 117 -241 59 120 -292 58 60 -64 -60 45
6265 45 -126 63 84 -95 30 78 205 139 89 40 -5 -99 -106 90 -72 -185 -50 54 -29 -124 142 34 126 81 -120
6290 -120 326 8 -33 9 -167 -102 -239 -167 18 -8 -84 -157 -218 -24 90 -37 0 99 91 -31 2 3 -199 113 -100
6315 -100 -272 -25 227 -163 -66 220 17 -66 195 224 -117 -100 29 30 21 169 -73 181 -292 -209 106 -132 103
6338 103 -138 7 -42 31 304 -85 -146 101 -76 31 -78 -32 -119 -254 -30 43 -112 -200 -32 35 -192 -10 40
$$ packed form
6168B17m09P8J64j79j14%R9L16Q7j12o8j33P9J7m0j66Q6J16q7J91j35j47j73L87
6192G4q4j42J71o3J03j22l7O9K49j05j02k3L39l94J36J8J09k01J73j68K48j06
6214A42q0J58l08%J83m3j2j7no9MR1k84J36j8p4K90k19K95n5j36K66l20k39L79
6239F5oP5Q0l06Q8J87k25K23k94P4K18r5n0r3J21j2O7l58L00O1m12L50Kj24MJ05
6265D5j71J89K1j79J25M8J27o6n0m9m5r4pJ96j62j13J35J04q3r5K66j08R2m5k01
6290a20M46l18m1M2j76O5j37P2J85k6p6p3o1J94J14j27L7R9qj22L3Jk02L12k13
6315a00j72K47K52l90R7K86k03q3K61K9l41J7J29JrJ48k42K54m73Q3L15k38K35
6338A03k41J45m9P3K73l89o1K47j77J07j09M6q7j35K24P3j55q8J68O7k27J82N0
$$ plain form
6361 40 100 241 229 -102 76 27 -65 -149 -206 134 145 -1 -15 36 -52 366 -33 13 -53 52 61 39 163 47 -88
6386 -88 64 -161 -192 -192 -231 268 151 32 388 112 -37 88 -68 -8 -116 33 -316 -50 15 54 -28 236 -39
6409 -39 155 88 225 -97 -316 143 -101 -120 -38 -273 -102 106 -41 21 -105 -72 -50 55 68 259 -43 165 121
6432 121 -53 160 -54 145 126 -187 45 -46 -47 -79 45 156 86 129 30 -77 109 277 -28 -50 129 139 -167
6455 -167 -14 -105 -47 81 -65 -227 34 -15 -125 -190 -120 -117 231 82 39 -5 62 -16 -319 -51 -173 166 -54 -21
6479 -21 18 70 -49 10 258 -175 -155 137 93 -10 88 85 -268 -83 0 40 149 -38 -245 26 -10 18 188 -30
6503 -30 -214 164 7 -85 98 134 -48 -44 -25 -62 1 56 31 -170 132 25 -64 -22 -49 301 -94 7 122 89 -233
6528 -233 8 65 -59 -141 11 8 275 259 12 142 -242 -35 127 48 -306 -175 -201 108 51 -59 152 -176 -45
$$ packed form
6361D0O0J41j2l31J78m9r2q4n7L40J1j46j4N1q8M18l99M6o6J05Rk2J24j16j35
6386h8J52k25l1%l9M99j17j19L56k76j49J25j56O0j08J49l49K66O5L9q2K64k75
6409c9J94o7J37l22k19M59k44j9Q2k35J71K08j47O2j26L3K2J05J3J91l02K08m4
6432A21j74K13k14J99j9l13K32r1jl2J24J11p0M3r9j07J86J68l05k2J79J0l06
6455a67J53r1N8J28j46j62K61m9j10o5P0LL48j49m3m4O7p8l03K68j22L39k20L3
6479b1L9N2j19N9K48m33K0K92m4j03R8ll53J85Q3M0J09j87k07K71l6K8J70k18
6503c0j84L78j57r2J83L6j82MJ9l7O3N5k5k01L02j07q9M2k7L50l95J01J15l3l22
6528b33K41N7j24q2J52lK67j6k47J30l84K07J62p9l54J31k6L09n7j10K11l28J31
$$ plain form
6551 -45 -91 -39 -194 43 -2 -100 -187 89 207 -88 54 -52 330 59 131 154 -137 66 -159 103 -29 -45 -8
6574 -8 9 110 88 121 -25 56 234 193 -201 62 -108 -163 -77 43 -181 -16 67 43 143 160 190 47 151 22
6598 22 91 161 29 10 51 4 32 -56 -134 -138 -26 -201 39 -7 6 114 -11 144 -24 260 93 8 -29 -62 286
6623 286 64 -131 -42 191 -172 -152 -263 -168 11 72 60 -84 -241 -136 386 -80 -3 -211 80 9 -97 140
6645 140 55 7 -153 -22 237 126 -2 132 -128 121 44 69 -72 63 -147 28 214 -53 -53 -8 275 88
6667 88 66 82 137 -56 -46 -187 -106 -135 -276 -132 -111 -145 35 -85 -70 -17 -220 -16 89 -247 -48 -135 -212 163
6691 163 112 8 81 29 -142 38 68 93 32 28 291 55 -6 57 -142 237 -241 91 76 -116 -124 187 229 -82 0
6716 0 -33 106 90 115 -110 -72 154 120 -174 -161 -103 -76 161 -55 -27 200 23 -41 155 -299 318 -76 52 119
$$ packed form
6551d5m6N2j55K37m5r8q7K76J18k95J42j06L82k71P2K3k91K03k25K62j32j6L7
6574hJ7J01k2L3j46Q1J78m1l94K63j70n5Q6J20k24J65Q3k4J00J7L0j43J04j29
6598B2O9P0j32j9M1m7K8q8p8mJ12j75K40m6J3J08j25J55j68K84j67q5l7l3L48
6623B86k22j95Q9K33l63K0j11R5J79O1j2j44j57J05N22m66P7k08K91p1j06K37
6645A40q5m8j60J31K59j11j28J34k60K49p7K5j41J35k10J75J86k67%M5K83j87
6667H8k2J6N5j93J0j41Q1k9j41J44K1l4J80j20J5N3k03K04J05l36J99q7p7L75
6691A63n1j04P3n2j71J80L0K5o1mK63k36o1O3j99L79m78L32j5j92qL11M2l11Q2
6716@l3J39j6K5k25L8K26l4k94J3N8K7K37k16K8K27j77o4J96m54O17l94J28O7
$$ plain form
6740 119 -155 -27 -255 221 141 80 -84 -237 50 -212 113 -19 0 319 307 135 48 -35 -134 -40 -82 -91 -3 -158
6764 -158 118 -96 -4 20 8 209 24 75 -159 -29 -44 306 -154 23 116 95 29 -307 -41 -9 -48 167 -137
6787 -137 186 131 77 153 -153 -145 9 -75 61 109 -283 42 0 45 132 14 159 -119 8 -17 33 122 -148 -219 -4
6812 -4 -74 88 -271 -126 55 64 -201 -112 50 -245 -47 -333 -160 94 -108 -25 -108 -150 -129 -41 -76 248 65 140
6836 140 41 140 28 -130 -87 202 -128 285 -271 126 68 -18 -72 -167 -249 36 -26 -50 -253 15 123 -176 117
6859 117 47 196 -22 22 11 75 -131 -92 -56 203 95 105 68 -11 53 148 -106 -153 89 216 53 -235 -51 -48 -104
6884 -104 -97 -57 -17 -6 -62 77 -18 205 200 85 -155 -145 -49 50 19 -20 -122 86 194 -135 -182 292 106 137 -89
6909 -89 125 168 -122 -82 -51 -79 72 -30 156 89 -231 -13 11 -99 72 -128 -25 172 18 -47 -66 -297 64
$$ packed form
6740A19k74J28k28M76q0o1j64j53K87k62L25j32J9L19j2j72q7q3r9R4m2rQ8j55
6764a58K76k14R2K4j2K01j85N1k34J30j5L50m60J77R3k1o6l36K66L2l9K15l04
6787a37L23n5n4P6l06QJ54q4J36M8l92L25m2M5Q7j18J45k78J27k5N0Q9k70p1K15
6812dp0J62l59J45J81Rk65Q9J62k95J98k86J73K54k02Q3q3m2K1Q8l5L24j83P5
6836A40r9R9j12j58M3K89l30M13n56L97n8q6n4r5q2K85o2k4k03K68J08k99K93
6859A17p0J49k18M4j1O4k06L9L6K59j08J0l7p9O4R5k54m7K42J27j63k88J84Ln6
6884a04PM0M0J1n6J39r5K23nj15k40J0R6R9l1l9j02K08J08l29m7M74j86L1k26
6909h9K14M3k90M0L1k8J51j02J86o7l20K18K4j10J71k00J03J97j54o5j9k31L61
$$ plain form
6932 64 91 17 14 -181 -27 35 -49 18 -70 -34 -170 -78 93 -143 148 -32 -18 92 130 -76 158 75 -23 -154 -61
6957 -61 -21 -5 20 151 11 36 -283 188 185 163 -345 -99 -45 31 44 10 -207 14 142 56 157 111 -197 114 136
6982 136 26 -64 -26 245 277 99 -166 226 111 -16 -41 1 -137 65 27 -49 -206 -313 57 88 -268 -21 -112
7005 -112 -232 95 153 -268 186 154 -227 -33 48 37 -63 59 65 141 -66 61 -146 260 58 142 36 3 -15
7028 -15 -60 -72 151 -90 158 -136 -33 48 113 50 35 6 2 72 -205 -40 -41 -137 384 -50 34 257 -169 -53 -26
7053 -26 -57 -109 61 218 -17 83 -224 168 71 -116 40 -167 272 -46 99 269 -73 36 -87 55 -141
7074 -141 -56 256 11 -73 -24 165 93 -159 104 -140 10 142 89 108 152 69 -206 -1 -23 -220 99 -24 -26 115
7098 115 111 -106 -60 149 26 199 -97 -1 1 -154 -31 -42 299 -115 -122 5 58 76 39 160 -223 205 -277 310
$$ packed form
6932F4K7p4lj95J54O2q4O7q8L6j36R2J71k36K91j80J4J10L8k06K34q3r8j31R3
6957f1M0J6K5J31j40K5l19M71lk2n08K46N4P6J3l4k17K21J28q6J01m6l08L11K2
6982A36j10r0L8K71L2j78k65L92j15j27k5M2j38K02l8p6j57j07L70L1l56K47r1
7005a12j20L27N8m21M54l2l81J94Q1j1j00J22OP6k07J27k07M06k02Q4j06l3j8
7028a5m5j2K23k41K48k94J03Q1O5o3j5k9mP0k77J65jr6N21m34Q4K23m26J16K7
7053b6l1n2J70J57k35J00l07L92r7j87J56k07M39l18J45J70l42J09j23J42j96
7074a41Q5L12k45q4M9J89p2k52K63k44J50J32n3J9M4q3k75K05k2j97L19j23kJ41
7098A15mk17M6K09j23J73k96R6Kj55J23j1L41m14pJ27N3J8l7J21l83M28m82N87
$$ plain form
7122 310 108 -233 61 26 -24 47 146 -177 94 -132 -132 46 186 -183 151 54 -3 80 79 -246 16 63 40 257
7146 257 -106 153 -110 -144 70 115 -75 25 -17 163 -100 36 -55 -94 -345 -46 -31 -197 144 -27 20 -157
7168 -157 80 201 27 6 10 -299 151 215 12 -76 14 -30 -310 218 -208 -106 216 -12 -103 -35 198 17 65
7191 65 -8 -10 -107 -145 -17 -307 -103 -17 134 76 -86 -249 56 -85 171 151 -170 133 -231 149 196 -53 -68 181
7215 181 -97 1 39 78 82 -61 5 39 -110 109 -37 134 208 23 -20 -186 -18 109 -267 -105 -56 249 -41
7238 -41 152 37 -217 -167 -142 239 9 -163 16 60 133 -156 165 182 84 -92 44 -172 -102 -56 99 190 -69
7261 -69 -44 -32 99 128 19 -132 -359 67 -24 19 212 -118 -162 -124 123 38 67 56 41 142 -42 289 54 -176
7285 -176 -115 80 -129 16 141 -169 102 -104 334 20 -175 -77 69 -18 29 -4 -45 -12 1 108 -63 52 28
$$ packed form
7122C10k02l41K94l5n0P1R9l23K71k26%J78J40l69L34r7n7Q3jl25K62M7k3K17
7146B57l63K59k63l4K14M5j90J00m2J80k63J36r1l9k51K99J5j66L41j71M7j77
7168a57K37J21j74k1Ml09M50O4k03q8R0m4k80N28m26J02L22k28r1O8K33j81M8
7191F5p3kr7l8J28k90K04Q6J51n8j62j63L05j41K56k0l21L03l64L80M7k49j5K49
7215A81k78R8L8L9Mj43O6L4j49K19j46J71P4j85m3j66J68J27l76J62M9L05k90
7238d1J93j15k54N0K5L81k30j72J79M4P3k89L21J7r8j76J36k16P0M6J55R1k59
7261f9K5J2J31K9j09j51k27M26r1M3J93l30m4L8K47q5K9j1j5J01j84L31k35k30
7285a76O1J95k09J45J25l10K71k06M38l14j95R8J46q7M7l3m1L3J3J07j71J15k4
$$ plain form
7308 28 226 -318 -148 -157 156 -127 -79 212 50 185 63 17 -60 8 -102 20 -261 222 -165 -9 -51 -70 -314
7331 -314 -20 83 19 359 259 20 96 53 34 -81 70 26 174 -89 0 -88 -51 46 -79 87 51 -182 -136 -76
7355 -76 122 -169 -275 18 -83 -238 -88 144 -18 98 355 -39 -52 78 179 208 -41 13 171 56 10 25
7377 25 117 -70 -50 -62 -280 96 213 -102 -236 207 -117 6 1 31 20 188 -178 -197 75 -111 -29 45 -214 -63
7401 -63 20 -14 -45 299 -12 -244 -46 36 132 -96 -35 -10 -85 -85 47 -186 -222 -35 123 236 -180 12 183 287
7425 287 8 -1 209 -68 -199 110 154 40 -71 122 -154 9 115 -180 104 -118 33 98 58 53 -30 -12 156
7448 156 164 13 186 80 385 -360 -149 30 60 73 100 -21 161 172 -9 -27 141 46 -54 -178 126 204 143
7471 143 -6 34 7 -85 -24 298 -2 121 78 -66 189 71 -50 64 24 102 -84 22 -46 -131 105 165 -47
$$ packed form
7308B8J98n44J70rL13k83M8K91j62J35j22m6p7O8j10J22k81M83l87J56m2j9k44
7331c14K94J03o4L40j00k39P6m3j9j15J51m4J48k63Q9q8L7R7j25J66l6k33M6O0
7355g6J98k91j06K93j01j55J50K32j62J16K57l94j3J30J01K9k49N4J58j15m6J5
7377B5R2j87K0j2k18L76J17l15j34M43l24J23nL0j1J68l66j9K72j86Q2P4k59J51
7401f3Q3l4l1L44l11k32J98Q2R6k28O1K5p5%J32k33l6J87J58J13m16J92J71J04
7425B87k79rK10k77j31L09M4j14j11J93k76J63J06k95K84k22J51O5m0nq3J8J68
7448A56Qj51J73j06L05p45K11J79L0J3K7j21J82J1j81j8J68r5j00j24L04P8o1
7471A43j49M0k7r2O1L22l00J23m3j44K55j18j21J14m0P8j86J06o8q5K36O0k12
$$ plain form
7494 -47 110 129 -255 152 57 258 111 61 124 9 21 52 39 155 77 52 65 -135 -131 104 -17 -243 5 103 -144
7519 -144 113 40 50 -35 -18 12 350 -152 -128 -203 -12 -165 -168 153 -11 75 -23 191 66 229 -90 101 122 124 -110
7544 -110 56 28 209 37 -1 193 84 -82 -92 17 165 -164 -328 7 108 101 214 100 16 -318 -10 -238
7566 -238 -347 -53 -33 -237 38 -103 -53 -135 -136 61 -14 50 51 191 -46 85 -9 -196 56 -73 100 -34 -122 -138
7590 -138 121 82 -67 -425 173 -128 -87 -40 -155 342 -56 218 184 -137 57 309 69 -90 203 4 130
7611 130 85 28 -12 401 105 212 -9 91 225 115 90 143 78 55 -55 -48 -167 -57 -8 82 86 -49 48 123 144
7636 144 53 0 182 11 -127 -83 -63 16 -211 228 167 50 149 -61 75 198 -168 -12 -132 89 62 30 -29
7659 -29 -255 174 157 144 83 -76 32 -192 60 45 23 99 -126 -43 178 189 8 26 -156 -35 85 -74 -142 147
$$ packed form
7494d7J57J9l84M07r5K01j47n0O3j15J2L1j3J16p8k5J3k00MK35j21k26K48R8k47
7519a44K57p3J0q5J7L0L38n02K4p5J91j53lL21j64Q6r8K14j25J63l19J91K1Kk34
7544a10J66k8J81j72l8J94j09j66j0J09J48l29j64L35J01pJ13j14q4l34L08k28
7566b38j09K94K0k04K75j41N0q2jJ97p5O4JJ40k37J31r4j87K52j29J73j34q8j6
7590a38K59l9j49l58N98l01M1M7j15M97l98K74l4l21J94K52k40j59K93j99J26
7611A30m5n7m0M13k96J07k21J00J34j10k5N3o5k3j10Pj19J10M9R0Mj35R7P5K1
7636A44r1n3J82j71j38M4K0P9k27M39o1j17R9k10J36J23l66J56j20K21k7l2n9
7659b9k26M29j7j3o1j59J08k24K52j5k2P6k25Q3K21J1j81J8j82J21J20j59o8K89
$$ plain form
7683 147 98 -8 6 187 78 16 -107 -154 16 38 23 -14 61 14 144 44 202 -103 -291 -234 9 -68 -25 4
7707 4 133 160 11 82 368 -78 157 -65 -17 141 252 71 -167 -171 -3 -75 -85 -42 376 -34 69 51 93 61
7731 61 -19 21 -93 146 -3 87 -178 155 199 -126 -55 9 -50 -210 122 -45 -115 -4 315 97 31 100 180 -53
7755 -53 -11 145 -174 89 221 -56 180 241 42 194 48 62 86 125 -185 106 -71 128 2 155 -42 -10
7777 -10 -248 -8 71 22 133 -232 86 -64 -74 97 -10 -229 352 45 -284 68 -195 71 -113 -209 -17 58
7799 58 -87 -119 -187 -58 -201 -92 98 -227 48 -33 33 -186 -130 -296 -134 271 350 -112 -217 -17 101 -94
7821 -94 -302 -227 -83 -13 -26 -58 -100 -214 -53 58 103 -37 64 38 144 -84 39 177 91 -13 -205 123 110
7844 110 -136 2 52 -76 25 -50 186 -201 -132 397 66 0 -16 -118 -131 172 -159 67 47 0 6 99 -142 -219
$$ packed form
7683A47m9j06J4J81j09o2j23m7J70K2j5l7P5m7J30j00J58l05j88N7K43p7M3K9
7707DJ29K7j49P1K86m46K35k22M8J58J11j81k38mJ68p2j0M3M18m10J03j8M2l2
7731F1q0M0j14K39j49R0k65L33M4l25P1O4n9j60L32j67p0J11L19k18o6O9Q0k33
7755e3M2J56l19K63J32k77K36O1j99J52j46J4K4L9l10K91j77J99j26J53j97L2
7777a0k38K40P9m9J11l65L18j50j0J71j07k19N81l07l29L52k63K66j84r6J92P5
7799E8j45l2o8J29j43J09J90l25K75q1O6k19N6j66J62M05P9m62j05K00J18j95
7821i4k08P5J44P0j3l2m2j14J61J11M5j40J01k6J06k28J23J38q6j04j92L28j3
7844A10k46J38N0j28J01p5K36l87O9N29l31o6j6j02j3L03l31K26k0m7OR3k41p7
$$ plain form
7868 -219 -136 18 -152 -55 -80 162 173 -230 -125 126 19 -43 -231 -76 27 178 81 295 -70 134 -138 41
7890 41 -54 144 111 -82 6 -233 8 34 13 -74 60 63 71 47 -94 -153 -100 -180 47 55 -22 37 -199 -104 -37 -56 -172
7917 -172 17 70 76 32 139 122 -67 141 25 -165 3 37 212 -52 -115 -201 -103 -73 136 150 50 -33 -83 -181 -53
7942 -53 88 -43 38 -24 -309 257 37 43 19 65 154 -138 124 7 28 1 -124 77 -198 -34 28 -84 -62 134
7966 134 188 62 -109 199 176 -210 77 1 -14 -201 -230 -66 62 202 69 -92 105 94 178 -35 229 136 -292
7989 -292 42 43 -56 27 232 -175 113 -94 -65 -125 -71 -116 172 -112 -39 -38 -140 90 188 -134 -143 108 73 -104 119
8014 119 147 160 -149 201 -10 -77 9 -37 71 -44 113 106 -12 141 139 -61 123 20 -22 390 -2 106 46 -105
8038 -105 -25 -302 -43 80 -60 -101 227 50 -27 103 15 126 -126 87 106 -177 65 104 31 -102 110 116 -177
$$ packed form
7868b19Q3J54j70R7k5K42J1m03J05K51j07o2j88J55J03J51r7K14l65K04k72J79
7890D1r5J98l3j93Q8k39K41K6k1q7J34LQk4j41n9N3q0K27Qp7N9k36R5O7j9j16
7917a72J89N3Om4J07j7j89K08j16j90J68L4J75k64o3q6R8L0K09J4j00q3n0r8J28
7942e3J41j31Q1o2k85N66k20Ok4M6Q9k92K62j17K1k7j25K01k75J64O2j12K2J96
7966A34N4j26j71L08k3l86K87p6j5j87k9J64J28J40j33j61J97j1Q4k13K64r3m28
7989b92L34Jr9Q3K05m07K88k07K9o0N4m5K88k84P3Jj02K30R8l22rK51l5j77K23
8014A19K8J3l09L50k11o7Q6m6J08j15J57pj18J53kk00J84j03m2M12l92J08o0j51
8038a05Q0k77K59J23j40m1L28j77p7J30q8J11k52K13J9k83K42L9p3j33K12Ok93
$$ plain form
8061 -177 -15 96 -8 -6 -107 341 205 275 45 -81 -188 -26 -257 -48 154 -24 -171 132 81 -108 -151 -81
8083 -81 62 -6 85 261 -87 -142 71 -98 20 -100 27 -62 -13 14 244 71 92 55 -70 -1 268 -282 124
8106 124 47 269 -49 -58 179 78 149 -65 -68 -3 -35 -27 41 -10 -1 46 175 -192 414 -42 62 -139 7 21 121
8131 121 40 151 13 215 -73 -145 313 -86 -108 153 -48 -34 -73 -259 -166 -30 -44 20 338 301 194 -119 159
8154 159 -8 86 -97 -159 101 113 188 36 11 54 -187 54 134 -148 -143 -89 -143 -9 137 195 -44 -13 74 190 64
8179 64 -354 -65 -126 100 231 3 53 149 40 -70 69 8
$$ packed form
8061a77J62J11j04Kj01M48j36P0k30j26j07J62k31K09K02j78j47L03n1j89m3P0
8083h1J43o8R1J76l48n5K13j69J18j20J27q9M9K7K30j73K1l7j25O9K69n50M06
8106A24p7K22l18rK37j01P1k14lO5l2QO8n1RM7J29l67O06m56J04k01J46J4J00
8131A21q1J11j38K02k88p2M58l99k2K61k01J4l9j86R3J36j4O4L18l7j07l13K78
8154A59j67R4j83o2K60J2P5j52k5M3k41K41Q0k82NN4n4J34J46N8k39L1Q7J16j26
8179F4m18K89o1K26J31k28N0R6j09j10J39o1
8191H
$$ Imaginary data points
##PAGE= N=2
##DATA TABLE= (X++(I..I)), XYDATA
$$ plain form
0 0 0 0 0 0 0 0 0 0 0 0 0 0 6 -8 8 -8 8 -16 16 -18 24 -26 32 -40 45 -50 61 -71 82 -93 107 -122 138 -155 177
35 177 -199 224 -249 279 -312 346 -385 427 -473 524 -579 640 -705 777 -855 942 -1039 1145
53 1145 -1263 1396 -1543 1713 -1911 2136 -2403 2723 -3117 3614 -4259 5141 -6425 8471 -12271
68 -12271 21774 -103044 -108827 44723 24576 89878 148330 97451 -30870 -65981 -79237 -96834
80 -96834 -79200 755 69496 123231 131003 94470 38549 -24029 -106791 -135599 -91776 -38195
92 -38195 474 67477 106983 62419 -2145 -29836 -71636 -106129 -69137 658 41417 77587
104 77587 108762 92888 38058 -9506 -52789 -89028 -82271 -37890 6957 50557 79049 64109
116 64109 19015 -29571 -75780 -96796 -74854 -31262 11945 61406 99296 89006 47625 11104
$$ packed form
0@%%%%%%%%%%%%Oj4J6j6J6k4L2l4M2n0N8p2Q5r5J11j32J53j75K00k29K60k93L32
35A77l76M23m73N28n91O58p31Q12r00R97j103J219j345J482j632J797j981K184
53A145k408K659k939L256l624M047m539N126n840O731p873R400j1566J4896k0742
68a2271L4045j24818n783J53550k0147O5302N8452n0879j28321l5111j3256j7597
80i6834J7634P9955O8741N3735P772l6533n5921o2578q2762k8808M3823N3581
92c8195L8669O7003L9506m4564o4564k7691m1800l4493L6992O9795M0759L6170
104G7587L1175j5874n4830m7564m3283l6239O757M4381M4847M3600K8492j4940
116F4109m5094m8586m6209k1016K1942M3592M3207M9461L7890j0290m1381l6521
$$ plain form
128 11104 -28551 -70399 -78153 -44612 1333 37386 61371 69135 46496 -3493 -53642 -77645
140 -77645 -75750 -59389 -22963 33852 71262 69370 53535 31624 -9898 -50342 -57349 -36871 -13102
153 -13102 14501 49599 64808 46134 10445 -24159 -50697 -67148 -62650 -28259 14895 39023
165 39023 47401 49739 31786 -7840 -38107 -39798 -33188 -21662 11313 47018 55838 42518 23221
178 23221 -4688 -39220 -59040 -51847 -29820 -3924 23048 43789 45356 26146 -2625 -25273
190 -25273 -38103 -41893 -26126 5959 33354 45195 46664 37068 8783 -25365 -42397 -43471 -36562
203 -36562 -16609 13632 34931 36484 24921 8467 -14078 -35904 -41234 -27001 -6283 14768
215 14768 33754 45937 38376 14130 -8236 -24031 -36434 -35510 -16570 7579 22580 28366 27493
$$ packed form
128A1104l9655m1848p754L3541M5945L6053K3985P764k2639m9989n0149k4003
140g7645J895J6361L6426N6815L7410j892j5835k1911m1522m0444p007K0478K3769
153a3102K7603L5098J5209j8674l5689l4604k6538j6451M498L4391M3154K4128
165C9023Q378K338j7953l9626l0267j691O610J1526L2975L5705Q820j3320j9297
178B3221k7909l4532j9820P193K2027K5896K6972K0741J567j9210k8771k2648
190b5273j2830l790J5767L2085K7395J1841J469r596k8285l4148j7032j074O909
203c6562J9953L0241K1299J553j1563j6454k2545k1826n330J4233K0718K1051
215A4768J8986J2183p561k4246k2366j5795j2403R24J8940K4149J5001N786q73
$$ plain form
228 27493 14347 -10329 -29576 -34014 -28859 -16747 3732 26573 38026 31992 18852 3655 -15749
241 -15749 -31022 -29691 -14692 1177 14097 26597 29743 15199 -5626 -19247 -28500 -32291 -22927
254 -22927 -1543 17246 25833 28585 24003 8191 -11544 -23032 -23432 -16577 -5482 11217 25608
267 25608 26611 16630 3759 -10228 -24531 -31453 -22926 -6942 6012 17310 26637 23302 8344
280 8344 -6757 -15249 -20526 -20238 -8180 9142 20214 22839 20450 11810 -4515 -20147 -25222 -21237
294 -21237 -13544 -1487 13667 22512 19275 9874 -113 -10859 -20532 -20250 -9223 3269 12777 20872
308 20872 23183 15047 -238 -11848 -18044 -20470 -16836 -4147 9433 15898 16080 12619 4092 -9651
322 -9651 -18404 -17432 -11345 -3396 7931 18355 21227 14274 4656 -4313 -13877 -18941 -14578 -4483 4902
$$ packed form
228B7493j3146k4676j9247m438N155J2112K0479K2841J1453o034j3140j5197j9404
241a5749j5273J331J4999J5869J2920J2500L146j4544k0825j3621r253l791R364
254b2927K1384J8789Q587K752m582j5812j9735j1488m00O855J1095J6699J4391
267B5608J003r981j2871j3987j4303o922Q527J5984J2954J1298R327l335j4958
280H344j5101q492n277K88J2058J7322J1072K625k389q640j6325j5632n075L985
294b1237P693J2057J5154Q845l237r401r987j0746r673K82J1027J2492R508Q095
308B0872K311q136j5285j1610o196k426L634J2689J3580O465J82l461q527j3743
322i651q753R72O087P949J1327J0424K872o953r618q969r564n064M363J0095R385
$$ plain form
337 4902 11297 15708 13813 3930 -7427 -13725 -15877 -14544 -7002 5209 15108 17190 14644 9406 -699
352 -699 -12108 -16322 -12668 -6412 453 9938 16266 13710 5452 -2236 -9842 -16450 -16709 -9307 1332
367 1332 8524 13511 15681 11367 1257 -7228 -11869 -12441 -9369 -2108 8178 13508 12238 8257 2357
382 2357 -6461 -14039 -14728 -9508 -3421 3305 11114 14416 9360 2867 -2856 -8498 -11880 -9699 -1960
397 -1960 5104 9523 11697 10465 4427 -4362 -10319 -11257 -10624 -6258 1582 9267 11173 8529 4840 -1032
413 -1032 -8168 -11835 -8988 -3548 1679 7918 12446 11486 5437 -1182 -6525 -10494 -11702 -7417 -15
428 -15 5706 8655 9368 7085 348 -6677 -9880 -9109 -6722 -1516 6167 10283 10021 7372 3035 -3216
444 -3216 -9021 -9903 -6828 -2609 2426 7142 9176 6892 1429 -3554 -6955 -8963 -8002 -2964 3639 7142
$$ packed form
337D902O395M411j895r883j1357o298k152J333P542J2211R899K082k546n238j0105
352f99j1409m214L654O256O865R485O328k556q258p688p606o608k59P402J0639
367A332P192M987K170m314j0110q485m641n72L072P261J0286N330j270l981n900
382B357q818p578o89N220O087O726P809L302n056o493n723n642l382K181P739
397a960P064M419K174j232o038q789n957r38O33M366P840P685J906k644l689n872
413a032p136l667K847N440N227O239M528r60o049o619n343l969j208M285P402
428a5N721K949P13k283o737p025l203P71K387N206P683M116k62k649m337o251
444c216n805q82L075M219N035M716K034k284n463m983l401k008R61N038O603L503
$$ plain form
460 7142 8097 8121 4805 -2332 -6803 -7448 -6378 -4201 1300 6648 8114 6008 2951 -1245 -6373 -8749
476 -8749 -7722 -3648 980 4974 8295 8275 4447 -814 -4483 -6409 -7566 -4738 881 5349 6647 6946
492 6946 5429 547 -4784 -7822 -7405 -5673 -2154 3178 6978 7273 5163 1724 -2249 -6012 -7357 -4772
508 -4772 -1021 2403 5657 7676 5848 1550 -2702 -5290 -6671 -6236 -2827 1825 4340 5757 5307 3115
524 3115 -1018 -4778 -5758 -4787 -2574 964 4987 6767 5321 2498 -424 -3796 -6352 -5799 -2960 389
540 389 2947 5199 5716 3014 -709 -3610 -5222 -5360 -3589 209 3912 5660 5211 4101 1104 -2582
556 -2582 -5389 -5316 -3591 -1522 2090 5070 5326 2984 959 -1626 -4873 -5817 -4255 -1019 1791 4093
572 4093 5655 4856 1823 -1461 -3529 -4515 -4216 -2314 1355 3988 4123 3570 2471 -583 -4298 -5068 -4016
$$ packed form
460G142R55K4l316p137m471o45J070K177N501N348J466k106l057m196n128k376
476h749J027M074M628L994L321k0l828n261l669j926j157K828N619M468J298K99
492F946j517m882n331l038M17J732L519N332L800K95k110l439l973l763j345K585
508d772L751L424L254K019j828m298m252k588j381M35L409M652K515J417m50k192
524C115m133l760r80R71K213L538M023J780j446k823k922l372k556N53K839L349
540C89K558K252N17k702l723k901j612j38J771L798L703J748m49j110k997l686
556b582k807P3J725K069L612K980K56k342k025k585l247r44J562L236K810K302
572D093J562p99l033l284k068r86K99J902L669K633J35n53j099l054l715p70J052
$$ plain form
589 -4016 -2367 -115 3157 5179 4068 2154 183 -2281 -4060 -4204 -2297 167 2712 3563 4335 2667
605 2667 -212 -2853 -3828 -4320 -3240 -751 2637 3886 3537 3025 1329 -1692 -3658 -3720 -2254 -634 1666
622 1666 3610 4279 2654 638 -1244 -3403 -4093 -3190 -902 1005 2690 3695 3325 1673 -1304 -2763
638 -2763 -3177 -2908 -1580 1064 3142 3490 2974 1868 -318 -2677 -3741 -3012 -1477 -180 2202 3375
654 3375 3003 1254 -136 -1869 -3119 -3102 -1759 167 1963 2922 3215 2331 -5 -2011 -2822 -2765 -2252 -374
672 -374 1509 2866 2664 1943 397 -1237 -2996 -2880 -2074 -347 1073 2706 3113 2204 267 -796 -2066
689 -2066 -2776 -2422 -531 1156 1945 2331 2213 555 -1108 -2350 -2453 -2224 -1268 493 2165 2715 1904 1308
707 1308 -8 -2016 -2695 -1973 -863 284 1721 2658 2434 851 -418 -1475 -2515 -2461 -1724 358 1539
$$ packed form
589d016J649K252L272K022j111j914j971k464j779j44J907K464K545Q51P72j668
605B667k879k641r75m92J080K489L388J249l49n12j696l021j966o2J466J620K300
622A666J944O69j625k016j882k159o90R03K288J907J685J005l70j652k977j459
638b763m14K69J328K644K078L48n16j106k186k359j064P29J535J297K382J173
654C375l72j749j390j733j250J7J343J926J796R59K93q84k336k006q11N7N13J878
672c74J883J357k02p21j546j634j759J16Q06J727J420J633M07r09j937j063j270
689b066p10L54J891J687P89L86j18j658j663j242j03K29R56J761J672N50q11n96
707A308j316k008o79P22J110J147J437R37k24j583j269j057j040N4P37K082J181
$$ plain form
724 1539 2185 2304 1672 324 -1516 -2048 -2008 -1382 -263 1449 2287 2161 1337 327 -961 -2286 -2340 -1675
742 -1675 -304 828 1555 2010 1407 343 -927 -1577 -1890 -1721 -470 831 1927 2183 1602 998 -752
759 -752 -1690 -2019 -1561 -847 365 1532 1893 1305 981 -390 -1473 -2220 -1641 -553 624 1261 2106 1912
777 1912 906 -334 -1247 -1673 -2170 -1213 437 1299 1662 1588 908 18 -1036 -1763 -1499 -1017 -312 982 1766
796 1766 1530 803 39 -723 -1259 -1830 -1072 -202 791 1279 1736 1156 303 -674 -1279 -1800 -1217 -113 656 1444
816 1444 1656 1004 838 -488 -1286 -1197 -1022 -555 470 1276 1527 1297 629 -308 -1283 -1494 -1174 -426 283 825
836 825 1529 1459 676 -192 -1040 -1190 -1155 -642 -13 1122 1328 952 770 -35 -875 -1253 -1012 -698 -149 701 1264
857 1264 1295 562 125 -517 -955 -999 -809 -87 586 1019 1300 901 175 -328 -933 -1016 -942 -222 404 789 946
$$ packed form
724A539O46J19o32j348j840n32M0O26J119J712Q38j26q24j010j288j325n4O65
742a675J371J132P27M55o03j064j270o50l13J69J251J301J096K56n81o04j750
759g52r38l29M58P14J212J167L61n88l24j371j083p47N79J088J177O37Q45j94
777A912j006j240r13m26m97R57J650Q62L63p4o80q90j054p27K64M82P05J294P84
796A766k36p27p64p62n36n71P58Q70R93M88M57n80q53r77o05n21N83J104P69P88
816A444K12o52j66j326p98Q9J75M67J025Q06K51k30o68r37r75k11L20P48P09N42
836H25P04p0p83q68q48j50L5N13O29J135K06l76j82q05q40l78K41L14N49Q50N63
857A264L1p33m37o42m38m4J90P22O73M33K81l99p26n03o05q3P4P20O26L85J57
$$ plain form
878 946 633 420 -255 -1244 -1011 -820 -618 108 740 1201 675 272 -352 -825 -1027 -1034 -401 335 530 680 971
899 971 546 -290 -650 -899 -949 -618 57 761 792 571 471 175 -512 -1294 -680 -469 -102 440 963 912 401
920 401 -117 -611 -828 -719 -775 -57 550 742 810 643 -281 -385 -568 -715 -957 -178 234 799 855 407 354 -448
942 -448 -651 -793 -537 -152 -10 497 851 593 243 -329 -432 -936 -736 -306 134 674 653 788 405 -114 -499
963 -499 -865 -608 -210 102 682 643 544 320 -76 -403 -809 -658 -352 108 310 659 827 470 -156 -379 -564
984 -564 -736 -429 -26 489 571 644 350 172 -418 -560 -499 -345 -91 74 563 561 520 -141 -98 -369 -542 -586 -68
1007 -68 -215 330 685 293 159 -65 -385 -705 -485 -20 33 440 463 342 272 128 -254 -276 -504 -605 -90 357
1029 357 493 365 187 -199 -301 -638 -614 -165 71 368 515 467 520 49 77 -484 -570 -185 93 -119 341 394
$$ packed form
878I46l13k13o75r89K33J91K02P26O32M61n26m03o24m73k02pO33P36J95J50K91
899I71m25q36l60k49n0L31O75P04L1k21j00k96o87p82O14K11L67N42N23n1n11
920D01n18m94k17J09n6P18O07J92O8j67r24j04j83j47k42P79M12N65N6m48n3q02
942d48k03j42K56L85J42N07L54k58l50n72j03n04K00M30M40N40k1J35l83n19l85
963d99l66K57L98L12N80l9r9k24l96l27m06J51L06M60K02L49J68l57o26k23j85
984e64j72L07M03N15Q2P3k94j78n90j42O1J54K54J65M89km1o61M3k71j73m4N18
1007f8j47N45L55l92j34k24l20l20K20M65N3M07K3j21p0j44l82k2k28j01N15M47
1029C57J36j28j78l86j02l37K4M49K36K97J47m8N3m71K8n61q6L85K78k12M60N3
$$ plain form
1051 394 353 165 142 -467 -515 -302 -56 105 404 527 488 138 -68 -441 -396 -284 -175 69 76 546 380 215
1073 215 -201 -447 -508 -184 -237 -55 247 412 219 194 -22 -103 -172 -64 69 87 351 495 377 41 -41 -257
1095 -257 -248 -447 -210 -148 91 -56 434 57 -134 -387 -202 -395 -342 20 177 426 45 213 179 -127 -427 -214
1117 -214 166 -76 -115 -55 70 363 130 -182 -91 -97 -157 41 180 -54 152 209 -30 -191 -382 -229 -141 -126 -37
1140 -37 250 541 60 29 -8 -249 -195 -149 104 231 101 202 202 114 -132 -45 -205 -169 -97 255 93 207 148 64
1164 64 -27 -274 -348 -66 -45 17 9 52 300 -62 -126 14 -229 -248 -123 -177 199 5 503 306 -5 42 -163 168
1188 168 -14 -82 148 221 103 -10 -83 -53 -79 -237 -149 54 1 302 352 181 220 -174 22 -68 -25 81 65 133
1212 133 12 46 -130 48 -187 58 -326 74 93 144 25 174 185 -79 -64 -171 -170 -68 -152 55 227 -24 136
$$ packed form
1051C94m1j88k3o09m8K13K46J61K99J23l9l50k06l73M5J12J09K44PM70j66j65
1073B15m16k46o1L24n3J82L02J65j93k5k16q1o9J08J33J8K64J44j18l36q2k16
1095b57Rj99K37O2K39j47M90l77j91k53J85j93N3L62J57K49l81J68l4l06l00K13
1117b14L80k42l9O0J25K93k33l12R1oo0J98J39k34K06N7k39j61j91J53Q8J5Q9
1140c7K87K91m81l1l7k41N4M6K53J27j30J01%q8k46Q7j60L6P2L52j62J14n9q4
1164F4r1k47p4K82K1O2qM3K48l62o4J40k43j9J25n4L76j94M98j97l11M7k05L31
1188A68j82o8K30P3j18j13p3L0k6j58Q8K03n3L01N0j71L9l94J96r0M3J06j6O8
1212A33j21L4j76J78k35K45l84M00J9N1j19J49J1k64J5j07JJ02q4K07J72k51J60
$$ plain form
1235 136 -75 -67 -18 -178 -31 155 85 72 27 31 69 -50 -187 -175 -190 42 -32 157 278 170 187 1 -322 -228 -145
1260 -145 -98 218 204 266 26 223 -176 -271 212 -210 -101 262 -165 97 118 5 -63 -31 -275 -115 -64 -87 102
1283 102 -71 -23 123 101 191 17 -133 -126 -35 -164 308 204 58 -152 -66 -244 -132 76 -268 30 -161 177
1305 177 105 179 110 -333 -116 -118 92 20 106 38 148 78 284 -239 -470 -224 132 -128 49 151 -93 36 -49
1328 -49 -170 -141 -92 144 26 195 100 90 59 -286 -15 67 -8 15 8 5 70 176 168 75 1 -194 -255 -313 50 -5 33
1355 33 85 -27 -50 120 111 -93 -110 -117 -141 91 48 18 -57 -160 -121 74 45 -83 -66 -4 -136 91 253 71 -207
1380 -207 -98 -31 23 -85 100 0 -13 102 11 -199 -113 -63 182 -16 340 115 204 -7 -154 -229 87 -252 -129
1403 -129 367 113 172 -49 -41 -93 76 179 -170 -60 -16 -85 77 95 -6 153 -179 -167 147 24 23 -139 8
$$ packed form
1235A36k11QM9j60J47J86p0j3m5ML8j19j37J2j5K32p4J89J21j08J7j86l23R4Q3
1260a45M7L16j4O2k40J97l99r5M83m22J09L63m27K62K1j13o8L2k44J60N1k3J89
1283A02j73M8J46k2R0j74j50PR1j29M72j04j46k10Q6j78J12K08l44K98j91L38
1305A77p2P4o9m43K17kK10p2Q6o8J10p0K06n23k31K46L56k60J77J02k44J29q5
1328d9j21K9M9K36j18J69r5j0l1l45K71Q2p5K3plO5J06qr3p4j95o1n8L63n5L8
1355C3N2j12k3J70rk04j7pk4K32m3l0p5j03L9J95k9j28J7O2j32K27J62j82k78
1380b07J09O7N4j08J85j00j3J15r1k10Q6N0K45j98L56k25Q9k11j47p5L16l39J23
1403a29M96k54N9k21Qn2J69J03l49J10M4o9J62J8j01J59l32J2L14j23jj62J47
$$ plain form
1426 8 62 243 222 -59 -35 -134 7 -227 -88 207 124 144 -184 47 -84 -118 59 171 -126 -163 -70 -68 28 -72 -210
1451 -210 -75 210 138 121 6 -240 224 -9 -98 209 -218 -53 -112 -35 -47 81 -98 207 238 -44 -247 -31
1473 -31 58 33 28 -281 146 -17 -3 31 -126 19 168 -237 -9 161 -271 -58 -34 -97 -216 167 -229 74 0
1496 0 57 135 26 -9 -86 -146 -46 29 101 -54 176 306 176 76 -240 166 -113 -22 114 168 25 87 85 39 5
1521 5 79 -229 -39 -7 167 -133 160 -47 -125 252 -189 92 -195 167 -125 94 68 234 169 236 -66 80 -32
1544 -32 -46 28 -1 135 5 76 -298 -168 156 -35 -61 -172 16 66 316 -158 234 169 -3 -56 -231 -49 -79
1567 -79 226 -42 104 18 -120 47 -94 20 -82 66 130 34 39 -85 -7 90 -17 120 -124 53 249 10 106
1590 106 -110 140 54 -142 -163 14 -70 -83 136 194 48 66 7 -204 -49 72 86 165 -26 -33 286 -2 -157 7
$$ packed form
1426HN4J81k1k81K4r9J41k34J39K95q3K0l28K31j31l4J77J12k97l7R3KR6j00j38
1451b10J35K85p2j7j15k46M64k33q9L07m27J65n9P7j2J28j79L05L1k82k03K16
1473c1Q9k5nl09M27j63J4L4j57J45J49m05K28J70m32K13K4o3j19L83l96L03p4
1496@N7P8j09l5p7o0J00P5P2j55K30J30j30j00l16M06k79R1J36N4j43O2km6l4
1521EP4l08J90L2J74l00K93k07p8L77m41K81k87L62k92K19k6J66o5O7l02J46j12
1544c2j4P4k9J36j30P1l74J30L24j91k6j11J88N0K50m74L92o5j72n3j75J82l0
1567g9L05k68J46q6j38J67j41J14j02J48O4r6Nj24P8R7j07J37k44J77J96k39R6
1590A06k16K50q6j96k1J77q4j3K19N8j46J8n9k11J55J21J4P9j91pL19k88j55J64
$$ plain form
1614 7 52 20 175 -153 81 -255 83 -87 -165 -124 -34 -74 -172 53 -222 213 -30 131 -13 225 -64 -80 268
1637 268 99 140 249 172 68 -325 -256 -228 -95 -52 -104 -48 171 1 -222 -47 211 -175 -10 81 31 51 8 -31
1661 -31 37 76 151 -67 -164 -43 66 104 32 35 -289 -118 -53 150 3 100 -211 -81 131 30 164 134 -62 7
1685 7 132 -66 -9 39 -58 14 160 -27 103 -74 97 -254 218 61 13 264 45 -120 -31 -46 -7 -53 -156 107
1709 107 125 67 120 136 -108 -122 30 0 60 -99 54 -27 -13 -166 -280 -244 118 -88 25 -64 236 65 30 50
1733 50 180 9 46 -10 41 353 97 190 404 -51 51 -49 -226 6 71 6 25 131 -100 54 -82 20 -91
1756 -91 -187 3 218 -223 -157 118 120 -81 -104 -354 -222 -113 -155 -66 356 45 127 172 -143 102 62 70 -113 247
1780 247 269 -16 181 39 -118 91 29 183 15 240 73 144 233 170 -222 -284 -216 106 16 38 66 83 155 115
$$ packed form
1614GM5l2J55l28K34l36L38j70p8M1R0m0r8K25k75M35k43J61j44K38k89j6L48
1637B68j69M1J09p7j04l93O9K8J33M3n2N6K19j70k23J75K58l86J65R1n0K0m3l9
1661c1O8L9P5k18r7J21J09L8p2Ll24J71O5K03j47R7l11J30K12j01J34l0j96O9
1685GJ25j98N7M8r7P2J46j87J30j77J71l51M72j57m8K51k19j65Q9j5L9m6j03K63
1709A07J8n8N3J6k44j4J52l0O0j59J53q1J4j53j14L6L62k06J13q9L00j71l5K0
1733E0J30j71L7n6N1L12k56R3K14m55J02j00j77K32O5o5J9J06k31J54j36J02j11
1756i1r6J90K15m41O6K75Kk01k3k50J32J09m2Q9M22l11Q2M5l15K45m0Qj83L60
1780B47K2k85J97j42j57K09o2J54j68K25j67P1Q9o3l92o2O8L22r0K2K8J7P2m0
$$ plain form
1804 115 -73 117 25 165 82 75 -16 23 74 22 23 129 117 95 -37 -6 148 -20 -128 41 180 -376 -328 -277 97
1829 97 220 -189 -122 -161 -332 24 -108 -92 -33 -57 31 -157 95 236 -83 -90 137 -96 -273 -228 -161 -178 123 54
1853 54 115 83 81 86 38 51 200 -26 246 55 12 69 -5 161 -82 -160 161 171 182 123 171 10 110 -82 110 -4
1879 -4 140 126 35 -18 -169 -9 53 189 28 -157 -62 -197 107 86 87 -126 -34 -71 -54 -47 -130 -228 -256 71 -81 178
1905 178 -200 -7 -134 -240 3 60 -88 -180 28 24 -71 84 -34 -357 -247 -44 -8 77 -3 -152 -267 -19 -168
1928 -168 26 -178 44 160 58 155 -63 -121 133 -99 221 -30 37 -70 25 -122 137 139 -116 77 -190 -34
1950 -34 66 2 -21 -72 218 39 -11 -4 -80 -158 -97 129 -151 219 -5 52 -114 -147 -9 -19 -81 -74 -35 -163 -112 -2
1976 -2 128 -109 86 174 163 23 -81 215 -30 97 42 4 -190 7 73 -40 -63 -87 119 -25 68 -216 -50
$$ packed form
1804A15j88J90r2J40q3pr1L9N1n2JJ06j2k2j32L1J54j68j08J69J39n56M8N1L74
1829I7J23m09O7l9j71L56j32J6N9k4Q8j88K52J41l19pK27k33j77M5O7j7L01o9
1853E4O1l2kNm8J3J49k26K72j91m3N7p4J66k43p8L21J0J1n9M8j61J00j92J92j14
1879dJ44j4r1n3j51J60O2J36j61j85R5j35L04k1Jk13R2l7J7Pq3r8k8L27j52K59
1905A78l78J93j27j06K43N7j48r2K08mr5J55j18l23J10K03L6Q5q0j49j15K48j49
1928a68J94k04K22J16j02R7k18n8K54k32L20k51O7j07R5j47K59Kk55J93k67J56
1950c4J00o4k3n1K90j79n0Pp6p8O1K26k80L70k24N7j66l3J38j0o2PL9j28N1J10
1976bJ30k37J95Q8j1j40j04K96k45J27n5l8j94J97O6j13k3k4K06j44R3k84J66
$$ plain form
1999 -50 77 -23 114 -39 -127 -53 54 227 -51 -85 -127 -177 82 180 52 80 68 87 83 -68 -126 304 68 54 36
2024 36 -34 124 -131 148 -1 -3 -144 90 -133 32 -65 108 138 -154 -5 27 -62 17 121 -72 183 -194 167
2047 167 9 0 -55 -93 -95 11 117 83 132 15 -280 -304 29 -3 -179 -201 -51 -95 26 37 133 81 -77 37 -130
2072 -130 134 153 49 -89 8 -25 -163 -13 -290 128 -138 44 43 0 -7 -209 203 -18 146 -118 120 -166 10
2095 10 -124 -87 190 142 -126 170 135 -103 123 247 -219 -17 32 -119 -115 29 -24 -266 155 -244 146 -38 308
2118 308 239 74 -140 114 137 181 -140 -56 -27 20 -222 165 -113 225 167 -4 35 49 -54 -32 68 -118 -117 183
2142 183 -213 206 45 -143 362 -59 77 -220 5 -19 -65 -9 -8 -96 372 -143 -139 -293 72 5 97 15 -264 -43
2166 -43 -154 -5 69 -10 158 42 -151 48 85 -332 101 143 -32 -179 -265 58 121 -50 -72 -171 186 -205 263
$$ packed form
1999e0J27j00J37j53q8P4J07J73k78l4m2n0K59R8j28K8j2J9mj51n8M30k36j4j8
2024C6p0J58k55K79j49kj41K34k23J65r7J73L0k92J49L2q9P9J04j93K55l77L61
2047A67j58rn5l8kJ06J06l4M9j17k95k4L33l2j76k2J50m4J21J1R6n2j58J14j67
2072a30K64J9j04j38R7l3j38J50k77M18k66J82jm3pk02M12k21J64k64K38k86J76
2095A0j34L7K77m8k68K96l5k38K26J24m66K02M9j51MJ44n3k42M21l99L90j84L46
2118C08o9j65k14K54K3M4l21Q4K9M7k42L87k78L38n8j71L9J4j03K2J00j86JL00
2142A83l96M19j61j88N05m21J36k97K25k4m6N6Jq8M68n15Mj54L65o7R2q2k79K21
2166d3j11J49P4p9J68j16j93J99L7m17M33M2j75j47q6L23O3j71k2r9L57l91M68
$$ plain form
2189 263 38 -169 -80 115 74 -231 228 283 174 -26 -144 111 5 -173 100 163 -55 -117 -135 -92 -16 -209 -24
2212 -24 -97 -199 -193 -256 32 143 268 179 -118 -271 86 226 151 -160 -2 86 229 113 -94 -105 -205 -70 -97
2235 -97 -43 -67 -93 41 148 43 155 72 71 -280 -142 -144 9 98 226 -170 21 24 -213 -83 140 30 192 94
2259 94 45 82 -73 -100 -150 -94 -207 4 -61 -91 50 167 10 -44 -123 -66 -237 6 90 9 36 152 -245 -198 -101
2284 -101 -145 15 190 -132 -113 75 -233 -1 -286 -206 -43 75 172 67 33 4 73 -171 105 26 3 -4 69 111
2308 111 -41 -33 -105 108 239 -135 -166 -57 -92 -8 96 1 58 -89 -210 -139 109 -16 192 -63 14 -91 -59 116
2332 116 180 -37 -133 -144 -74 156 -180 215 -31 83 -201 -179 143 50 -290 -60 66 64 69 66 80 129 -41 -151 118
2357 118 107 107 -130 -24 -5 74 -140 -84 -29 246 -132 47 -90 -75 -101 40 204 -40 -46 -184 187 -249 -239 8
$$ packed form
2189B63k25k07Q9J95m1l05M59N5j09k00j18K55j06j78K73O3k18o2j8M3P6j93J85
2212b4p3j02Oo3K88J11J25q9k97j53L57J40p5l11J58Q8J43j16k07j1j00J35k7
2235i7N4k4k6J34J07j05J12q3jl51J38kJ53Q9J28l96J91Lk37J30K23j10J62r8
2259I4m9L7j55k7n0N6j13K11o5l0J41J17j57n4p9N7j71K43Q4q1K7J16l97M7R7
2284a01m4J60J75l22J9J88l08K32k85Q0J63J18R7j05l4k9O9k44K76p9k3pP3M2
2308A11j52Qp2K13J31l74l1J09l5Q4J04r5N7j47j21P1K48j25K08k55P7j05L2J75
2332A16O4k17r6j1P0K30l36L95k46J14k84K2L22r3l40K30J26kNlJ4M9j70j10K69
2357A18j1%k37J06J9P9k14N6N5K75l78J79j37J5k6J41J64k44oj38L71m36J0K47
$$ plain form
2381 8 38 20 8 200 16 180 -64 39 -233 35 3 -58 40 -148 -306 -51 -141 -141 220 72 -47 7 120 264
2405 264 -5 -215 -70 -170 -15 -96 43 269 -108 -88 -97 -38 -119 -143 155 351 409 -35 -117 -193 -57 29 232 -222
2429 -222 77 3 -152 -106 -43 -8 -92 -150 -260 326 -49 191 -83 56 -211 176 -36 44 184 121 -89 -39 147
2452 147 32 -19 -42 48 126 -103 20 -110 -254 -33 85 76 -12 -37 121 -196 -66 224 3 -100 163 228 -21
2475 -21 -76 58 -208 3 -105 286 -44 130 37 37 47 -244 -67 326 -15 -46 -51 43 94 -160 -93 112 -124 143
2499 143 106 -195 36 -146 34 -82 15 24 -43 47 168 144 108 132 143 -21 77 -104 222 -41 -87 153 -96 -102 55
2524 55 -52 39 -116 24 -114 54 298 -130 104 -166 25 -40 -85 56 -25 66 -109 -130 231 70 -37 195
2546 195 29 -165 -55 107 16 88 124 117 37 -35 -119 -110 116 -276 -94 -241 -54 -78 227 63 158 -50 -354 125
$$ packed form
2381HL0j8j2J92j84J64k44J03k72K68l2o1R8j88j58K55r0%L61j48j19N4J13J44
2405B64k69k10J45j00J55q1J39K26l77K0rN9q1k4K98J96N8m44q2p6J36Q6K03m54
2429b22K99p4j55M6O3L5q4n8j10N86l75K40k74J39k67L87k12Q0J40o3k10N0J86
2452A47j15n1k3R0P8k29J23j30j44K21J18rq8k5J58l17J30K90k21j03K63O5k49
2475b1n5J34k66K11j08L91l30J74r3%J0k91J77L93l41l1nR4N1k54O7K05k36K67
2499A43l7l01K31j82J80j16R7Ro7R0J21k4l6K4J1j64R8j81L26k63m6K40k49oJ57
2524E5j07R1j55J40j38J68K44m28K34k70J91o5m5J41q1R1j75k1L61j61j07K32
2546A95j66j94J10J62r1P2L6pq0p2q4RK26l92J82j47J87k4L05j64R5k08l04M79
$$ plain form
2570 125 -22 26 164 -62 52 -174 -182 6 -179 90 -129 -213 -109 65 91 -3 -30 150 -220 -33 -11 -44 -162
2593 -162 -182 -152 3 171 72 -298 -47 -22 38 123 54 -49 -53 31 232 -47 -291 84 23 -92 -201 -176 129 -47
2617 -47 55 -89 -180 69 -53 -17 -146 23 -291 186 99 4 90 91 105 88 -92 31 131 85 90 42 -130 -95 -37
2642 -37 286 74 32 -62 106 19 213 -67 -175 -111 50 -255 32 16 211 51 -24 -106 38 -163 33 67 -95
2665 -95 -39 -100 -49 -115 132 -77 65 -16 -191 38 -155 7 -162 242 99 -98 -89 -71 101 -144 -19 31 -68 26
2689 26 -46 28 -7 163 26 52 49 -87 66 -244 118 -2 25 204 209 194 63 -224 460 -187 85 118 221 -125
2713 -125 43 -15 -9 -209 128 150 -239 -113 -74 -14 -70 24 4 16 223 -68 80 -150 242 135 -223 -91 129
2736 129 140 56 125 40 62 -154 219 -246 -118 54 -67 136 92 56 186 -37 -176 214 194 70 -116 -167 161
$$ packed form
2570A25j47M8J38k26J14k26qJ88j85K69k19q4J04J74K6r4k7J80l70J87K2l3j18
2593a62k0L0J55J68r9l70K51K5O0Q5o9j03mQ4K01k79k44L75o1j15j09K5L05j76
2617d7J02j44r1K49j22L6j29J69l14M77q7r5Q6JJ4j7j80J23J00m6Nm8j72L5N8
2642c7L23k12m2r4J68q7J94k80j08O4J61l05K87j6J95j60p5q2J44k01J96L4j62
2665i5N6o1N1o6K47k09J42q1j75K29j93J62j69M04j43j97RJ8J72k45J25N0r9R4
2689B6p2P4l5J70j37K6lj36J53l10L62j20K7J79Nj5j31k87O84o47K72L3J03l46
2713a25J68n8Ok00L37K2l89J26L9O0n6R4k0J2K07k91J48k30L92j07l58J32K20
2736A29J1q4O9q5K2k16L73m65J28J72j21K03m4l6J30k23j39L90k0j24j86n1L28
$$ plain form
2759 161 133 36 -122 -213 -148 -11 60 27 -114 -79 233 41 -63 -67 -86 86 -15 -86 -89 29 4 -55 73 -86 53
2784 53 -133 81 -66 148 -188 -57 45 0 -44 124 49 65 106 -42 80 137 -2 -44 31 -123 45 295 264
2807 264 -87 -83 112 133 14 246 -39 171 -61 69 74 -173 -34 19 -38 198 -3 164 43 -1 -74 115 -23
2830 -23 22 -172 -40 223 -126 233 -74 -389 2 15 28 -86 32 86 -57 -49 -46 43 25 108 66 -123 -98 134 -152
2855 -152 -93 -78 209 -40 -190 -271 -34 -46 41 -111 174 -64 -41 -27 120 -276 -57 -162 -87 195 0 -97 -151
2878 -151 -71 79 155 -69 -36 16 -109 -115 41 -70 -114 -70 106 -226 -9 -38 63 -26 -62 47 -49 -48 134 -132 29
2903 29 47 -3 11 -207 135 -113 55 -2 -73 -131 -139 75 88 8 -7 113 27 -64 50 -70 -297 90 151 -79 120
2928 120 -3 354 -165 -108 84 -32 158 14 245 -382 216 -9 95 -4 192 14 44 -116 -47 -9 -78 -317
$$ packed form
2759A61k8r7j58r1O5J37P1l3j41L5L12j92j04mj9J72j01p1lJ18k5n9J28j59J39
2784E3j86K14j47K14l36J31J02m5m4J68p5J6M1j48J22N7j39m2P5j54J68K50l1
2807B64l51MJ95K1j19K32k85K10k32J30Nk47J39N3n7K36k01J67j21m4p3J89j38
2830b3M5j94J32K63l49L59l07l15L91J3J3j14J18N4j43QLQ9j8Q3m2j89K5K32k86
2855a52N9J5K87k49j50q1K37j2Q7j52K85k38K3J4J47l96K19j05P5K82j95r7n4
2878a51Q0J50P6k24L3N2j25oJ56j11m4M4J76l32K17k9J01q9l6J09r6JJ82k66J61
2903B9J8n0J4k18L42k48J68n7p1n8qK14J3q0j5J20q6r1J14j20k27L87O1k30J99
2928A20j23L57n19N7J92j16J90j44K31o27N98k25J04r9J96j78L0j60O9L8o9k39
$$ plain form
2950 -317 -118 -122 122 66 34 154 -204 -66 -72 80 -297 -44 64 84 -57 -178 -34 -75 -147 -164 21 -5 102 -76
2974 -76 36 -13 -150 130 154 70 -73 5 24 31 22 141 -69 56 -149 -153 120 -13 97 -9 224 -120 -31 48 -173
2999 -173 61 15 173 -35 -21 142 177 91 72 150 173 44 -11 -56 219 211 24 -24 20 -135 59 -133 140 69 94
3024 94 -34 -85 153 62 -169 55 -54 37 -22 261 131 193 247 -72 -151 6 192 -84 -83 134 -138 -59 56 -37
3048 -37 100 29 153 -60 209 -125 -159 124 43 -87 180 -78 10 -132 -43 -112 -32 -43 37 -95 90 84 -29 28
3072 28 142 -172 -85 129 -41 20 77 71 -210 103 120 -97 -160 -30 74 -86 7 41 231 -242 -103 -158 44 -13
3096 -13 72 171 -90 -10 2 -52 -152 99 -35 103 -255 80 -151 105 -158 -88 -27 -20 -40 22 119 255 33 -34 -20
3121 -20 32 171 -206 93 266 -165 -37 112 14 -55 -187 -224 -148 -44 -29 93 -151 -197 31 109 6 -7 178
$$ packed form
2950c17J99mK44n6l2J20l58J38oJ52l77K53J08K0j41j21J44m1p2j7J85k6J07j78
2974g6J12m9j37K80K4q4j43P8J9PrJ19k10J25k05mK73j33J10j06K33l44Q9P9k21
2999a73K34m6J58k08J4J63L5q6j9P8K3j29n5m5K75qj87m8M4j55J94j92K73p1K5
3024I4j28n1K38r1k31K24j09R1n9K83j30O2N4l19p9J57J86k76JK17k72P9J15r3
3048c7J37p1J24k13K69l34l4K83q1j30K67k58Q8j42Q9o9Q0j1Q0j32J85oj13N7
3072B8J14l14Q7K14j70O1N7ok81L13J7k17o3J30J04j60R3L4J90m73J39n5K02n7
3096a3Q5R9k61Q0J2n4j00K51j34J38l58L35k31K56k63P0O1Pk0O2R7J36k22o7J4
3121b0N2J39l77K99J73m31J28J49r8o9j32l7P6J04J5J22k44m6K28P8j03j3J85
$$ plain form
3144 178 -45 -287 -80 -68 -12 64 172 -3 -18 -50 97 174 38 80 -147 80 -33 93 2 -26 -121 -134 -201 -7
3168 -7 -345 -66 142 -34 3 96 77 134 -130 94 -99 -35 282 -13 -151 80 -352 -78 -125 59 144 46 302
3191 302 -57 -104 74 34 -89 -72 62 -44 38 -86 -33 -8 42 -38 -286 -41 -46 -60 -79 388 60 5 -125 69
3215 69 265 -45 -28 -25 -41 -46 -184 -20 -186 121 -357 3 -46 183 -119 -170 -283 161 31 49 6 21 -55 36 -115
3240 -115 -45 -58 -28 132 25 -170 -117 31 6 -59 -60 -13 150 -31 0 440 -134 -220 153 -5 -391 -24 317 -88
3264 -88 -142 14 94 -263 -199 27 153 170 54 -59 -31 -22 60 36 -142 -54 152 98 -99 -63 -57 -5 56 63 -88 215
3290 215 56 46 -106 38 151 -78 -56 -237 156 -118 25 -48 122 427 -127 -48 -11 0 134 208 -61 -203
3312 -203 -39 -134 83 -76 -85 -205 202 32 119 268 72 102 -154 73 42 -86 -159 106 -148 -93 134 118 59
$$ packed form
3144A78k23k42K07J2N6P6J08j75j5l2J47P7j36M2k27K27j13J26r1k8r5j3o7J94
3168gl38K79K08j76L7R3j9N7k64K24j93O4L17k95j38K31m32K74m7J84Q5r8K56
3191C02l59m7J78m0j23J7J34j06Q2j24N3K5N0q0k48K45nj4j9M67l28n5j30J94
3215F9J96l10J7Lj6nj38J64j66L07m78L60m9K29l02n1j13M44j30J8m3J5p6R1j51
3240a15P0j3L0J60j07j95N3J48k5o5jM7J63j81L1M40n74q6L73j58l86L67L41m05
3264h8n4J56Q0l57O4K26J26J7j16j13K8RQ2k4j78Q8K06n4j97L6ON2O1Pj51L03
3290B15j59j0j52J44J13k29K2j81L93k74J43p3J70L05n54P9L7J1J34P4k69j42
3312b03J64r5K17j59rj20M07j70Q7J49j96L0k56K27l1j28p3K65k54N5K27j6n9
$$ plain form
3335 59 8 82 -53 197 257 122 26 162 -5 201 123 -112 -63 -111 54 -136 3 -73 -274 -193 75 -1 90 -2
3359 -2 -146 102 39 153 -122 -211 114 -110 -41 -129 -29 67 195 87 138 -164 94 15 -24 -16 166 -123 23 43
3383 43 92 -52 -58 -63 77 -36 -147 -28 -180 390 60 79 131 -141 -41 52 -85 260 155 216 -86 27 -40 -79
3407 -79 -75 303 328 -98 19 201 -43 131 11 -3 90 17 -45 -141 -317 -131 40 -84 22 -64 -46 -52 -230 -151 184
3432 184 -140 31 171 37 66 -107 -66 -30 -189 -17 -75 26 123 -69 -41 -15 1 6 -52 13 219 27 -91 24
3456 24 306 -212 -62 187 20 -20 -17 -13 176 -218 -28 -97 113 -100 -208 162 -97 -194 -67 191 -102 -9 -218
3479 -218 120 130 33 55 118 -56 -171 54 221 109 -45 -108 19 183 12 -196 112 434 -123 16 9 123
3501 123 -84 -151 -104 33 -147 -141 -125 -66 -53 -113 -176 -24 -24 104 108 65 295 195 -50 141 -35 153 49 -31 137
$$ packed form
3335E9n1P4j35K50O0j35r6J36j67K06p8k35M9m8J65j90J39p6k01Q1K68p6R1r2
3359bj44K48o3J14k75q9L25k24O9q8J00R6J28j08N1l02K58p9l9QJ82k89J46K0
3383D3M9j44onJ40j13j11J19j52N70l30J9N2k72J00R3j37L45j05O1l02J13o7l9
3407g9ML78K5m26J17J82k44J74j20j4R3p3o2r6j76J86J71j24J06q6J8oj78P9L35
3432A84l24J71J40j34K9j73M1L6j59J72n8J01R7j92K8K6J6Nn8O5K06j92j18J15
3456B4K82n18J50K49j67m0LMJ89l94J90o9K10k13j08L70k59r7J27K58k93R3k09
3479b18L38J0r7K2O3j74j15K25J67j12j54o3J27J64j71k08L08L22n57J39pJ14
3501A23k07o7M7J37j80OJ6N9J3o0o3J52%J28Mm3K30j00k45J91j76J88j04q0J68
$$ plain form
3526 137 212 -26 -26 -263 -82 -2 67 76 6 -10 -72 -16 -90 -52 -97 26 -104 81 117 103 -155 -57 -63 -168 50 164
3552 164 34 -207 381 166 46 -95 179 24 -146 8 3 -32 122 42 -33 0 -106 -25 -121 44 192 -2 -76
3575 -76 -18 150 -252 55 -69 220 41 -166 10 252 -22 -216 -83 -81 -20 -141 150 51 -73 -96 130 -44
3597 -44 62 151 -154 21 -182 -38 103 -125 -34 183 -4 -226 69 250 -104 29 -161 -142 186 -117 -206 -86
3619 -86 90 212 -115 -76 160 -211 -186 -26 -61 -61 168 -8 28 -66 16 143 41 -86 249 21 157 -282 -84
3642 -84 47 -140 58 171 111 -69 171 -225 71 -83 98 50 -157 5 -134 30 31 219 29 197 73 -93
3664 -93 115 196 99 154 -46 73 -105 -72 139 -152 -127 84 65 30 -17 -9 -10 -87 53 139 39 11 111 84 -60 52
3690 52 187 -151 -152 -20 -79 -10 52 74 26 142 -221 185 -29 -13 55 200 -74 14 -142 53 -84 -69 468 -93
$$ packed form
3526A37P5k38%k37J81Q0O9Rp0j6o2N6p4L8m5J23j30J85L6j4k58R8oj05K18J14
3552A64j30k41N88k15j20j41K74j55j70J54nl5J54q0p5L3j06Q1r6J65J48j94p4
3575g6N8J68m02L07j24K89j79k07J76K42k74j94J33KO1j21K91r9j24k3K26j74
3597d4J06Q9l05J75k03J44J41k28R1K17j87k22K95J81l54J33j90J9L28l03q9J20
3619h6J76J22l27L9K36l71K5J60l5%K29j76L6r4Q2J27j02j27L35k28J36m39J98
3642h4J31j87J98J13o0j80K40l96K96j54J81m8k07J62j39J64JJ88j90J68j24j66
3664i3K08Q1r7N5k00J19j78L3K11k91K5K11j9l5m7Qjp7J40Q6j00k8J00k7j44J12
3690E2J35l38jJ32n9O9O2K2m8J16l63M06k14J6O8J45k74Q8j56J95j37J5N37n61
$$ plain form
3714 -93 -83 -36 178 -11 323 19 205 172 146 -142 -153 3 193 100 45 -60 292 -27 -146 30 9 236 147
3737 147 70 197 -48 130 114 100 52 15 13 141 -137 210 103 -48 -73 -89 -354 22 120 -24 -16 51 -12 -104 -68
3762 -68 -8 -160 89 -173 -48 -118 -33 -28 22 241 114 -120 -157 27 -111 -232 -62 205 144 -21 -142 -24 228
3785 228 162 -31 120 -173 228 -34 10 -168 30 17 180 -8 132 -160 67 7 -117 27 22 98 -59 88
3807 88 -5 301 -293 156 -121 -256 -126 61 -33 -28 -211 147 27 107 -193 -200 28 -48 -17 -112 85 75 -152 -95
3831 -95 -11 190 16 -46 131 -97 19 110 32 -219 165 35 147 144 193 157 -171 157 -255 56 137 46 35 182
3855 182 -62 -30 208 -62 -62 45 -144 130 -49 113 141 21 -66 -62 -28 14 130 123 -159 121 -79 43 -182 -35
3879 -35 -8 -15 241 -74 -101 -31 205 -52 13 50 15 -344 -29 -152 114 63 -143 -203 179 42 14 -154 -9 127
$$ packed form
3714i3J0M7K14j89L34l04J86l3k6k88j1J56J90r3n5j05L52l19j19J76k1K27q9
3737A47p7J27k45J78j6j4m8l7kJ28k78L47j07j51k5j6k65L76R8j44QO7o3r2L6
3762f8O0j52K49k62J25p0Q5NN0K19j27k34l7J84j38j21J70K67o1j65j21J18K52
3785B28o6j93J51k93M01k62M4j78J98j3J63j88J40k92K27o0j24J44nP6j57J47
3807H8r3L06n94M49k77j35J30J87r4Nj83L58j20Q0l00pK28p6L1r5J97j0k27N7
3831i5Q4K01j74o2J77k28J16R1p8k51L84j30J12lM9l6l28L28m12L11Q1r1j1J47
3855A82k44L2K38k70%J07j89K74j79J62K8j20q7ML4M2J16pk82K80k00J22k25J47
3879c5K7pK56l15k7P0K36k57O5L7l5l59L15j23K66n1k06o0L82j37k8j68J45J36
$$ plain form
3903 127 -146 117 131 68 -202 -8 -66 -83 74 -196 142 49 38 66 -101 -63 388 -33 138 -20 -97 118 78
3926 78 168 40 76 -185 154 148 -54 89 -81 96 -76 -92 -76 -96 -126 -79 26 -194 7 3 -101 -149 67 74 -30
3951 -30 67 -112 70 -132 31 -72 6 -217 -155 -83 63 197 -217 192 112 -98 -177 76 155 182 -115 -115 156 -68
3975 -68 16 8 -142 236 89 147 48 208 64 91 44 9 -4 19 -21 19 303 21 309 -2 -118 59 -34 -102 -191
4000 -191 -68 72 85 -77 73 -11 108 189 -154 -74 -121 -39 -250 119 137 90 -236 51 -78 93 41 12 42 195
4024 195 30 -278 -213 248 -31 -196 70 -79 161 138 119 -343 74 -117 45 18 -122 -20 20 -209 39 -74
4046 -74 137 319 -44 20 95 -139 -123 -148 116 -145 -70 66 -30 -27 7 -110 31 -61 -169 63 222 9 60 -188
4070 -188 100 241 77 103 -190 -127 -118 40 -92 54 100 118 -21 17 97 306 198 -26 -185 69 91 -63 22
$$ packed form
3903A27k73K63J4o3k70J94n8j7J57k70L38r3j1K8j67L8M51m21J71j58p7K15m0
3926G8R0j28L6k61L39ok02J43j70J77j72j6J6k0l0M7J05k20K01mj04m8K16Pj04
3951c0R7j79J82k02J63j03P8k23O2P2J46J34m14M09q0k10p9K53P9K7k97%K71k24
3975f8Q4qj50L78j47N8r9J60j44K7m7l5j3K3m0M0K84k82K88l11j16J77r3o8q9
4000a91J23J40J3j62J50q4J19Q1l43Q0m7Q2k11L69J8m7l26K87j29J71n2k9L0J53
4024A95j65l08O5M61k79j65K66j49K40k3j9m62M17j91J62k7j40J02M0k29K48j13
4046g4K11J82l63O4P5k34J6k5K64k61P5J36r6LL4j17J41r2j08K32J59k13N1k48
4070a88K88J41j64K6k93O3RJ58j32J46M6J8j39L8Q0K09j08k24j59K54K2j54Q5
$$ plain form
4093 22 112 -306 63 -64 195 -94 -6 115 -11 83 100 41 187 17 -15 -94 62 -50 -95 -111 53 -43 4 98
$$ packed form
4093B2R0m18L69j27K59k89Q8J21j26R4J7n9J46j70l2p9J56j12m5j6J64r6M7R4
$$ [...]
8191a15
##END NTUPLES=NMR FID
##END=
