##TITLE=1H_DE-30_acetone
 Acetone-d6
 8 sc, 
 31.7.2024
##JCAMPDX= 6.0         $$ Bruker NMR JCAMP-DX V2.0
##DATA TYPE= NMR FID
##DATA CLASS= NTUPLES
##ORIGIN= UXNMR, Bruker Analytische Messtechnik GmbH
##OWNER= root
$$ XWIN-NMR		Version 3.5
$$ Wed Jul 31 13:57:15 2024 Russian Standard Time (UT+4h)  she@DPX200
##.OBSERVE FREQUENCY= 200.1315
##.OBSERVE NUCLEUS= ^1H
##.DELAY= (6, 6)
##.ACQUISITION MODE= SIMULTANEOUS
##.ACQUISITION SCHEME= undefined
##.AVERAGES= 8
##.DIGITISER RES= 18
##SPECTROMETER/DATA SYSTEM= spect
##.PULSE SEQUENCE= zg30
##.SOLVENT NAME= DMSO
##.SHIFT REFERENCE= (INTERNAL, DMSO, 0, 15.7039)
##AUDIT TRAIL= $$ (NUMBER, WHEN, WHO, WHERE, WHAT)
$$ ##TITLE= Audit trail, XWIN-NMR		Version 3.5
$$ ##JCAMPDX= 5.01
$$ ##ORIGIN= Bruker BioSpin GmbH
$$ ##OWNER= she
$$ F:/spectra/data/she/nmr/H-F/1/audita.txt
$$ ##AUDIT TRAIL=  $$ (NUMBER, WHEN, WHO, WHERE, WHAT)
(   1,<2024-07-31 13:55:48.68 +0400>,<she>,<DPX200>,
      <created by zg, POWCHK disabled, PULCHK disabled
       configuration hash MD5:
       00 E9 B6 7A A2 85 ED C7 34 08 36 98 17 FE 4E 26
       data hash MD5: 16K
       76 D6 7D 61 A7 00 AE 25 88 29 7C 99 79 02 78 75>)
$$ ##END=
$$ 
$$ hash MD5
$$ 23 ED 2A 3C 7C 3C A4 56 24 2B D1 3F C3 C2 B7 4D
##$RELAX= 
##$RELAX= 
##$RELAX= 
##$RELAX= 
##$RELAX= 
##$RELAX= 
$$ Bruker specific parameters
$$ --------------------------
##$DU= <F:/spectra>
##$EXPNO= 1
##$NAME= <H-F>
##$PROCNO= 1
##$TYPE= <nmr>
##$USER= <she>
##$AMP= (0..31)
100 100 100 100 100 100 100 100 100 100 100 100 100 100 100 100 100 100 
100 100 100 100 100 100 100 100 100 100 100 100 100 100 
##$AQSEQ= 0
##$AQ_mod= 1
##$AUNM= <au_zg>
##$AUTOPOS= <>
##$BF1= 200.13
##$BF2= 200.13
##$BF3= 200.13
##$BF4= 200.13
##$BF5= 200.13
##$BF6= 200.13
##$BF7= 200.13
##$BF8= 200.13
##$BYTORDA= 1
##$CFDGTYP= 0
##$CFRGTYP= 5
##$CHEMSTR= <none>
##$CNST= (0..31)
1 1 145 1 1 1 1 1 1 1 1 1 1 1 1 1 1 1 1 1 1 1 1 1 1 1 1 1 1 1 1 1 
##$CPDPRG= <>
##$CPDPRG1= <>
##$CPDPRG2= <>
##$CPDPRG3= <>
##$CPDPRG4= <mlev>
##$CPDPRG5= <mlev>
##$CPDPRG6= <mlev>
##$CPDPRG7= <mlev>
##$CPDPRG8= <mlev>
##$CPDPRGB= <>
##$CPDPRGT= <>
##$D= (0..31)
0 1.2 0 0 0 0 0 0 0 0.06 0 0.03 0 0 0 0 0.0002 0 0 0 0 0 0 0 0 0 0 0 0 
0 0 0 
##$DATE= 1722419748
##$DBL= (0..7)
120 120 120 120 120 120 120 120 
##$DBP= (0..7)
150 150 150 150 150 150 150 150 
##$DBP07= 0
##$DBPNAM0= <>
##$DBPNAM1= <>
##$DBPNAM2= <>
##$DBPNAM3= <>
##$DBPNAM4= <>
##$DBPNAM5= <>
##$DBPNAM6= <>
##$DBPNAM7= <>
##$DBPOAL= (0..7)
0.5 0.5 0.5 0.5 0.5 0.5 0.5 0.5 
##$DBPOFFS= (0..7)
0 0 0 0 0 0 0 0 
##$DE= 6
##$DECBNUC= <off>
##$DECIM= 24
##$DECNUC= <off>
##$DECSTAT= 4
##$DIGMOD= 1
##$DIGTYP= 9
##$DL= (0..7)
0 120 120 120 120 120 120 120 
##$DP= (0..7)
150 150 150 150 150 150 150 150 
##$DP07= 0
##$DPNAME0= <>
##$DPNAME1= <>
##$DPNAME2= <>
##$DPNAME3= <>
##$DPNAME4= <>
##$DPNAME5= <>
##$DPNAME6= <>
##$DPNAME7= <>
##$DPOAL= (0..7)
0.5 0.5 0.5 0.5 0.5 0.5 0.5 0.5 
##$DPOFFS= (0..7)
0 0 0 0 0 0 0 0 
##$DQDMODE= 0
##$DR= 18
##$DS= 0
##$DSLIST= <SSSSSSSSSSSSSSS>
$$ [...]
##$SUBNAM2= <"">
##$SUBNAM3= <"">
##$SUBNAM4= <"">
##$SUBNAM5= <"">
##$SUBNAM6= <"">
##$SUBNAM7= <"">
##$SUBNAM8= <"">
##$SUBNAM9= <"">
##$SW= 24.0689530833862
##$SWIBOX= (0..15)
0 0 2 0 0 0 0 0 0 0 0 0 0 0 0 0 
##$SW_h= 4816.95568400771
##$TD= 16384
##$TD0= 1
##$TE= 0
##$TE2= 300
##$TE3= 300
##$TEG= 300
##$TL= (0..7)
0 120 120 120 120 120 120 120 
##$TP= (0..7)
150 150 150 150 150 150 150 150 
##$TP07= 0
##$TPNAME0= <>
##$TPNAME1= <>
##$TPNAME2= <>
##$TPNAME3= <>
##$TPNAME4= <>
##$TPNAME5= <>
##$TPNAME6= <>
##$TPNAME7= <>
##$TPOAL= (0..7)
0.5 0.5 0.5 0.5 0.5 0.5 0.5 0.5 
##$TPOFFS= (0..7)
0 0 0 0 0 0 0 0 
##$TUNHIN= 0
##$TUNHOUT= 0
##$TUNXOUT= 0
##$USERA1= <user>
##$USERA2= <user>
##$USERA3= <user>
##$USERA4= <user>
##$USERA5= <user>
##$V9= 5
##$VALIST= <valist>
##$VCLIST= <CCCCCCCCCCCCCCC>
##$VD= 0
##$VDLIST= <DDDDDDDDDDDDDDD>
##$VPLIST= <PPPPPPPPPPPPPPP>
##$VTLIST= <TTTTTTTTTTTTTTT>
##$WBST= 1024
##$WBSW= 4
##$XGAIN= (0..3)
0 0 0 0 
##$XL= 0
##$YL= 0
##$YMAX_a= 189185
##$YMIN_a= -89422
##$ZGOPTNS= <>
##$ZL1= 120
##$ZL2= 120
##$ZL3= 120
##$ZL4= 120
##$ABSF1= 10
##$ABSF2= 0
##$ABSG= 5
##$ABSL= 3
##$ALPHA= 0
##$AQORDER= 0
##$ASSFAC= 0
##$ASSFACI= 0
##$ASSFACX= 0
##$ASSWID= 0
##$AUNMP= <proc_1d>
##$AZFE= 0.1
##$AZFW= 0.1
##$BCFW= 1
##$BC_mod= 2
##$BYTORDP= 1
##$COROFFS= 0
##$CY= 11.3945322036743
##$DATMOD= 1
##$DC= 2
##$DFILT= <>
##$DTYPP= 0
##$F1P= 15.6554695791079
##$F2P= 12.8336369535428
##$FCOR= 0.5
##$FTSIZE= 0
##$FT_mod= 4
##$GAMMA= 1
##$GB= 0.15
##$INTBC= 1
##$INTSCL= 1
##$ISEN= 128
##$LB= 0.24
##$LEV0= 0
##$LPBIN= 0
##$MAXI= 10000
##$MC2= 0
##$MEAN= 0
##$ME_mod= 0
##$MI= 1.114404
##$NCOEF= 0
##$NC_proc= 0
##$NLEV= 6
##$NOISF1= 3.799351
##$NOISF2= 2.8
##$NSP= 1
##$NTH_PI= 0
##$NZP= 0
##$OFFSET= 15.70392
##$PC= 1
##$PHC0= -25639.63
##$PHC1= 15.18749
##$PH_mod= 1
##$PKNL= yes
##$PPARMOD= 0
##$PSCAL= 0
##$PSIGN= 0
##$REVERSE= no
##$SF= 200.130013532006
##$SI= 16384
##$SIGF1= 3
##$SIGF2= 2
##$SINO= 400
##$SIOLD= 16384
##$SREGLST= <1H.CDCl3>
##$SSB= 0
##$STSI= 0
##$STSR= 0
##$SW_p= 3612.71676300578
##$SYMM= 0
##$S_DEV= 0
##$TDeff= 0
##$TDoff= 0
##$TI= <>
##$TILT= no
##$TM1= 0
##$TM2= 0
##$TOPLEV= 0
##$USERP1= <user>
##$USERP2= <user>
##$USERP3= <user>
##$USERP4= <user>
##$USERP5= <user>
##$WDW= 1
##$XDIM= 8192
##$YMAX_p= 0
##$YMIN_p= 0
$$ End of Bruker specific parameters
$$ ---------------------------------
##NTUPLES= NMR FID
##VAR_NAME=  TIME,          FID/REAL,        FID/IMAG
##SYMBOL=    X,             R,               I
##VAR_TYPE=  INDEPENDENT,   DEPENDENT,       DEPENDENT
##VAR_FORM=  AFFN,          ASDF,            ASDF
##VAR_DIM=   8192,          8192,            8192
##UNITS=     SECONDS,       ARBITRARY UNITS, ARBITRARY UNITS
##FACTOR=    0.0002076,     1,               1
##FIRST=     0,             0,               0
##LAST=      1.7004516,     0,               0
##MIN=       0,             -89422,          0
##MAX=       1.7004516,     189185,          0
$$ Real data points
##PAGE= N=1
##DATA TABLE= (X++(R..R)), XYDATA
0 0 0 0 0 0 0 0 0 0 0 7 -7 7 -7 7 -8 14 -14 19 -21 26 -28 35 -41 48 -55 62 -69 81 -91 104 -115 132 -146
33 -146 165 -183 206 -227 253 -281 313 -345 382 -423 469 -519 574 -640 710 -794 886 -998 1130
52 1130 -1287 1485 -1737 2073 -2541 3249 -4453 7016 -27606 88895 116455 -24809 -10908
65 -10908 91946 72928 -66776 -89422 4126 48282 181 -1194 66329 104946 59726 4621
77 4621 -602 24335 16708 -16920 -10641 54639 86154 34708 -8140 35977 74069 16707 -47465
90 -47465 -9344 45553 6960 -45154 3366 70407 35488 -32438 -16139 23261 -15690 -72788
102 -72788 -50496 -2203 -13128 -39906 -11043 30753 12905 -39184 -55648 -36472 -30003 -46783
114 -46783 -48769 -10743 32873 27687 -16928 -32237 -2020 2223 -44914 -61413 -6455 36694 11657
127 11657 -10341 26785 48245 -442 -43016 -10318 31891 10865 -18021 14635 59391 42229
139 42229 -1036 3388 34692 30047 -5635 -14437 14849 35790 21633 2413 11910 31935 23030
152 23030 -9050 -17110 6703 13378 -14449 -25372 7746 29918 5296 -16639 2100 13670
164 13670 -18125 -42628 -17561 8883 -8055 -27281 -4921 20660 2159 -30357 -27085 -5771
176 -5771 -10259 -29656 -24661 1869 12548 -556 -11321 -3830 3081 -8515 -22422 -12930 8619
189 8619 9093 -6681 -1218 23929 24008 -6695 -17725 8029 20004 -5369 -17707 11982 34820
202 34820 13470 -8820 7430 25782 8608 -15576 -5673 17920 15284 -2472 503 19056 20732
215 20732 330 -10987 -91 9997 -652 -13294 -3288 14078 8980 -10333 -9487 8757 6389
228 6389 -17193 -21196 1226 9248 -10827 -19380 882 13081 -3745 -18005 -6153 5805 -5845
241 -5845 -18527 -8996 5576 1392 -9101 -3515 8608 4900 -10930 -14102 -932 5537 -3947 -8951
255 -8951 4000 17177 8721 -7204 -4596 8469 4185 -9857 -5729 13583 15900 350 -2470
268 -2470 11182 12225 -5069 -11488 4122 13435 2808 -5151 5052 13653 3802 -8642 -3226 7650
282 7650 4705 -5884 -4811 7006 8334 -4287 -9683 682 8633 166 -10153 -4399 5975 1021
296 1021 -11492 -8106 4877 4358 -7112 -5862 5527 3676 -10225 -12258 402 4896 -4472 -7674
310 -7674 3648 9957 -85 -10110 -5239 2267 40 -5689 -1646 7492 7787 -441 -4349 1095 3575
325 3575 -3246 -6342 1928 10231 5327 -3377 420 7528 2809 -7100 -3675 7478 6898 -2772 -2310
340 -2310 6515 6099 -4517 -6484 3787 6814 -217 -4510 1230 5078 114 -5351 -2328 3283 2765
355 2765 -1702 -2037 1570 1557 -4431 -6740 -662 4217 -360 -5163 413 5836 -237 -9113 -5806 3268
371 3268 2228 -4788 -2154 5863 4366 -4373 -5447 909 1130 -3627 -3124 3229 5372 409 -3105 -225
387 -225 1922 -340 -3544 -1019 3554 3930 165 -1707 1803 3160 -790 -3862 798 5295 2071 -2983
403 -2983 -568 4992 1719 -4381 -1992 4363 2986 -2190 -1697 2493 1457 -3216 -2709 2400 2383 -1318
419 -1318 -1713 1704 1893 -1836 -3669 -1503 1745 1607 -1218 -1555 712 1741 -1265 -4078 -1653 1507
435 1507 -525 -2267 -122 3338 595 -3793 -1718 1968 148 -3354 -1102 3765 2322 -2063 -1546
450 -1546 2116 1269 -1671 -1622 1625 1841 11 -788 365 1416 957 -1118 -800 1281 1951 -50 -1465
467 -1465 637 1934 330 -1743 437 2500 195 -2078 543 2711 -135 -3084 -538 2767 630
482 630 -2444 -913 1569 862 -1708 -1583 274 587 -544 -375 572 646 -185 -925 -967 -51 -180 -893 -1006
501 -1006 889 1460 -597 -1994 290 1553 -660 -2241 -106 1839 638 -1640 229 1952 420
516 420 -1868 -153 1404 685 -709 -77 1464 778 60 -3 237 -230 -59 162 464 695 565 -458 -738
535 -738 452 587 -804 -1184 714 1524 -162 -1435 117 990 -272 -1423 28 1040 -67 -1009 293
552 293 488 -979 -1133 25 1254 288 -785 31 288 265 -481 -696 -134 510 807 -137 -42 506 603 -626
572 -626 -1205 148 1469 -32 -425 505 1309 -47 -1453 254 672 -45 -459 435 755 -73 -219 246
590 246 256 -145 -183 269 496 784 51 -120 -734 -357 221 -358 -675 170 604 -30 -1043 -184 100 -496 -553
611 -553 470 606 -576 -480 642 231 -1234 -734 339 438 190 -122 149 293 -347 -456 -198 -286 -308 518
631 518 558 255 304 420 -351 -484 237 400 -117 -20 909 707 -383 -749 96 490 -484 184 877 715 -579
652 -579 -792 204 355 -185 -78 46 228 70 192 -312 -449 -172 99 245 -465 332 461 -50 -714 -179
672 -179 198 -689 -641 197 303 -514 -795 174 290 -827 -425 441 230 -213 213 436 -152 -669 -57 -32 75
693 75 127 515 425 9 -162 78 -136 -359 417 508 102 193 524 22 -678 -287 457 322 -611 -108 1085 533
715 533 -216 -248 -45 155 -227 -209 52 -171 -127 134 173 -429 -662 163 8 -174 216 -141 -32 -400 49 -147
737 -147 -500 -274 351 689 -155 -90 123 171 -417 -395 278 35 -363 -11 691 -355 -191 -26 506 324 -75
758 -75 633 220 241 88 195 142 222 86 403 228 161 -30 686 -19 -31 107 365 -119 -227 262 223 -130 -260
781 -260 0 -121 -52 -8 549 111 -518 -581 -3 -284 -328 -228 97 6 -446 -172 -123 -469 -308 291 154 -432
803 -432 62 96 100 -408 105 116 -109 0 503 130 54 -470 127 69 -252 -34 372 -41 -74 256 71 115 -388
826 -388 125 270 -73 -55 177 161 -27 153 253 3 -203 194 143 88 -40 111 136 -706 -201 142 308 -138
848 -138 34 426 -104 -242 -315 291 106 -64 162 156 -306 -252 298 -166 -307 -115 -10 137 -40 -149 -100 121
870 121 -320 80 142 294 54 226 -60 225 -301 32 293 0 -16 186 -198 -362 139 291 87 -367 -81
891 -81 315 -278 456 352 281 176 -9 10 144 -251 -120 -41 558 86 174 77 138 -141 -81 165 -151 -51 278
914 278 297 -150 -102 65 -114 -213 -165 -241 106 -203 -71 23 -14 -239 -272 133 2 -126 -442 147 45 130 8
937 8 21 -76 -83 199 -302 -9 153 112 -81 162 122 -133 -31 -127 78 -30 -158 -80 -41 76 -174 348 314 26
961 26 -228 -73 329 155 -161 -181 84 335 -96 30 -133 -154 -235 183 78 68 -261 -114 63 272 29 -88
983 -88 -186 -463 -126 -224 -237 306 27 -126 -381 -363 45 -272 -148 -254 199 -207 -187 -71 178 16 -115 306
1005 306 -56 -53 -276 52 -7 -119 284 96 44 -62 213 -47 -121 125 41 -108 -245 379 416 -2 21 -61 264
1028 264 -41 -144 102 -69 136 140 254 294 -21 -418 51 36 -92 -34 -131 46 -151 -131 -219 -274 -68 118 227
1051 227 57 134 -113 -196 -97 -115 115 80 95 -59 -133 183 -156 306 -207 -55 66 339 175 -236 -151 119 85
1074 85 -176 -126 35 -192 237 105 -94 89 174 19 -101 -273 -54 118 -125 27 16 43 -173 -153 193 164
1096 164 -111 -399 317 172 -19 99 100 161 -60 26 305 72 -173 -269 82 -111 131 -23 -147 273 181 -199
1118 -199 -52 -43 35 -115 24 183 -41 78 60 119 1 176 -437 218 63 77 -87 -344 166 47 -145 -59
1140 -59 287 39 -158 70 88 -22 131 325 79 24 85 70 186 177 175 -71 20 29 225 96 -249 99 -37 340
1164 340 -204 101 -81 177 144 -261 -36 206 13 18 230 -33 12 111 -45 333 153 58 23 -181 -275 39 251
1187 251 100 135 154 17 -214 -32 152 -300 -88 109 -69 158 -233 88 -218 -278 -276 41 -157 291 173 291
1209 291 95 51 209 -190 115 4 67 -45 -254 -244 86 54 -74 9 120 -22 -78 92 323 40 0 51 100
1232 100 -102 -254 -104 -231 285 -21 -80 41 -301 97 -219 129 -161 -91 -242 -21 -125 -202 9 -95 -91 -22
1254 -22 -125 -366 207 -221 154 -129 -64 -95 -130 -108 344 -183 -125 -223 -71 -176 -420 -100 84 111 -31 -134 -124
1277 -124 22 -28 331 -127 95 226 70 -277 -213 15 -49 19 -9 193 129 -242 -10 -149 -334 -171 1 52
1299 52 181 -144 50 -79 -327 124 84 132 -7 -100 -120 -109 -27 -16 28 250 -1 283 -100 -162 -229 180 -248 -243
1323 -243 -107 80 -156 -1 144 -60 -32 -157 -9 48 -46 -45 188 115 -197 -193 -87 48 -352 -315 91 56 50 -65
1347 -65 76 80 -27 155 -11 -63 36 -99 29 -193 -161 -90 -429 -89 54 164 248 -258 27 38 -412 -10 -212
1370 -212 99 -131 -25 -184 94 -163 -131 -22 -61 -31 -130 44 148 -228 -77 -182 -110 -81 -157 -72 -109 -131 -94 403
1394 403 462 -34 -179 179 -140 -284 75 -20 -98 43 70 -220 108 -240 -135 -99 -11 -150 -19 40 77 275 -100
1417 -100 44 180 98 -132 -235 -88 300 -148 -72 163 -12 -113 -216 208 38 0 42 28 -105 -70 242 -215
1439 -215 -310 -61 70 -38 215 -185 -88 -113 228 -50 133 -74 231 36 -203 -81 156 -240 -69 181 -22
1460 -22 325 -37 134 -38 -97 -17 275 -41 366 -18 -140 -133 51 57 -61 204 -100 -144 -93 50 -87 -44 -148
1483 -148 150 -111 18 -245 -67 -67 127 135 1 -13 -110 51 -312 230 -96 41 262 -237 19 216 -3 322
1505 322 234 -178 -54 183 162 -160 -198 68 56 134 71 32 -31 2 12 165 -91 -36 -81 -268 -212 -261 -106 66 -148
1530 -148 -128 54 24 -11 -215 -190 13 201 86 -405 -19 164 -85 -124 4 -155 268 -190 -229 430 -312 30
1552 30 153 -29 53 30 79 -142 118 21 -202 -58 -31 220 97 -228 43 -13 -43 -295 -95 40 78 -25 -6
1575 -6 -24 -129 -104 14 11 -62 15 135 -70 216 171 -173 39 -108 -139 136 11 121 -138 -99 -111 -386 -329 -114
1599 -114 178 -116 141 45 -18 12 -128 21 -232 84 -79 -4 -82 24 -201 267 -197 12 277 24 -311 -215
1621 -215 -33 233 -312 -77 -208 139 -60 -285 -206 101 362 141 170 -240 42 -59 245 -167 6 53 -130
1642 -130 -75 141 54 337 -68 280 146 -101 -80 32 8 -62 247 -289 210 -116 -155 -82 -269 27 -60 58 109
1665 109 -6 -172 84 -319 -297 -179 -126 -62 72 -29 -56 -152 20 -121 -118 -81 196 182 26 28 -111 120 -116 -339
1689 -339 66 11 -60 167 -62 -189 -270 -157 107 -172 52 108 -46 247 -113 -263 -233 230 31 275 61 111
1711 111 50 141 241 259 12 -283 -183 185 -67 -131 -281 -46 104 208 -154 -73 180 46 157 88 441 400
1733 400 124 0 54 129 -120 295 413 -31 -44 -17 42 269 -191 -174 347 171 152 35 -66 101 -23 -175
1755 -175 129 70 117 -50 -141 18 140 -16 115 227 154 19 132 57 81 170 -65 102 -129 59 55 -181 -196
1778 -196 138 360 -22 -266 156 146 70 57 28 360 -24 35 -24 207 124 -125 13 128 -94 63 35 -53 -103
1801 -103 -154 -277 -269 -149 -188 223 54 31 39 -41 -3 -43 -203 -30 -9 207 16 106 -201 -34 -116 -231 52 73 253
1826 253 -3 -131 -95 17 -7 -346 -8 27 36 -163 -151 58 141 66 13 215 -9 -67 181 184 -63 13 147 75 -209
1851 -209 46 -207 -69 -152 -97 -21 244 45 -118 38 135 47 -4 -244 -1 22 45 -475 11 -116 -182 -3 97
1874 97 -47 294 -144 -90 117 28 -235 -61 -141 -159 -86 262 43 281 -44 227 234 -202 -53 165 252 171 -7
1897 -7 80 269 116 -31 83 67 -292 -324 -135 -35 -129 -120 -61 99 -53 -118 71 366 -19 85 240 -2 38 258
1921 258 82 -435 145 191 62 -94 -124 67 73 -20 -252 -259 51 173 213 164 144 -265 -106 -126 37 -139 49 -102
1945 -102 59 -285 -72 87 -99 -293 93 -154 40 -191 26 93 -34 49 165 -113 -103 -110 -43 -117 -149 -276 121
1968 121 -183 -24 -121 129 176 -60 405 -20 123 -303 -108 -201 126 63 173 173 112 -302 -4 -133 97 207
1990 207 177 7 -95 1 75 -70 -118 314 -300 -97 -285 -99 49 2 170 156 -284 81 350 -19 115 42
2012 42 -134 -12 85 73 -73 106 -238 -66 234 -20 274 122 236 -137 -77 -244 -239 -5 -93 -157 -107 133 371
2035 371 217 209 -48 12 0 -8 -46 -158 178 15 52 151 -162 55 178 166 42 -59 -273 58 60 -97 109 266
2059 266 -188 251 -285 -68 136 -253 -130 76 213 -266 142 -96 253 5 -40 -68 -13 147 9 -108 -13
2080 -13 -90 -38 255 170 -55 42 -101 -65 -50 -137 -125 -173 -110 180 -1 -16 25 109 -239 234 -182 -51 -194 -222 -163
2105 -163 -265 -108 283 227 60 -225 182 -28 67 146 -177 150 -220 -312 -96 -129 -36 -173 33 -87 -214 81
2127 81 -336 143 208 -109 -35 -217 -4 89 22 151 -107 -213 -144 85 -199 -282 182 173 -135 90 -80 -165 -19
2150 -19 14 -83 -242 -230 -110 -124 94 110 122 38 -376 90 152 -26 -181 50 270 -133 122 -105 59 -55 -3
2173 -3 131 -122 -289 -18 -71 37 127 -33 299 229 -102 289 308 100 88 49 195 148 74 130 -50 131 3 60
2197 60 143 180 232 -256 120 -14 -148 175 22 -10 -5 122 -74 -130 -246 140 449 22 -119 -160 263 47 173
2220 173 55 35 52 152 -93 -147 33 124 57 78 405 16 60 -5 -90 98 334 -5 -77 91 -202 202 -430
2243 -430 -22 199 22 -237 226 -77 -349 -313 4 -65 9 -143 127 133 -63 -4 85 275 0 45 5 -156 -138
2266 -138 126 -221 76 49 126 -52 0 318 -49 -235 7 73 -212 5 -60 304 -154 239 1 -72 -162 57
2288 57 123 -73 -61 74 240 -99 -67 56 92 169 79 150 33 244 96 -201 -81 16 75 0 91 38 -118 -53 140
2313 140 -5 100 -20 95 286 29 -386 228 212 -164 164 11 461 -4 -105 196 4 -72 -170 -1 40
2334 40 233 -54 167 324 59 -2 -128 81 -177 188 -108 102 62 215 274 -49 211 110 261 -278 280
2355 280 82 -36 50 -99 93 -24 -24 48 310 12 -59 -138 86 181 -121 118 -193 77 -44 -230 77 -79
2377 -79 -211 69 -169 -58 10 237 85 -76 101 39 141 197 -269 368 140 -230 -135 31 -181 327 17 -3
2399 -3 -280 20 249 -111 -201 -38 -19 -172 -30 147 -223 -218 -63 -90 67 65 188 -1 -187 31 -24 -64 150 147
2423 147 17 -90 96 281 212 146 176 -93 147 -263 262 -38 -209 -145 -250 -41 -58 -189 -272 183 -71 81
2445 81 107 91 -30 -216 -136 -275 77 -22 27 389 -73 -98 269 -103 -45 -72 330 -185 40 36 -107 -196 135 172
2469 172 169 -10 123 140 -114 0 120 -22 128 -50 -18 141 -116 113 167 -133 -113 39 -282 -134 181 -26
2491 -26 -148 155 -65 -38 83 -30 239 -112 167 -206 -80 106 -27 31 -33 282 91 95 77 -120 37 -42 -213
2514 -213 -1 50 -14 -38 -15 101 205 99 75 -27 79 -247 -141 189 149 -10 146 -101 197 303 91 -254
2536 -254 -57 112 16 -87 34 115 71 -147 -81 -38 63 -58 -166 198 -62 -134 -367 224 22 125 -71 49
2558 49 -70 -253 -76 245 52 -48 117 -16 98 197 392 174 43 -381 -288 115 93 -2 -141 -376 25 -53
2580 -53 197 120 -262 11 31 -27 9 -133 49 -215 -107 -262 -1 -389 -79 -60 -57 -232 -188 24 -98 -258 -114
2603 -114 132 93 118 37 88 112 -9 170 -200 -86 140 -499 -68 168 -221 -2 163 70 -63 92 72 80 0
2626 0 -157 150 -171 -170 -72 119 -97 25 -36 -4 -137 -104 -166 103 -84 20 144 241 261 50 270 -13 -18 -261
2650 -261 -213 -190 -219 -179 20 119 -241 95 -167 -126 -5 327 -14 175 19 -357 237 -35 -17 52 2 -56 345
2673 345 31 -36 244 -356 -206 -1 -30 160 130 299 -216 220 13 180 -47 -197 -40 171 -88 227 -14
2694 -14 91 23 255 333 83 100 15 266 168 -110 -99 190 -311 -140 -306 -71 130 -21 -103 -37 -96 -259 567
2717 567 30 62 202 -85 362 -86 -11 134 333 45 10 -100 130 -282 1 -220 -116 157 141 191 -177 158
2739 158 78 58 2 100 -19 68 -115 68 12 25 184 -4 -119 90 -86 89 166 92 133 -29 -9 -65 -102 -117 -161
2764 -161 43 -68 117 -69 -21 61 210 112 27 36 57 32 -378 -6 -18 -161 -59 -177 -79 -82 171 161 -114 231
2788 231 110 -86 -60 157 -41 -15 104 -97 -107 222 155 227 -279 192 -48 172 3 52 -12 214 -60 125
2810 125 -225 134 -115 107 91 -77 202 -194 -203 -312 -290 132 -127 -62 68 153 -10 100 13 -80 52 -71 38
2833 38 -62 155 -174 -24 -113 75 -84 28 20 -66 26 -3 -194 -85 4 124 -164 -134 -122 -85 311 -10 462 123
2857 123 -86 34 -287 124 -100 102 301 235 132 220 26 -30 189 72 87 81 -20 -28 4 119 -37 108 169
2880 169 -26 -77 -14 -288 -136 7 47 20 -282 26 -263 63 -149 269 63 -168 -17 34 -36 -25 50 52 88 131
2904 131 -190 17 15 -264 127 214 32 -29 189 -238 124 27 132 -46 -11 45 -34 -67 -231 -2 29 62 119 -205
2928 -205 -1 91 322 72 -118 32 96 -33 147 -79 -215 -174 -46 -96 154 -91 -94 133 -119 -91 -29 -16 -337
2951 -337 62 145 40 242 9 123 107 -84 387 -28 95 81 60 -120 287 -130 -25 -41 -270 -29 43 -40
2973 -40 358 86 153 48 30 -67 309 56 70 237 104 -85 284 -108 -190 81 52 -21 -240 -92 -91 282 46
2996 46 283 265 56 133 -258 147 89 94 211 91 205 -62 -10 86 351 173 -17 15 -120 96 185 64 151 -105
3020 -105 -122 61 -67 -52 426 -37 -40 -144 -109 109 -88 192 104 -160 31 -13 142 -162 -195 -82 -116 96 -190
3043 -190 -170 -11 24 -45 -205 149 1 231 -18 84 74 340 16 -43 -162 -38 252 -202 -79 63 13 53
3065 53 128 51 271 167 213 -23 147 67 -214 -121 -180 60 -210 107 46 -187 13 -94 -44 -71 84 -39 -27 32
3089 32 -114 41 92 10 74 -145 -254 145 99 -101 105 199 -190 116 352 45 -173 74 19 1 270 110 64
3112 64 202 21 -8 11 -217 -81 114 -152 56 -242 -16 -33 -160 -32 50 285 49 4 197 -160 -55 178
3134 178 -61 224 -57 10 78 16 24 173 -85 79 42 175 -372 32 -89 -79 131 -207 -26 185 121 243 52
3157 52 -266 94 204 0 15 61 -31 -197 37 48 66 58 149 -297 116 63 -109 81 -151 56 -221 25 80 131
3181 131 -203 97 207 148 -146 21 235 39 52 -89 46 -148 137 -208 -9 -19 -207 -304 0 252 161 83
3203 83 -16 -22 -98 204 91 -69 -37 179 -68 -38 -35 -18 288 -126 199 -216 -48 96 -78 59 -66 168 62
3226 62 -236 156 277 -226 191 242 -128 161 147 145 15 -74 93 -29 45 -281 -83 83 224 8 -247 288
3248 288 -191 -218 290 -275 134 -59 -145 100 -245 -268 24 16 -321 -249 -169 9 -118 -43 -227 -148 25 -131 -147
3271 -147 -187 147 -135 45 -111 -122 -105 0 277 55 -102 107 258 -70 48 138 143 11 -17 33 -265 -73 -4
3294 -4 114 242 44 -1 191 -74 18 -103 355 -45 -299 -160 58 -50 177 416 -175 -265 333 228 -51 71
3316 71 11 34 -46 16 143 -138 189 254 -70 48 -183 -75 335 33 97 33 32 107 -94 -18 -16 71 21 200 142 -174
3342 -174 9 -81 283 -384 -169 133 -43 255 -46 7 -29 57 -135 -69 412 586 78 -53 -328 138 -15 83
3364 83 40 -417 -92 -101 309 26 206 8 362 69 -257 -154 66 125 189 -142 -86 282 11 -44 -11 -115 -4
3387 -4 159 -69 -103 -39 171 81 -112 -112 387 -92 3 153 -4 114 -7 -350 -36 -150 -146 -82 -25 -24 -206 -8 129
3412 129 -32 -46 120 -119 -281 -72 -159 150 98 139 134 -147 263 46 6 134 -259 310 186 -10 -112 36
3434 36 -122 14 -61 148 45 54 -188 63 299 -277 -11 -68 232 198 17 522 20 137 -27 293 114 -50
3456 -50 -89 39 18 63 407 120 22 20 -114 -87 -95 123 -108 183 174 -142 36 238 157 -94 169 470 -134 389
3480 389 309 214 -327 35 6 118 279 246 254 146 -97 253 198 166 -163 -206 466 -135 -130 32 -67 -167 186 -185
3504 -185 -11 55 -122 -137 32 79 89 -176 -21 -31 -109 -139 42 -3 -302 -93 84 -73 -281 -148 193 43 -107
3527 -107 -282 128 -47 31 -182 183 -166 5 18 -80 355 86 -17 -151 88 40 109 -41 2 -121 -62 -157 18
3550 18 -66 -15 342 21 -108 342 -77 -118 -211 199 -59 7 -107 -132 32 151 151 -88 -32 -96 9 -64 308 -205
3574 -205 16 -38 -55 9 84 157 141 -57 -29 191 123 -391 -5 -109 216 103 127 219 -15 -9 -60 -146 -3 -71 215
3599 215 -53 -26 200 -243 42 -84 -47 122 -40 -279 -37 67 2 131 -65 -42 -16 133 103 -5 -9 60 277
3622 277 93 -131 47 70 -219 235 171 141 -171 -47 102 -187 -362 -5 -389 -484 32 170 94 242 176 35
3644 35 -61 -18 59 -170 -272 -133 -152 -151 13 -86 -35 -83 -77 -20 281 46 347 -111 72 214 62 -90 -135 332 211
3669 211 -128 -1 34 -25 77 80 159 102 -3 -263 -48 39 -15 211 -190 124 -41 -50 14 -114 59 -99 -107 20
3693 20 4 108 9 72 186 53 -279 150 -35 137 248 351 219 33 78 -153 237 108 4 35 207 83
3715 83 66 -50 -111 -63 11 -34 -54 66 -26 44 222 -168 -3 -47 -242 383 -271 21 33 -152 45 -214 -105 116
3739 116 237 -96 -90 -188 -65 151 112 -169 -249 466 -41 193 37 37 -7 -228 91 -157 235 -205 -176 220 84
3762 84 115 1 208 81 -277 -49 -69 91 -230 -209 -255 -323 24 126 -44 -66 -166 176 -20 93 308 -74
3784 -74 488 252 -159 114 122 -58 68 289 93 -11 -152 173 33 210 3 15 -56 -324 -93 41 -215 124
3806 124 432 22 -55 229 -186 42 -205 -283 -31 216 -108 -105 -18 -210 -96 -32 -49 5 -117 -28 -72 205 134 -228
3830 -228 179 -136 199 -99 29 144 -55 106 102 -431 48 81 -29 -54 -122 -11 -94 264 243 224 143 -99 101
3853 101 -196 -137 -60 65 -26 -137 -99 168 60 101 -287 -331 67 -158 -56 -368 -42 26 117 64 -99 -6 77 68
3877 68 -19 -162 -266 53 -128 16 -264 137 142 237 -52 206 198 93 -156 74 -175 6 -81 -234 5 -140 9
3900 9 -151 120 -71 -143 -93 10 -32 24 377 144 -201 -145 115 21 180 -81 49 71 -184 -18 73 171 33 -145
3924 -145 397 93 23 114 -146 -78 124 -109 212 -47 -267 -40 -38 -120 89 18 -315 -154 178 -101 304 -96
3946 -96 -176 -116 -251 123 63 -329 81 -74 -114 226 162 10 -38 -124 164 189 141 270 196 -546 364 -181 -231 -16
3970 -16 35 113 -60 290 68 46 -159 22 -195 -115 102 262 -157 278 -32 100 124 -56 -218 -268 -142 28
3992 28 -54 -138 -154 15 331 -2 184 -66 143 329 39 0 103 -59 209 168 -172 88 -71 25 -110 178
4014 178 65 -155 108 232 -42 207 98 94 -90 -66 -123 -36 -84 -84 226 -72 127 165 1 71 -332 -104 -250
4037 -250 188 109 108 35 -98 225 -172 -218 -22 162 186 72 19 97 -324 -148 -16 7 -108 -168 -394 156 -105
4060 -105 108 108 -196 24 33 -64 -83 -42 102 -24 111 -112 15 -18 -34 -151 129 -69 16 146 66 237 -211 229
4084 229 2 55 211 -100 -19 6 -189 2 431 -103 -26 -109 -179 -162 10 -164 -75 46 -255 -95 150 151 32
4107 32 -283 -75 105 -24 -207 -134 89 -19 -346 146 27 132 77 160 24 -17 105 94 -149 -295 -218 -21
4129 -21 -57 -11 133 31 -23 52 -164 179 -1 -122 283 -108 107 74 -33 -37 -121 87 90 292 14 -32 313 -231
4153 -231 84 300 -151 -98 86 -131 -55 -43 235 228 -122 -260 -487 122 63 263 -215 12 -181 4 -144 -223
4175 -223 404 -197 -153 173 -304 201 -38 61 51 -27 -88 149 188 84 80 48 -183 -135 190 39 -368 94 51 -38
4199 -38 120 -1 -87 -254 -78 155 -80 221 118 -327 85 -3 -61 228 73 14 3 122 180 -174 -70 130
4221 130 191 -35 6 19 53 5 -32 115 -180 197 -35 -150 247 8 26 50 245 -74 190 -172 95 64 120
4244 120 -80 -208 70 -105 293 -139 78 53 -207 -58 -5 -127 -91 58 -44 -280 -197 -187 -66 -127 -293 166
4266 166 15 -302 -49 -170 -26 64 331 -110 -224 -78 -97 -127 -41 -82 146 -269 9 122 -173 -252 -4 -174
4288 -174 -139 111 -73 90 121 75 -243 -85 49 80 -23 129 38 -41 -52 111 71 -189 228 137 233 -155 215
4311 215 -67 66 -81 -138 3 -168 116 41 97 151 111 -353 115 -47 -40 263 -98 -199 38 -216 176 -17
4333 -17 71 24 -146 31 6 -153 -311 167 241 -33 34 -16 -129 201 215 -226 -22 -44 -168 -257 334 -10 -262
4356 -262 306 -146 156 108 -105 72 -298 58 -110 -292 194 84 195 -233 -125 -2 27 -138 139 327 199
4377 199 -300 -171 115 -80 -36 134 -168 98 -79 -63 65 123 -160 288 -499 -46 52 32 29 -218 -36 198
4399 198 -190 -1 20 76 287 185 106 -206 -104 190 -43 -92 -210 -34 -34 139 1 -207 13 426 16 -19
4421 -19 -208 -257 -17 -71 -100 -83 97 -106 5 -20 141 -34 41 -199 2 34 1 9 248 62 -137 18 151 -298
4445 -298 90 -128 24 41 -44 291 -211 -183 -28 46 -164 -180 91 -58 12 240 250 -135 -9 -277 363 22
4467 22 -144 -375 157 -150 27 -135 -47 50 -262 197 183 308 -196 -189 -356 261 79 -118 65 44 -130 -238
4489 -238 36 71 3 28 7 96 -86 -278 83 186 12 -153 323 -349 -238 -66 -139 -109 -242 207 -219 -97
4511 -97 82 -82 13 -148 -47 -98 155 154 -201 -158 223 -121 -317 -313 295 124 -29 313 -294 256 -81 131 163
4534 163 -94 232 -139 154 13 -307 -22 -29 -127 -271 -222 142 184 135 139 -60 146 -462 287 -303 11 0 83
4557 83 178 74 -139 186 -94 -139 221 92 -156 -176 -199 67 174 -164 253 -60 -162 -21 -90 40 134 24
4579 24 26 23 -70 -14 237 -254 31 -220 -96 184 -84 -66 86 212 -331 -53 -206 -46 147 1 -131 -133 -317
4602 -317 172 -137 -220 140 71 -12 127 45 22 -228 114 64 380 205 -69 95 7 22 136 34 144 32 69
4625 69 307 -90 -57 -24 91 152 80 -94 88 -23 132 -17 67 -211 86 145 35 -194 -19 -218 192 39
4647 39 174 80 -100 -62 -369 -113 -145 -124 -55 -36 -200 39 212 147 -88 -151 18 -242 -61 -188 33 114 162 70
4671 70 77 -24 -13 371 150 -140 76 110 -246 -132 298 102 -187 100 -162 92 2 -75 103 -180 -14 18 -113
4694 -113 -153 -191 23 81 187 180 188 -59 476 -30 -78 -51 -38 322 -139 244 29 76 75 -7 100 -283 -114 -180 -47
4719 -47 -32 -75 20 -130 -293 14 34 52 -55 59 -14 -236 96 -38 -215 431 -198 -100 67 -18 295 5 -77
4742 -77 -145 164 146 146 -148 -4 -42 -132 -120 5 -248 177 173 -75 70 42 23 100 147 -17 111 -42 -91 236 -431
4767 -431 -41 -130 -155 165 -469 -160 -11 35 82 242 -278 189 12 16 -159 -304 -224 -309 -196 -278 17 43 -283
4790 -283 10 -222 99 40 116 -143 -144 -42 132 52 -95 171 -198 8 216 135 -325 43 -16 -66 6 -134 13
4813 13 69 -101 144 253 -157 -98 -124 -56 4 -107 35 198 -95 -114 -48 -315 214 14 -70 -137 -253 79 -137
4836 -137 -99 286 5 1 160 -169 66 31 -81 199 58 250 -77 -117 -185 -109 271 -154 201 146 -19 54 239
4859 239 275 250 184 165 -119 160 -86 -39 -261 -191 -226 -93 304 344 132 -31 -173 138 -12 105 -30 51 -176
4882 -176 -136 179 160 14 152 251 -388 -327 203 -74 -1 173 128 -56 38 -204 -217 208 -40 -92 77 -96 -168
4905 -168 150 -85 179 224 126 -52 145 -118 38 -38 -120 110 -157 -19 -78 -143 47 -70 -73 321 69 21 109
4928 109 22 68 238 71 127 118 56 -57 -146 83 231 71 -307 -143 -263 -252 -104 105 19 85 -7 -19 129 -181
4952 -181 -269 -55 103 -103 102 -133 236 216 -132 15 -127 -236 -2 -71 137 45 -113 98 11 -14 107 -257
4974 -257 -82 -290 183 81 -5 131 -111 -271 -195 46 165 -231 159 -38 -87 1 -44 -81 -37 10 193 -148 13
4997 13 -128 12 -193 -173 -260 13 263 -95 -1 95 36 324 117 -168 -50 67 -116 234 -57 16 119 114 164
5020 164 17 -184 103 -165 -37 49 -63 -301 155 -191 67 -229 209 232 20 -57 -187 -51 -45 -118 -205 125
5042 125 -196 -108 -220 -195 -147 -88 4 146 66 274 131 -173 248 92 -74 -79 263 -107 167 97 -113 -274 58
5065 58 -373 26 -199 84 130 -284 -74 -410 256 303 -10 -20 -95 59 -94 -366 110 -80 16 -192 25 170
5087 170 -11 2 143 -59 42 -148 114 239 56 -48 -123 -28 -318 180 -35 -100 -43 -2 -52 -56 -144 -408 -181
5110 -181 -48 63 57 -63 134 -118 104 222 -30 63 145 -77 -346 230 74 -132 129 -48 73 87 0 108
5132 108 36 -81 33 -96 46 -64 -121 -310 -23 71 220 200 111 32 -110 -15 -144 115 -53 -52 -171 -52 -188
5155 -188 -197 -183 -107 56 -199 -95 -17 103 266 -49 132 177 -236 15 154 83 -88 -93 -65 -203 -321 6 125
5178 125 166 -182 127 0 -161 87 186 66 241 450 10 123 47 377 116 -124 -181 156 111 283 3 237
5200 237 -83 47 -49 -201 405 -114 225 158 -66 109 238 90 171 -107 21 -94 37 25 17 112 19 22 34 106
5224 106 -25 67 -233 124 231 -80 -22 -128 382 -180 -261 -226 -152 137 -439 149 152 -78 -7 -15 -232 -93 -103 180
5248 180 212 95 -175 -94 -58 -32 157 -202 -229 -184 44 150 139 289 -73 123 130 -37 -116 -10 -97 206 22 36
5272 36 -39 -193 75 32 -49 39 133 138 -23 -413 -146 137 312 -56 -11 162 -261 148 -134 -313 50 257 93
5295 93 52 -378 -128 -217 186 235 187 155 -75 -134 -166 87 -80 -12 82 14 -40 -4 -109 -94 -8 378 30 137 -76
5320 -76 -8 -139 -174 43 156 170 -286 72 -66 -35 61 -63 -106 -189 -8 -32 52 -172 39 -285 -113 -107 60 -186
5344 -186 -23 -52 -128 -124 -272 -62 55 144 -70 118 144 59 37 -174 106 68 128 319 -73 -104 53 52 -60 37 -65
5369 -65 266 48 -25 -47 153 47 -143 -102 -97 -91 -166 -94 65 67 -178 -122 -88 -89 -123 -13 -88 -381 -35 22 -82 53
5395 53 -201 -69 72 -295 -110 110 445 -38 15 54 102 67 -26 -60 -70 93 -127 132 236 29 77 -204 -57
5418 -57 -266 -255 172 35 -241 -151 -73 -208 -106 147 -51 -177 98 -5 -156 189 88 -64 -114 -6 -177 171
5440 171 -103 35 43 26 31 -63 103 47 -132 263 -31 -191 -118 25 -86 163 293 190 58 347 -15 142 -120
5463 -120 -84 160 -350 198 -138 -165 -303 87 -454 -47 120 -255 -209 -22 -162 -65 -9 -29 -11 -382 -162 172
5485 172 -67 72 -25 248 -174 68 92 132 36 168 122 -60 28 -33 -237 215 66 -66 169 33 32 -6 -111
5508 -111 -11 -74 136 7 -139 -174 104 23 143 150 118 40 -67 67 -150 198 -323 -13 -113 90 -214 16
5530 16 9 111 -11 209 -99 -88 -140 211 -56 17 73 48 -25 -32 19 162 -17 -121 134 17 86 97 -46 -184 387
5555 387 195 21 -249 285 -102 99 199 -60 -126 -65 -83 113 111 295 -179 -56 -97 -83 -109 -248 356 -50 49
5578 49 347 20 -116 -81 155 -110 -278 -26 -107 169 124 247 -187 55 -202 83 33 -139 220 -382 173 369
5600 369 -173 -43 195 37 -133 -110 -29 -153 -147 149 -58 -112 -2 47 251 161 97 -59 11 245 265 90 337
5623 337 20 9 82 -12 -227 108 -120 -25 -70 -5 173 43 62 -2 -12 -3 -303 -110 276 -53 -52 -41 -193 87 -336
5648 -336 -51 62 299 -197 -132 -22 55 149 -32 143 -46 17 -239 285 9 -22 -60 33 23 -30 2 -450 -52
5671 -52 -434 -142 -224 -85 135 -235 83 172 55 -17 -131 -343 -316 28 255 117 158 -340 177 367 -242 151
5693 151 331 119 -228 -171 -23 26 534 194 122 200 18 -164 -29 -149 -25 -64 111 345 39 -22 -54 -34 215
5716 215 91 -114 181 170 -152 49 -18 -3 42 151 -204 -40 86 -216 13 -106 131 100 -247 200 72 -74
5738 -74 -36 221 47 59 -322 -76 -84 -477 237 253 236 -168 -28 57 68 -155 -289 -58 -211 -157 -99 104 -140 95
5762 95 28 210 -8 281 -36 -45 -111 108 154 2 -239 98 208 -30 132 -98 389 -166 204 110 189 4 61
5785 61 -64 -111 168 24 9 -322 -81 -335 -157 -52 -79 -296 -140 492 140 -171 -246 100 -322 42 -92 167
5807 167 -163 -110 -25 16 216 306 174 -250 -105 38 112 -33 -142 8 34 -40 211 157 -209 163 -49 -121 -283
5830 -283 8 -282 -101 -115 -83 234 80 -25 -156 -26 23 -82 104 44 -18 -230 -133 117 -83 -209 151 -49
5852 -49 178 -210 162 20 -29 -313 180 18 -81 39 -32 -146 -270 -22 182 -127 136 178 78 -212 11 -109
5874 -109 -55 83 -132 -380 -125 50 -85 -134 234 -93 -20 -300 167 128 49 391 49 -43 24 -68 -94 192 -24
5897 -24 -106 230 -44 -431 128 -22 76 -128 -116 137 -41 73 8 53 148 152 41 -80 126 172 124 36 -243 -78
5921 -78 116 -59 -217 67 -60 -562 -249 174 29 48 -11 -124 2 -36 -194 -142 38 121 45 -145 52 -48
5943 -48 -194 -40 -27 -222 -2 -328 -236 -171 -5 -249 -194 -201 131 238 -214 4 72 308 -40 -3 300 21 -184
5966 -184 8 294 266 38 -119 -125 -240 -290 72 241 140 265 59 -189 7 39 -31 335 -46 250 21 53
5988 53 -319 -93 -27 160 -28 143 77 122 164 -44 14 -34 117 -12 58 464 340 168 -51 -148 206 78 -55
6011 -55 117 13 34 276 -156 146 -212 65 119 19 134 79 33 353 131 221 14 -193 13 18 -53 -380 231
6034 231 221 -40 -251 -100 -108 -118 -175 -29 17 -112 -198 -145 -50 28 33 -28 -142 -250 255 -9 -39 151 50 -76 -263
6059 -263 120 -368 64 -178 -123 -57 214 298 -316 -72 -115 -243 -65 -155 -152 -224 -99 -100 65 -12 168 110 351 -168
6083 -168 -85 -55 102 -233 56 -289 -46 -195 -181 -158 206 169 219 -122 -61 163 -133 73 -16 -88 -6 4 28 -390
6107 -390 -145 22 103 -141 -166 297 -332 -172 -167 -3 287 -38 45 -318 -247 -18 12 48 -352 -120 -169 26 -142
6130 -142 -261 -41 118 -244 -99 92 150 20 -129 -50 27 -49 160 -149 446 -134 -105 -19 78 -304 -162 163
6152 163 -18 -151 -15 152 -56 215 247 -187 -405 312 148 284 -1 52 15 200 30 125 61 -183 -47 97
6174 97 210 -313 -252 -48 506 -279 -121 145 206 -357 -70 218 263 96 79 -11 -25 48 51 -79 324 37 351
6197 351 -96 238 287 -318 -198 -380 164 191 -80 -121 29 -152 113 -80 -298 100 202 -59 84 -56 -161
6218 -161 -132 -42 89 -128 -188 -7 -59 -157 33 150 -145 -2 -68 78 -386 -63 -92 -508 80 -29 -28 122 27
6241 27 -81 187 57 -188 -60 93 16 -34 -116 114 142 156 -174 -169 3 76 -162 67 -173 -270 13 69 176 38
6265 38 287 -332 -217 4 -144 -66 -382 -245 -200 -161 -107 109 44 -150 -94 -107 -215 -137 166 -40 -106 -127 233 -100
6289 -100 83 -31 -57 -123 -237 -103 -214 3 -90 -58 -242 299 193 96 149 194 -147 168 240 139 59 -164 -22
6312 -22 14 88 -250 -325 168 -208 36 295 -182 -80 56 191 63 -251 112 -239 -133 232 134 21 -137 177
6334 177 106 93 97 -83 -149 385 9 -61 -46 35 55 -56 62 223 83 -79 -77 -133 -204 -33 -241 -38 187 -284
6358 -284 -166 -68 16 -79 184 -68 248 47 49 -151 259 -105 56 -334 201 -146 -145 16 145 193 -110 -16 -190
6381 -190 -202 -321 -203 34 228 16 -374 -135 -212 -121 -48 -354 -15 116 299 -292 -113 -27 12 -200 -15 -99
6403 -99 -132 -168 -110 70 14 -43 -280 229 7 -176 203 -133 -97 154 -148 70 50 139 133 112 20 -188 47 -114
6427 -114 197 218 -169 222 187 190 55 -87 109 -271 207 -142 -9 -253 -34 108 -8 244 -234 -304 -23 -87
6449 -87 -197 -107 -2 -26 -80 198 -37 -30 129 -49 56 71 170 7 -373 -108 107 -80 -24 169 -85 230 134
6472 134 -47 -330 213 3 -72 98 53 9 69 -64 4 -300 189 389 107 -193 163 -36 24 -78 268 84
6494 84 210 -304 244 -90 -11 47 -288 -133 16 -221 -98 47 106 -153 -106 65 195 -48 -38 12 73 -56 51
6517 51 212 397 95 41 112 -58 -20 180 -146 82 117 48 188 -110 -4 -318 -23 -171 229 155 59 36 108
6540 108 161 -348 124 -136 -33 -56 -49 -27 62 133 -64 19 230 188 122 128 -94 12 1 -76 -102 158 -72 -364 142
6565 142 -145 286 -142 108 92 256 129 69 85 219 -42 100 -59 -140 185 115 -60 73 -158 -127 69 -133
6587 -133 111 48 5 -51 84 -47 10 -22 -213 295 -316 160 74 -273 167 79 -9 356 -94 -228 -46 -121 153
6610 153 -46 140 -122 12 137 -18 -117 30 -274 55 65 -222 19 249 17 -32 -88 -19 178 -338 239 47
6632 47 -235 250 222 -158 -199 3 198 74 193 -74 125 98 57 21 75 72 -85 10 -50 72 185 22 108 -132
6656 -132 -90 -35 257 61 -62 -22 -237 86 -126 -80 -101 -174 -63 20 -44 -195 33 192 -58 31 -123 153 -8
6679 -8 132 195 167 70 -96 -221 -184 61 52 -362 -76 238 197 -119 -128 52 85 -212 120 113 -130 -114 78 -217 89
6704 89 76 52 -15 -215 -281 -130 -85 4 -91 -30 -115 -139 -224 -181 -32 184 23 -119 -182 -35 -237 -232 69 -17 -144 -180
6730 -180 219 -3 -129 -48 16 222 -138 -250 -149 -23 275 -170 27 174 -69 64 44 -230 -98 -75 -131 -16
6752 -16 124 -63 27 -15 -244 -93 -300 -181 76 186 -37 -37 129 87 129 -177 17 41 -238 -345 -240 -2 55
6775 55 -135 -104 -390 -485 -307 -95 37 57 -105 52 181 -136 107 34 250 71 132 -91 -9 49 -127 215 -269
6798 -269 54 -70 179 -386 -30 -52 174 93 93 53 -215 -51 -128 109 -88 156 -206 -307 235 -179 -129 -125 -81
6821 -81 107 5 56 -12 136 31 290 -242 -341 127 25 130 113 -47 34 71 249 35 -3 -139 -37 94 6
6844 6 278 125 121 19 -140 47 -121 -263 -8 265 79 81 -21 -123 50 -10 152 -293 -449 -38 17 -49 185
6867 185 262 150 126 204 -22 149 -69 71 16 -77 10 211 -59 95 -33 -126 -93 -3 200 -62 217 -40 22
6890 22 -176 136 -101 52 -74 -80 71 -195 -106 153 -164 -3 -277 -201 -87 126 -47 242 133 -1 -81 -66
6912 -66 -149 -262 -108 -17 69 141 -325 263 -28 107 -44 204 -46 -98 0 29 120 -159 -298 -96 -103 -129 -69 -326
6936 -326 83 -323 -106 -46 318 44 -189 188 49 -229 91 -285 93 -214 94 -218 -94 -86 -37 -219 -109
6957 -109 56 -49 206 -250 -169 -144 -154 -180 261 229 110 215 -123 -27 66 260 -116 76 -32 -191 -67 243
6979 243 -34 117 -105 -14 1 -27 118 153 -297 -14 230 143 -10 49 245 -165 -203 260 49 -69 -22 -1 -184
7002 -184 79 47 173 64 33 240 96 73 -169 -63 -167 56 -125 286 -222 -28 -135 -135 -190 -115 91 143 30
7025 30 62 -2 195 255 -116 273 157 28 26 242 -290 41 230 98 40 -187 148 -238 23 -11 153 -90 -83
7048 -83 168 107 40 164 43 93 202 114 24 83 -233 -160 -30 -10 0 84 -51 -81 21 36 110 265 219 135 -43
7073 -43 4 369 -417 15 12 109 24 -55 22 138 183 -117 -345 106 -122 -171 -148 44 70 -161 -141 147 -64 174
7097 174 -177 -233 -461 -22 256 144 -48 -98 -184 144 -308 -70 -217 -254 -8 -27 120 -39 -16 2 -82 -39 98
7120 98 -77 -266 -94 11 -220 -157 53 91 86 -47 349 35 -29 387 -95 -118 -199 -43 -135 163 81 134 79 120
7144 120 1 109 -155 -122 35 -47 -306 -231 -410 -37 -180 -137 -79 -27 161 79 -13 21 471 -199 140 187 295
7167 295 -72 -124 -66 -318 103 16 185 21 3 -86 176 -199 -39 -143 130 6 -30 158 114 -46 151 -35
7189 -35 -142 -150 98 63 313 126 59 -77 163 -174 111 -84 -69 383 28 -159 12 150 14 -230 25 180
7211 180 -263 348 -146 -43 -76 11 240 147 54 206 22 126 -75 72 -136 -128 -119 -120 -200 -49 116 81 -132 -98
7235 -98 8 53 -254 -226 -97 46 -47 9 -57 109 -137 160 123 175 393 102 115 8 -272 302 -89 -61 143
7258 143 273 -67 -21 41 55 12 -132 207 36 262 -268 147 -47 21 -30 -56 101 -52 -132 -63 -84 -134 22 61
7282 61 -205 32 193 -266 -157 -164 21 207 90 -169 251 -101 287 91 -131 484 -80 69 158 -160 -318
7303 -318 109 82 -226 66 146 40 152 51 -157 74 131 244 -40 76 165 -15 82 -103 101 544 74 -40
7325 -40 -15 157 -152 64 314 -71 10 -12 -229 146 -232 118 125 3 -84 16 -241 252 -34 -1 40 43 -44 -282
7349 -282 -45 19 156 70 34 167 -131 -175 -265 -184 -204 -94 -208 15 -178 -26 356 49 -47 116 -93 422 15
7372 15 -25 193 165 45 99 -488 -317 240 -97 51 -35 277 -107 27 53 -154 -408 -121 -100 -6 26 -366 -131
7395 -131 -19 10 -80 147 -272 -363 -21 -246 -62 -260 205 -318 103 36 142 62 -80 113 -29 66 89 96 -172
7418 -172 -236 154 -187 114 99 269 -252 -76 225 -72 -184 -239 -8 65 39 133 65 21 -32 4 53 64 1 -167
7442 -167 28 -291 -137 223 -42 117 265 41 114 -355 72 -222 -111 -25 -181 -434 -91 24 34 203 -125
7463 -125 30 -214 -57 -94 -163 -49 70 274 -486 202 -11 143 64 58 76 -45 160 10 37 -50 -98 -79 -72 -5
7487 -5 -203 118 144 74 374 180 71 -77 49 -295 -93 -284 -286 -17 -5 78 77 -19 94 -68 -41 -245 66 358
7511 358 -52 -14 -179 245 208 -233 162 33 -221 47 82 165 -221 -71 -68 -282 -44 10 302 40 -93 203
7533 203 253 -24 261 -204 -344 216 -182 -178 53 136 -8 -102 -190 -257 -135 42 -167 48 39 71 50 66 -49 122
7557 122 -238 -191 114 278 67 222 -62 -322 -224 -230 -350 166 51 85 144 35 145 187 44 24 -103 109 217
7580 217 162 4 5 12 -40 82 178 -229 174 51 191 19 -133 120 -115 85 42 221 -5 332 -78 -55 -13
7603 -13 -137 257 -154 8 -294 25 235 -98 -104 110 -122 -22 -22 40 -151 244 71 -76 -155 -88 176 -24 -252
7626 -252 -294 278 -8 -71 117 119 21 148 110 -16 -15 80 -158 -210 -111 -102 -15 377 118 -59 198 -143 70 -16 -29
7651 -29 31 156 90 -186 -87 305 81 169 -55 -74 78 98 -190 -103 -1 239 303 165 47 174 92 322 45
7674 45 -28 -334 189 -4 -166 19 34 105 -21 -295 -35 233 39 -78 -76 281 89 95 -412 -75 57 136 59
7697 59 358 65 16 -1 191 25 -253 151 -106 -89 191 188 179 73 190 158 109 13 53 -215 46 306 8 34
7721 34 -83 14 -355 91 110 -191 -323 -155 38 -129 43 -30 221 -260 1 -70 -69 114 -118 263 14 79 191
7744 191 -363 -91 -6 86 301 -63 -18 -100 222 31 -247 -251 -159 -296 -131 -2 40 -208 -142 -54 -197 78 -10 39
7768 39 -126 29 22 -6 64 197 82 -69 -153 -100 68 196 82 -24 -223 -38 -240 -28 93 -324 218 -91
7790 -91 -64 -239 -62 -155 195 52 113 -20 18 -69 217 -36 27 59 401 -306 -170 108 -149 80 -54 -181 -92
7813 -92 -171 -53 -100 -75 -396 -62 29 100 -32 -41 122 31 580 283 -45 -209 67 -63 96 116 -4 -110 -76 -56
7837 -56 -356 -244 255 -336 -53 33 -121 -282 -34 194 -233 -271 24 -297 57 -21 -43 -42 16 41 38 116 81 254
7861 254 228 -37 -248 46 -206 -166 -54 -139 48 -141 79 -358 -184 390 33 -146 -117 5 -1 -217 167 -543
7883 -543 112 -58 -11 -216 151 -110 -176 -37 -161 75 213 85 -70 -172 286 68 -71 23 -77 64 -299
7904 -299 -127 34 -117 -224 12 -60 -67 271 67 63 447 -4 -171 45 -86 -90 -126 -165 267 129 -45 261 64
7927 64 265 257 113 -120 198 -188 -240 20 47 8 40 27 51 -116 101 -137 -243 41 -28 31 244 184 110 -196
7951 -196 -100 154 -134 175 143 -37 -116 18 159 -124 89 7 150 229 63 -202 -147 -224 -36 30 -42 175 81
7974 81 40 -416 -180 -244 -265 -223 -207 32 -59 24 80 50 32 108 -92 -57 14 -250 40 -162 53 21 -116 -177 -155 -66
8000 -66 -105 220 -89 5 71 -213 28 34 73 -66 -94 181 105 -226 86 185 -409 242 116 -184 146 370 62
8023 62 27 -31 -71 136 35 130 28 -8 -270 -91 -31 -147 85 81 -119 73 -131 -209 96 -152 21 -161 297
8046 297 207 39 19 13 -15 44 -194 19 86 51 53 204 -30 252 161 -199 -267 171 -277 -190 43 154 -6 202
8070 202 158 -203 34 -99 -152 134 14 58 10 304 -42 84 191 120 1 -26 89 2 168 -124 69 -113
8092 -113 -116 -96 124 2 57 123 -204 -251 49 -171 -248 -226 -28 -146 -70 -169 130 -95 91 62 67 -165 -31 -268
8116 -268 95 -63 -59 -70 -54 -18 -128 -118 -227 101 -362 169 -140 -32 10 77 -120 33 49 36 -136 65 152 -179
8140 -179 379 5 106 79 -243 -121 -91 109 -90 -130 164 38 -173 -122 -69 148 -6 -73 18 -145 -340 -123
8162 -123 -120 -6 254 169 283 6 -56 -39 37 -137 27 -173 39 -77 -23 126 62 49 70 -247 51 -286 24
8185 24 69 72 125 109 -49 -28
8191b8
$$ Imaginary data points
##PAGE= N=2
##DATA TABLE= (X++(I..I)), XYDATA
0 0 0 0 0 0 0 0 3 -7 7 -7 9 -14 14 -21 28 -28 35 -42 51 -61 70 -81 93 -108 126 -142 162 -185 211 -236
30 -236 267 -300 335 -376 419 -469 519 -577 639 -710 786 -871 963 -1066 1180 -1312 1458
47 1458 -1624 1815 -2037 2301 -2618 3006 -3499 4145 -5033 6338 -8451 12455 -22739 106250
61 106250 189185 -18526 -15183 74911 59572 -76221 -66705 51563 101506 33104 16658 65553
73 65553 79791 7362 -48088 -38133 2392 2998 -18320 -8097 44698 53704 -9733 -55782 -13768
86 -13768 20414 -33691 -87283 -37353 24838 -9440 -60794 -15864 41793 -4066 -77566 -57308
98 -57308 -6216 -32262 -76073 -39140 21081 11608 -21771 -297 30846 2323 -48829 -48661 -9279
111 -9279 9581 666 4963 38005 61605 35462 -14555 -24914 10835 21836 -12486 -16926 40404
124 40404 75969 36367 765 26118 41810 -5322 -38269 4744 50497 27227 -6684 19572
136 19572 54108 24704 -24519 -18226 15739 9904 -23909 -25131 8596 23729 1511 -20575 -12131
149 -12131 4420 -7703 -35994 -35817 -7325 2247 -21512 -27858 3559 20119 -10086 -34990 -15037
162 -15037 172 -24426 -40398 -8633 20369 2314 -19217 234 21323 -496 -31321 -20111
174 -20111 8768 7586 -9086 -424 24904 28043 7106 -5758 2941 11433 2285 -6370 6830
187 6830 26261 23153 4176 6097 24484 19419 -10753 -17738 10615 23125 -1255 -12658 15512
200 15512 32328 5487 -19144 -2746 15797 -2059 -23285 -8572 16122 10094 -10695 -8577
212 -8577 8184 5410 -15902 -23284 -7982 3421 -6248 -16398 -5915 9447 1732 -17439 -15259
225 -15259 3113 1686 -18717 -18810 5698 12549 -7435 -14933 4986 15593 -3061 -16852 -2517
238 -2517 10794 -104 -11304 291 15288 9008 -3685 766 11159 6205 -8142 -7416 7864
251 7864 13851 3757 -1553 9888 18230 5889 -9926 -5100 8932 6206 -6679 -1528 15582
264 15582 14402 -4240 -8186 5118 6120 -9901 -12855 4582 12300 -612 -9002 383 7428 -3216
278 -3216 -13968 -6540 5290 1912 -8998 -6624 4381 4194 -8183 -12006 -236 7043 -2522 -12193
292 -12193 -4694 6256 745 -10287 -5499 7815 6103 -5769 -5371 5943 4045 -8993 -8534 6199
306 6199 10248 -662 -4119 6303 10190 -1281 -9819 -1939 7302 4468 -1160 2012 9340 7257
320 7257 -2204 -5466 947 4162 -669 -3514 4621 10536 3211 -5908 -2051 5115 292 -7484 -3027
335 -3027 7793 5507 -5155 -4953 3845 3097 -6780 -6937 3008 5976 -3007 -7042 -350 3212 -1970
350 -1970 -6596 -2494 3446 1753 -3430 -3660 217 128 -4361 -4862 1648 5597 136 -4207 250 5021
366 5021 -1177 -8032 -2811 6676 4995 -3075 -1050 6294 3696 -5232 -4758 2782 3859 -1185 -861 5048
382 5048 5425 -759 -4076 -164 2654 123 -2114 1040 4635 3347 -1042 -2765 633 2333 -1227
397 -1227 -3382 1096 4988 582 -4528 -1392 3504 324 -4912 -2099 3974 2299 -3776 -2933 1810
412 1810 835 -3784 -2403 2319 2198 -2085 -2364 1043 1191 -2478 -3533 -431 2450 1754 -1092 -1390 794
429 794 1038 -1636 -3081 90 3420 1031 -1566 500 3603 416 -3498 -685 3070 1278 -2614 187
445 187 4416 2337 -2578 -1578 2417 1491 -1753 -1100 1871 2082 -439 -1149 616 1345 -181 -1604 -817
462 -817 924 1822 -392 -1662 388 1613 -263 -1798 81 2139 -3 -2858 -184 2185 -535 -3351
478 -3351 -868 2819 476 -3137 -1413 1882 726 -1871 -1300 875 969 -325 -327 499 770 -253 -658
495 -658 -240 422 459 -446 -467 1129 1635 -502 -1627 410 1802 -216 -1959 660 2719 720 -1585
512 -1585 313 1766 -9 -1602 -207 1744 472 -1074 -52 1040 286 -613 -701 -58 -135 -219 -209 468
530 468 -39 -334 -635 -876 116 594 -716 -855 533 1152 -548 -2042 117 1320 -292 -1324 -3
547 -3 839 18 -910 -113 443 -505 -786 508 1299 192 -938 -215 396 218 -425 -223 328 805 784 -80
567 -80 -353 680 275 -595 -649 508 1417 -20 -698 533 669 -502 -1468 -270 1084 225 -450 240 484
586 484 -427 -842 102 -7 -293 -487 187 629 45 -379 -538 -565 122 336 -282 -515 -60 964 -408 -1130
606 -1130 -170 653 100 -54 202 236 -340 -204 672 551 -987 -618 754 1307 48 -140 84 418 -381
625 -381 -40 287 354 200 264 190 -261 -144 192 -464 -261 218 903 10 -133 504 324 -979 -744 245 668
646 668 -353 -220 808 234 -705 -967 -181 280 -223 -350 42 88 -359 -287 -60 -467 -340 426 18 -30 41
667 41 178 -221 -600 -371 43 -224 -50 552 490 -357 -560 195 430 -332 -164 744 506 -103 415 386 51
688 51 -520 14 535 597 208 150 386 -8 -83 373 -158 -86 258 376 191 -472 141 169 -560 -558 437 119 -657
711 -657 -168 840 253 -598 -724 -221 255 -397 -68 -31 -150 -495 -206 -220 -476 -491 67 162 -60 -153 71 -131
733 -131 -326 206 -85 174 -184 361 627 -66 -529 283 209 -120 100 727 193 -68 78 360 217 -498 103
754 103 258 362 65 472 281 -74 -331 -266 129 -137 269 341 89 -20 -140 -229 -530 -374 -37 421 -445
775 -445 -77 142 92 -563 -532 0 55 -301 -190 398 4 -570 -405 -15 14 -447 -33 586 43 -88 -210 8
797 8 -38 37 85 202 -234 46 540 248 -439 112 359 -98 178 307 91 -42 -181 207 381 66 -411 623
819 623 454 -252 -212 199 -95 -431 77 262 287 177 -268 -5 -117 -56 251 148 -105 107 -53 -299 -409
840 -409 -216 73 37 113 161 -80 -98 -102 299 -26 -628 -271 308 -8 -118 -176 181 303 -330 -113 395 8 133
863 133 70 20 132 -82 -113 4 90 203 168 161 -90 -16 -140 184 -146 -37 132 -143 -83 399 239 -182 114
886 114 95 234 -86 -194 354 -4 -232 -115 -45 -526 -30 336 104 -3 -109 -264 53 -9 -277 -12 -283
907 -283 242 -71 -391 -361 -44 80 109 -138 45 -73 -402 123 196 -40 -166 -123 6 136 140 -348 -315 351 68
930 68 -133 58 292 348 224 63 -51 -208 14 159 147 165 76 -42 -335 -342 283 159 -222 193 -34 -170 19
953 19 -82 -6 -124 -86 4 242 -145 55 -270 460 -179 151 277 232 63 -131 169 -1 -405 -243 101 -578
975 -578 67 395 -81 67 -198 -99 127 -313 72 -9 -132 -165 302 195 -39 -142 -26 1 -111 -88 -129 -12
997 -12 75 -435 -303 -27 -103 334 62 -12 -19 -210 -217 -213 -107 -93 42 318 -52 -261 -50 -187 -225 -22 45 174 415
1022 415 226 -78 -6 -146 56 177 -34 -32 -218 112 191 143 105 -332 -16 -92 109 -112 17 -3 -240 -233 -102
1045 -102 -200 33 -104 -13 -105 -32 -163 -242 -18 -306 119 287 -95 118 443 -138 -99 -83 129 290 -38 39 -19
1068 -19 311 218 36 101 -124 55 -70 185 418 -77 -315 12 99 146 228 76 63 407 131 78 -175 -120 67
1091 67 21 97 198 -165 -189 -174 77 69 -330 27 179 329 -288 -186 155 -27 -64 24 310 -25 75 -103 122
1114 122 -325 -181 43 -153 -160 20 182 166 20 118 18 -84 97 -30 -69 10 16 148 -101 -55 -292 -40 -9
1137 -9 103 63 376 36 -114 144 52 326 116 193 -95 -105 -273 93 169 -21 34 -7 -9 55 -338 -178 -120 -423
1161 -423 136 31 -183 8 81 -35 -73 -176 322 30 -39 5 177 -112 -194 -129 -100 283 165 16 -210 298
1183 298 -415 182 313 234 -147 -28 -257 16 149 -95 27 9 233 70 -169 -103 185 -5 -15 -129 39
1204 39 141 55 -14 400 267 -257 -316 88 51 31 197 244 77 -6 -121 -176 87 -7 -121 3 -126 11 276
1227 276 171 50 -152 15 -9 -95 217 26 -74 -77 -31 -342 -105 224 161 -146 51 -22 113 383 -40 -178
1249 -178 -188 78 -232 -6 23 -34 -17 61 -86 -43 126 42 -144 191 117 -102 142 -145 154 258 -27 80 77
1272 77 170 78 246 126 -209 67 78 -53 170 44 9 -116 22 -18 170 -282 4 91 -134 -148 -226 232 140
1295 140 -11 -164 -358 38 -340 -21 -241 -30 204 87 176 211 -214 -245 -221 -68 54 -346 59 106 53 175
1317 175 -185 -185 -98 -18 31 84 -174 -93 -376 102 169 233 -184 3 -41 -435 -3 99 -98 -194 339 121 -63 -107
1341 -107 266 -168 131 63 -53 -58 -85 -90 -71 70 135 37 -96 -253 33 110 -137 -3 66 -1 419 -245 -20 1
1365 1 -171 -159 -226 46 174 65 136 2 -160 104 -266 -142 155 21 -71 -354 12 -110 -50 -54 -483 129 1
1388 1 -81 169 53 -40 -411 230 127 -81 220 130 397 -237 -302 -129 19 112 -124 -281 98 -251 -147 -47
1410 -47 101 -66 -32 139 182 76 274 -143 -57 374 -13 97 71 -139 116 -103 16 26 71 117 -29 -129 -35
1433 -35 -145 141 103 -128 149 99 191 375 -198 11 -155 -297 39 147 -304 63 330 109 -64 -57 -174 -140
1455 -140 21 -359 157 167 142 29 73 -16 343 257 -13 225 22 -31 -27 -270 -31 -72 208 7 -16 107 -254
1478 -254 23 92 1 -18 129 -132 -115 -23 -112 103 -53 76 -15 253 -21 249 -3 -351 -164 -132 226 -189 51
1501 51 -117 -185 63 -8 247 83 -313 -191 32 -262 349 150 53 -289 282 189 15 246 -492 188 83 0
1523 0 -4 342 -114 558 219 -207 -25 -7 -83 176 63 95 13 4 -126 152 -69 95 94 223 -481 22 -222 -65
1547 -65 108 97 8 -52 189 158 117 205 -168 -141 -157 -109 -1 6 -100 -47 162 -438 214 155 -129 -54 347 -64 157
1572 157 -37 40 125 -4 329 87 3 161 3 252 36 75 237 -125 -106 52 -232 78 72 -89 -137 -115 -391
1595 -391 77 137 149 146 40 349 -219 -146 -57 -147 -179 127 104 -64 -54 316 132 19 185 -49 155 119 45 -87
1619 -87 200 332 -107 90 -74 -245 -152 105 94 54 76 -48 113 84 -246 -60 74 326 30 132 -43 -175
1641 -175 -4 344 -128 106 -72 -210 -201 -155 143 -7 170 6 201 -178 123 71 -407 149 168 -127 131 229
1663 229 -22 -247 -201 -288 45 -241 166 -322 54 106 -7 -25 287 36 45 -118 -352 -67 -62 181 -289 -78 -240
1686 -240 -77 -113 65 -92 132 85 -145 60 264 4 -179 -151 155 -73 20 -4 -119 304 15 201 -128 -181
1708 -181 -116 0 213 89 14 23 21 -83 -116 -12 245 -98 -329 195 -92 35 124 -211 -15 -374 -26 64 91
1731 91 210 -48 -12 -51 7 222 -190 -32 69 -214 74 -92 -56 185 20 -83 -82 -12 -194 -15 88 255 -54
1754 -54 43 0 145 72 -214 -65 -259 171 -36 239 -69 31 -7 -168 -123 -177 270 32 63 -156 -257 137 177
1777 177 122 -92 -375 -74 -150 136 -38 6 17 210 76 36 -142 167 118 125 79 146 -163 -304 -40 -44 -195 -97
1801 -97 -191 -13 193 -183 -39 -133 170 62 133 115 96 -82 88 265 73 93 -210 68 112 21 -180 51 -224
1824 -224 -119 287 181 2 -14 103 -38 237 -52 146 -7 -154 25 256 201 63 151 -15 58 -7 63 115
1846 115 299 33 -199 44 -35 88 -86 116 291 116 189 609 61 -78 -88 45 -84 -162 20 -283 -270 -89
1868 -89 -103 -28 3 140 -205 190 -179 -98 -166 126 -231 -93 -90 -119 -143 9 -101 160 49 41 3 90 202 -91 393
1893 393 -43 -14 -149 -472 77 -158 111 105 160 198 -224 -149 58 -40 -36 31 -156 -30 -62 173 -189 195 165 -39
1917 -39 25 -133 82 -136 -287 -89 125 28 -316 -108 -56 -4 -80 216 145 -11 237 145 -198 42 -51 152 142
1940 142 -79 226 -202 -103 367 115 -100 241 -17 -269 -65 -86 68 47 214 29 -295 102 -133 -196 127
1961 127 -41 -43 -61 -12 58 13 141 -71 67 -87 83 19 -240 297 -198 -44 116 174 -157 133 143 -13 79
1984 79 -39 -163 270 5 106 -418 190 -92 -123 67 36 80 -11 -30 27 257 0 86 -229 -57 56 246 62
2007 62 -274 -133 24 -29 -64 -25 -85 133 -96 -60 -171 -68 40 174 19 163 26 -110 284 163 142 68 303
2030 303 41 125 -170 181 295 -238 113 -71 -118 -92 -58 154 -119 121 -63 208 31 -66 52 405 -165 148
2052 148 78 -167 -208 176 -233 -156 -38 -114 193 -17 293 -33 -43 -241 -16 97 -72 147 -74 37 -23 -7
2074 -7 -6 147 49 94 -149 -3 168 -126 -148 -36 60 124 240 140 173 -323 -224 29 33 157 9 -126 -21 -36 151
2099 151 183 163 33 -228 203 151 184 -26 -11 38 -7 61 171 16 -200 69 189 -8 -92 -125 105 71 138 -114
2123 -114 139 -322 214 -102 55 -55 -116 9 -133 60 -10 -28 -221 6 60 -190 -11 -212 194 -185 69
2144 69 -202 29 -65 14 9 107 -234 255 12 -70 -296 6 91 -214 -12 -226 69 -98 -114 -38 168 -171 125
2167 125 162 -432 253 -149 109 117 -222 122 -42 -30 21 -6 -79 168 -313 362 -164 251 0 39 -148 -124 320
2190 320 152 286 -155 6 -238 -277 100 48 47 -147 132 31 242 198 48 -38 217 34 -21 -147 -282 -353 130
2213 130 -157 -44 61 306 124 85 59 188 314 -113 164 -173 222 -56 -43 155 -92 -325 13 -81 -83 -216
2235 -216 9 -95 49 -321 -151 -213 255 -99 -182 -66 -135 101 115 25 53 -213 214 -109 47 139 -223 72
2257 72 185 64 193 -38 269 182 59 115 -131 -55 225 62 -4 102 329 -51 -239 11 204 143 138 85 -32
2280 -32 -94 212 -61 -146 227 112 -113 17 -261 -27 42 -48 158 -80 73 -100 225 -112 123 -273 -16 -93
2302 -93 -14 46 -8 98 -185 -61 -340 335 46 123 -63 213 -135 151 -120 -94 96 42 -211 -57 319 -282
2324 -282 73 48 171 -132 130 171 -52 139 93 32 103 181 -59 117 -31 18 1 20 212 44 20 117 -101 -54
2348 -54 0 -59 97 81 -88 -10 205 158 139 113 -96 -118 -328 167 136 163 87 -70 398 19 213 -34 238 -298
2372 -298 -205 -37 22 29 -280 -225 31 -128 50 67 -52 -146 23 -168 -213 -301 -184 -208 -9 77 399 -19 29 328
2396 328 156 221 -49 -156 -62 -198 -142 86 -93 -214 -237 -86 -125 -297 -11 48 327 -42 48 228 209 1 -184
2419 -184 -64 71 149 -168 117 244 8 -59 210 165 -205 -30 -216 31 219 -56 112 -138 171 96 -277
2440 -277 12 -416 -275 -225 -82 -97 289 223 -11 92 -125 -46 134 -6 150 13 -142 -39 93 14 120 115
2462 115 116 210 -96 -220 143 -16 80 166 4 196 -241 237 84 263 17 -219 -291 -101 -41 -249 -335 -179 116
2485 116 102 63 -12 1 -6 -193 2 -136 -307 33 -95 404 59 -155 79 -122 208 311 58 128 -330 -87
2507 -87 -93 69 100 -58 -33 -158 -65 -128 -86 60 65 -103 61 71 -246 -197 -74 -163 125 -151 -53 69 -310 -50 -26
2532 -26 244 -198 268 -7 -344 -129 158 -239 66 66 49 -37 -44 -226 230 36 115 71 97 199 -130 17 198
2555 198 177 -69 149 -28 -35 -120 20 93 346 211 55 177 -6 -5 -382 77 69 371 -34 156 -81 -76 14 18 259
2580 259 -153 25 -116 114 -167 16 -91 -323 -19 274 55 4 48 135 -251 -14 194 97 -192 36 -80
2601 -80 219 -211 -154 -26 9 45 -230 140 89 -150 -398 236 32 116 338 -84 -206 -111 -146 206 223 -194 122
2624 122 -335 -8 -396 -395 41 153 203 304 151 -43 29 85 -172 250 -186 -41 -23 -49 -38 374 -237 76 166
2647 166 81 -188 -84 134 -90 61 -194 125 1 -64 26 124 -94 -446 253 1 90 89 9 -114 -160 130 -51
2670 -51 -35 -62 -129 120 432 -258 25 -43 128 320 -61 -118 -61 -317 -61 101 -16 -100 -278 -268 23 249 -24
2693 -24 -113 231 85 194 81 -236 -252 103 163 179 -41 18 -259 -108 204 297 220 -73 -39 -168 318 206 -62
2716 -62 150 60 -464 -102 181 -222 -50 -149 -192 -288 217 98 110 -17 -55 300 -351 -30 175 -333 -150 -87 122
2739 122 111 -141 -18 112 -130 294 46 38 72 39 -29 63 13 -38 147 -181 151 -61 -269 119 -24 -18 -44 -93
2763 -93 21 -56 47 23 -50 121 -30 -5 -106 214 -84 172 89 118 264 102 -419 -82 -162 103 -189 53 233
2786 233 16 -26 -106 -153 240 -37 -75 -87 -64 -44 -49 -32 -178 -61 -140 133 112 -91 -18 85 85 106 24 21 -108 -116 -168
2813 -168 -82 84 257 123 95 78 -163 -211 -145 -117 -39 -121 -26 -58 51 78 119 -221 114 273 -63 -34 -238 -30
2837 -30 78 -205 -31 169 -20 -369 270 42 -149 156 -42 2 113 320 29 -76 -202 -47 8 -294 -24
2858 -24 331 -94 -245 -27 -162 24 56 -45 -49 165 -161 3 -33 -145 -154 -132 44 22 -42 -253 -42 131 209 181
2882 181 -183 -89 -177 -174 -38 -25 117 -105 181 43 -26 75 6 31 -52 -19 40 -10 -278 107 -65 151 174 -406
2906 -406 -90 273 37 23 171 -48 228 182 -54 116 440 336 86 116 58 85 -193 97 98 1 -31 -83 40
2929 40 35 34 93 -213 171 167 147 124 168 -98 86 -28 -45 -282 270 284 -58 99 13 -86 150 -113 187 1 112
2954 112 180 9 -59 56 -207 227 90 163 93 161 -63 17 14 -29 -129 -233 259 67 101 195 -81 -18 424 163
2978 163 273 301 104 73 -86 34 -98 -301 -308 -153 223 -146 -82 -197 -211 -284 -7 -72 -98 -159 -323 -267 74 57
3002 57 6 -32 -287 -32 166 -177 159 167 66 -196 10 -228 52 -206 86 -90 20 32 191 -354 15 -36
3024 -36 69 136 111 -71 18 -132 -124 -54 217 172 -24 -52 52 10 -25 -18 60 -98 289 -94 -193 -52 -120 -9 -42 -2
3050 -2 14 243 25 66 125 260 -137 244 257 -36 -95 -89 101 -234 109 134 79 283 -269 49 -214 107 -69 29
3074 29 -168 84 122 -96 53 20 -50 -11 -33 -127 129 -138 -134 -119 54 2 291 -98 185 341 -175 -2 -40 -102
3098 -102 -40 -225 -118 -265 -248 158 -215 -223 -279 -212 306 -80 48 -74 -1 270 165 -91 -149 -62 -38 -77 70 -26
3122 -26 -12 -28 -244 225 100 -252 3 102 119 100 56 367 -85 -286 47 -17 -334 70 -176 -63 109 141 -56
3145 -56 40 -14 2 181 251 449 18 -174 133 47 -328 21 -107 200 143 -40 206 -73 -58 -56 -133 -20 -168 14
3169 14 2 -169 200 -92 -164 47 -39 -222 -79 100 -62 -103 -243 444 -95 79 -74 -342 -202 78 264 63
3191 63 183 258 152 -98 32 -108 339 169 11 388 -123 26 -70 202 -96 60 -19 -83 14 -57 21 -2 201
3214 201 -137 235 -395 -382 -4 -38 127 -119 179 117 144 316 80 120 -31 14 -56 233 -91 -200 174 16
3236 16 35 148 295 157 119 -66 -35 105 264 43 -143 80 77 -90 -22 -68 199 -248 225 100 -99 -4 -9 -76
3260 -76 171 8 22 41 -378 -126 10 135 -173 0 135 -96 30 -63 -10 218 -51 81 88 -31 254 37
3282 37 254 -105 17 221 -175 83 -57 -8 -128 116 240 -33 121 161 223 -394 207 60 -8 21 87 148 -144
3305 -144 -21 73 89 -57 -179 51 -137 -171 -251 -248 -2 285 8 -46 -67 -6 78 -278 41 -105 348 -129 59
3328 59 104 88 324 -148 238 40 -72 55 -249 -273 -114 21 -23 35 -76 -401 46 200 -167 -99 132 -59
3350 -59 103 -255 131 -321 -136 -47 163 50 -144 17 24 178 82 283 131 -202 -178 -120 29 -27 113 -419 -103
3373 -103 109 78 -69 -55 73 83 272 180 68 -167 -102 -345 -157 162 -232 176 38 -274 208 -111 131 201
3395 201 -90 113 6 -81 -56 129 -93 32 67 296 -141 -144 -147 8 3 -6 73 -14 -184 102 -173 -22 213 -23
3419 -23 -21 100 -32 77 30 -66 35 40 -121 81 -7 67 43 -164 -125 -30 -3 -136 -39 40 46 192 81 335 23 -366
3445 -366 24 68 -11 102 -154 5 136 -92 -115 -177 -6 4 -9 236 4 -248 119 -12 -220 275 -167 -98
3467 -98 -179 119 272 178 -100 68 12 -193 61 139 -222 -19 -87 20 -113 79 -203 -104 -289 187 -131 -30
3489 -30 -67 -125 271 62 -4 -138 119 -36 66 7 -93 -5 -4 -306 37 255 -107 179 86 233 -243 -57 -25
3512 -25 -111 198 -84 16 108 106 24 -28 179 -291 -77 75 120 90 -132 -103 -17 85 -42 -222 144 81 43 -30 24
3537 24 355 183 71 -67 67 36 282 51 263 205 -192 -54 -304 -4 159 87 -160 -15 103 403 132
3558 132 123 254 213 120 -44 171 -130 186 46 -232 70 -2 81 164 208 239 76 -33 257 -223 -107 -156 -72 -36
3582 -36 -24 118 105 -43 76 -361 -300 196 49 131 146 123 68 -134 -373 5 -192 -77 -306 18 224 111 -85
3605 -85 -101 72 -324 -159 -110 232 71 391 65 -189 157 37 61 -146 130 43 44 313 219 11 26 -42 401
3628 401 47 90 -30 99 -162 -428 106 67 461 231 168 151 112 -144 155 -8 66 -20 -240 36 -12 -127 74
3651 74 3 101 -202 -91 105 119 -35 257 143 -44 -319 -77 97 -55 -35 -75 -180 -221 -98 -52 103 387 113
3674 113 154 18 -76 -90 -83 55 -144 -84 9 22 -233 64 60 -82 187 121 -79 311 98 111 -63 124 41 -54 2
3699 2 -60 -99 -130 106 187 90 -61 243 191 -3 134 -132 0 -143 200 150 -22 0 288 218 -83 41 -199 -135
3723 -135 94 85 -37 23 -19 86 -41 -283 -160 -102 83 -260 -63 -133 -53 -339 90 -12 -430 85 154 198 -24
3746 -24 303 -50 -192 -196 -135 -96 110 178 96 23 418 106 211 40 104 26 -135 78 -31 -44 -7 63 42 -160 -283
3771 -283 276 65 48 197 184 -34 69 -42 -80 -267 -358 177 47 -85 -140 83 -35 97 303 -18 -14 197
3793 197 269 71 12 -247 -352 198 -188 -62 283 50 -109 -182 -66 4 57 -12 -31 -101 -94 -96 188 9 56 52 -3
3818 -3 -100 -127 -428 -281 -139 -83 44 -283 -250 8 277 -208 -319 77 -240 -194 -73 -162 -131 -17 164 5 5 180
3842 180 99 -3 -189 -23 -14 -174 -352 -213 170 -88 39 74 -57 -178 -49 -195 -96 39 179 -341 -282 93
3864 93 193 -70 203 27 -69 -180 -114 1 243 -65 -315 -209 11 -47 -124 63 79 -172 101 120 -26 185
3886 185 156 115 -207 8 -144 -61 -105 -21 399 -77 178 -28 41 125 -21 -33 -70 -39 -10 -71 -131 83 174 162 177
3911 177 -187 179 10 -33 -1 172 161 47 99 42 135 -55 6 16 559 87 17 -257 -30 -179 229 -20 187
3934 187 -14 -47 -22 12 90 3 -10 -91 -291 -149 -69 105 -176 6 -212 217 61 77 83 -74 50 129 -45 83
3958 83 -122 -9 39 132 175 -6 -132 -69 214 -260 -58 -1 -161 34 105 -262 110 80 81 -422 346 144 -151
3981 -151 -140 304 -134 -152 57 -156 -204 171 -202 -101 402 -93 255 61 -232 -171 -64 100 14 -142 -153 129
4003 129 159 20 -14 -200 4 18 159 -40 -183 -100 -47 -195 -41 -171 -13 -75 -168 83 97 -86 282 -424 251
4026 251 -185 -140 127 -318 -338 -156 99 135 -62 122 345 180 202 103 46 199 137 5 -22 116 214 -42 -189
4049 -189 -125 -293 8 -260 -9 127 -245 56 123 143 229 69 195 43 162 -14 16 -35 80 -162 -108 163
4071 163 -90 -14 64 148 11 -76 -79 -114 -111 -74 -187 193 125 67 14 64 -262 -3 66 -110 -36 147 73 -28 19 -35
4097 -35 -125 11 -25 16 -30 96 68 126 144 -123 191 23 -213 41 -31 163 125 -4 -150 -6 521 5 -10 -550
4121 -550 147 102 151 -36 5 177 41 168 49 -31 275 264 -122 155 -255 -292 -99 59 120 109 -119 -258 -23
4144 -23 -78 -69 -115 75 -78 -38 -51 -265 -255 -107 91 137 -52 -77 -210 -92 25 -16 155 -125 -138 228 -45 -161
4168 -161 -154 79 129 63 178 -117 54 220 95 -33 107 -378 0 125 320 -131 31 -152 -22 -131 56
4189 56 -272 60 -29 60 336 116 215 -239 31 46 6 89 -39 -163 208 -41 331 97 -81 75 140 -54 -39
4212 -39 -7 -40 74 22 137 344 -190 -121 -171 -124 -71 -15 -93 153 149 271 130 151 -8 -144 -198 193 121 90 -59
4237 -59 132 -41 -35 121 -11 -310 1 143 12 14 -48 58 -96 38 -180 75 -105 103 -81 213 282 -9
4259 -9 -128 -192 -75 119 193 76 246 159 162 99 42 -228 7 323 -73 15 44 110 -168 130 -195 -141 -100 -223 -91
4284 -91 185 -156 327 -97 124 15 196 207 96 -280 268 -63 -26 -228 -318 -20 -133 -144 -135 -196 -49 60 28
4307 28 155 -10 81 -21 117 -156 -124 -369 291 -180 93 -121 83 -192 -108 312 29 -196 -107 47 206 148
4329 148 145 160 -106 -32 -127 21 -27 -68 -73 -201 -8 -5 -106 68 48 122 137 -156 -60 3 78 38 105 -216 12 4 111
4356 111 -56 -60 106 -80 -176 259 233 -309 175 167 39 -18 -10 473 242 24 -103 189 157 221 -27 115 7 220
4380 220 100 -199 -120 91 88 134 -105 296 -102 202 -84 -68 -30 247 216 124 -141 330 -11 -80 -22 -48 190 -264
4404 -264 10 45 77 175 28 303 198 66 -160 -43 -264 -77 -37 -147 -13 75 2 -169 188 39 -164 -29
4426 -29 -87 51 -170 291 22 -80 51 179 27 -75 -144 103 -155 -67 -29 -61 76 208 205 60 5 49 -63
4449 -63 -158 -172 18 -104 5 -328 -95 -185 139 -103 -34 -217 -244 -295 62 -169 149 -110 246 48 -71 239
4471 239 -232 96 58 471 51 59 120 87 145 258 -95 -112 84 -3 95 -209 -119 -88 -97 46 318 244 -267 107 183
4496 183 -343 -234 83 -208 11 -90 -2 -368 101 169 -247 -82 -60 36 306 -30 77 -156 -88 -172 -43 21
4518 21 44 157 -16 218 -282 -15 404 -422 109 -26 229 -126 39 -6 -135 54 -194 65 5 89 -120 -170
4540 -170 -40 27 320 101 32 331 -180 54 148 30 329 -307 -31 174 -128 -56 -55 -77 49 156 -261 9
4562 9 -361 -150 161 23 154 -239 57 283 -233 -127 -128 -207 96 27 93 -165 -82 178 -111 -49 -174 129 -275
4585 -275 -169 -139 12 -45 -16 -23 -88 136 49 -59 75 143 54 22 119 272 122 114 -73 -158 -330 6 -48 -55 -139 -175
4611 -175 -134 437 27 -201 -123 -304 -59 46 -70 108 207 -423 -74 67 218 -226 291 163 63 -46 91
4632 91 57 137 -160 -321 69 8 61 373 152 -313 172 10 -218 21 -167 -243 62 -91 155 150 47 -135 -337
4655 -337 167 -23 8 -185 -256 98 -175 -68 12 -164 53 131 -52 -104 21 -34 -156 -171 -304 39 -196 6
4677 6 -170 -520 -138 -94 -131 382 30 -24 -131 -10 -254 -81 93 -148 -31 61 232 22 -360 462 116 74
4699 74 -64 -198 102 -66 110 -242 185 -99 134 83 -74 187 297 170 73 -46 -151 -182 -68 -3 118 226
4721 226 -20 65 47 27 -323 -111 -3 -396 79 177 288 192 86 155 266 102 -137 67 -69 -161 19 -187
4743 -187 -191 -47 21 258 -25 -12 128 49 0 -57 9 17 14 201 -235 -199 39 -425 188 39 234 158 71 155 11
4768 11 204 187 67 -155 -79 -104 -47 143 290 80 -223 145 39 263 -10 336 -165 213 -154 95 -170 137
4790 137 -275 48 211 271 -167 23 93 -285 -150 -282 68 135 110 -72 120 -35 -134 -44 118 151 198 187 -142
4813 -142 101 -59 141 361 304 139 -156 66 -147 196 155 142 -50 102 -72 142 -110 -199 99 70 -361 -99
4835 -99 127 -164 164 105 54 -315 59 209 73 96 -169 386 152 32 184 -31 -148 66 88 -76 110 -105
4857 -105 166 -1 153 105 -7 110 -53 -72 -215 53 253 280 -10 224 -377 -43 -220 28 -439 14 37
4878 37 296 -115 -84 -147 254 -79 -130 -221 -138 -13 -149 188 2 -88 -54 186 -15 -214 76 98 2 143 -117
4901 -117 -42 104 268 148 206 -37 -48 47 -19 -85 326 77 38 -288 142 92 -103 4 -32 -213 -307 139 231 6
4925 6 -47 123 141 -237 253 95 320 21 -78 148 108 -229 -33 168 -16 98 112 52 -183 33 -162 -59 130
4948 130 29 37 215 11 191 110 130 109 -119 -94 105 153 -176 78 33 391 -279 -190 42 238 214 312 12 -93
4972 -93 -167 356 -343 -163 -181 -302 -160 -39 150 -205 356 3 -171 55 96 -58 134 -279 -6 -144 -147 -80
4994 -80 -94 -186 -243 -231 19 -27 226 -203 -260 -6 -296 -248 85 291 -88 91 -296 -365 37 -230 27 90 61 49
5018 49 -33 -67 -12 337 -163 128 367 34 -146 -38 73 27 -136 290 -124 -131 -234 -107 248 -320 -103 263
5040 263 3 -48 -3 75 -18 66 59 -319 36 181 258 -161 2 115 369 100 -104 -42 110 184 281 116 -89 -25
5064 -25 -214 -111 -111 -152 -196 106 -170 -8 91 62 -171 11 -90 307 18 132 -314 -25 144 77 -350 78 -154
5087 -154 -209 -188 -34 187 26 212 -356 -98 121 7 459 -87 11 168 57 14 147 131 104 152 27 198
5109 198 7 -15 7 -78 -281 -50 36 183 93 -21 -159 -39 14 65 54 -68 -51 -279 -214 10 -355 188 -43
5132 -43 111 52 -139 -50 -115 455 -74 -138 -187 168 -56 7 -199 -336 -361 -89 -232 -384 61 -114 31 199 -250
5155 -250 190 139 -96 129 -300 0 -81 -118 13 524 391 174 -61 104 -46 -2 117 -113 -182 49 332 195
5177 195 -135 -24 -216 -29 54 -3 -374 -148 331 105 216 83 -34 32 8 202 285 191 99 120 -122 15 295
5200 295 75 0 -96 -35 26 342 -73 182 164 10 -181 -241 -75 186 -78 -210 191 -36 -165 233 4 158
5222 158 -125 103 129 -251 -136 243 -145 214 -94 130 185 152 109 -171 387 -105 144 -41 20 -13 -290 -23
5244 -23 84 -48 23 -108 35 -152 -258 -12 227 -20 86 51 -77 61 70 -198 -48 129 267 207 74 270
5266 270 207 -314 15 64 -192 -148 -226 -3 120 -86 -141 147 53 -52 -211 -196 62 -90 50 38 232 208 215 10
5290 10 -164 -63 112 -216 -190 -73 240 -103 103 121 32 -145 17 204 -19 298 -30 -153 85 -360 -32
5311 -32 -58 29 54 -177 -42 12 -34 9 -131 -272 -158 21 220 -212 -92 -512 22 -156 376 -89 -97 63 -320
5334 -320 81 3 -153 -128 56 68 -29 -21 -114 319 313 -72 152 95 -214 -297 -229 -25 439 -178 217 -121 167 -5
5358 -5 -14 311 -208 -381 -79 -52 221 207 -161 -64 -137 255 73 -68 -197 9 78 -98 85 -317 -122 206 -194
5381 -194 153 -76 -2 -123 -138 108 118 141 -35 135 -76 -243 -339 387 61 143 -105 33 1 139 -174 -234 -247
5404 -247 -101 -107 23 141 26 -112 -165 364 206 88 -234 -94 229 29 -60 25 -177 244 54 133 -241 -177
5426 -177 71 -243 -125 16 -304 36 228 -165 20 212 -198 -82 2 226 248 -210 70 -228 221 41 156
5447 156 -233 -274 143 33 -25 -46 -18 -106 -70 -163 -76 114 -74 -41 -104 -53 92 109 193 303 -19 -14 171 -18 113
5472 113 -143 -213 -374 33 157 -533 -98 75 -44 185 146 -149 -80 52 -103 422 48 -186 -123 76 26 285
5494 285 -100 -132 141 235 -4 -23 -139 0 229 177 237 -4 -298 37 91 298 -63 -113 8 177 357 92
5516 92 147 140 209 58 22 56 -300 135 93 -170 66 -124 -56 156 154 -31 74 231 117 -6 143 -223 -128 3
5540 3 -114 212 -80 -146 240 139 -67 3 -124 -142 -140 -138 -135 18 40 -33 -212 -43 -56 -123 73 16 -139 -78 -6 -53
5566 -53 -116 63 103 -111 -7 -116 -151 25 149 213 -96 -180 -11 227 -280 -412 -206 -73 -89 50 80 -342 -171
5589 -171 -164 158 -54 -430 123 -322 156 89 24 -142 16 316 182 -2 -195 19 -98 415 3 98 -89 180
5611 180 -160 -69 -16 -262 117 -136 -109 -95 -227 -63 -19 -133 148 -80 -237 161 -18 20 -356 -179 341 -140
5633 -140 -24 67 -114 -128 103 -35 65 176 126 -224 78 -8 110 78 -36 143 -217 -182 175 -218 260 -28
5655 -28 84 85 -18 21 -129 -59 122 83 88 155 -44 85 -45 43 -149 252 4 2 5 -141 -155 71 318 -74 -154
5680 -154 -124 -52 91 30 -53 -64 115 -148 130 232 152 104 109 -113 -231 54 199 243 -8 -291 49 -125 5
5703 5 11 252 -53 -264 -32 -382 64 93 -70 -2 -218 -33 86 -28 -215 187 287 218 247 -173 32 75 -160
5726 -160 -109 -60 74 -116 -224 69 79 -324 99 -57 65 137 45 308 144 79 268 53 -89 242 -60 233
5748 233 -30 -198 -23 84 125 250 -151 108 18 -87 -205 -20 -109 -334 -25 348 -184 108 -308 196 -76
5769 -76 -239 66 19 68 -3 259 76 149 321 251 -10 -114 -171 224 -158 -242 88 -140 -108 -101 -285 -53 98 20
5793 20 -101 -73 -23 -121 190 130 -112 -54 -81 42 -152 -178 360 -26 -1 325 -197 -34 434 -110 41 259 -87
5816 -87 -13 142 216 -26 252 -80 247 -321 140 -139 -285 -63 85 -61 55 -78 83 43 -356 -141 281
5837 281 -79 216 48 -68 -240 68 12 -7 288 -173 232 107 312 -176 -28 -283 -137 -30 -124 -31 50 5
5859 5 -118 366 -204 183 0 -63 -122 -124 315 361 160 -291 -269 -65 -53 -61 184 -31 -58 246 90 -159 -84 148
5883 148 139 -60 -174 -93 -115 -124 62 22 -2 52 196 130 80 224 -31 -16 15 -24 163 -53 -37 105 -150 172 -157
5908 -157 84 -122 -17 230 -63 -50 -72 162 -20 -219 -140 -113 -250 -150 -290 61 -51 75 -117 82 -55
5929 -55 -106 262 -184 275 83 -7 188 -90 -237 157 -221 -2 -128 132 15 60 211 142 50 -119 -79 -16 -57
5952 -57 23 91 43 230 -53 -78 -119 38 -152 -49 -191 -3 144 226 245 313 222 120 -136 97 -160 15 174
5975 174 -397 -166 -200 127 122 -19 -72 108 -71 -202 -128 -22 242 -17 -18 -80 109 -289 -283 -71 57 129 -50 -173
5999 -173 -106 11 -65 -142 185 22 92 -41 9 -362 -257 -46 206 -144 280 299 -182 49 77 105 -27 -50 166
6022 166 67 155 18 -86 -44 -7 -32 116 311 244 82 -80 61 61 4 -100 253 -57 266 15 80 -8 68 -142
6046 -142 165 78 -164 -53 -27 -148 -29 -71 -62 -116 15 143 153 -44 -32 -233 -208 -276 -75 -289 40 180 -145
6069 -145 241 360 -245 26 59 54 153 36 144 -49 357 -61 1 -155 -92 208 -108 -216 -20 341 170 -120
6091 -120 -289 -67 110 -35 107 -286 195 117 140 23 263 -46 -174 -18 -102 -158 -35 -63 84 -171 106 -66
6113 -66 103 21 -47 128 17 -75 37 175 -81 80 -15 -80 -84 -131 303 -62 30 -144 -317 -96 230 157 -2 194
6137 194 11 82 -129 -326 255 -40 -114 -245 64 -68 420 46 -40 35 -150 -85 342 254 466 221 -51 -148
6159 -148 -20 190 101 -270 99 -46 10 -114 -224 -190 -31 -118 30 213 -51 -328 137 -94 24 384 -344
6180 -344 -277 -93 32 93 -23 315 -67 -193 24 -215 111 -285 124 5 -281 11 187 191 -122 205 -23
6201 -23 -153 303 81 -163 219 156 -27 73 -169 36 -17 -153 80 81 102 205 -8 -165 378 239 180 455
6223 455 -302 4 15 -67 178 -178 -42 22 75 138 218 -56 115 -138 348 -91 -191 54 -446 -214 -6 81
6245 81 399 -272 16 193 -172 -169 -7 83 -5 77 26 282 -126 17 135 -98 -217 -105 94 -89 -78 -86 -205
6268 -205 189 181 201 156 -68 52 -12 -10 -67 -425 12 129 -27 117 136 -183 -239 -132 -14 -29 93 95 -59 112
6292 112 -203 -37 -94 -84 -180 158 -175 48 -47 -117 82 -246 -60 -165 -52 -16 326 -27 -247 82 -84 -79 -67
6315 -67 113 170 70 134 -190 -118 92 104 240 -158 190 90 235 -257 -118 -64 -60 149 57 -225 -5 -85 -67 -109
6339 -109 30 -183 -209 -12 -215 247 -46 -155 -112 7 70 -152 108 76 -312 -198 -219 -106 19 99 -42 -32
6361 -32 -4 -97 -232 -98 -365 146 -74 14 86 -46 -243 -35 155 -24 -250 -4 43 203 124 -82 -108 -165 -83
6384 -83 16 -152 85 -30 70 44 -166 364 195 147 154 -51 91 118 -4 -225 -60 -291 -272 107 -157 445 9
6407 9 170 -126 55 -50 -310 359 -138 49 -202 61 -267 -33 -66 -273 122 123 254 -296 -190 9 -109 -115
6429 -115 104 -193 143 222 69 175 -421 112 78 40 212 -210 38 218 20 221 -319 -236 0 -12 67 42
6451 42 -168 31 -45 -176 75 260 69 -119 -34 235 -29 -63 -57 -291 0 -96 66 -256 -127 -96 86 -108 74
6474 74 45 150 130 -305 30 69 -182 275 227 -98 -99 -269 -11 -140 -226 -201 263 104 -18 -175 139 -25 -27 238
6498 238 -43 -85 132 -189 56 -196 -209 -190 64 135 -116 -63 13 -116 200 63 -134 -28 -337 18 331 -24
6520 -24 -17 -39 44 333 -61 150 -119 -109 -174 27 18 -228 54 -3 10 18 -217 -410 -158 41 -199 228 106 22 -47
6545 -47 -87 -28 158 -456 -17 -118 -336 103 -130 65 -139 -32 -130 171 48 82 -376 20 -63 -171 152 -161
6567 -161 -118 -15 -4 109 -24 16 -174 -6 -81 271 245 -155 35 114 363 235 -150 -75 -14 -86 -11 -26 -424 229
6591 229 31 -129 143 -141 47 -144 -227 -108 -64 180 -15 40 -367 -119 154 178 10 -32 72 -75 34 8
6613 8 -13 -29 189 79 -103 251 -126 -246 178 149 39 -241 149 317 85 123 -38 -178 9 -45 269 289 143
6636 143 -45 110 -139 -16 79 -188 192 -137 -17 -101 -151 174 94 150 95 167 207 182 127 -186 -271 20 123 140
6660 140 80 19 108 154 149 -48 -37 12 124 -108 26 -54 -36 -17 -58 11 -73 -140 201 97 305 227 -93 -258 98
6685 98 -92 284 205 -245 -15 -89 -227 86 135 -318 -101 19 148 73 410 502 -20 -76 -102 -99 106 290 258 -6
6709 -6 -59 -117 126 -48 278 -126 151 4 -44 -214 -69 -50 -9 95 129 -136 38 256 62 -76 92 113 -49
6732 -49 57 -92 109 31 -110 -117 70 74 74 37 174 125 134 20 -30 -1 125 -283 -114 -204 77 -10 -44 -51 -45 -60 21 -82
6760 -82 -179 -192 -182 169 -14 -84 -17 362 9 -111 -34 15 9 -253 -222 -136 40 283 -194 28 -197 118 15 172
6784 172 198 -235 453 -279 91 253 198 103 -32 62 -173 129 6 28 65 -176 18 -9 102 101 -41 238 -289
6807 -289 -24 -52 39 269 137 -53 124 87 93 -272 -164 204 45 9 77 -114 69 109 -221 -48 -214 -76 -118
6830 -118 -18 213 -129 43 102 -213 337 94 57 300 62 -150 -162 -279 -20 51 11 200 -37 -34 185 147 -3
6853 -3 -104 -23 -121 204 265 150 -276 -103 -143 12 -325 -243 319 127 131 11 199 336 255 4 51 -229 -123 158
6877 158 -46 67 -103 -45 -48 132 -198 169 88 -96 49 -330 -140 -42 -256 80 -33 -97 297 -177 -14 12
6899 12 38 -137 -201 -260 -189 -308 51 29 11 94 58 165 192 47 -149 -162 -33 -68 -31 198 -51 123 -94 0 -236
6924 -236 124 -93 -47 78 -62 181 329 -76 144 37 2 404 -3 -269 -207 239 -68 -3 -279 319 211
6945 211 -143 31 -344 -266 -191 26 98 175 97 124 284 -125 128 94 22 30 27 45 451 -149 191 247 -58 -38 -162
6970 -162 153 350 -307 -123 -55 -237 26 -30 162 -112 -54 -5 -263 24 155 14 -366 246 -72 -36 140 -143
6992 -143 -107 -278 152 125 -195 -323 -101 5 236 -231 -97 -103 -178 4 58 34 54 -235 243 -86 264 -119 187
7015 187 -118 17 -170 73 285 -36 9 -266 -171 287 20 -17 56 -220 -229 5 192 89 -38 -39 -336 -90 92
7038 92 -216 98 -12 230 38 -152 -285 31 22 180 206 157 -244 191 -290 -32 26 -103 -88 -74 113 173 -4
7061 -4 -119 75 356 -73 -61 54 317 76 73 -110 129 -153 154 -127 24 140 -175 111 -1 17 -96 -190
7083 -190 38 93 8 42 -74 130 129 -25 26 176 -136 61 45 -23 75 185 -105 -305 -104 11 -53 220 270 278
7107 278 126 -82 39 -303 103 192 -106 -88 34 -62 108 85 207 277 99 -62 24 10 -322 -98 58 91 31
7130 31 99 -30 67 -146 101 -172 133 -83 -60 42 -130 210 142 -55 -33 -2 -206 -177 -250 -107 97 81 -109
7153 -109 -25 -109 290 -123 -268 -35 323 340 153 -51 -233 107 -3 308 176 -312 117 -177 -212 -146 248 131
7175 131 21 110 -41 -104 -92 269 126 130 107 -25 -240 -112 -82 -40 82 55 -187 13 -152 -73 -95 -226 352 63
7199 63 48 43 47 136 187 294 -16 275 -41 -250 -25 -225 408 -95 -464 -258 -95 302 47 -94 -49 51 -149
7222 -149 228 -87 326 53 236 -19 -26 -316 -76 222 -140 -76 263 92 -147 161 54 141 -267 174 182 -187
7244 -187 -189 -30 -121 -91 71 -78 107 63 124 25 82 291 -58 252 -138 14 65 111 -351 -223 138 36 38 -219
7268 -219 -14 109 56 -228 -108 131 -244 98 -140 142 -14 -146 -125 290 196 -85 169 -44 -101 125 171 193
7290 193 -72 -15 -89 193 -142 -91 -237 -27 71 58 -18 22 -16 -1 -82 -290 61 129 121 -4 -7 -94 -293 21 147
7315 147 23 141 90 -121 -121 191 -185 -48 36 106 61 -52 107 -69 43 254 -50 -555 -41 -141 -253 -175
7337 -175 -145 9 -204 56 -12 192 118 -27 -376 -49 -6 76 13 166 -336 -51 -123 -122 -163 66 -185 -74 -84 35
7361 35 -129 259 -289 -32 199 335 -162 -23 64 -300 -147 20 -156 161 -223 148 -81 153 -122 -184 152
7382 152 -87 267 238 138 159 -70 133 -97 161 54 83 94 56 -47 -280 45 175 -188 14 115 -21 260
7404 260 -102 -65 -73 178 18 228 231 159 21 -2 -7 15 57 -154 152 3 -4 42 -83 -30 84 -189 -19 177 -92
7429 -92 -49 43 159 347 -172 -185 100 271 -8 128 -35 -82 -205 -176 159 -4 222 115 137 24 175 150 -117
7452 -117 -140 -308 2 -214 -343 67 -216 -204 -130 4 -110 -165 -264 285 -44 38 -165 -110 8 5 125 34 125 41
7476 41 -69 -163 334 31 -4 -92 -195 -114 -369 261 163 -60 -11 -67 256 -385 268 190 -46 -85 -295 -121 -249
7499 -249 131 -162 348 164 119 -24 -114 -28 -60 120 -2 167 -139 110 -146 -209 146 89 129 -83 -304 61
7521 61 122 -220 115 50 -51 24 54 -106 -235 -24 164 289 487 -282 -145 -197 -14 -284 -200 -29 -124 23 -76
7544 -76 -103 -26 -81 -132 -167 -50 319 139 -28 -169 119 -265 -54 -158 77 -107 24 356 -23 -34 -259 -66
7566 -66 77 -184 18 -201 -44 -99 100 85 297 161 -25 -481 126 66 33 76 313 7 -31 186 -199 13
7588 13 -110 -344 -223 -223 -138 -284 -82 245 222 -6 -259 86 -174 124 -34 337 127 -60 159 71 96 -109
7610 -109 339 88 -238 -224 -128 119 271 90 211 104 129 -22 -142 50 114 46 -62 117 157 -248 79 20
7632 20 57 -81 215 98 141 290 -25 224 126 47 40 -183 -29 57 -63 252 212 -4 5 -125 230 114 -314 247
7656 247 131 -96 37 -161 66 -23 -189 22 -102 -53 15 -84 -71 -100 -440 27 132 -15 -105 122 89 -240 74
7679 74 -43 21 25 3 -42 -49 154 69 -306 22 -117 -50 218 -256 61 -37 81 40 -8 20 -231 -55 113 136 16
7704 16 -54 145 7 -39 144 115 54 102 177 -211 114 -120 103 218 71 -42 131 179 11 -142 -9 237 -205
7727 -205 -24 -57 -193 11 120 -172 -160 218 275 16 -35 -30 -69 -161 -54 48 -274 153 144 -14 1 70 -24 327
7751 327 -11 87 140 35 -125 59 34 -4 -37 67 -174 -50 -107 -91 -375 315 10 146 -36 -10 -13 -229 236
7774 236 -173 -246 -219 -108 115 -23 169 253 163 145 144 322 57 18 278 -35 -67 -26 233 -5 286 29 -159
7797 -159 -176 -157 32 91 -128 -229 -66 252 -65 -13 314 104 -54 -127 -234 -170 -313 389 380 -80 -266 24 -15
7820 -15 -20 204 -78 0 -113 -36 -143 163 60 -335 -34 467 74 251 57 92 15 85 -140 450 -283 -33 366
7843 366 -177 85 -345 -46 38 77 -106 -22 37 42 137 184 -6 -93 -66 137 221 82 -50 27 -30 34 -182 -312 -279
7868 -279 236 162 -211 86 160 12 63 156 273 -58 176 -271 145 190 -12 229 -108 -251 241 -42 -87 492
7890 492 -71 -217 -66 -13 454 273 -151 -98 176 239 71 49 187 76 109 -77 160 -87 -192 64 112 122
7912 122 -343 -5 47 -1 -160 -92 -22 -18 -83 5 158 -97 29 -151 152 -123 -80 196 -162 -29 -137 136 53
7935 53 234 -58 -211 -98 -208 -106 31 -388 -96 64 229 -211 -155 -123 -138 -299 -169 217 -172 121 -137
7956 -137 -104 -40 31 -255 -129 48 -117 90 -287 21 13 -66 41 37 249 9 139 71 -12 44 -110 110 81 -59
7980 -59 -91 161 66 53 -247 44 -24 -302 -54 -118 130 136 -112 61 -288 343 256 133 76 -26 -260 30 173
8003 173 325 -122 -126 -244 44 298 -32 -3 38 173 33 175 13 29 49 -1 -99 159 147 132 114 61 66 -143 -90
8028 -90 -12 -97 -10 -16 -97 35 232 42 -65 183 -88 -313 -64 105 -38 -86 -160 -26 -69 -143 -203 346 16 -104
8052 -104 -71 45 28 293 233 158 47 224 -317 -140 48 -104 64 -48 -98 116 -54 29 -11 23 36 187 -367
8075 -367 16 -22 264 28 154 -81 183 118 -190 60 -317 38 -40 85 -14 -221 3 -23 96 -99 -180 27
8097 27 310 -162 -340 72 -159 -108 -103 -30 150 24 161 87 68 -317 -32 86 -179 -57 123 62 -16 -396 167
8120 167 118 -311 -211 152 -229 18 -17 61 18 -99 189 -169 -12 -47 -389 80 109 103 185 162 56 49 -99 338
8144 338 -56 253 -48 -80 -203 -78 -213 -273 95 355 -31 96 -75 -20 -15 335 56 230 157 514 158 33
8166 33 -73 -53 238 -37 -83 -47 39 0 120 -220 131 -108 100 26 -129 90 -117 1 -57 190 -202 -4 -96
8189 -96 58 -142
8191a42
##END NTUPLES=NMR FID
##END=
