##TITLE=1H_DE-30_DMSO_TFA
 DMSO-d6
 8 sc, 
 29.7.2024
##JCAMPDX= 6.0         $$ Bruker NMR JCAMP-DX V2.0
##DATA TYPE= NMR FID
##DATA CLASS= NTUPLES
##ORIGIN= UXNMR, Bruker Analytische Messtechnik GmbH
##OWNER= root
$$ XWIN-NMR		Version 3.5
$$ Mon Jul 29 14:56:35 2024 Russian Standard Time (UT+4h)  she@DPX200
##.OBSERVE FREQUENCY= 200.1315
##.OBSERVE NUCLEUS= ^1H
##.DELAY= (6, 6)
##.ACQUISITION MODE= SIMULTANEOUS
##.ACQUISITION SCHEME= undefined
##.AVERAGES= 8
##.DIGITISER RES= 18
##SPECTROMETER/DATA SYSTEM= spect
##.PULSE SEQUENCE= zg30
##.SOLVENT NAME= DMSO
##.SHIFT REFERENCE= (INTERNAL, DMSO, 0, 15.7039)
##AUDIT TRAIL= $$ (NUMBER, WHEN, WHO, WHERE, WHAT)
$$ ##TITLE= Audit trail, XWIN-NMR		Version 3.5
$$ ##JCAMPDX= 5.01
$$ ##ORIGIN= Bruker BioSpin GmbH
$$ ##OWNER= she
$$ F:/spectra/data/she/nmr/H-F/1/audita.txt
$$ ##AUDIT TRAIL=  $$ (NUMBER, WHEN, WHO, WHERE, WHAT)
(   1,<2024-07-29 14:55:28.68 +0400>,<she>,<DPX200>,
      <created by zg, POWCHK disabled, PULCHK disabled
       configuration hash MD5:
       00 E9 B6 7A A2 85 ED C7 34 08 36 98 17 FE 4E 26
       data hash MD5: 16K
       5E 27 09 F2 24 30 66 5E DD 87 59 B7 49 12 0D 26>)
$$ ##END=
$$ 
$$ hash MD5
$$ 48 6B E8 ED 96 5A 11 89 2F 89 BC D9 CB B8 73 C1
##$RELAX= 
##$RELAX= 
##$RELAX= 
##$RELAX= 
##$RELAX= 
##$RELAX= 
$$ Bruker specific parameters
$$ --------------------------
##$DU= <F:/spectra>
##$EXPNO= 1
##$NAME= <H-F>
##$PROCNO= 1
##$TYPE= <nmr>
##$USER= <she>
##$AMP= (0..31)
100 100 100 100 100 100 100 100 100 100 100 100 100 100 100 100 100 100 
100 100 100 100 100 100 100 100 100 100 100 100 100 100 
##$AQSEQ= 0
##$AQ_mod= 1
##$AUNM= <au_zg>
##$AUTOPOS= <>
##$BF1= 200.13
##$BF2= 200.13
##$BF3= 200.13
##$BF4= 200.13
##$BF5= 200.13
##$BF6= 200.13
##$BF7= 200.13
##$BF8= 200.13
##$BYTORDA= 1
##$CFDGTYP= 0
##$CFRGTYP= 5
##$CHEMSTR= <none>
##$CNST= (0..31)
1 1 145 1 1 1 1 1 1 1 1 1 1 1 1 1 1 1 1 1 1 1 1 1 1 1 1 1 1 1 1 1 
##$CPDPRG= <>
##$CPDPRG1= <>
##$CPDPRG2= <>
##$CPDPRG3= <>
##$CPDPRG4= <mlev>
##$CPDPRG5= <mlev>
##$CPDPRG6= <mlev>
##$CPDPRG7= <mlev>
##$CPDPRG8= <mlev>
##$CPDPRGB= <>
##$CPDPRGT= <>
##$D= (0..31)
0 1.2 0 0 0 0 0 0 0 0.06 0 0.03 0 0 0 0 0.0002 0 0 0 0 0 0 0 0 0 0 0 0 
0 0 0 
##$DATE= 1722250528
##$DBL= (0..7)
120 120 120 120 120 120 120 120 
##$DBP= (0..7)
150 150 150 150 150 150 150 150 
##$DBP07= 0
##$DBPNAM0= <>
##$DBPNAM1= <>
##$DBPNAM2= <>
##$DBPNAM3= <>
##$DBPNAM4= <>
##$DBPNAM5= <>
##$DBPNAM6= <>
##$DBPNAM7= <>
##$DBPOAL= (0..7)
0.5 0.5 0.5 0.5 0.5 0.5 0.5 0.5 
##$DBPOFFS= (0..7)
0 0 0 0 0 0 0 0 
##$DE= 6
##$DECBNUC= <off>
##$DECIM= 24
##$DECNUC= <off>
##$DECSTAT= 4
##$DIGMOD= 1
##$DIGTYP= 9
##$DL= (0..7)
0 120 120 120 120 120 120 120 
##$DP= (0..7)
150 150 150 150 150 150 150 150 
##$DP07= 0
##$DPNAME0= <>
##$DPNAME1= <>
##$DPNAME2= <>
##$DPNAME3= <>
##$DPNAME4= <>
##$DPNAME5= <>
##$DPNAME6= <>
##$DPNAME7= <>
##$DPOAL= (0..7)
0.5 0.5 0.5 0.5 0.5 0.5 0.5 0.5 
##$DPOFFS= (0..7)
0 0 0 0 0 0 0 0 
##$DQDMODE= 0
##$DR= 18
##$DS= 0
##$DSLIST= <SSSSSSSSSSSSSSS>
$$ [...]
##$SUBNAM2= <"">
##$SUBNAM3= <"">
##$SUBNAM4= <"">
##$SUBNAM5= <"">
##$SUBNAM6= <"">
##$SUBNAM7= <"">
##$SUBNAM8= <"">
##$SUBNAM9= <"">
##$SW= 24.0689530833862
##$SWIBOX= (0..15)
0 0 2 0 0 0 0 0 0 0 0 0 0 0 0 0 
##$SW_h= 4816.95568400771
##$TD= 16384
##$TD0= 1
##$TE= 0
##$TE2= 300
##$TE3= 300
##$TEG= 300
##$TL= (0..7)
0 120 120 120 120 120 120 120 
##$TP= (0..7)
150 150 150 150 150 150 150 150 
##$TP07= 0
##$TPNAME0= <>
##$TPNAME1= <>
##$TPNAME2= <>
##$TPNAME3= <>
##$TPNAME4= <>
##$TPNAME5= <>
##$TPNAME6= <>
##$TPNAME7= <>
##$TPOAL= (0..7)
0.5 0.5 0.5 0.5 0.5 0.5 0.5 0.5 
##$TPOFFS= (0..7)
0 0 0 0 0 0 0 0 
##$TUNHIN= 0
##$TUNHOUT= 0
##$TUNXOUT= 0
##$USERA1= <user>
##$USERA2= <user>
##$USERA3= <user>
##$USERA4= <user>
##$USERA5= <user>
##$V9= 5
##$VALIST= <valist>
##$VCLIST= <CCCCCCCCCCCCCCC>
##$VD= 0
##$VDLIST= <DDDDDDDDDDDDDDD>
##$VPLIST= <PPPPPPPPPPPPPPP>
##$VTLIST= <TTTTTTTTTTTTTTT>
##$WBST= 1024
##$WBSW= 4
##$XGAIN= (0..3)
0 0 0 0 
##$XL= 0
##$YL= 0
##$YMAX_a= 189092
##$YMIN_a= -63003
##$ZGOPTNS= <>
##$ZL1= 120
##$ZL2= 120
##$ZL3= 120
##$ZL4= 120
##$ABSF1= 10
##$ABSF2= 0
##$ABSG= 5
##$ABSL= 3
##$ALPHA= 0
##$AQORDER= 0
##$ASSFAC= 0
##$ASSFACI= 0
##$ASSFACX= 0
##$ASSWID= 0
##$AUNMP= <proc_1d>
##$AZFE= 0.1
##$AZFW= 0.1
##$BCFW= 1
##$BC_mod= 2
##$BYTORDP= 1
##$COROFFS= 0
##$CY= 11.3945322036743
##$DATMOD= 1
##$DC= 2
##$DFILT= <>
##$DTYPP= 0
##$F1P= 15.6554695791079
##$F2P= 12.8336369535428
##$FCOR= 0.5
##$FTSIZE= 0
##$FT_mod= 4
##$GAMMA= 1
##$GB= 0.15
##$INTBC= 1
##$INTSCL= 1
##$ISEN= 128
##$LB= 0.24
##$LEV0= 0
##$LPBIN= 0
##$MAXI= 10000
##$MC2= 0
##$MEAN= 0
##$ME_mod= 0
##$MI= 1.114404
##$NCOEF= 0
##$NC_proc= 0
##$NLEV= 6
##$NOISF1= 3.799351
##$NOISF2= 2.8
##$NSP= 1
##$NTH_PI= 0
##$NZP= 0
##$OFFSET= 15.70392
##$PC= 1
##$PHC0= -25640.24
##$PHC1= 8.587491
##$PH_mod= 1
##$PKNL= yes
##$PPARMOD= 0
##$PSCAL= 0
##$PSIGN= 0
##$REVERSE= no
##$SF= 200.130013532006
##$SI= 16384
##$SIGF1= 3
##$SIGF2= 2
##$SINO= 400
##$SIOLD= 16384
##$SREGLST= <1H.CDCl3>
##$SSB= 0
##$STSI= 0
##$STSR= 0
##$SW_p= 3612.71676300578
##$SYMM= 0
##$S_DEV= 0
##$TDeff= 0
##$TDoff= 0
##$TI= <>
##$TILT= no
##$TM1= 0
##$TM2= 0
##$TOPLEV= 0
##$USERP1= <user>
##$USERP2= <user>
##$USERP3= <user>
##$USERP4= <user>
##$USERP5= <user>
##$WDW= 1
##$XDIM= 8192
##$YMAX_p= 0
##$YMIN_p= 0
$$ End of Bruker specific parameters
$$ ---------------------------------
##NTUPLES= NMR FID
##VAR_NAME=  TIME,          FID/REAL,        FID/IMAG
##SYMBOL=    X,             R,               I
##VAR_TYPE=  INDEPENDENT,   DEPENDENT,       DEPENDENT
##VAR_FORM=  AFFN,          ASDF,            ASDF
##VAR_DIM=   8192,          8192,            8192
##UNITS=     SECONDS,       ARBITRARY UNITS, ARBITRARY UNITS
##FACTOR=    0.0002076,     1,               1
##FIRST=     0,             0,               0
##LAST=      1.7004516,     0,               0
##MIN=       0,             -63003,          0
##MAX=       1.7004516,     189092,          0
$$ Real data points
##PAGE= N=1
##DATA TABLE= (X++(R..R)), XYDATA
0 0 0 0 0 0 0 0 0 0 0 0 -4 8 -8 8 -8 14 -16 16 -22 24 -30 33 -40 48 -54 61 -70 80 -91 103 -116 131 -147
33 -147 166 -184 206 -229 253 -283 312 -349 384 -425 472 -521 578 -639 713 -793 888 -997 1123
52 1123 -1274 1464 -1703 2014 -2444 3072 -4107 6229 -24090 62096 15511 -11998 100222 46904
66 46904 15579 71557 53149 13740 49037 71417 75608 69476 73549 69063 36846 29571 41072
79 41072 632 -18587 7066 7524 -2437 4997 -2076 -10445 -13960 -18278 -23597 -38188 -36911 -15473
93 -15473 -17326 -16467 1364 -8760 -16189 2261 -4219 -18414 -7280 -2827 -1718 7347 9218 8752
107 8752 8637 7256 10256 4477 -3389 4322 4660 518 9970 9474 -742 5441 7544 -2969 -4188
122 -4188 -1803 -4453 -2953 477 1349 -1091 -1718 1776 -776 -5258 -2680 -2715 -5416 -173 2753 -1580
138 -1580 55 3211 365 -1311 -242 -758 -1678 -280 2407 1294 205 2643 2048 -710 342 55
154 55 -2290 -938 1583 -186 -194 1399 738 -140 179 -622 -1450 -1138 190 419 66 596 873 -247 287
173 287 -131 -1114 -514 228 69 187 757 753 384 299 61 -343 -519 -406 27 -312 298 788 204 21 425
194 425 -463 -1066 76 -147 -153 24 355 180 172 111 63 -334 236 342 -365 -52 654 188 -85 332 -1 -178
216 -178 34 -53 -292 146 542 64 -76 294 -68 -32 182 -269 -248 -55 59 90 -184 382 324 -36 -311 -182
238 -182 -125 -317 85 321 59 -149 205 -170 165 107 -218 -211 118 -398 -91 38 283 14 -12 27 -224 -145 -111
261 -111 -50 83 -142 279 -130 -247 39 -252 -398 -48 51 76 92 168 163 -178 -157 25 47 -15 -214 -113 225 87
285 87 89 -226 180 105 -58 -151 8 207 304 -28 -216 -1 82 -101 -57 254 130 134 -265 203 74 103 33 177
309 177 -163 -269 49 -7 -68 160 180 49 20 219 -229 159 -185 -59 -170 67 -107 65 192 -115 -126 38
331 38 332 -80 29 134 91 12 -173 196 14 -104 -14 50 130 34 -92 -6 -10 34 -103 -48 141 188 90 -127 -134 232
357 232 146 -156 255 -4 147 11 68 60 -130 86 -114 -113 -226 138 122 68 -54 -177 -298 -42 -34 15 -154 -180
381 -180 136 -84 116 135 71 -167 30 92 -111 204 93 -114 222 157 -88 -332 81 196 108 100 11 -55 16 -124
405 -124 30 289 -49 -18 -93 -85 -30 -203 335 -104 -30 -77 112 199 -37 -40 74 350 123 35 -107 -255 -98 -307
429 -307 126 -22 144 11 62 -17 544 -30 78 73 -3 45 52 -76 -96 156 -3 -68 -14 -61 -141 57 71 47 -103
454 -103 73 -80 376 66 56 258 -113 221 137 8 105 289 259 111 54 122 477 5 202 193 -3 35 -283
477 -283 -24 186 -63 -236 224 35 -103 214 -297 -175 81 11 447 94 201 169 153 -63 166 180 -202 64
499 64 60 -159 84 104 -55 302 249 -34 171 -8 -85 182 107 124 209 -420 5 48 272 -110 -75 -6 -95 228 138
524 138 60 16 -96 -82 -138 99 98 23 -53 -197 -53 0 -130 -307 88 -90 -73 -196 150 -113 -103 -181 77 212
548 212 190 -190 -109 -190 -235 220 167 15 153 -3 -222 -69 46 48 42 84 136 -32 234 108 -33 260 44 144
572 144 -54 -208 -96 16 -109 -210 266 -81 -38 -294 203 -57 -16 55 -124 69 -25 46 3 -34 -389 -80 -158
595 -158 -22 118 -104 143 -118 -215 -286 -28 159 -69 228 -27 173 -105 -143 44 53 -106 93 -92 5 -75 -376
618 -376 27 -37 -116 44 -6 -120 -130 -42 71 184 190 -162 -1 -112 39 42 -217 181 -199 -48 -115 -55 -227 -144
642 -144 96 26 179 -76 -140 240 42 -55 45 44 73 -171 -106 -15 50 48 16 323 16 113 123 53 128 81 -177 -173 -73
669 -73 -179 -196 59 -86 133 131 -67 154 -146 -236 -156 -293 -52 6 -5 138 187 -109 -177 104 90 185 -15 172
693 172 275 220 -124 60 174 14 -109 -88 20 108 -32 -42 -156 -283 152 215 99 265 47 8 37 72 201
716 201 77 64 49 135 162 -149 -176 88 111 -281 -79 78 66 247 28 -62 21 65 -67 245 126 98 -85 -68
740 -68 -334 -86 59 -28 -18 23 -95 434 -98 162 175 -189 173 166 57 -17 234 -120 138 -47 164 -103 -104 -123
764 -123 -286 96 155 181 -74 -131 -25 45 -21 -111 3 -73 -141 362 92 38 -12 254 416 30 77 155 124 -73 -285
789 -285 50 171 137 188 -310 46 171 37 230 134 204 -33 220 -392 75 -129 -154 194 72 -74 122 99
811 99 163 -12 216 217 -87 103 -149 105 222 -66 -55 -83 -51 -114 -137 -109 60 69 100 130 -106 -294 -43 18 138
836 138 121 -485 -243 -253 -16 -279 -237 73 245 80 -6 105 159 28 51 294 -157 55 -17 -26 115 173 -17 42
860 42 26 90 -320 -187 -92 -130 162 -132 -230 -165 -68 -199 -20 -91 -48 42 33 -160 -30 -75 474 -147 -263 19 -139
885 -139 -29 -78 -59 87 50 -272 0 -90 5 317 22 252 -157 -74 -124 -211 226 -10 -278 -128 -42 -195 -21
908 -21 -71 145 4 -25 -200 -119 39 161 -273 -314 -3 126 -6 15 325 10 -19 131 100 -156 1 123 84
931 84 226 107 -50 170 -76 -152 -151 189 26 -105 124 -182 -203 -291 11 208 41 -62 63 89 41 -88 92
954 92 9 -29 322 -124 23 67 23 213 -150 102 317 -107 -252 -9 104 175 13 125 190 97 78 212 34
977 34 -46 69 -31 130 -116 -180 -116 -3 24 -192 -164 -41 -245 99 236 -265 -105 229 8 -120 44 -216
999 -216 -24 -52 -173 -18 102 -3 47 -263 -14 35 -80 25 -149 -107 -314 188 189 133 -20 379 39 -90 -246
1022 -246 250 -40 -32 242 118 16 -108 -70 -106 169 -221 -204 -185 -69 -203 253 -226 -143 35 129 45 181 127
1045 127 42 -177 199 165 -103 119 287 20 -130 -57 -76 -100 -280 80 78 2 -44 26 -41 48 -220 -194 77 -113
1069 -113 46 -17 -76 -152 -119 19 28 -193 205 270 -33 37 -38 69 248 -238 18 287 -132 39 175 -33 -204
1092 -204 -90 -156 -117 -13 5 -136 91 -338 38 261 -415 25 -71 162 39 123 -106 -191 -113 -148 -101 45 81
1115 81 -33 -158 144 126 184 -190 -73 268 26 -342 322 -134 -252 192 -174 -192 113 42 74 117 -233 -22
1137 -22 -327 -123 -120 -191 -17 -106 38 -212 -33 187 -8 -175 169 -67 229 89 205 -223 -72 52 -21 -121
1159 -121 327 72 -55 -115 270 -204 31 122 202 6 219 -85 145 63 182 84 3 -25 -70 35 -128 -108 268
1182 268 321 -42 207 127 -22 26 -56 22 118 -206 48 206 -6 -14 -385 342 241 -263 -75 270 245 185 -29
1205 -29 -259 -193 5 140 -151 263 68 -74 -69 -27 19 168 22 -168 75 139 -1 70 131 31 18 -49 -188 -50
1229 -50 149 -144 -36 170 -239 -212 173 100 62 -252 23 128 -87 -165 105 235 440 -15 -149 207 6 341
1251 341 -27 64 90 -3 79 -96 49 -308 -129 -42 90 -186 178 193 -216 210 -2 146 263 -41 178 -75
1273 -75 102 275 205 -193 8 13 -102 32 104 123 -49 272 202 -229 93 235 -25 -198 -148 -149 43 147 184 64
1297 64 -619 83 38 12 151 25 14 -249 -134 -18 134 202 -19 -35 -326 169 205 -207 102 225 -232 159
1319 159 -9 -167 287 -38 -98 76 -23 48 72 90 10 -28 140 -208 45 17 162 64 33 -178 192 8 136
1342 136 131 1 202 81 142 156 -102 -204 -57 -139 257 232 -76 -121 -47 138 92 96 401 -70 211 98 -99 195
1366 195 87 -103 -1 18 81 25 -38 -290 -176 208 106 104 90 125 -11 -57 24 20 319 137 -323 26 69 126 144
1391 144 -161 -119 -8 220 361 -57 189 -49 255 -53 276 305 -290 286 187 -153 -155 268 53 314 180 -220
1413 -220 -92 27 -235 127 -12 119 59 84 -23 145 -147 -218 -159 -21 58 247 35 317 289 -26 121 166
1435 166 -240 100 162 -129 9 54 108 -70 100 -212 149 -217 92 -88 268 -103 119 42 -215 -86 231
1456 231 3 95 -233 53 -57 144 124 -277 -11 -133 -38 264 157 -25 202 65 144 -116 -48 -319 -115 180
1478 180 -40 368 434 63 -297 234 -6 132 370 133 121 39 -98 -225 75 -12 -115 -107 36 51 -314 -55
1500 -55 -44 -340 -258 140 -24 -110 -16 156 -185 -364 26 -137 -216 -18 251 -25 196 -343 -266 186 -285 50
1522 50 110 260 -63 338 -106 186 93 -222 45 -107 -189 127 -169 58 -41 -205 206 -50 -67 -134 -47 64 48
1545 48 61 2 139 28 26 126 -355 -158 223 -92 132 213 13 33 -56 -137 253 -39 108 32 -110 -37 33 194
1569 194 -456 -26 213 189 169 134 286 98 -195 -68 -17 -253 -96 -238 1 97 -51 -161 -1 81 5 69 5
1592 5 135 145 21 181 -193 286 196 -173 117 47 20 198 74 -71 111 -22 42 389 187 -32 -80 -108 -151
1615 -151 -26 13 -16 -204 -61 90 -92 -86 -148 74 162 101 -59 78 9 -276 -14 73 -56 -57 -40 12 -176 -74
1639 -74 -68 284 151 -351 47 148 -138 241 124 -52 -27 -119 314 118 -154 73 65 52 -9 48 112 87 152 -219
1663 -219 -72 73 -186 67 260 -76 -191 -164 59 -60 -78 108 437 -123 -192 138 173 272 181 -211 3 11 128
1686 128 -192 136 -236 -50 208 -209 167 287 -127 -65 79 21 -166 -125 -62 170 -1 49 22 -276 -24 89
1708 89 -43 -100 -39 261 -264 -132 95 161 -84 146 214 -231 -115 -61 348 174 33 -26 -64 -41 20 -140 32
1731 32 -63 -2 -101 -314 -18 -144 160 253 39 -28 144 -152 122 143 158 46 -53 45 -99 12 -41 172 241 54
1755 54 -132 28 32 18 -103 51 -152 140 283 72 -71 409 111 105 -79 127 140 167 -76 230 21 409 -46
1778 -46 343 288 -142 -120 50 197 76 320 -69 165 -331 -230 0 -45 5 37 -27 -115 36 -251 6 -139 138
1801 138 226 106 -309 245 -2 -156 -95 2 -90 -205 207 4 17 78 -6 -6 -74 84 338 -68 6 92 -331 144
1825 144 143 87 20 -322 30 -289 -95 -253 -139 33 -38 151 7 -184 176 237 -84 -231 -9 208 -255 -23
1847 -23 -57 183 0 -35 319 -24 168 -300 -273 -83 -113 131 -78 -105 67 191 133 -30 194 -48 202 -50
1869 -50 -157 -22 132 310 -281 -64 216 203 266 -217 153 217 43 -24 -174 46 286 -42 90 107 -3 -109
1891 -109 -42 -126 -54 32 29 10 -330 44 -212 235 -46 -103 -108 -84 -4 17 15 -72 -72 82 -129 84 -28 90 35 124 295
1918 295 -42 -123 -317 -147 -82 102 -202 8 -206 -170 -133 123 -11 243 234 -141 99 -11 -275 26 23 -268 -84
1941 -84 115 272 -159 7 26 52 -85 -46 185 134 -521 72 -68 180 25 -63 -52 12 -28 160 -331 23 340
1964 340 -51 16 -251 373 72 46 -129 397 -254 -48 -251 -84 -87 -199 108 -11 -132 -36 70 -6 89 16 17
1987 17 -244 275 -274 -14 -24 -99 99 -135 204 -221 -10 -107 -95 13 153 191 -46 177 210 -25 -394 -15
2009 -15 -30 37 134 118 -235 -217 60 108 -69 -81 -180 -192 -249 -290 44 -86 197 -141 -94 120 74 120 64 267 96
2034 96 139 267 -304 12 -323 276 -23 250 88 -353 -250 -52 43 47 20 62 -45 -225 -20 -321 -302 161 77
2057 77 49 -178 125 321 55 -81 0 -292 -265 78 -221 -3 6 -50 110 72 -261 -36 -222 126 -245 -16 -109
2080 -109 -198 -125 -240 -138 -7 -211 29 125 -132 3 264 -97 -85 39 117 113 227 -20 34 448 -14 331 116
2103 116 -141 44 -258 19 -101 -198 -68 -114 -241 62 294 -115 -16 -205 8 119 -15 -116 -76 155 158 -149
2125 -149 7 47 -62 34 -132 72 -147 -87 -47 -52 21 -41 -268 -4 -2 33 96 -17 80 3 -16 -177 -52 -70 -41 101
2151 101 -23 14 -221 -9 -175 114 -38 176 -247 50 -250 -91 340 -22 71 -247 -83 118 -127 -168 -2
2172 -2 -85 52 -78 225 -105 -132 158 7 73 80 -44 284 -59 -55 45 96 107 12 76 60 -45 295 -154 -211 26
2197 26 -95 -209 110 6 -202 7 249 186 154 -55 15 77 225 342 21 -89 -41 -29 121 175 0 -75 -90
2220 -90 -260 -17 15 -22 247 -276 -128 -164 185 -83 132 58 47 -79 139 20 -11 280 -43 238 97 -169
2242 -169 -100 39 -7 348 58 -41 -73 -184 -70 -100 24 -4 -100 -241 -410 -70 -227 -640 -39 -98 -225 -24 0
2265 0 136 -188 -300 176 47 191 -4 343 244 -159 143 163 -101 -193 -199 -129 58 251 117 82 -19 110 62
2288 62 87 266 -18 -85 -79 3 242 13 63 -254 152 -57 66 -74 205 -69 -146 92 -208 -3 214 72 -185
2311 -185 -261 45 -209 130 -89 -73 -67 -76 22 -121 227 156 -68 -319 29 7 -55 165 -55 -317 39 151 -28
2334 -28 224 53 -3 -58 185 171 -4 23 32 292 -132 -208 -112 165 110 169 10 122 -169 -83 -48 -369 157 -27
2358 -27 192 103 -93 -144 171 50 37 -130 179 98 -92 -109 14 99 -90 -17 35 -43 -89 -51 45 209 -50 -59 152
2383 152 152 -22 -15 -71 -250 -212 15 354 70 168 158 -15 181 -243 136 -85 -20 -455 23 43 -61 28 -71 111
2407 111 -121 -53 -113 195 -77 113 107 -116 164 -375 -12 311 -68 19 153 -5 -152 -104 59 26 139 -4
2429 -4 -72 -247 -314 -195 19 72 -86 215 -35 109 29 320 98 218 344 121 304 -67 -145 -11 161 -104
2451 -104 -278 -95 -52 -241 -101 204 -12 -1 -127 -252 131 26 -138 -133 185 -78 -10 -157 -194 -157 64 87 29
2474 29 278 108 94 -19 86 -231 -44 109 -175 120 172 -86 189 -90 111 57 -402 -134 -23 -146 67
2495 67 -23 -235 141 3 -56 -131 22 -187 -285 -143 118 -65 14 -42 174 -41 -33 -61 48 19 -145 14 -26 10
2519 10 -103 -66 -62 -2 -83 -34 91 56 -140 197 55 -36 -18 -156 91 107 48 90 -86 153 41 -98 29 -161
2543 -161 74 -32 -158 51 -172 -16 -203 129 -94 -55 34 -312 237 -89 -21 101 226 23 -132 -93 -163 208
2565 208 109 -110 222 -107 -178 131 114 -141 -10 155 132 -285 34 -70 -150 179 58 -38 148 265 -167 -192
2587 -192 14 247 78 9 165 -59 -172 21 -90 14 108 72 -95 140 20 26 137 178 -38 -100 197 139 54
2610 54 204 -65 -118 -107 -317 -165 -26 -22 -14 223 272 40 -46 -68 204 87 -316 -53 488 47 -461 -201 -2
2633 -2 194 -227 101 -193 48 -127 -121 -344 -62 -8 84 66 38 52 -75 -169 377 -101 63 38 117 -304 89 86 -67
2658 -67 -175 157 -358 43 -251 -17 -77 74 -213 175 -102 -59 -8 -156 147 -56 -231 190 -46 -239 139
2679 139 -362 86 248 -36 67 -14 -290 -157 95 -64 -19 -40 -24 -105 -156 123 19 -269 -150 46 -324 -6
2701 -6 -60 1 169 68 -49 -184 -20 -2 263 -129 -38 -248 194 -53 -234 -77 -99 139 269 108 113 -172 221
2724 221 25 52 48 34 -51 34 184 36 -18 55 71 20 -233 -169 -261 -208 -70 62 142 -123 116 -68 -184 31 93
2749 93 -252 -151 39 -78 74 109 -64 167 -161 -280 122 52 40 -141 -295 -239 -174 229 116 -61 -78 153
2771 153 236 15 12 -19 153 -10 276 215 111 -16 102 -78 94 108 -88 54 61 139 -11 -81 54 -167 -6
2794 -6 188 -29 -61 303 -54 146 135 144 5 -130 17 -219 -68 76 -526 -72 -42 3 225 169 26 -212 205
2817 205 89 -175 -132 -3 439 74 -80 -21 35 43 40 170 87 20 -151 -66 -8 200 20 12 216 -14 -22 135 -18
2842 -18 -235 -63 -249 -27 -121 108 -80 -104 -234 148 -251 -251 179 -174 -36 -265 -101 -36 -139 -180 -32 -72 231
2865 231 0 -173 27 158 13 92 -139 -122 79 -202 48 -19 196 7 -59 -8 84 -71 151 160 341 22 131
2888 131 190 -317 324 171 26 -36 97 24 -226 -84 -5 -231 77 94 -11 198 -43 20 -55 -230 23 49 246
2911 246 116 -18 -113 -179 -164 -36 -2 -183 38 28 69 -177 -12 64 -67 -80 83 255 -202 -61 43 -241 35
2934 35 -78 -108 -98 -140 -24 193 -398 -63 43 146 -10 -80 -287 55 -72 272 -153 -75 -56 84 -151 83
2956 83 356 1 -150 43 -28 -168 139 -76 -237 160 -205 -180 129 159 18 -27 3 -25 26 228 -234 196 -207
2979 -207 153 -28 -288 0 163 -41 -136 99 110 20 -83 -172 40 42 -160 75 312 386 -177 88 28 193 -128
3002 -128 -23 -71 -8 -88 -267 -126 124 121 -23 314 90 91 350 206 44 167 91 -95 -125 -53 -14 93 -43 153
3026 153 -29 -124 -6 423 -4 -247 -100 -217 154 -120 -104 -227 -31 -164 6 156 -245 -250 -92 -1 -10 -135
3048 -135 225 151 209 66 35 78 140 -18 -71 -96 38 109 -273 55 -47 258 17 -50 163 8 -191 254 -146
3071 -146 265 323 296 -61 -40 338 -137 218 -17 83 133 94 -35 70 -81 -262 -115 317 -251 317 -60 -40
3093 -40 152 117 -27 160 177 -143 -3 -49 -189 -371 -172 -13 -273 -125 18 351 -201 145 -44 -48 -96 -30 144
3116 144 -160 139 -69 -39 -211 -106 -10 33 -25 -22 -84 294 117 91 157 -24 -105 274 -22 6 96 473 133 100
3140 100 -202 62 12 -40 -99 -92 -31 -42 134 -204 -59 -78 75 -80 140 143 134 -195 275 81 340 -110 -108 -16 -156
3165 -156 -14 117 81 467 -15 -17 -55 -36 -115 -189 -90 -121 -82 -127 56 -223 -3 137 102 127 131 -82 180 130 -4
3190 -4 -57 -168 -51 -167 104 -12 112 93 -14 -58 83 -275 -325 -133 -147 -77 322 84 98 -15 -166 -67 50
3213 50 111 -166 -90 23 26 -85 -221 13 166 80 17 142 111 -75 129 102 -69 -143 126 133 -1 168 -15 -240
3237 -240 -98 219 -62 61 -149 -113 233 107 119 -165 -40 74 -175 196 -2 150 -80 147 59 67 -16 140
3259 140 28 -64 310 -147 72 -80 284 -116 35 4 -5 -1 -150 -244 125 329 -135 117 161 -4 -382 38 -220
3282 -220 -327 308 -394 -210 170 272 78 -16 -64 -93 66 96 71 -174 35 325 155 210 23 -46 -32 17 212
3305 212 -112 295 42 11 -102 143 320 29 -203 117 41 -9 110 62 335 -34 137 -287 219 -201 247
3326 247 34 -140 85 66 -176 203 76 -231 -235 -15 -115 6 -66 -91 178 -139 89 -64 -198 -52 -408 -8
3348 -8 -65 -27 -19 122 -108 50 -39 -75 29 67 9 89 -33 -142 -9 -157 113 10 -126 -57 47 277 -33 107
3372 107 -1 -79 -207 -141 138 94 3 -65 23 -196 -135 53 -355 -130 170 4 240 318 -126 14 -104 -364 -207
3395 -207 -4 43 -171 -100 -79 137 82 3 -252 74 239 -236 194 331 205 -29 -29 17 39 -117 73 74 13 -216
3419 -216 -171 119 -112 -204 -194 98 -128 3 -25 -35 -233 186 101 86 -25 260 40 -88 -148 -61 122 111 197 -342
3443 -342 80 -230 171 70 120 194 -307 19 -107 263 -60 165 176 74 94 -45 -332 -69 234 56 -156
3464 -156 -228 205 -142 -33 56 284 -80 -208 7 8 67 -150 298 116 -117 -245 0 2 -8 60 -94 245 99
3487 99 -225 -161 -35 192 44 -18 -169 -53 281 40 -156 114 -72 -12 -89 -22 -2 -45 24 166 16 55 106 -79
3511 -79 -38 344 116 -101 155 261 -151 75 -59 -168 110 21 74 -54 -57 142 47 -113 72 125 -183 -60 -109
3534 -109 176 114 -11 -18 158 348 49 -147 -285 -174 117 78 96 -96 -33 178 -15 -79 -20 261 138 134 142 123
3558 123 176 -81 -15 36 -209 170 165 -187 -191 -471 -120 89 151 -43 325 -51 20 229 -208 12 323 173 103
3581 103 -230 -176 -142 -30 -42 128 -164 181 -17 377 44 15 14 38 117 -156 -168 33 272 76 -50 134 417
3604 417 -82 160 30 -159 105 84 -188 -413 -44 -198 101 165 -145 -252 -78 235 167 -125 -57 277 30
3625 30 179 -63 -173 209 51 -19 87 71 -91 -68 -147 191 117 75 -17 -267 -38 -228 256 -2 -109 119 -393
3648 -393 289 -183 -5 -115 244 159 -210 226 -165 7 -30 -39 -52 -256 8 -141 -278 110 -20 201 53 -26
3670 -26 180 -148 -45 -29 37 -53 -84 89 -158 -37 173 -162 -38 -39 -133 -149 -138 -267 155 -37 -87 180 -121 149
3694 149 -174 365 -299 -267 96 24 -133 354 19 10 202 -22 -5 -74 -72 230 -92 -144 -12 7 -159 -103 -154 -11
3718 -11 -75 -73 108 -10 -161 123 108 148 -97 -66 160 74 -97 -91 222 -4 -102 161 10 120 -534 -335 -105 -255
3742 -255 92 90 -15 -74 -67 -39 48 67 53 -137 33 64 30 -16 66 3 21 7 26 -138 -122 -215 165 309 -167 38
3768 38 46 126 -93 24 55 -84 -123 6 -44 114 82 42 8 49 54 -77 157 178 -234 -35 -271 -91 56 -264 22
3793 22 -113 10 19 -69 -331 -94 -105 -149 65 -148 182 -27 98 165 98 100 -241 -303 -40 326 185 -36 74 13
3817 13 281 47 -257 26 -72 -73 61 199 -147 -11 -79 -133 -81 403 -144 -171 52 129 -116 58 158 -141 -102
3840 -102 -198 219 111 -39 96 -192 -428 104 80 148 -57 -113 1 -75 33 -30 -112 228 17 140 38 190
3862 190 107 97 1 -378 253 27 39 -47 141 -263 -186 -9 185 -348 -8 56 23 -140 186 -22 -182 -284 86
3885 86 143 -71 -10 298 135 -323 -202 9 -86 -80 -115 -51 -204 172 325 213 -143 -52 166 159 148 188 20 -94
3909 -94 54 63 -113 319 -140 -111 -106 1 -59 -26 6 39 293 113 -288 -13 -8 186 55 -274 273 -171 -157 475
3933 475 -142 -119 105 163 -181 -118 -62 204 150 35 12 212 116 1 -45 180 5 24 -22 -128 -266 -40 117
3956 117 142 39 3 41 -336 -29 86 130 311 -79 257 -30 -5 11 204 72 -62 -198 84 118 -220 -162 -199
3979 -199 -46 -27 192 -51 -98 321 49 184 18 248 15 136 -30 -196 -42 -162 291 371 32 -124 -283
4000 -283 110 28 326 -212 40 -448 212 196 -221 104 96 -268 -197 63 -135 -45 -61 74 -31 195 -94 -97 -27
4023 -27 38 -67 -14 -196 122 -63 -70 45 -95 -77 257 -255 -112 206 -33 6 45 173 193 -57 38 166 -10
4046 -10 -121 432 187 -147 68 -168 -74 46 47 27 143 105 123 6 -226 -2 -233 -213 80 78 83 78 -150 -164 129
4071 129 92 -30 -39 -56 94 35 -34 -79 51 304 -47 -368 -4 -65 -86 65 -209 -212 -416 78 -127 17 -259 -492
4095 -492 -41 101 168 -122 -119 -19 -10 347 103 -248 48 280 18 466 -143 -80 81 28 112 210 -170 -42 95
4118 95 347 113 -59 -131 -111 -69 9 -52 -265 -166 -63 -80 -164 167 162 68 16 -20 81 -98 -181 171 71 241 222
4143 222 233 -147 346 -225 -17 137 -91 105 -17 153 -224 -229 -73 -27 40 428 -128 102 -154 212 -63 15
4165 15 208 -60 -198 138 -50 81 -36 -87 -49 1 -163 26 244 93 -316 -6 34 4 0 218 75 15 -51
4188 -51 286 -144 -143 65 36 -218 149 135 -153 238 -2 -62 -186 14 -53 74 5 -84 77 88 94 -13 101 -71
4212 -71 49 288 275 -181 -263 -48 -40 23 22 -40 273 5 -127 177 59 167 -14 -116 -5 209 109 42 34 82
4236 82 119 -42 -163 88 -246 -11 119 84 15 -328 -18 82 -207 87 176 137 152 -100 -26 -64 49 5 -186
4259 -186 96 54 45 -109 -110 121 -92 94 10 -146 41 113 -51 -73 130 180 -14 38 -277 130 8 12 15 339 -53
4284 -53 139 -50 222 71 -19 53 -328 -79 -38 -259 155 12 142 -156 264 115 -27 -232 224 -29 309
4305 309 -41 -63 -163 39 44 -107 16 -226 -197 32 -41 59 -118 113 89 -47 57 -153 148 -87 177 150
4327 150 -91 10 -23 44 44 87 -103 120 -94 215 -20 -33 -289 127 61 -27 26 -123 262 -54 -143 249 -84
4350 -84 -109 -119 -109 289 -23 126 184 179 -19 406 -32 198 -65 -3 67 87 -32 -28 27 216 157 -194 34 24 -42
4375 -42 -91 -41 77 15 37 57 -90 217 8 262 -18 1 -490 -160 45 -165 -138 -33 382 -324 -223 106 -293
4398 -293 -143 275 33 -121 -13 -54 -186 83 206 24 -21 103 -5 -118 -107 9 -285 68 49 -126 90
4419 90 -52 -48 -54 34 122 52 24 -93 50 -59 126 -65 212 26 43 -63 -241 -22 51 83 45 -282 -356 106 -266
4444 -266 -373 -64 128 -46 74 62 22 -187 183 270 -220 -2 -248 -511 173 198 -135 -35 -26 -20 -131 120 76
4467 76 -64 -323 -153 112 161 -2 83 217 102 172 -134 112 -19 343 -99 167 -385 104 -19 160 -127
4488 -127 -28 13 246 42 74 167 -143 -203 -44 -39 -50 69 -272 73 -32 219 58 -101 -117 -27 -271 176 309
4511 309 185 -61 40 -80 -22 103 -132 53 265 -251 -106 -163 195 -115 -205 26 35 -115 -295 89 199 -171
4533 -171 -81 -48 409 -28 -306 169 -22 -36 19 -77 -45 196 148 -33 -148 79 -18 -177 -172 -98 -120 67 70 194 47
4558 47 123 -411 289 32 -64 -78 89 -111 -202 22 9 100 133 -291 -150 -40 158 118 132 -213 -218 43 84 -133
4582 -133 144 64 132 -260 32 -35 155 -96 -8 -122 -286 64 -148 134 -208 429 141 -68 -204 -141 152 -102
4604 -102 -13 22 57 93 -176 -151 5 330 -169 -20 79 20 -135 45 -223 94 -25 157 -70 316 -13 28 59
4627 59 74 23 -151 -10 -233 128 219 67 -177 106 -204 -88 -30 26 -56 -189 -12 -61 50 -186 220 245 -439
4650 -439 -2 -153 -23 -119 -45 -300 -132 -89 -5 21 213 19 105 -45 71 -16 -319 -108 -192 50 168 74 362
4673 362 -279 50 -189 233 208 27 -259 -3 32 87 42 39 -42 -160 -99 -152 86 -499 -364 -236 -69 -19 130
4696 130 -46 -213 446 -174 88 121 56 -167 -90 141 -101 50 16 91 -325 78 173 -42 334 81 138 -122
4718 -122 108 -1 148 -121 -162 6 29 -60 -215 -36 -136 -7 -174 -356 -289 45 -177 -132 -50 307 50 -229
4740 -229 -76 51 -51 -111 -139 66 123 -70 -236 15 -46 -30 227 -149 183 -192 -157 -73 -111 -14 55 22 -43 -58
4764 -58 373 77 -64 20 128 42 84 -154 44 106 -48 8 -10 175 10 153 -172 152 179 -42 -6 69 -120
4787 -120 48 -142 -79 228 148 -142 94 -39 -176 -146 -141 -351 -68 274 -232 152 54 78 14 134 -10 15 160
4810 160 -181 -301 -113 -145 11 -21 -64 46 122 -258 -378 -84 50 -1 101 -183 219 -1 -146 10 45 -77
4832 -77 -64 169 -132 -93 186 218 217 -250 -61 118 179 -2 -81 -3 -68 -341 230 -143 -118 53 27 -96 49 -158
4856 -158 -135 -4 -55 14 -329 -93 77 193 -203 -51 -193 -47 -170 -26 -226 -345 66 101 -176 -137 409 36
4878 36 269 -64 73 303 101 40 123 148 147 -309 35 0 94 -66 -110 -88 333 -254 -88 80 -246 187 136 40
4902 40 13 -21 -130 90 141 -118 33 136 119 312 -306 -186 -313 391 203 81 197 144 -7 95 -10 -55
4924 -55 164 -63 -47 -63 234 225 -8 -4 -248 94 118 -143 -77 424 -100 28 -294 -131 182 188 -25 -260 55 -74
4948 -74 160 -320 157 -82 -169 219 -224 -148 116 -35 9 -18 -84 -121 85 73 -124 -49 50 -119 -127 -347 -97 -103 131
4973 131 65 -150 175 91 -49 -51 -43 -257 295 335 162 -79 63 6 -37 55 -53 -198 63 -61 77 58 68 57
4997 57 139 8 284 -82 -39 -197 -227 -218 -99 -80 146 -90 16 130 110 104 137 -31 58 -29 14 -101 131 8 -45
5022 -45 221 -245 -145 -139 9 -402 -413 70 150 16 -249 -51 56 -64 -123 -129 129 145 86 -139 -170 150 3 115
5046 115 100 -5 253 112 21 79 -32 -93 87 38 -130 53 -214 45 -38 73 103 17 -190 205 -85 -136 47
5069 47 125 88 28 -228 47 -106 -37 -160 -117 15 -178 287 -101 37 34 11 -110 -153 -268 17 -84 64 -36
5092 -36 138 -32 -53 -76 -143 -211 -63 -71 -110 -65 -55 -17 116 -144 -148 -69 198 240 27 39 0 -123 -148 -160 215 115
5118 115 -15 -34 324 21 -414 212 -110 -8 64 -59 10 283 -195 124 -117 -203 105 57 -79 -21 120 -257
5140 -257 447 1 265 -123 87 0 75 187 53 326 134 214 -59 -79 -73 149 -397 -139 251 -13 58 -12 -262
5163 -262 40 -28 62 -101 -43 -11 -37 148 -145 -8 162 -64 -61 -7 -72 -56 -128 -242 -130 67 53 -69 268 81
5187 81 -263 183 -61 -401 -90 -191 -162 36 98 -157 -191 -29 -98 136 -170 -202 176 171 49 327 -253 -38 -233
5210 -233 325 -191 64 -98 46 5 -36 -88 332 -48 -140 190 192 208 -298 -209 -139 -265 -153 -244 146 -111 24
5233 24 -114 -29 85 -98 27 46 272 -129 284 30 337 -294 228 -158 -38 -54 -157 164 178 -209 -355 172
5255 172 -192 331 -61 183 316 8 60 -37 -145 -75 162 89 30 -71 -2 60 -54 -20 -170 137 36 -31 -128
5278 -128 177 -176 -247 150 -116 197 -78 2 -124 -70 -45 -76 -235 -101 78 72 -169 -78 -134 83 -209 211 128
5301 128 -16 -174 -181 94 -140 160 -236 -43 -164 158 19 -16 -134 10 19 130 28 102 408 -207 -171 -295
5323 -295 -93 195 125 503 352 -61 -53 110 185 -397 -141 152 105 21 14 -140 232 98 73 75 108 -19 -39 295
5347 295 89 -64 -26 143 -43 133 -69 164 156 -139 -199 -156 235 23 228 190 273 160 104 208 163 274 -88
5370 -88 55 173 40 -74 -97 288 13 163 51 -440 -53 177 35 -457 314 -212 39 23 46 321 -130
5391 -130 -160 79 -115 313 -113 25 139 -131 -34 60 97 210 -274 31 -159 230 -29 45 -15 -100 -93 -83 -107 -197
5415 -197 140 -140 48 -209 -125 208 -167 92 26 -142 -106 -157 -332 -132 -7 -4 138 406 -235 95 -40 -34 52
5438 52 -35 114 -107 133 67 33 73 226 -43 -33 21 -96 169 131 5 -130 -130 -101 194 59 -30 78 134 -212
5462 -212 122 -234 197 73 -88 -205 -92 164 216 -35 -80 90 227 227 168 134 -52 223 -1 -318 36 -330
5484 -330 114 276 87 -57 -15 11 41 98 -52 152 -62 -66 -273 89 117 -5 -163 194 40 22 167 148 -179
5507 -179 69 -77 -119 -54 121 348 237 -40 -47 -228 182 -14 -69 234 174 140 -31 295 119 -205 -44 143
5529 143 -98 -106 63 134 409 -26 -36 163 180 56 -149 -203 8 66 -24 -26 -213 205 179 187 24 44 97 25 117 251
5555 251 47 -45 1 155 -136 -7 11 280 228 -56 51 -61 -260 -187 108 -114 256 69 137 -79 3 -14 196
5578 196 -53 73 -62 -66 -324 -178 64 158 64 121 156 -143 232 -18 104 137 -152 168 -300 -132 -18 36 81
5601 81 -75 129 278 -102 199 -195 -14 121 130 47 182 95 165 -141 249 -285 -222 174 203 -216 203 -53 503
5624 503 111 -255 247 217 65 -47 101 -149 -191 -8 -141 -106 -177 -212 0 236 274 121 -161 -134 -15 144
5646 144 24 -138 -184 73 -115 -216 -26 58 126 -196 -151 -231 22 139 46 64 28 -50 -109 -301 -130 89 249
5669 249 -115 85 -32 -31 -41 -58 1 224 -6 -6 50 140 -314 -70 203 194 114 -119 80 217 171 159 21 -47 -371
5694 -371 -34 149 77 92 -388 44 238 39 96 -76 86 173 -6 328 243 -203 -100 -11 139 65 34 242 -162
5717 -162 24 73 97 -137 -29 249 31 99 128 -94 153 -76 -74 140 187 -181 -45 -62 177 26 -134 76 -262
5740 -262 -42 -9 18 -145 21 89 122 -30 -58 -77 -77 385 -102 -121 1 -155 142 26 103 106 -7 -63 140 -57
5764 -57 177 127 295 -107 85 89 18 229 7 50 48 37 -239 17 39 -107 280 54 86 -161 -13 137 29 -19
5788 -19 73 95 -324 110 -37 -128 277 -15 91 72 -32 -148 -30 119 -163 -91 -78 71 -37 -287 4 -70 -131
5811 -131 206 262 -152 -175 13 126 -63 28 32 -192 -87 -146 -124 38 7 -27 50 72 225 329 89 -282 337 -196
5835 -196 5 -260 25 8 -172 -269 -7 389 159 -67 -9 2 24 -55 -137 -113 99 104 -283 222 -55 14 -12 196
5859 196 -84 15 -16 265 -173 -38 -15 -74 -159 8 174 25 141 76 129 -60 164 -205 -264 -55 -51 93 46 -95
5883 -95 -1 -190 194 79 281 238 -153 31 131 -311 -70 267 -57 -415 -121 -302 124 -114 -60 -327 138
5904 138 -21 106 29 42 -7 -125 209 -138 125 46 51 -238 325 -138 112 103 19 -58 35 192 32 -181 -19 -105
5928 -105 274 -17 -19 -44 165 -36 -85 133 61 65 -203 -245 -62 0 -54 -120 -39 -112 240 145 42 168 10 267 46
5953 46 290 50 260 20 1 -266 -78 128 103 145 -42 229 -104 95 -104 -352 124 1 598 422 97
5974 97 -44 -155 -266 394 181 18 -410 -126 -109 37 21 -109 144 -30 141 106 -125 -36 -34 -15 51 11 -188
5997 -188 -171 304 -256 -90 388 -251 52 68 -112 -38 -146 -162 -63 -23 -406 -66 -58 -111 148 -139 -4 -6 128 -43
6021 -43 -137 35 -44 -165 -90 -218 138 188 -98 -151 -191 -202 -62 117 -170 63 -221 -190 56 -249 -91 -136 165
6044 165 -3 -29 34 -168 -3 143 106 101 -227 -180 -2 -4 -97 254 -100 -191 -30 -24 33 235 258 -167 103 333 -16
6069 -16 -335 -59 201 -164 193 -63 293 269 193 -83 -367 -263 -13 -181 94 -132 29 64 -137 -20 130
6090 130 135 195 -253 -268 111 -139 -326 -222 -100 131 -53 -106 73 -120 -10 -15 -307 125 -123 -149 7 -2 78 -26
6114 -26 -132 -125 93 131 -142 -294 20 285 24 395 243 22 -83 -251 -46 -66 -439 4 63 -216 28 22 -353
6137 -353 -8 -51 -109 -296 9 145 45 -152 -244 -338 -213 239 29 -204 142 69 -92 -394 4 103 253 159
6159 159 -116 16 256 -2 30 -30 95 45 212 -212 72 -146 -92 88 58 -121 -267 -91 165 115 299 2
6181 2 113 225 101 91 -220 -126 154 -84 22 121 0 49 369 306 165 -84 99 126 -266 104 -243 -25 122
6204 122 200 0 -85 -81 25 -72 -128 33 -22 -175 -115 -123 -90 -3 -180 -77 27 303 262 -135 -244 74 -123 198
6228 198 -98 -32 46 35 194 -91 71 212 -205 59 -123 56 -218 110 74 36 -139 -368 146 -47 194 156
6250 156 -298 -369 0 121 69 -139 190 65 271 -62 371 244 219 194 33 282 172 -192 34 34 -106 -147
6272 -147 -221 -76 9 -62 123 21 63 -22 -1 -91 -98 -42 25 -162 44 128 -35 114 -86 -212 -210 23 -61 -28 -95 -144
6298 -144 -109 111 98 127 125 -183 192 -115 201 36 -51 81 -87 -181 90 133 25 -71 -75 45 -318 29 -142 -73
6322 -73 117 12 255 -86 62 -148 93 134 -163 -272 -62 -296 83 -41 114 30 130 -6 372 43 122
6343 122 -61 -34 123 -366 30 25 -66 284 -16 -86 65 -116 222 205 -9 -137 -35 -125 144 -162 169 27
6365 27 -200 -5 -131 -123 -272 -199 -114 -79 -48 -253 126 -141 -95 -6 109 402 314 -157 77 -127 -65 -155 -14 72
6389 72 -261 -94 32 -7 -27 257 2 85 96 -197 -283 65 90 336 -100 92 237 212 12 203 100 -90 -146
6412 -146 55 -15 -216 -467 86 -97 -129 -323 57 44 213 141 -138 189 99 11 -334 -36 -4 21 -254 -47 -29
6435 -29 251 313 6 49 -32 -52 257 12 -75 -92 161 136 26 85 19 0 66 49 34 -184 -17 86 -38 59 5
6460 5 -66 -20 -73 -130 20 77 195 74 -220 63 130 -132 217 -24 181 114 3 105 180 220 -130 122 -233 82
6484 82 -95 76 9 -4 94 198 281 46 -53 82 75 20 8 63 -168 -71 -73 -74 -59 -79 43 -190 -70 -63 -62 262 -218
6511 -218 125 75 31 239 55 217 137 320 59 151 -256 108 289 0 253 14 -179 -228 -392 -289 -139 -130
6533 -130 -145 29 -254 -173 53 13 -219 -95 301 -200 -17 4 -192 56 -245 -126 -103 -160 -80 -123 -380 -167 105
6556 105 131 -63 -226 129 27 -38 -53 -28 -64 -68 133 -76 54 -44 -42 -298 -72 -279 -111 106 178 98 47 82 298
6581 298 211 119 322 -127 -412 56 -324 -117 423 -449 -47 -99 127 -60 -315 132 59 88 -50 -216 -78 -224
6603 -224 -145 -42 116 -258 -49 -365 9 30 201 218 53 313 70 -53 -386 -29 -67 41 84 38 119 -210
6625 -210 -144 139 106 -22 108 -43 112 13 203 243 -112 -116 -192 -345 -23 300 -148 -1 -90 -65 -66 366 241 213
6649 213 -148 -183 143 -71 87 154 -211 -238 277 12 -203 -140 -49 266 183 -209 167 -109 79 104 250 143
6671 143 115 -17 -27 -27 140 146 16 201 -93 171 21 -90 -158 -77 -138 -42 111 -133 198 -62 -89 -199 148 -122
6695 -122 30 -115 -91 -137 -169 -82 26 106 309 -173 -253 122 333 1 50 -73 40 -131 98 66 -107 -299 100
6718 100 18 -294 -13 -123 -55 -13 22 242 65 63 174 -209 -50 11 -26 31 -202 -140 246 -53 91 -119 -239
6741 -239 170 85 -85 -185 202 174 85 28 -174 212 103 105 322 -21 7 -124 63 192 262 170 209 182 136 376
6765 376 -305 268 355 -222 -106 68 -261 -144 -91 -94 -49 124 -157 -3 -98 -81 101 144 -269 -49 101 56 212
6788 212 -55 -72 -59 -43 -92 72 -69 -269 -217 -136 -38 -62 -97 -33 0 -321 269 16 150 194 335 35 224 -171
6812 -171 -8 -51 -140 -62 -62 147 -191 25 -38 7 42 -279 5 -183 -49 -176 49 39 -158 140 65 -102 -156 96
6836 96 132 64 216 64 222 -8 -199 -35 -198 -9 31 -30 -145 -63 -7 -48 180 -99 262 -132 -198 -82 62
6859 62 2 -148 -56 56 -88 -199 155 38 285 -165 -9 92 235 116 -366 7 94 24 146 138 12 35 -22
6882 -22 -238 134 34 -79 -88 8 153 160 -267 -71 -84 -236 195 -27 51 -76 -154 -107 375 -84 -14 -16 167 238 -46
6907 -46 -102 -244 84 13 -37 -163 276 -111 121 69 -193 211 60 -149 8 285 -35 -1 60 -32 -136 47 -26
6930 -26 59 -74 28 44 -190 99 -141 -122 208 -112 197 15 -42 36 -39 -5 40 90 -102 -73 101 119 5 -30
6954 -30 -38 250 13 224 61 -355 -198 -138 -203 -19 121 -74 -105 -143 59 330 -289 -321 -243 -94 83 -224 85
6977 85 -120 -112 87 172 104 -364 -96 207 334 -169 -37 -259 38 -188 -15 -476 -154 182 189 241 313 -297 -258
7000 -258 155 345 263 308 119 -24 -120 8 117 3 -32 -94 74 -240 87 -151 -32 131 194 -87 -141 52
7022 52 -73 11 -124 -179 -33 163 323 -73 19 -378 -77 -51 42 146 102 -4 -144 -15 -217 -144 115 -260 -172
7045 -172 263 -110 14 202 107 75 268 -130 41 -4 37 -29 -289 119 -87 83 294 -57 -103 -180 66 -133
7067 -133 261 32 -23 -19 53 -258 65 252 -116 -188 307 219 -140 -204 -230 291 32 -65 -277 15 -163 -105 -91 -127
7091 -127 -47 108 -22 -3 -146 -77 -291 33 -161 -150 -21 -307 -43 219 -106 -168 114 -154 61 103 -218 -271
7113 -271 111 -277 -67 36 -114 -42 83 228 -176 -106 216 80 -99 154 218 165 -180 187 -141 72 -60
7134 -60 18 -82 341 -12 -253 78 -19 17 -87 117 -215 41 -11 68 -5 -33 35 172 94 77 64 -34 106 207
7158 207 -135 -173 37 -121 29 -26 125 -155 176 -68 153 -398 194 -129 405 -239 -136 -94 139 -190 9
7179 9 -24 124 40 -109 232 -49 138 -201 -58 -169 -287 -6 136 -213 137 18 56 -21 173 118 296 22
7201 22 128 105 100 216 -157 19 -64 301 24 -62 353 -70 -168 -35 -4 -186 -177 -74 -201 26 -158 34 -130
7224 -130 8 140 -16 186 145 -193 -368 -164 -331 -7 -97 -30 -101 1 12 76 -90 -26 -119 123 133 -229 -104
7247 -104 -179 -166 168 139 83 -25 329 290 -11 243 285 -82 -151 -133 217 196 372 87 365 -64 -11 19 269 -77
7271 -77 215 176 32 -212 210 26 31 97 -111 -113 69 -115 142 -131 37 292 3 40 -122 -25 -66 69 -127
7294 -127 164 -76 -60 171 -27 25 215 3 36 -5 -209 52 -111 43 -12 -238 -41 43 -102 -174 113 43 -187
7317 -187 -111 -439 109 -278 87 -74 -123 -61 -125 38 -290 305 31 -12 37 10 -9 -1 -52 5 9 -143 -201 -79 -110
7342 -110 -21 60 -115 29 235 -272 148 14 -336 51 226 213 -62 -74 -118 25 78 17 8 -239 38 26 -267
7365 -267 -234 -175 -39 -30 -13 -155 394 -213 -21 176 45 98 -115 100 94 -151 102 -161 163 34 103 90 -216
7388 -216 -414 -81 -309 3 16 200 383 223 145 206 29 180 16 -177 -43 -263 -137 -176 63 -62 -59 -75
7410 -75 6 -200 -210 -289 122 -67 76 -92 -9 -128 -370 -268 -123 52 119 281 9 -17 71 263 -58 81 131
7433 131 75 293 85 -123 189 -141 -129 91 -16 33 -18 -279 108 -184 287 13 -276 50 -249 195 67
7454 67 -268 -16 -116 50 -45 -91 -323 94 -278 31 76 -123 55 84 223 1 -74 -269 21 -226 -164 11
7476 11 -44 186 128 6 113 -5 63 155 -52 66 -164 -6 299 -148 -21 64 -117 -110 -51 -332 -225 310 -1
7499 -1 39 -40 -32 -74 36 -178 24 -51 -274 -138 9 39 43 -38 -9 200 -60 -197 213 -124 350 53 -54 -3 194
7524 194 -173 -217 220 15 -160 -221 115 98 -118 238 189 -131 165 246 -8 -21 68 -21 -148 -79 21 -51 132
7547 132 221 6 46 -34 79 -330 -177 -156 282 -99 222 -92 -124 -205 -62 210 38 -204 109 13 355 -68
7569 -68 1 -289 -175 355 -250 -109 -23 241 202 -86 53 48 246 40 32 190 127 -19 30 -127 76 -161 -268
7592 -268 -226 29 -159 162 -282 -13 -133 -133 134 21 75 90 243 3 -37 -183 -36 -45 54 62 -283 -226 136 233
7616 233 27 32 88 -569 -413 165 -14 -163 -51 -246 -133 204 -474 106 -169 74 -57 -348 -311 -83 -92 -255
7638 -255 342 91 -103 -230 150 -249 -291 195 -93 5 -123 117 -65 62 -139 189 -158 84 97 29 72 -35
7660 -35 -236 -174 -62 198 -98 113 0 -68 239 -107 10 -63 302 193 -46 -148 117 243 -67 -227 -214 -170
7682 -170 -109 28 -185 -282 -181 -15 93 162 -110 8 -46 -116 65 -4 -144 -218 28 128 -128 4 -52 -127 -41
7705 -41 8 -123 39 -117 -61 -10 -268 -379 -11 -87 335 -334 -45 -209 92 32 -334 -24 -15 -38 78 -596 -68
7728 -68 185 80 -106 190 81 235 2 -217 -59 -6 -160 11 -64 -106 3 132 55 -229 562 -18 -46 -120
7750 -120 113 -88 139 -293 -5 99 68 203 85 -102 -151 83 -102 -106 -94 -75 182 -70 153 9 26 134
7772 134 37 91 55 -105 -116 134 -68 -6 270 -121 192 -101 -140 -94 175 320 -124 20 -133 148 37 55 112
7795 112 -102 -246 66 -339 120 -108 47 -198 1 -7 122 187 -257 -95 50 188 -28 -30 -14 248 -398 132
7817 132 -119 -112 -301 -231 147 -317 86 207 137 -160 -300 -12 -107 136 -168 -50 -35 -23 -53 10 100 -23 -23 -118
7841 -118 57 -78 -154 -290 119 229 -153 -224 152 151 254 202 89 332 103 -146 -24 86 229 146 -146 -361
7863 -361 204 296 29 187 74 52 -273 -170 -252 164 -11 -100 86 -45 -170 56 -25 90 302 73 -97 -49
7885 -49 -167 167 -254 -266 94 -111 79 160 62 72 -275 -112 165 -4 -18 -67 204 -36 296 -136 -340 -40
7907 -40 103 -122 170 -55 -45 37 -330 13 -169 -55 153 -52 -105 285 -83 180 -108 -100 167 -120 188 -27
7929 -27 42 -198 20 77 95 60 -103 -153 -71 315 -149 -106 8 -205 102 48 -41 181 -119 195 37 68 213 52
7953 52 -224 62 272 -159 112 29 -38 -34 181 -107 -95 -86 -174 -252 305 163 50 6 -144 69 -54 39 -219 12
7977 12 -200 151 203 -210 -37 -153 -202 159 36 195 -252 20 -31 81 99 -298 210 175 -94 9 75 -60
7999 -60 86 -19 435 -376 -18 78 333 -381 -37 178 -128 19 193 -123 -162 213 71 -49 -256 -226 -86
8020 -86 -93 141 81 -102 19 61 -12 9 -51 -168 73 326 29 -24 -192 -97 292 -13 -229 -90 107 -103 125
8043 125 216 -105 89 267 -88 124 -122 41 50 -66 -95 188 62 130 38 84 25 31 64 4 406 -102 197 -49
8067 -49 -48 186 21 32 -144 -223 26 -114 -254 -19 -175 144 -265 22 -64 -315 -114 95 -46 107 272 -59
8089 -59 7 134 135 -15 -247 222 -122 -146 -49 -193 -128 -59 -78 -108 353 -42 182 -91 -67 267 -100 -43 179 -47
8113 -47 -249 314 13 31 -76 -73 29 225 58 156 -270 -153 95 -133 101 46 -58 309 236 174 332 -176 -73
8136 -73 -73 137 10 -27 94 -54 151 -160 42 -63 -70 -344 4 277 69 14 102 -152 -105 -59 -69 -174 -56 171
8160 171 -23 -54 226 -138 313 81 123 57 35 243 -10 238 68 156 68 -52 116 -278 105 175 -73 166
8182 166 -14 -118 -10 -137 -34 20 -21 -68 -18
8191a8
$$ Imaginary data points
##PAGE= N=2
##DATA TABLE= (X++(I..I)), XYDATA
0 0 0 0 0 0 0 0 8 -8 8 -8 16 -16 22 -24 32 -38 43 -52 64 -72 86 -99 114 -133 153 -175 200 -227 256 -291
30 -291 326 -366 411 -459 513 -570 636 -706 784 -867 962 -1064 1178 -1302 1444 -1603 1782
47 1782 -1985 2217 -2488 2811 -3194 3668 -4263 5044 -6114 7675 -10184 14875 -26700 120856
61 120856 189092 43256 151304 97277 23889 64350 67578 4383 39227 56725 40023 13002
73 13002 3017 -10742 -35566 -49926 -27574 -49338 -63003 -25692 -11695 -30483 -22317 -24163 -31182
86 -31182 -28617 -26402 -24040 -23519 -16587 9247 12172 4125 15859 11035 -4076 12285 12217 -4816 6596
101 6596 17773 12967 16922 15863 8719 6321 2794 3048 -420 -7242 28 5165 -1653 2894 4029
116 4029 -7576 -4588 665 -8953 -9917 -3023 -2859 -2064 1731 1308 -1577 -2455 -188 -762 -4889 -1516
132 -1516 1638 -761 2789 6140 919 251 3689 685 -2260 -365 361 -545 1206 2756 1703 -334
148 -334 511 731 -2229 -1779 -221 -1939 -950 2197 431 -623 1116 246 -1429 -1060 -804 -1261 -73
165 -73 1030 1079 51 597 698 -271 -225 76 -555 -465 1029 450 155 1042 557 38 -265 -296 -298 -315 277 208
187 208 -39 563 398 -135 -542 -27 -447 -896 102 262 11 113 588 -37 -193 309 -85 -434 -358 77 -288
208 -288 -20 693 -3 -251 96 -192 -586 -70 127 -142 -134 167 84 -268 18 153 -573 -338 32 110 297 -10
230 -10 390 -105 145 -114 -179 22 302 -168 -164 321 8 -209 82 -117 -299 -460 -262 209 -47 404 410 111
252 111 16 112 -187 -222 -238 68 33 -52 300 80 -179 149 -146 -35 148 -294 4 -26 324 5 -61 225 -361
275 -361 -251 -58 -65 255 214 283 234 346 235 -232 -98 -190 178 -13 98 -51 -7 -7 148 52 251 -204 3 -127
299 -127 41 160 60 60 -68 -27 -300 -172 137 -41 -210 326 -191 -150 144 151 -147 -106 -159 -312 -83 82 290
322 290 202 20 116 42 87 86 -390 72 120 502 -5 -51 142 -128 -117 -163 -15 123 43 -233 -62 220 -108 89
346 89 -3 -60 21 -289 108 62 -225 -67 -47 162 -3 -276 255 129 77 112 -283 -137 32 -157 -216 184 92 -25
370 -25 -36 -205 -322 -127 -44 292 23 146 119 264 -106 256 -77 21 405 -112 -109 116 88 -208 144 -44 145
393 145 -20 51 -188 224 211 46 -377 -21 240 228 -94 47 133 187 110 -66 139 -242 -129 -75 172 73 -241
416 -241 -10 96 106 -28 212 -58 -166 -103 -83 -169 34 -337 26 59 -234 -143 -23 -105 143 -67 54 278 -116
439 -116 -110 69 79 210 -109 40 123 128 109 147 173 47 -19 -147 -107 44 208 -100 209 354 102 -110 186 190 -77
464 -77 -143 -60 20 -113 163 -283 -92 54 -118 18 -159 222 2 5 -49 119 186 -124 76 -239 -321 90 163 -105
488 -105 60 16 -96 50 61 -163 315 533 98 -48 -16 14 -57 36 83 35 -75 -11 -96 0 -297 290 164 186
512 186 -207 395 86 -227 -70 28 -60 126 316 -175 -100 -18 -42 114 194 85 -132 4 127 -28 117 22 350
535 350 264 38 -218 -111 -126 29 -75 -143 -143 76 -69 -167 168 -11 222 -133 -192 125 185 181 -72 -199 -5 -31
559 -31 347 -74 -184 28 324 -145 195 158 49 -98 -87 -129 -285 -94 249 159 -351 31 -583 242 69 170
581 170 -219 -46 12 -343 96 -146 55 7 83 -206 50 171 9 -25 -18 -312 110 10 -163 -50 385 193
603 193 142 46 -212 -141 96 -222 77 -96 3 -4 135 107 -57 -207 190 -29 -93 -93 -17 -80 192 -259 226 -54
627 -54 39 -116 -35 121 119 -147 -78 260 38 73 104 -36 -223 -157 149 -142 206 138 -32 263 -293 170 -39 201
651 201 13 -238 -157 -135 -214 -77 -131 7 -109 -115 -119 -83 217 -263 111 326 -43 -58 15 -89 -299 -180 -265 -71
675 -71 -406 148 43 -92 156 -495 240 512 106 -29 -116 -58 -186 -30 -99 -9 82 93 114 147 283 35 -94
698 -94 58 -204 -155 267 -181 114 -289 -34 -88 158 41 -145 149 -259 -54 137 219 -173 -266 -56 167 -213
720 -213 341 103 133 -18 -86 194 -104 -88 78 8 -104 -83 62 -152 119 -54 317 256 -90 -94 -123 176 128 103
744 103 -398 56 56 -179 -36 58 141 -111 6 215 1 -21 -47 -209 26 -152 44 85 45 118 -17 -99 -155 163
768 163 -98 -299 -127 150 -45 -115 -165 204 -24 -420 66 117 52 -100 -81 366 -95 -83 120 -62 96 -64
790 -64 -174 -154 62 20 -173 300 28 77 53 171 -60 -53 -19 -194 326 167 5 -130 71 155 219 61 -137 -253
814 -253 138 -91 330 141 -27 54 173 156 111 -48 -247 294 -95 -210 141 270 -137 124 7 290 77
835 77 117 -92 91 -38 -306 -299 -19 -261 -111 -97 126 -323 -67 350 -6 -41 -103 -79 -80 -81 -149 -3 89 155 136 50
861 50 -88 215 -240 -79 -161 -33 -155 31 -416 5 14 -63 19 53 323 -216 50 122 26 83 -95 224 100 106
885 106 197 -139 4 8 -28 -4 -103 -45 -67 -28 -516 -13 335 -30 154 252 206 -7 -188 138 -174 88 -41 -65
909 -65 -87 -52 -40 43 134 -200 56 209 102 268 -31 214 -141 137 130 120 -24 200 -17 232 129 -344 62
932 62 -323 -24 111 113 -46 -262 -109 20 -68 -118 -61 -42 25 -17 55 -64 -317 150 -73 -67 276 149 202 432 80
957 80 -54 -2 162 -301 109 76 32 273 109 505 -190 -42 150 -74 -57 61 -253 -10 15 -129 -11 87 365
980 365 -127 -117 -18 12 -143 160 -231 -87 -75 63 -125 -18 258 -103 -180 -261 48 31 362 90 155 174 277
1003 277 57 -89 90 -284 -163 364 128 -143 99 43 49 81 90 -253 134 144 -160 -141 185 100 -99 -79 33
1026 33 -21 181 58 367 90 12 27 31 -315 -67 69 6 11 53 27 96 -84 -121 232 -18 -32 44 43 -40 -300 -135
1052 -135 320 151 199 295 274 109 -90 -59 105 49 257 -7 -121 75 195 -160 -113 47 32 168 -154 -73 -70
1075 -70 127 -187 -20 125 -39 329 170 342 -190 239 -119 -260 362 -267 92 257 -60 19 -174 -34 -36
1096 -36 -311 -131 70 7 104 43 79 -174 -32 -408 -91 -205 -69 91 122 -66 -76 -14 178 -107 211 161 -182
1119 -182 276 147 271 140 -67 -4 -278 -127 254 218 -213 -185 -16 150 -119 -34 -60 -116 180 -166 28 53
1141 53 -164 -85 207 300 19 -134 110 -8 -288 381 26 -229 -23 -203 252 76 160 -49 225 63 -137
1162 -137 200 -46 245 -11 -87 -152 -224 45 81 -145 -120 50 -190 -225 125 120 41 186 -42 -85 -224 -5 18 -91
1186 -91 -131 41 -80 -16 -94 -76 -149 97 78 -2 100 -108 198 297 171 220 61 59 268 -126 -4 -22 165 328
1210 328 -151 213 240 42 226 -84 -84 274 -88 -2 -147 211 185 269 336 -13 -1 -201 -7 -287 56 -126 37
1233 37 -35 -63 163 -15 -143 65 297 -139 -8 276 -58 178 -174 -63 175 -173 -70 12 229 182 -293 247
1255 247 84 -74 16 -300 137 65 -212 -197 106 -123 -42 25 -261 25 222 104 -168 -163 -222 5 -134 -197 -233
1278 -233 244 32 79 -172 58 -64 176 -239 184 -278 -329 138 147 -100 -261 37 110 -85 -168 109 -166 99
1300 99 99 -347 51 -108 -124 89 118 -233 -20 45 -76 -66 -24 -111 258 80 87 119 -458 254 -294 -157 -9 -15 61
1325 61 133 -123 -48 16 -70 45 271 -178 -216 120 301 13 -156 78 217 -311 104 56 210 96 -342 -140
1347 -140 165 198 -87 287 114 104 -163 -2 -92 571 74 16 -186 -225 -340 -2 68 0 135 -337 79 146 87
1370 87 208 91 5 49 -35 130 -35 -57 -61 -68 105 44 -197 29 -402 -148 -178 279 -37 46 -58 -144 105 -310
1394 -310 -177 149 21 -326 -220 154 93 17 90 36 299 -122 -29 17 104 324 87 50 -128 -314 -117 -73 91
1417 91 30 114 36 41 -158 263 -9 -108 -72 127 -49 -77 -50 16 -196 25 -216 61 -112 54 30 -204 388 4
1441 4 180 360 -252 -31 107 16 145 25 28 -101 -56 82 -4 117 -162 -94 270 79 174 -232 17 23 138 11
1465 11 93 -102 -238 59 -2 -25 -200 -346 -8 -192 -132 -155 60 -239 -89 -46 182 -202 -112 -286 -53 -141 34
1488 34 -210 -100 69 -8 -85 -74 -136 203 -118 64 -20 -234 36 -65 149 138 -172 117 398 144 -71 155
1510 155 262 -80 66 -25 163 -189 53 17 -130 149 59 -17 -263 137 126 -219 -3 -156 -108 4 47 123 58
1533 58 -155 -72 -54 -22 -295 -106 -375 -101 12 15 -220 -62 -162 -125 -97 -197 -123 5 -344 70 -83 115 -171
1556 -171 -198 101 -32 47 -24 -139 -72 12 230 -9 123 -43 157 -101 -33 26 -239 244 307 -88 -499 -141 -125
1579 -125 -139 -22 -200 228 -120 -280 102 -116 -168 10 323 133 131 -172 -6 -138 223 -102 -14 -102 394 119
1601 119 53 109 137 93 124 -138 -27 119 25 -67 -182 179 106 113 -55 -208 270 -150 21 229 -149 150 -5
1624 -5 -24 -12 -97 283 132 25 85 186 8 234 -3 400 306 -212 45 141 61 -31 -332 -124 -20 413 73
1647 73 -269 119 -69 72 -19 159 127 -21 -228 -136 155 110 -84 -152 183 141 206 -337 47 160 -197 53 -63
1670 -63 -210 -286 177 115 -91 -56 -212 -225 51 349 -415 18 144 309 -307 -91 183 28 -224 -70 111 188
1692 188 107 219 40 -168 97 71 -129 -160 291 145 -66 -227 -66 81 270 19 -384 149 24 -51 12 128
1714 128 30 65 -85 283 -13 -108 43 19 163 -162 -89 -142 55 -187 -85 -172 5 -114 278 -177 76 127 -141
1737 -141 -247 193 -96 62 176 -153 -96 57 38 -143 -148 -112 30 -288 147 161 47 -1 -316 -37 172 297
1759 297 18 -21 166 -105 0 88 -343 102 -68 272 -19 -381 173 -60 119 -73 183 -298 -87 12 130
1780 130 -117 296 -33 -275 -234 -116 -286 175 -150 23 15 -31 -107 -289 -15 -33 39 -217 -72 -52 123 43 151
1803 151 -22 -319 -195 -84 62 -22 -70 -40 -274 77 -39 -12 -47 8 -121 -214 227 176 -204 269 237 7 -53
1826 -53 191 -72 -7 -197 81 135 76 138 101 -44 55 34 125 83 -62 350 -281 97 96 205 41 -101 -60 150
1850 150 -8 -149 -249 -119 -17 53 367 -22 353 -295 -168 42 98 -58 77 204 -146 -28 -22 42 -40 58
1872 58 92 -55 -114 -25 105 157 -193 8 47 -53 136 228 148 137 -351 10 8 -109 -4 -161 -199 -157 -74 -310 -78
1897 -78 -51 326 -3 -57 -150 -28 -130 -177 184 30 97 136 -168 341 80 -88 -283 -32 141 246 23 138
1919 138 -124 -92 -85 -25 76 -184 258 105 -63 134 219 215 -56 -45 222 -63 -246 141 89 113 -190 135 76 120
1943 120 124 123 83 71 -53 90 237 -57 -172 -196 93 242 14 -103 -102 134 -281 58 18 -139 -102 62 63 -82
1967 -82 213 -217 12 -98 29 241 29 -146 60 135 -76 49 32 -110 -84 -170 -143 274 -69 24 -255 148
1989 148 137 97 305 219 -128 81 15 23 -146 -91 307 17 37 31 160 -330 -190 -59 -105 -117 -131 -16 -41 -266 4
2014 4 -74 -34 -80 51 36 -243 -23 -92 -225 219 -114 -58 -182 -31 -51 151 -72 179 25 258 40 -159 -96
2037 -96 146 38 -210 52 63 96 10 85 134 -299 195 148 35 -228 -61 127 47 168 -31 -144 33 -12 147
2060 147 -35 -58 125 -45 -35 -361 -33 -1 287 -114 -59 105 -15 -81 -139 56 -241 -31 -27 24 22 -3 -119 161
2084 161 -15 247 -59 -15 -96 126 75 59 112 96 -71 -161 280 -65 29 215 -252 201 24 269 -56 175 200
2107 200 25 205 312 223 -134 207 -383 -128 -270 -81 89 -276 86 93 162 20 69 78 -160 245 -13 -269
2129 -269 35 238 -14 27 43 133 -35 -20 -113 4 41 46 120 134 134 88 31 -1 -46 234 -30 -18 62 -40 -117 104
2155 104 0 31 -159 37 42 -55 425 416 -142 97 167 -123 105 94 -337 241 565 -27 -6 110 116 93 -35 61
2179 61 228 -20 71 -148 110 120 -23 226 -10 63 80 62 -15 73 83 5 -219 107 168 -5 -111 -266 -78 67
2203 67 -126 -67 43 -39 53 84 2 -285 148 -28 428 290 81 92 142 4 -38 167 -193 -166 -196 160 191 -55
2227 -55 207 -145 150 137 308 -79 -374 -130 231 239 -199 -168 -165 -258 -374 -54 41 44 64 56 65 -14 149 286 -19 166
2253 166 -78 -186 220 -130 -222 -16 156 -226 -12 127 224 4 78 -118 119 99 67 105 85 -130 -144 -134 59
2276 59 92 116 120 66 -22 -10 216 -14 164 148 159 -108 73 90 -92 -151 -191 88 77 -16 -309 -169 -297 -215 94
2301 94 -91 66 140 70 123 -62 166 170 132 76 105 -15 -112 120 241 -264 78 187 -141 134 -343 193 -156
2324 -156 40 -108 172 148 5 -50 87 -66 -276 -45 66 222 -30 -333 18 -164 60 117 -25 231 -11
2345 -11 57 -47 29 203 -9 -133 21 -145 -51 -209 -207 82 63 -21 -165 -177 -42 -33 -24 -72 61 -6 98 182 -93
2370 -93 46 -107 20 -39 -106 17 -67 -128 -65 -129 246 447 -126 -67 270 -34 -146 -91 -135 22 47 -119 -274 -97
2394 -97 -194 190 -1 -170 -13 180 99 147 -83 -195 -1 62 -220 -152 46 248 92 64 -104 -117 -125 -128 -97 -274
2418 -274 -24 32 -142 148 -20 -210 -69 -228 50 -105 83 333 129 31 -259 -86 -21 -367 -78 35 98
2439 98 -207 245 -80 77 -163 -173 124 -29 -261 -370 -226 -73 -199 -114 -168 12 32 144 -261 -6 -89 -260
2461 -260 248 132 397 -272 -74 366 188 -39 -74 -308 -65 388 -91 -229 -55 80 -155 74 87 42 181
2482 181 -105 36 423 290 -55 -183 -103 -21 118 -115 143 123 -26 -171 -82 357 -102 -66 39 56 142 -36
2504 -36 4 -129 190 -290 -172 106 231 -228 -417 346 80 286 28 188 166 188 -93 89 90 17 178 -63
2526 -63 186 265 163 -91 -91 -178 -23 182 189 -216 -245 -122 -111 99 18 143 -207 92 59 -147 228 -108 228 22
2550 22 26 -7 -100 -2 187 -11 -111 117 -195 -9 94 14 -4 -76 312 -168 99 126 -42 172 -284 29 -378
2573 -378 253 -23 -187 46 57 -77 -117 -116 71 -150 83 -286 124 13 100 120 67 297 -153 -94 -28 -210 -21
2596 -21 110 49 -36 39 93 69 -277 -104 -140 90 74 -108 8 53 -140 -136 17 -18 76 106 187 -218 99 164 59
2621 59 -123 171 -62 155 51 31 -177 24 -27 125 -379 -6 -427 380 90 262 -213 213 32 273 -199
2642 -199 -66 121 -75 -45 81 417 -174 212 151 455 -213 40 -74 105 -51 68 259 -266 -175 259 -177
2663 -177 -17 -165 -146 196 77 -15 -128 -24 -318 -9 -5 27 -119 137 77 117 -33 116 -25 -62 -224 46 8
2686 8 -141 -117 -155 12 8 205 119 29 263 307 -67 -37 159 -29 -38 -89 50 -225 -359 -93 -143 -221 32 -88 24
2711 24 26 12 84 62 -241 85 285 182 -47 171 137 52 -22 -476 35 -59 -117 -78 190 119 -219 -121 28 381 99
2736 99 -272 -59 -205 11 -41 72 66 106 -135 153 228 82 249 17 287 -108 -142 -53 -150 381 -252 -16 -289
2759 -289 -132 -52 -209 290 -54 -22 58 24 -67 -3 -238 141 113 10 332 160 -307 6 24 223 86 148 106
2782 106 -57 71 75 37 -138 -223 -73 -231 -222 -199 117 103 -156 -42 25 91 -106 -161 48 -92 158 94 -157 -35
2806 -35 -268 -1 105 -200 -9 -71 -124 277 -32 8 120 -119 -382 32 44 68 56 -103 -66 85 158 -280 -96
2829 -96 -180 -29 230 187 -54 -53 83 -25 -42 241 -18 279 -85 38 -113 46 -83 165 53 -152 106 57
2851 57 29 -196 -125 -78 52 -52 -94 88 74 -259 177 -20 -127 -49 7 89 -89 23 -74 11 -10 -138 -137 -175 -39
2876 -39 294 112 -101 72 408 19 57 -214 -165 -94 -259 23 -168 36 87 -98 48 90 -242 190 -361 -312
2898 -312 395 170 -334 134 206 -60 223 -205 -141 233 182 87 181 -44 -61 26 169 72 14 172 -75 -100 67
2921 67 -16 -31 -239 -45 284 183 228 218 -230 -165 237 -58 -22 -171 271 -133 224 -151 -259 -46 69 -112
2943 -112 76 133 228 203 -65 131 107 -162 11 -65 -133 98 -121 -204 13 174 -132 -119 -170 30 -92 142 -333
2966 -333 297 145 -83 -85 -257 -9 81 -146 48 143 -115 -150 232 -66 -111 -419 -34 148 -187 216 21 -250
2988 -250 386 -15 -116 -22 91 -26 119 376 -32 170 112 117 106 -108 152 -167 -186 128 37 -110 258 83
3010 83 100 230 -83 153 -81 -131 4 -249 227 85 -111 -86 189 200 40 402 -50 -101 0 -27 -227 -18
3032 -18 80 45 -243 40 -65 261 -109 -87 -72 112 -142 81 80 -44 153 -68 -98 -174 126 67 173 13 213
3055 213 -95 126 52 -39 -134 -107 -3 35 -68 -54 82 143 257 116 97 -53 -15 73 -99 -176 -129 65 88 -203
3079 -203 105 116 295 -417 -196 54 26 -116 -56 98 -10 -205 143 -112 -7 -32 -240 -168 177 -90 -13 226
3101 226 -151 172 -72 23 316 259 -97 83 -56 80 -98 -51 -76 66 121 60 -40 166 -172 255 -131 122
3123 122 -1 32 194 -89 -98 -39 -114 -71 -77 -105 23 -193 -138 152 -71 -23 -2 217 -3 124 15 -13 -251 -4
3147 -4 116 153 -122 -188 -100 87 187 -78 162 218 110 146 61 31 33 41 -26 -90 -90 246 -127 4 -61 113 -70 -76 -27
3174 -27 167 13 -1 147 -127 -171 58 173 -131 81 -58 -195 -264 140 495 99 88 218 35 -231 -242 -226
3196 -226 12 -90 28 -48 -167 -288 6 -109 75 -121 247 59 -81 67 -219 -82 27 275 170 -266
3216 -266 -205 228 161 -234 60 -188 -122 278 5 -145 -117 -131 87 -3 -198 198 139 43 144 194 -158 -218 83
3239 83 111 -40 -11 -31 -209 -8 74 -76 -125 -202 -110 -176 78 -113 96 -202 -37 -87 41 -153 147 5 143
3262 143 333 -81 286 -29 -232 -248 122 -293 -89 -300 -118 126 38 7 -247 166 130 221 18 138 467 -147
3284 -147 -52 155 -186 34 184 -2 -146 -74 184 -83 187 -117 -88 -72 -2 21 39 17 -127 45 124 -68 -88
3307 -88 152 195 -385 180 82 54 377 85 13 17 -174 11 416 261 81 217 434 45 29 6 -117 139 83
3330 83 71 -26 167 31 -12 -150 -41 -93 22 -114 262 -14 -42 103 -40 -51 -76 -22 -213 -98 97 -78 270
3353 270 -60 99 239 129 -174 -136 289 107 64 112 43 -23 -292 -59 -300 -440 -78 -61 -310 35 -121 -120 -129
3376 -129 -195 -18 -131 -83 22 -51 -57 -25 -128 -207 -90 5 -226 144 105 26 -122 218 244 -79 138 16 -51 20
3400 20 178 285 -22 25 235 54 -43 44 -199 194 -29 -261 44 -65 24 88 177 -194 188 9 95 359 24
3423 24 -83 -194 -33 -119 13 -13 -76 127 -225 -47 -120 61 -95 16 -179 67 87 256 144 77 85 -3 -118
3446 -118 231 -129 218 138 68 40 117 -110 36 116 -30 273 34 191 111 8 -192 230 -326 2 -80 162
3468 162 -224 -41 -51 82 -30 21 85 271 -144 -279 -53 33 -364 127 -77 -35 -148 -126 109 18 -128 -9
3490 -9 227 8 184 76 -314 -34 216 74 -53 -269 -52 -93 50 -9 157 155 169 35 -31 -196 -93 -223 159
3513 159 65 -158 -221 -9 180 -56 -239 204 129 -270 -178 -218 -290 48 164 -73 133 144 153 -117 -186 -210 146 50
3537 50 -72 -237 22 -177 -82 -384 57 -90 -259 -199 59 -18 73 -230 9 197 -406 -4 -445 196 58 -220
3559 -220 -43 -159 188 192 -200 150 130 -19 -24 236 61 -521 -33 121 109 -103 -86 73 -88 10 0 83 -107
3582 -107 36 33 -174 33 189 -285 -164 138 125 -67 50 171 109 -292 -118 -30 70 -300 31 13 -137 -46
3604 -46 143 -47 178 107 166 148 117 217 -61 69 62 -181 -132 -53 -190 -215 163 161 391 -107 -244 -62 -75 68
3628 68 138 -73 37 -49 -149 -9 209 139 -106 -91 -90 -158 -293 -49 -306 -36 -94 -19 334 57 78 -275 120 -49
3652 -49 85 177 136 -260 -4 12 199 148 268 147 77 -26 40 -20 -263 22 -220 -280 117 -155 -160 74 -81 91
3676 91 117 -36 9 18 192 -50 280 -99 -68 -18 211 -122 363 -194 -183 197 -14 139 81 -50 -62 -15 -10 208
3700 208 -252 23 -170 30 -34 142 133 110 -13 -154 -252 28 82 13 372 -84 199 -283 72 -57 -165 111
3722 111 -31 81 -52 -195 -68 -81 169 98 62 -186 53 102 -216 7 -155 386 -117 57 43 190 71 102
3744 102 158 68 -29 -227 39 99 61 64 65 30 30 -194 205 83 -13 -7 -62 44 249 -170 -1 -53 57 11 -127 -33
3770 -33 -89 -302 -106 -9 -21 130 87 -344 32 -1 69 24 -80 -113 -40 -401 262 29 -173 330 -33 110 122 58
3794 58 44 95 86 107 124 -153 -323 -402 -95 -41 -100 -265 8 130 -85 -80 242 -110 -249 43 21 -218 -81 56
3818 56 89 -143 44 -201 -14 -11 -291 -28 32 -20 33 -146 327 -377 -159 33 -97 134 70 -59 9 197 -149
3841 -149 132 -335 -25 -38 228 165 -61 -64 -31 29 171 -175 -194 197 -179 0 -175 -99 258 -123 -65 44 124
3864 124 -109 -72 14 37 75 79 117 -213 -4 -181 123 -5 24 -54 -31 -190 116 -95 -80 145 -154 -34 26 283
3888 283 26 -77 24 -55 -87 -133 -212 360 139 -172 -128 107 -197 -17 -210 -78 -199 88 72 100 -237 -11
3910 -11 -130 21 36 -45 -56 -156 -84 78 6 120 -107 -238 289 -73 98 -237 52 78 -163 194 95 -187 -290
3933 -290 -188 376 131 167 147 -293 47 -61 -1 238 136 -194 -126 74 86 72 -64 -47 -166 -95 -129 -54 -180
3956 -180 -77 -257 -26 184 139 85 484 -68 -13 125 -135 31 144 -48 73 266 -38 78 262 -101 -8
3977 -8 -52 -117 -59 -69 259 38 -201 69 -113 -107 194 -10 251 169 -169 -186 -163 19 92 127 -143 149 -123 127
4001 127 190 -105 -218 -404 128 -11 191 -199 59 307 -291 103 -162 -25 48 211 32 50 -46 -59 32 -278
4023 -278 -36 90 -349 324 -2 243 -52 -120 -104 -160 -253 154 135 -256 63 18 74 -181 74 -108 -218 -84
4045 -84 -21 180 -4 -59 -136 29 10 167 248 -67 -147 5 16 184 -145 124 306 -157 60 173 117 127 100 -232
4069 -232 207 -189 136 -31 133 197 -177 206 -116 -182 118 -220 162 181 207 -14 -119 -149 23 201 70 -105
4091 -105 73 -179 -165 34 -128 15 226 84 224 -51 -136 -231 10 182 -4 140 -170 36 85 55 80 -299
4113 -299 96 -80 17 -80 -18 -232 -40 -68 10 -31 1 -212 -179 100 57 -152 237 78 325 -49 -90 -212 -111
4136 -111 -69 187 333 -27 183 -196 -162 275 103 253 -217 58 -184 -249 90 100 -71 58 39 93 162 93 -180
4159 -180 -125 -66 -87 -150 64 71 37 151 -100 -243 -2 136 8 112 -143 190 -72 73 -1 191 -328 -6 194
4182 194 -238 44 189 40 -154 -6 226 203 103 -180 -46 140 -51 48 -1 288 -137 -224 13 150 -303
4203 -303 217 -106 -171 96 168 -185 292 69 305 -183 192 349 153 -72 -78 22 42 172 -173 -26 -176 36
4225 36 -17 -359 -241 191 -60 103 44 240 82 84 17 -28 12 -213 256 54 66 -51 -274 25 -200 -25 -272
4248 -272 34 75 104 -125 -77 -61 14 111 -171 86 -142 307 54 122 242 -74 4 -160 -169 -84 -85 166 -352 162
4272 162 -175 40 -52 205 -43 -114 401 7 -98 -178 162 -141 224 182 108 -179 -276 -18 112 -4 -22 108
4294 108 -179 6 264 -251 119 108 -187 -20 31 -92 106 -30 -47 -17 -95 -8 -35 281 -115 230 -89 86
4316 86 52 -11 13 -145 -63 81 254 -148 184 -145 12 -78 20 488 -11 -264 147 162 -48 221 -25 146 -79
4339 -79 98 32 167 -197 40 195 -247 -157 44 -188 13 -180 51 195 24 -9 4 41 209 27 35 49 19
4362 19 -187 61 -88 203 -367 132 -68 -196 163 23 383 -178 -143 -238 -169 1 83 62 -125 250 -107 7
4384 7 -108 -40 242 -6 151 189 -250 -99 358 192 -37 -55 -150 -219 193 24 -37 55 125 -246 -20 -89 38 -233
4408 -233 95 -224 -123 -136 130 116 -161 -58 179 -127 -59 33 -132 -131 138 -1 -226 37 103 12 -200 -49 153
4431 153 -48 56 14 90 151 199 65 54 -36 174 149 -94 108 -50 -486 -181 -102 160 283 -247 -131 39 -99
4454 -99 -163 -56 -288 -23 -61 -155 304 -278 170 -134 -38 200 34 378 -114 331 131 -298 14 -289 59 133
4476 133 -57 131 -87 45 122 -191 175 156 -78 -58 -249 -144 256 18 117 193 -147 -175 -234 91 41 26 9
4499 9 85 -210 -35 22 -33 -95 30 202 81 158 45 85 -17 -52 95 10 254 -34 -55 -105 -223 73 -55 50
4523 50 -256 285 40 -277 15 80 -51 341 33 -149 -39 -16 227 -98 -165 81 -149 157 213 116 -177 22
4545 22 -113 58 416 51 29 -65 112 -312 -89 7 -49 -265 111 -82 98 -122 -117 -84 128 -124 -106 -123 -23
4568 -23 16 12 -111 413 -180 285 -54 -46 105 -149 43 128 -145 -42 -274 -121 307 -57 -288 -23 125 146 154
4591 154 48 104 132 -105 141 28 30 53 -255 -187 -245 -208 39 18 112 -196 -16 -60 50 60 200 5 -181 27
4615 27 181 -334 -130 -290 -101 -264 81 77 -89 185 58 37 -56 -136 203 -1 -138 173 -72 132 -84 56
4637 56 24 31 112 187 154 133 -193 -93 113 -25 -94 -89 -102 66 133 -121 10 123 -106 -160 -14 -83 -168 130 -181
4662 -181 -377 315 -261 -9 161 18 -154 -83 -174 -56 -60 -216 104 307 104 -100 70 -244 66 -116 56
4683 56 175 -112 24 330 126 151 -324 -238 -199 108 133 -129 181 -112 72 140 78 16 59 -66 157 202 -79
4706 -79 162 301 -82 49 -179 62 162 182 -77 -285 -13 285 56 -173 -340 -8 -182 -83 -67 -143 -6 -160
4728 -160 82 -194 76 -75 -47 256 -11 159 -50 -100 373 8 -50 -327 198 33 -25 14 -66 110 -51 -175
4750 -175 8 52 59 189 140 130 40 -99 -156 -387 -241 229 90 -53 106 206 207 175 1 339 -112 37 -6 -144
4774 -144 -252 42 23 54 22 -26 200 -87 25 -56 56 14 -3 -338 100 -200 164 219 102 -126 -87 229 -166
4797 -166 171 -383 -130 -151 -125 107 -105 43 -124 46 -352 -336 79 127 -44 -120 181 -33 -146 -51 -115 -64 73
4820 73 68 -74 37 149 -3 -51 48 -76 197 126 -139 -162 35 96 2 -154 246 486 115 37 29 323 -75 7
4844 7 326 102 226 -135 -17 16 0 -40 168 110 -92 -5 -71 -109 15 197 -427 42 -459 24 296 -286 -60
4867 -60 -96 -19 275 183 -24 -144 -53 86 -109 116 -371 -8 -204 220 -316 282 -195 94 74 -96 -108 -91 -14
4890 -14 -21 89 41 35 -119 -249 -70 54 101 185 -61 98 -48 -56 81 -243 131 -294 190 -191 88 214 -93
4913 -93 62 27 100 -88 181 67 34 -159 82 77 31 -144 -147 144 94 182 45 20 24 -259 103 119 43 -130 -262
4938 -262 404 113 -183 -83 -62 177 -206 40 -58 155 271 162 -193 -42 190 84 252 156 -10 247 3
4959 3 288 137 -10 -82 -117 -5 -113 -173 -111 172 -195 -270 -96 -7 -14 49 129 -139 -173 33 -137 222 27 238
4983 238 118 57 198 -42 -78 229 205 142 321 188 116 138 120 52 -155 -106 218 -149 11 -316 30 117 -200
5006 -200 130 101 -15 95 285 -186 161 -48 -73 254 23 -73 -102 279 270 186 76 122 64 148 -74 -31 -5 96
5030 96 39 6 77 158 77 217 20 -217 -15 -79 13 65 -208 160 -279 -12 27 82 56 -43 -45 -242 -112 -87 -269
5055 -269 222 -19 40 101 -102 114 150 -121 -226 125 210 -134 -114 -10 194 -64 15 55 341 30 -166 192
5077 192 147 12 287 -284 25 -186 -61 32 -243 25 -125 -106 8 53 112 174 69 179 338 149 125 -199
5099 -199 109 -6 148 36 39 350 -137 13 77 227 67 170 152 243 -56 251 104 -42 -59 -26 -38 110 86
5122 86 250 -186 8 -103 38 -117 -133 129 63 -116 -54 -57 -98 163 -20 31 -107 158 273 -118 80 -47 -92
5145 -92 -46 181 159 -57 -3 219 -147 -40 19 -135 -93 68 -208 -179 -194 18 183 136 -133 338 -33 241 319
5168 319 196 64 -143 -177 83 149 -20 -67 12 91 -68 -122 -171 -56 19 -221 103 -2 241 -183 -77 -130 170
5191 170 -240 322 123 134 201 -110 52 -109 -101 -111 270 49 -55 -80 64 -59 -13 -262 129 -175 -12 56 205
5214 205 -191 132 -31 49 -100 60 21 18 22 62 149 -110 398 166 -30 59 -193 -211 -84 81 177 276 -329 44
5238 44 -234 -81 43 210 -66 18 -132 -300 111 178 -155 -159 225 -43 -18 -66 -15 54 313 -63 82 29 210
5261 210 90 -158 207 125 10 136 6 133 31 232 259 192 26 126 -112 91 58 24 -185 -82 5 168
5283 168 -235 5 -136 -130 329 -12 59 53 -34 43 91 336 -133 -148 141 -99 165 -28 400 195 -27 -110 49
5306 49 80 433 -168 -136 539 -238 1 94 -126 44 398 -146 -21 -60 -149 37 -37 95 -88 30 114 -113 -126
5329 -126 204 -58 34 -215 -74 107 210 59 -80 273 84 5 -56 -90 -311 97 136 137 -85 -53 -38 163 140
5352 140 -17 195 -174 205 -54 -107 -5 109 -16 239 196 -67 127 91 -34 -101 403 129 132 519 -22 -28 -222
5375 -222 -69 277 -121 126 58 42 -98 160 26 6 39 -7 48 -18 -117 319 -120 44 213 34 -31 29 16 94
5399 94 131 -93 131 -94 492 209 242 -93 -120 -232 139 159 -54 -28 -117 68 111 -5 48 95 -74 -157 -126 -26
5423 -26 128 -84 -212 -213 -23 -46 94 314 -118 214 -90 -94 -254 200 116 128 141 456 166 -59 -31 -76 197 -99
5447 -99 157 19 98 -30 72 322 79 329 -18 -9 227 60 -100 56 306 4 140 127 -110 -7 -11 28 77
5470 77 -164 -105 42 -316 -39 -47 -157 41 -22 145 53 67 -186 348 67 78 81 -6 -1 10 133 30 138 -285 -96
5495 -96 -226 50 -168 -260 123 141 -66 -16 -99 131 163 -199 -226 79 -87 390 -142 204 98 221 -90 -177 95
5518 95 -270 -24 -8 25 -84 -68 -75 -121 156 128 48 -89 151 -73 35 309 -147 103 51 137 -29 191 -16 -175
5542 -175 -391 -25 -72 6 -201 154 -127 -200 131 258 -201 -78 -15 -70 -49 85 -49 -160 -22 -247 -17 304
5564 304 -52 239 314 -51 -115 -144 24 -23 163 37 177 92 -152 141 37 37 -223 137 4 39 -239 -43 3
5587 3 -195 -37 225 -344 167 28 21 -92 75 -113 -81 163 -127 181 -36 66 21 -24 73 -284 68 -78 43
5610 43 236 200 158 -147 167 -293 74 228 88 -77 15 329 164 44 107 -142 -202 149 -208 214 -98 -123
5632 -123 -89 333 -142 137 186 50 73 -62 199 -370 -88 -202 -314 -154 317 -97 -67 -88 -190 -281 37 56
5654 56 90 102 60 -10 -69 -39 -127 157 92 141 169 -241 -77 244 -135 211 167 -39 103 282 108 -126 -33 194
5678 194 161 -123 -46 -291 174 -32 -88 -287 97 151 -67 256 -82 -148 -37 -90 -196 -213 -73 -319 137 82 -32
5701 -32 -330 245 -186 156 -211 -98 -276 134 18 -45 -410 -217 -33 -38 -165 -168 87 124 -223 139 80 -171 84
5724 84 117 1 -222 135 -9 -7 -287 210 -22 69 8 47 -14 -248 -63 -205 -17 260 -183 -73 -57 138 97
5747 97 32 5 -54 -76 -186 -25 276 253 -379 -55 -61 18 -66 35 156 -198 59 -45 84 -95 164 116 114 -212
5771 -212 -17 30 158 -58 -5 217 143 26 12 39 -103 -30 -190 -232 39 75 24 -92 40 -10 -73 -341 -139 -44
5795 -44 -121 -71 -87 95 -118 138 -25 54 86 -7 252 314 9 11 -2 0 40 -199 -63 -221 181 -52 113 -64 62
5820 62 -197 411 74 207 -279 -109 -61 -184 -83 -245 -75 -3 -103 -284 127 -64 46 -190 46 27 163
5841 163 32 -284 195 -95 80 74 -51 -148 147 79 5 -77 -29 -50 96 -121 -22 70 116 213 -309 216 -103 183
5865 183 419 -227 208 63 -291 206 260 22 -248 -15 145 26 -179 96 -21 -36 -1 64 66 -158 82 25
5887 25 387 86 3 71 -55 9 69 264 14 -131 85 127 87 -109 95 237 181 13 53 -116 -117 -159 6 -222
5911 -222 -141 16 95 34 82 53 33 0 -147 -9 -163 32 48 227 -63 -18 18 -96 -167 112 -224 99 44 -63
5935 -63 -89 -220 86 174 -1 141 92 22 250 -126 176 140 -40 80 28 -271 -319 222 -89 -63 -6 140 -154
5958 -154 -72 252 -445 -319 247 312 17 204 -193 -285 -71 69 -122 -98 63 24 89 -69 -215 -184 76 -76
5980 -76 -17 28 -12 55 -74 -166 94 -17 -132 114 -93 -191 168 131 48 58 109 141 -12 -4 -45 15 -63 -6 -92 107
6006 107 252 -171 -176 252 16 -174 -90 288 -136 -81 -88 -144 116 77 -126 -20 209 55 149 -164 15 -114 159
6029 159 134 38 -32 -296 -237 147 -74 293 110 19 70 -360 -11 -105 -202 -163 22 -280 -20 -221 254 -170 50
6052 50 -129 172 -199 -69 -240 134 111 188 41 131 210 187 -58 -39 167 345 -129 100 -56 109 316 -283
6074 -283 -97 -97 124 -205 151 -34 -90 157 0 -11 7 -293 83 219 -22 122 -123 -169 -288 -79 67 -134
6096 -134 -189 -310 150 -106 54 -54 -234 185 255 7 266 -342 400 226 147 -31 -109 205 -121 -391 -324 -59
6118 -59 -104 -93 -63 180 -67 118 -213 66 239 16 53 -113 38 90 134 -35 379 -118 340 -169 155 67 170
6141 170 156 -134 9 -112 -9 -263 236 -170 202 -157 -26 -324 -56 -170 -180 -31 -81 119 -284 -2 136
6162 136 59 -465 -105 2 138 -6 51 176 89 28 116 -9 49 6 -89 -81 -172 -44 196 -97 -211 29 49 -131
6186 -131 117 -132 -94 -22 -30 -24 -300 -77 253 58 -343 -130 -33 45 73 -100 -15 -109 -89 65 -189 -155 217 -46
6210 -46 -122 -74 29 111 -398 -299 -93 -35 193 -165 136 95 -57 -153 143 35 -41 239 185 -157 -24 -71 -50 26
6234 26 -140 24 -237 -123 -51 -8 62 120 165 27 -55 168 93 259 147 -267 87 -121 118 196 51 116 -282
6257 -282 -262 71 34 -43 345 145 104 -179 -6 81 70 -189 -110 336 41 87 281 -245 259 9 64 -51 -96
6280 -96 -15 -85 148 -138 -89 -263 -277 -161 22 -19 164 -44 90 -75 171 233 67 167 -210 -51 -374 -248
6302 -248 31 -33 92 183 391 61 148 -27 -122 153 275 -264 121 198 209 -102 -20 50 88 247 30 40 -34 -52
6326 -52 -183 -161 -227 -187 122 121 27 248 -178 68 272 -137 -34 -168 -4 154 38 41 -41 112 27 73 -30 200
6350 200 79 -60 263 -45 -129 -17 -396 43 -160 57 142 129 9 19 120 147 344 406 153 -81 -25 -49 86
6373 86 131 49 -170 212 -123 -25 -242 -411 -164 8 -266 5 -87 -47 -148 -53 -97 195 91 -152 73 180 -82
6396 -82 -157 -117 -355 88 -93 156 -94 -19 14 137 -190 -256 43 0 -173 -94 -32 -437 39 45 84 32 130 26 -60
6421 -60 -76 -199 -24 -241 107 176 -42 -306 -48 435 44 121 -259 131 -4 -194 309 -71 109 322 142
6442 142 -177 -128 300 24 260 -425 -301 -143 9 116 71 277 47 -69 -32 -134 -241 -38 149 -109 262
6463 262 144 84 -293 27 190 -294 -4 -4 -21 -360 -87 -27 -38 -13 308 -15 205 69 -113 150 334 53
6485 53 25 143 98 37 211 -63 205 -118 -74 69 -85 -46 -292 16 -50 -251 -155 -276 -256 117 136 -205 231
6508 231 -105 -304 47 -40 224 220 9 32 339 158 -70 0 85 199 150 -16 108 -51 5 138 109 4 53
6531 53 207 -21 -11 -176 -104 137 -330 -315 -185 -131 211 205 -289 123 -33 -89 -203 -127 -366 266 -128 350 -81
6554 -81 112 68 -164 13 -116 -152 -135 282 98 -170 78 1 227 -96 -48 -146 33 -35 118 161 -161 51 185
6577 185 368 -52 -86 337 314 13 287 -194 152 150 174 162 -49 -81 -217 147 -213 4 173 255 -21 -114 -100
6600 -100 -225 56 -104 -55 149 -110 86 -28 0 70 -147 -23 -26 -135 -140 2 317 118 -136 32 25 -52 -163
6623 -163 278 -67 15 -178 -262 174 -260 -187 -68 -152 -107 204 -200 -21 79 -182 64 13 -223 37 149 193
6645 193 26 4 184 -176 83 -7 267 -6 -168 -144 138 -244 163 -27 -11 65 -226 11 -47 -269 -172 37
6667 37 82 50 131 32 105 94 -305 -140 -226 -124 66 -238 -208 -87 156 -104 -87 -196 -122 173 -330 360 112 -187
6691 -187 79 -41 63 8 142 57 40 91 -434 -191 -37 -114 -85 24 -84 39 136 149 183 -110 111 34 146
6714 146 -41 -112 94 -530 -15 -82 102 -112 11 -384 277 248 -125 166 -172 -49 -239 -33 -100 144 -16
6735 -16 129 -128 -120 -332 -114 -350 110 116 -122 -102 -43 -100 253 -154 -223 -144 339 179 65 86 80 -277 -134 -133 120
6760 120 -3 153 0 -102 -155 148 -67 -132 79 172 -174 -222 317 -9 188 -278 165 90 277 88 60 228
6782 228 12 115 159 -7 -28 -160 265 -39 -161 42 -64 16 166 65 -46 148 -110 -43 -77 45 61 3
6804 3 74 202 122 -103 46 -102 23 197 262 -265 -39 -18 -304 -202 -178 128 -128 -300 223 59 190 11
6826 11 -10 154 -74 -128 171 81 -172 -71 201 -57 -48 32 -29 -97 -126 -169 -289 -84 -22 93 160 -115 -214 -110 -272
6851 -272 -361 270 188 96 -101 -129 -126 -18 90 -221 165 -41 123 -200 -22 -202 -131 -78 21 -21 -133 -132 226 23
6875 23 -78 -1 -160 129 208 -197 -18 209 56 -1 289 -52 96 -39 -162 190 163 -19 1 -171 -187 288
6897 288 -153 -52 131 278 155 -64 247 35 4 209 126 102 300 -238 -123 81 -60 -60 484 161 72 221
6919 221 146 -3 -225 23 -208 -219 133 -238 -142 -37 -221 -149 157 85 279 237 -148 128 112 247 16 -26 43
6942 43 138 -3 52 -17 -384 -109 -6 100 -124 125 -132 -72 -122 297 181 86 -194 -18 -95 25 -97 -149 122
6965 122 -106 -66 376 173 59 -120 64 130 150 146 -286 72 128 -128 -79 99 15 -40 10 360 -366 -61 -106 250
6989 250 160 -148 30 36 -35 -184 -187 -38 -251 -117 -261 -209 -128 32 98 -157 151 -161 195 -147 -23 217 -57
7012 -57 15 -145 -103 33 -250 49 -101 80 -219 -26 150 -189 3 -226 -132 42 -81 302 -67 -248 -186 -80
7034 -80 73 7 130 -386 -318 -37 -147 -239 -143 -188 -138 140 10 -159 -70 -8 -70 -321 118 117 9 139 274 3
7058 3 -106 58 -213 80 117 -314 -40 4 -309 -105 -228 -151 9 2 -276 -63 169 -228 202 57 -2 -207 40
7081 40 -76 -282 -100 120 -158 106 205 83 -121 129 91 147 152 -221 -133 32 55 -134 45 -9 70 -25 299 35
7105 35 -194 -115 13 252 -146 308 82 -9 268 -195 15 212 -10 -54 287 -17 -269 106 179 -2 -133 77
7127 77 71 188 -213 49 -24 84 15 40 71 229 278 151 196 253 225 -176 -258 -131 62 16 154 0 -6 102 148
7152 148 -278 256 211 79 -176 -393 -72 211 141 100 101 -3 31 -100 37 0 85 -116 -133 -341 185 158 -265
7175 -265 -107 -88 -37 32 -48 -150 -18 233 100 -296 -211 -233 221 56 224 -29 160 -7 -261 -28 -18 114
7197 114 107 -30 320 -30 55 274 -200 -202 -190 -193 163 -122 -63 5 336 -214 -417 30 -294 288 -109 301 194
7220 194 230 -140 -53 226 75 -232 184 67 196 -41 -39 32 412 -154 -264 -87 -104 -6 157 156 -191 70 -137
7243 -137 -28 135 -40 -11 -160 20 346 -263 99 294 -93 94 -174 -36 122 232 131 39 -6 -249 74
7264 74 39 -58 -152 -215 -163 36 -145 -102 93 162 12 180 -116 -51 16 -8 63 116 -161 -222 70 -52 106 -50 45
7289 45 114 -467 5 126 75 59 270 -212 173 78 -206 -32 123 -192 45 40 -92 -120 45 -49 -6 299 310 -231
7313 -231 -27 291 -30 -58 260 -120 41 -30 114 288 -76 -94 -87 16 -29 25 194 -149 203 -110 -9 55 -265
7336 -265 -61 -72 -3 101 -32 94 50 -171 118 -161 -14 87 103 -46 -95 -166 -219 -199 -65 -108 181 -154 241
7359 241 102 -354 -211 5 -180 -25 -339 -79 154 -71 34 71 152 -326 245 14 186 -60 -104 -62 36 -133
7381 -133 -76 -98 215 -7 70 -144 -165 -198 56 68 -58 94 38 -377 113 87 -168 191 -4 245 79 -80 -218
7404 -218 -66 -79 175 -72 -253 184 -189 85 -132 -27 -101 246 104 -22 -104 -66 -97 -158 53 253 47 -116
7426 -116 34 -79 -101 84 -33 -401 212 76 123 209 3 -108 6 -165 -118 108 169 -185 486 258 -76 -1
7448 -1 -34 22 -77 -73 83 114 -21 28 215 124 -326 42 14 92 -11 -56 213 52 106 -29 61 -96 16 -5 -126
7473 -126 -80 -11 -89 70 -334 -174 15 -216 -14 -120 178 138 -201 344 50 -21 246 34 127 106 -4 -124
7495 -124 -72 47 79 -210 225 36 66 65 29 85 290 -244 99 118 100 -31 -179 171 286 -123 -114 -83 -171 -7
7519 -7 -309 -229 -202 181 205 241 -1 71 168 -46 88 94 295 170 189 49 12 101 -390 146 -213 -20 55 -76 219
7544 219 -205 164 -259 -49 -67 -91 31 -96 116 113 -318 39 45 -252 42 33 21 -273 -62 -156 -14 -239 -20
7567 -20 -105 68 -44 -366 465 14 158 33 152 21 -55 56 -58 -221 13 -7 110 181 220 -202 -27 -105
7589 -105 79 72 -294 145 -17 -170 -11 24 41 -78 224 6 -64 308 50 -27 -13 -1 52 15 87 49 -240 -158
7613 -158 1 56 45 253 -213 -59 113 96 162 214 -88 -67 79 245 -99 -171 148 -131 -57 -91 118 -201 76
7636 76 -207 100 -136 -114 -61 -17 -111 153 -200 80 -76 60 13 39 -97 280 21 128 158 63 -399 -101 8
7659 8 -174 1 -103 139 -50 -150 -76 -30 14 -59 -100 6 230 158 105 194 -213 136 -221 9 194 332 -116
7682 -116 -94 -84 -128 -63 24 -25 -6 64 152 330 -24 -129 -91 -173 30 433 -62 -42 -97 -179 90 -113 153 -30 -62
7707 -62 172 104 16 -86 -133 55 15 39 -64 11 -247 66 90 45 7 -179 199 31 92 -292 136 139 -99 231
7731 231 55 73 -34 -12 115 194 196 -70 -40 179 -10 -21 -20 -12 -161 44 -28 236 -179 159 392 -29 10 -153
7755 -153 -235 -334 -241 -90 199 -140 -83 -20 64 -49 -199 -138 116 111 43 86 66 -62 218 84 -76 -2 -96 207 -101
7780 -101 -23 77 20 28 -19 -15 -43 -105 -104 7 157 136 51 -219 51 66 104 -95 364 128 20 -139 351 -126 -91
7805 -91 -111 -68 -135 -177 -196 76 -61 80 222 -79 177 -95 190 -56 -16 308 63 99 167 -100 147 -377 105
7828 105 36 -44 -160 65 -62 -9 75 -30 216 -92 56 -221 48 -291 183 -102 148 76 -28 56 115 -59
7850 -59 -68 -194 -255 130 -123 -43 -85 -189 119 130 302 -303 99 125 46 56 -112 93 -70 -135 38 -14 110 -16
7874 -16 192 -127 198 -39 75 51 -77 71 -565 89 -85 91 -38 397 -47 -125 232 12 -169 -143 223
7895 223 3 -37 -146 7 102 -105 -105 -226 -140 191 81 -130 180 -2 -22 -67 -57 194 194 46 129 -54 232 -155
7919 -155 -58 1 179 -11 -35 23 85 16 -137 -184 -94 -140 -154 274 354 66 -238 -29 -184 133 60 -230 63 103
7943 103 210 45 132 -124 73 164 -65 252 -208 -205 26 15 203 47 163 84 73 -388 66 150 -163 182 -239
7966 -239 270 75 86 -39 150 -8 -84 277 -112 -40 -51 49 133 -135 -262 76 10 -87 2 203 -5 222 -253
7989 -253 21 49 319 -54 -24 46 -88 228 -181 -5 221 -161 76 82 -79 244 -10 -15 -147 -322 -282 68 -58
8012 -58 -17 -24 49 62 -222 26 24 350 -6 156 -219 -214 -13 34 60 -95 -62 -110 231 -4 -154 43 46 30 8 -62
8038 -62 -265 -47 -193 -158 60 75 -259 74 -238 -79 262 26 -17 38 45 44 78 -23 77 23 -140 102 403 -81
8062 -81 -114 -81 261 154 181 -327 9 -194 -201 90 108 88 140 279 16 147 156 -35 151 205 99 -184 -46 -154
8086 -154 -187 155 -299 238 -228 270 -198 1 148 491 -112 2 68 -259 140 -61 -216 61 -173 -32 173
8107 173 74 -89 -15 -305 58 495 -126 103 90 201 -120 363 131 -77 114 87 -52 157 -130 129 251
8128 251 -233 -52 -304 17 -182 115 -203 136 99 51 -126 124 -158 57 -44 84 42 -161 -207 -73 -59 -113
8150 -113 175 262 26 -72 -11 41 221 95 -76 190 -127 -80 -31 -29 103 -66 -252 70 240 -116 -171 -46 -20
8173 -20 -37 -65 -9 33 -134 -40 -82 36 206 -9 -68 126 191 -93 115 1 142 12
8191A2
##END NTUPLES=NMR FID
##END=
