##TITLE=1H_DE-30_DMSO
 DMSO-d6
 8 sc, 
 29.7.2024
##JCAMPDX= 6.0         $$ Bruker NMR JCAMP-DX V2.0
##DATA TYPE= NMR FID
##DATA CLASS= NTUPLES
##ORIGIN= UXNMR, Bruker Analytische Messtechnik GmbH
##OWNER= root
$$ XWIN-NMR		Version 3.5
$$ Mon Jul 29 14:00:08 2024 Russian Standard Time (UT+4h)  she@DPX200
##.OBSERVE FREQUENCY= 200.1315
##.OBSERVE NUCLEUS= ^1H
##.DELAY= (6, 6)
##.ACQUISITION MODE= SIMULTANEOUS
##.ACQUISITION SCHEME= undefined
##.AVERAGES= 8
##.DIGITISER RES= 18
##SPECTROMETER/DATA SYSTEM= spect
##.PULSE SEQUENCE= zg30
##.SOLVENT NAME= DMSO
##.SHIFT REFERENCE= (INTERNAL, DMSO, 0, 15.7039)
##AUDIT TRAIL= $$ (NUMBER, WHEN, WHO, WHERE, WHAT)
$$ ##TITLE= Audit trail, XWIN-NMR		Version 3.5
$$ ##JCAMPDX= 5.01
$$ ##ORIGIN= Bruker BioSpin GmbH
$$ ##OWNER= she
$$ F:/spectra/data/she/nmr/H-F/1/audita.txt
$$ ##AUDIT TRAIL=  $$ (NUMBER, WHEN, WHO, WHERE, WHAT)
(   1,<2024-07-29 13:58:38.62 +0400>,<she>,<DPX200>,
      <created by zg, POWCHK disabled, PULCHK disabled
       configuration hash MD5:
       00 E9 B6 7A A2 85 ED C7 34 08 36 98 17 FE 4E 26
       data hash MD5: 16K
       BF 3D 59 4E 23 A1 30 C3 AA 05 90 F3 1A FD 53 D2>)
$$ ##END=
$$ 
$$ hash MD5
$$ 73 31 48 A4 EC E9 04 C1 16 A1 DD CB CD EC 9C D7
##$RELAX= 
##$RELAX= 
##$RELAX= 
##$RELAX= 
##$RELAX= 
##$RELAX= 
$$ Bruker specific parameters
$$ --------------------------
##$DU= <F:/spectra>
##$EXPNO= 1
##$NAME= <H-F>
##$PROCNO= 1
##$TYPE= <nmr>
##$USER= <she>
##$AMP= (0..31)
100 100 100 100 100 100 100 100 100 100 100 100 100 100 100 100 100 100 
100 100 100 100 100 100 100 100 100 100 100 100 100 100 
##$AQSEQ= 0
##$AQ_mod= 1
##$AUNM= <au_zg>
##$AUTOPOS= <>
##$BF1= 200.13
##$BF2= 200.13
##$BF3= 200.13
##$BF4= 200.13
##$BF5= 200.13
##$BF6= 200.13
##$BF7= 200.13
##$BF8= 200.13
##$BYTORDA= 1
##$CFDGTYP= 0
##$CFRGTYP= 5
##$CHEMSTR= <none>
##$CNST= (0..31)
1 1 145 1 1 1 1 1 1 1 1 1 1 1 1 1 1 1 1 1 1 1 1 1 1 1 1 1 1 1 1 1 
##$CPDPRG= <>
##$CPDPRG1= <>
##$CPDPRG2= <>
##$CPDPRG3= <>
##$CPDPRG4= <mlev>
##$CPDPRG5= <mlev>
##$CPDPRG6= <mlev>
##$CPDPRG7= <mlev>
##$CPDPRG8= <mlev>
##$CPDPRGB= <>
##$CPDPRGT= <>
##$D= (0..31)
0 1.2 0 0 0 0 0 0 0 0.06 0 0.03 0 0 0 0 0.0002 0 0 0 0 0 0 0 0 0 0 0 0 
0 0 0 
##$DATE= 1722247118
##$DBL= (0..7)
120 120 120 120 120 120 120 120 
##$DBP= (0..7)
150 150 150 150 150 150 150 150 
##$DBP07= 0
##$DBPNAM0= <>
##$DBPNAM1= <>
##$DBPNAM2= <>
##$DBPNAM3= <>
##$DBPNAM4= <>
##$DBPNAM5= <>
##$DBPNAM6= <>
##$DBPNAM7= <>
##$DBPOAL= (0..7)
0.5 0.5 0.5 0.5 0.5 0.5 0.5 0.5 
##$DBPOFFS= (0..7)
0 0 0 0 0 0 0 0 
##$DE= 6
##$DECBNUC= <off>
##$DECIM= 24
##$DECNUC= <off>
##$DECSTAT= 4
##$DIGMOD= 1
##$DIGTYP= 9
##$DL= (0..7)
0 120 120 120 120 120 120 120 
##$DP= (0..7)
150 150 150 150 150 150 150 150 
##$DP07= 0
##$DPNAME0= <>
##$DPNAME1= <>
##$DPNAME2= <>
##$DPNAME3= <>
##$DPNAME4= <>
##$DPNAME5= <>
##$DPNAME6= <>
##$DPNAME7= <>
##$DPOAL= (0..7)
0.5 0.5 0.5 0.5 0.5 0.5 0.5 0.5 
##$DPOFFS= (0..7)
0 0 0 0 0 0 0 0 
##$DQDMODE= 0
##$DR= 18
##$DS= 0
##$DSLIST= <SSSSSSSSSSSSSSS>
$$ [...]
##$SUBNAM2= <"">
##$SUBNAM3= <"">
##$SUBNAM4= <"">
##$SUBNAM5= <"">
##$SUBNAM6= <"">
##$SUBNAM7= <"">
##$SUBNAM8= <"">
##$SUBNAM9= <"">
##$SW= 24.0689530833862
##$SWIBOX= (0..15)
0 0 2 0 0 0 0 0 0 0 0 0 0 0 0 0 
##$SW_h= 4816.95568400771
##$TD= 16384
##$TD0= 1
##$TE= 0
##$TE2= 300
##$TE3= 300
##$TEG= 300
##$TL= (0..7)
0 120 120 120 120 120 120 120 
##$TP= (0..7)
150 150 150 150 150 150 150 150 
##$TP07= 0
##$TPNAME0= <>
##$TPNAME1= <>
##$TPNAME2= <>
##$TPNAME3= <>
##$TPNAME4= <>
##$TPNAME5= <>
##$TPNAME6= <>
##$TPNAME7= <>
##$TPOAL= (0..7)
0.5 0.5 0.5 0.5 0.5 0.5 0.5 0.5 
##$TPOFFS= (0..7)
0 0 0 0 0 0 0 0 
##$TUNHIN= 0
##$TUNHOUT= 0
##$TUNXOUT= 0
##$USERA1= <user>
##$USERA2= <user>
##$USERA3= <user>
##$USERA4= <user>
##$USERA5= <user>
##$V9= 5
##$VALIST= <valist>
##$VCLIST= <CCCCCCCCCCCCCCC>
##$VD= 0
##$VDLIST= <DDDDDDDDDDDDDDD>
##$VPLIST= <PPPPPPPPPPPPPPP>
##$VTLIST= <TTTTTTTTTTTTTTT>
##$WBST= 1024
##$WBSW= 4
##$XGAIN= (0..3)
0 0 0 0 
##$XL= 0
##$YL= 0
##$YMAX_a= 132914
##$YMIN_a= -101774
##$ZGOPTNS= <>
##$ZL1= 120
##$ZL2= 120
##$ZL3= 120
##$ZL4= 120
##$ABSF1= 10
##$ABSF2= 0
##$ABSG= 5
##$ABSL= 3
##$ALPHA= 0
##$AQORDER= 0
##$ASSFAC= 0
##$ASSFACI= 0
##$ASSFACX= 0
##$ASSWID= 0
##$AUNMP= <proc_1d>
##$AZFE= 0.1
##$AZFW= 0.1
##$BCFW= 1
##$BC_mod= 2
##$BYTORDP= 1
##$COROFFS= 0
##$CY= 11.3945322036743
##$DATMOD= 1
##$DC= 2
##$DFILT= <>
##$DTYPP= 0
##$F1P= 15.6554695791079
##$F2P= 12.8336369535428
##$FCOR= 0.5
##$FTSIZE= 0
##$FT_mod= 4
##$GAMMA= 1
##$GB= 0.15
##$INTBC= 1
##$INTSCL= 1
##$ISEN= 128
##$LB= 0.24
##$LEV0= 0
##$LPBIN= 0
##$MAXI= 10000
##$MC2= 0
##$MEAN= 0
##$ME_mod= 0
##$MI= 1.114404
##$NCOEF= 0
##$NC_proc= 0
##$NLEV= 6
##$NOISF1= 3.799351
##$NOISF2= 2.8
##$NSP= 1
##$NTH_PI= 0
##$NZP= 0
##$OFFSET= 15.70392
##$PC= 1
##$PHC0= -25638.83
##$PHC1= 8.587491
##$PH_mod= 1
##$PKNL= yes
##$PPARMOD= 0
##$PSCAL= 0
##$PSIGN= 0
##$REVERSE= no
##$SF= 200.130013532006
##$SI= 16384
##$SIGF1= 3
##$SIGF2= 2
##$SINO= 400
##$SIOLD= 16384
##$SREGLST= <1H.CDCl3>
##$SSB= 0
##$STSI= 0
##$STSR= 0
##$SW_p= 3612.71676300578
##$SYMM= 0
##$S_DEV= 0
##$TDeff= 0
##$TDoff= 0
##$TI= <>
##$TILT= no
##$TM1= 0
##$TM2= 0
##$TOPLEV= 0
##$USERP1= <user>
##$USERP2= <user>
##$USERP3= <user>
##$USERP4= <user>
##$USERP5= <user>
##$WDW= 1
##$XDIM= 8192
##$YMAX_p= 0
##$YMIN_p= 0
$$ End of Bruker specific parameters
$$ ---------------------------------
##NTUPLES= NMR FID
##VAR_NAME=  TIME,          FID/REAL,        FID/IMAG
##SYMBOL=    X,             R,               I
##VAR_TYPE=  INDEPENDENT,   DEPENDENT,       DEPENDENT
##VAR_FORM=  AFFN,          ASDF,            ASDF
##VAR_DIM=   8192,          8192,            8192
##UNITS=     SECONDS,       ARBITRARY UNITS, ARBITRARY UNITS
##FACTOR=    0.0002076,     1,               1
##FIRST=     0,             0,               0
##LAST=      1.7004516,     0,               0
##MIN=       0,             -101774,         0
##MAX=       1.7004516,     132914,          0
$$ Real data points
##PAGE= N=1
##DATA TABLE= (X++(R..R)), XYDATA
$$ [...]
$$ plain form
1916 51 -18 272 -237 76 -237 146 -137 -192 -35 -27 -48 -123 -78 -8 -251 0 -3 -62 -96 -235 -16 -10 -52 47 96 110
1942 110 -74 113 289 32 118 -166 -159 111 106 -18 54 200 -62 191 214 58 245 -57 -2 282 168 143 -51
1965 -51 -55 29 -348 168 65 -55 31 100 -89 -91 -254 -28 83 -159 -163 -3 118 -136 -140 -107 81 -53 63 83 89
1990 89 -361 0 -195 -402 -3 118 98 96 -245 -274 90 139 48 19 334 -86 168 -167 -17 -121 -143 -102 -136 63
2014 63 3 274 -216 204 156 -125 -82 228 -176 -13 64 -331 123 -94 31 171 -133 -191 195 -87 -158 370
2036 370 -22 40 84 95 109 77 -190 -389 118 136 66 311 49 -248 -179 -142 -44 154 47 179 -63 -118 -10 108
2060 108 -269 85 -60 -151 -55 25 120 -117 -161 134 -272 -193 -129 -123 -3 146 76 -208 212 155 111 171 -340 -19
2084 -19 46 -103 103 -25 -222 29 100 107 -166 127 92 -35 -110 -235 -24 -73 -221 51 -41 -3 40 15 2 20 -134
$$ packed form
1916E1o9K90n09L13l13L83k83n5J57Qk1p5M5P0k43K51ln9l4j39K19Om2R9M9J4
1942A10j84J87J76k57Q6k84PK70nj24P2J46k62K53K3j56J87l02N5K84j14k5j94
1965e1mQ4l77N16j03j20Q6O9j89kj63K26J11k42mJ60J21k54mL3J88j34J16K0O
1990H9m50L61j95k07L99J21k0kl41k9L64M9r1k9L15m20K54l35J50j04k2M1l4J99
2014F3o0K71m90M20m8k81M3L10m04J63P7l95M54k17J25J40l04n8L86k82p1N28
2036C70l92O2M4J1J4l2k67j99N07J8p0K45k62k97O9L7R8J98j07J32k42n5J08J18
2060A08l77L54j45r1R6Q0R5k37m4K95m06P9O4OJ20J49p0k84M20n7m4O0n11L21
2084a9O5j49K06j28j97K51P1Pk73K93l5j27p5j25K11m9j48K72r2L8M3k5j3J8j54
$$ plain form
2109 -134 89 216 45 -56 -218 -240 135 -167 -177 299 88 -64 93 -209 -96 -276 133 93 69 -242 -74
2130 -74 -118 -121 162 350 -41 -114 65 -66 68 141 116 78 13 -89 81 151 32 318 149 -6 53 -371 -75 222
2154 222 -302 172 179 -136 305 -13 200 -234 27 289 -205 -3 88 -135 -47 34 -1 87 -42 -118 35 80 -73
2177 -73 -336 -30 -213 86 -105 -219 -19 180 -80 -136 74 49 202 129 4 165 159 -271 269 -245 69 194
2199 194 -211 -350 -175 -183 -59 89 324 -21 152 213 29 131 92 -127 114 68 87 58 -199 74 181 71
2221 71 -121 -93 88 379 310 148 52 202 127 181 283 -166 134 -60 20 321 -5 -40 -189 91 -11 57 31
2244 31 4 337 40 -352 4 -68 70 29 9 8 134 112 -8 -179 -213 33 -197 42 126 259 61 161 122 23
2268 23 247 -169 -37 -20 252 -61 154 -130 -81 274 115 -261 30 81 -64 -204 -169 -37 -157 35 -60 -246
$$ packed form
2109a34K23J27j71j01j62k2L75l02j0M76k11j52J57l02J13j80M09m0k4l11J68
2130g4m4lK83J88l91p3J79j31J34P3k5l8o5j02J70P0j19K86j69j55N9m24K96K97
2154B22n24M74Pl15M41l18K13m34K61K62m94K02R1k23Q8Q1l5Q8j29p6J53M5j53
2177g3k63L06j83K99j91j14K00J99k60n6K10k5J53p3j25J61om30N40n14L14J25
2199A94m05j39J75qJ24J48K35l45J73O1j84J02l9k19K41m6J9k9k57K73J07j10
2221G1j92K8J81K91o9j62r6J50p5N4J02m49L00j94Q0L01l26l5j49K80j02O8k6
2244C1k7L33k97l92L56p2J38m1k0jJ26k2j20j71l4K46k30K39Q4J33j98J00l9r9
2268B3K24m16J32J7K72l13K15k84M9L55j59l76K91N1j45j40L5J32j20J92r5j86
$$ plain form
2290 -246 101 73 -164 -39 -182 -229 -135 -161 69 -257 -12 15 -378 -208 68 -59 -56 -151 -193 152 408 28 221
2313 221 8 124 -116 290 -7 -305 -247 51 190 77 -92 278 27 227 -152 -125 271 51 -244 -156 371
2334 371 291 43 -196 58 -301 58 205 135 33 51 -184 -140 -18 175 -98 -61 -137 209 -31 -210 -50 -89
2356 -89 -6 42 -39 192 54 -147 -104 61 -20 292 218 56 39 -136 -32 -159 334 -225 -350 -195 6 142 -203
2379 -203 -194 -5 -1 -25 -285 -48 96 -96 -119 344 -131 -188 22 -364 39 -230 72 126 -192 92 9 64 -150
2402 -150 -57 -75 -275 -80 116 170 175 -108 -125 207 490 105 -151 17 171 -208 171 -203 -32 220 161 -28
2424 -28 -125 65 -277 -74 150 63 89 315 -2 -5 -64 -260 68 -45 -57 199 -165 -112 222 51 139 -115 -323
2447 -323 102 50 -135 417 86 -290 224 77 129 164 -126 -211 -48 -135 95 99 -87 -68 -6 -146 140 -21 -222
$$ packed form
2290b46L47k8k37J25j43m7R4k6K30l26K45K7l93J70K76j27Lr5m2L45K56l80J93
2313B21k13J16k40M06k97k98N8K98J39j13j69L70k51K00l79K7L96k20k95Q8N27
2334C71q0k48k39K54l59L59J47p0j02J8k35M4J22J93k73L7p6L46k40j79J60l9
2356h9Q3M8q1K31j38k01M3J65q1L12p4j62j7j75J04j27M93n59j25J55K01J36l45
2379b03RJ89Mk4k60K37J44j92k3M63m75n7K10l86M03k69L02N4l18K84q3N5k14
2402a50R3j8k00J95J96N4Nk83j7L32K83l85k56J68J54l79L79l74J71K52n9j89
2424b8r7J90l42K03K24q7K6K26l17ln9j96L28j13j2K56l64N3L34j71Q8k54k08
2447c23M25n2j85N52l31l76N14j47N2L5k90q5J63q7K30Mj86J9O2j40K86j61k01
$$ plain form
2470 -222 124 270 206 -119 -27 -23 -192 -114 -514 82 203 -142 -148 2 146 81 -176 -348 59 81 113 -262 350
2493 350 80 -31 -163 295 -57 -115 -57 -28 144 303 -11 122 92 -88 31 180 12 -60 1 -3 142 -93 -6
2516 -6 243 -236 -171 -44 -217 -6 -95 292 135 55 -289 39 -205 -221 -321 249 18 -137 -145 -33 -7 -266 -56
2539 -56 221 24 -28 -114 -124 85 -31 -274 -198 -94 -369 -100 217 -178 -190 -308 218 185 -82 243 70 39 -8
2562 -8 121 34 -5 7 40 -276 -272 129 -64 -142 -291 -171 -1 -141 -282 -166 -250 -102 -42 -115 14 -1 -18 -84 -42
2587 -42 -130 143 -159 -42 168 -205 192 -204 -91 13 -215 100 -389 -108 -392 -303 108 114 -66 -2 94 174 127
2610 127 126 -293 -230 -35 -406 36 79 32 -102 11 25 25 -25 -41 207 -7 -23 -248 37 -50 -54 -31 193 173 44
2635 44 -218 -49 67 -35 -171 -169 100 61 8 22 -16 190 80 173 -76 93 -16 -99 -118 248 48 314 -29
$$ packed form
2470b22L46J46o4l25R2Mj69P8m00N96J21l45oJ50J44o5k57j72M07K2L2l75O12
2493C50k70j11j32M58l52n8N8K9J72J59l14J33l0j80J19J49j68p2O1mJ45k35Q7
2516fK49m79O5J27j73K11q9L87j57q0l44L28k44j6j00N70k31j55qJ12K6k59K10
2539e6K77j97n2q6j0K09j16k43P6J04k75K69L17l95j2j18N26l3k67L25j73l1m7
2562hJ29q7l9J2L3l16MM01j93p8j49J20J70j40j41J16q4J48O0p3J29j5j7o6M2
2587d2q8K73l02J17K10l73L97l96J13J04k28L15m89K81k84Q9M11Oj80O4R6Q0m7
2610A27jm19O3J95l71M42M3m7j34J13J4%n0j6K48k14j6k25K85q7mK3K24k0j29
2635D4k62J69J16j02j36KK69l9n3J4l8K06j10R3k49J69j09q3j9L66k00K66l43
$$ plain form
2658 -29 35 236 145 -281 49 -51 119 28 210 33 -162 19 -97 -310 -128 145 160 121 -216 -30 -139 -58
2680 -58 -95 38 -27 304 133 -191 -28 -138 79 10 -356 -23 59 -287 153 72 151 203 178 -302 -269 -78 10 -51
2704 -51 -252 -222 -192 3 -73 80 280 233 134 10 -144 -116 175 120 -107 -220 128 137 -112 116 14 -302 153
2727 153 46 246 -111 81 118 104 -88 40 -155 20 92 104 73 79 95 -147 -123 26 3 -239 -84 -152 95 -300
2751 -300 -144 -90 -147 -164 176 -127 -24 -58 147 68 8 137 -161 24 112 -120 -200 -34 -192 -9 166 324 209
2774 209 108 4 -187 -73 -220 -91 -112 -256 -75 98 30 -254 -88 29 -162 188 -80 -193 -11 35 -152
2795 -152 227 -6 -161 49 118 72 75 -19 -52 -200 -139 -111 -179 86 -276 -104 13 -56 83 39 -42 -185 -94 -143 12
2820 12 208 -155 219 92 113 -205 -68 74 207 -175 52 133 96 15 -169 -17 78 82 41 -121 -53 98 217
$$ packed form
2658b9O4K01r1m26L30j00J70r1J82j77j95J81j16k13J82K73J5l9l37J86j09Q1
2680e8l7J33o5L31j71l24J63j10K17o9l66L33Q2l46M40q1P9N2k5m80L3J91Q8o1
2704e1k01L0L0J95p6J53K00m7r9j24j54K8K91n5k27j13L48Rk49K28j02l16M55
2727A53j07K00l57J92L7j4j92J28j95J75P2J2l1OJ6k42K4J49k3k42J55o8K47l95
2751c00J56N4n7j7L40l03J03l4K05p9o0J29k98J85Q8k32q0J66j58J83J75J58j15
2774B09j01j04j91J14j47J29k1j44J81J73o8k84J66J17j91L50k68j13J82M6j87
2795a52L79k33j55K10O9m6Lr4l3j48O1K8o8K65l62J72J17o9J39m4q1j43R1m9J55
2820A2J96l63L74j27K1l18J37J42J33l82K27Q1l7q1j84J52R5Mm1j62O8J51J19
$$ plain form
2843 217 326 239 -121 24 -41 -9 -222 26 3 188 357 214 120 -205 -6 108 98 -65 -283 66 82 283
2865 283 -158 87 200 239 -229 84 -37 -218 6 129 79 4 98 -45 -273 97 16 -64 198 -116 -106 109
2887 109 -425 -31 72 -244 -68 -205 -188 -107 299 -183 -80 4 187 -89 286 63 119 -220 207 -292 121
2908 121 -29 -110 250 -111 -2 -67 -35 -80 -143 -89 -82 -64 -1 -258 165 -264 -194 63 92 176 -39 -205 -167 78 -302
2933 -302 -124 51 107 219 -10 65 -60 -137 20 -74 -192 23 45 85 32 -80 -19 394 171 -218 476 142 -177
2956 -177 52 -296 -106 -89 189 53 -377 176 -112 -42 -88 250 -40 11 -4 -108 81 76 -179 -109 -48 87 243
2979 243 -140 119 -146 -133 151 -60 146 -12 70 41 -14 118 181 -98 43 -130 91 50 52 13 -110 -103 -167 274
3003 274 184 -178 209 -122 -89 -139 -149 119 -16 -206 -113 -98 -203 -38 -205 29 -253 45 84 -366 225 -2
$$ packed form
2843B17J09q7l60J45o5L2k13K48k3J85J69j43r4l25J99J14j0j63k18L49J6K01
2865B83m41K45J13L9m68L13j21j81K24J23n0p5R4j43k28L70q1q0K62l14J0K15
2887A09n34L94J03l16J76j37J7Q1M06m82J03Q4J83k76L75k23N6l39M27m99M13
2908A21j50q1L60l61J09o5L2m5o3N4PJ8O3k57M23m29P0K57K9Q4k15j66L8K45l80
2933c02J78J75N6J12k29P5j25p7J57r4j18K15K2M0n3j12O1M13k23l89O94l34l19
2956a77K29l48J90J7K78j36m30N53k88P0m6L38k90N1j5j04J89nk55P0O1J35J56
2979B43l83K59k65J3K84k11K06j58Q2k9n5J32O3k79J41j73K21m1Kl9j23Po4M41
3003B74r0l62L87l31L3n0j0K68j35j90R3J5j05J65j67K34k82K98L9m50N91k27
$$ plain form
3025 -2 161 -28 -6 -66 -59 -91 28 3 135 -78 -15 216 170 -104 -58 59 -274 131 -91 480 -163 -85 -10 -155
3049 -155 54 253 101 -20 85 14 144 -79 -111 -3 -81 221 -105 -15 -27 -200 394 55 -52 68 516 -19
3071 -19 70 266 0 -171 -96 -59 232 312 -149 67 31 21 78 8 26 176 -164 -32 5 140 -62 33 66 220
3095 220 23 48 88 298 -225 -231 -164 -25 261 -19 -172 15 10 -100 -85 -131 71 -388 25 -56 220 50 70 -56
3119 -56 -125 7 291 77 167 -69 377 29 82 -42 100 -97 -172 -124 44 18 -175 77 -165 -12 23 -239 -136
3142 -136 -12 129 -370 -70 -236 -198 -314 -52 231 106 -238 98 -123 -127 -283 -23 -51 231 298 4 113 -62
3164 -62 48 -144 49 -26 55 -12 127 -66 160 1 -2 62 440 162 132 92 -82 67 33 147 -144 -224 -146 127
3188 127 -64 -168 -216 185 -14 128 31 -253 7 -9 -23 -126 -100 -155 -56 -56 -251 19 162 -174 25 258 -78
$$ packed form
3025bJ63j89K2o0Pl2J19k5J32k13O3K31m6k74M6J17l33M05k22N71o43P8P5j45
3049a55K09J99j52j21J05p1J30k23l2J08p8L02l26R0j2j73N94l39j07J20M48n35
3071a9Q9J96k66j71P5L7K91Q0m61K16l6j0N7p0J8J50l40J32L7J35k02R5L3J54
3095B20j97K5M0K10n23oO7J39K86k80j53J87nj10J5m6K02m59M13q1K76j70K0j26
3119e6o9J32K84k14R0k36M46l48N3j24J42j97p5M8J68k6j93K52k42J53L5k62J03
3142a36J24J41m99L00j66L8j16K62K83j25l44L36k21mj56K60k8K82O7k94J09j75
3164f2J10j92J93p5Q1o7J39j93K26j59lO4L78k78l0m0j74J49l4J14k91q0P8K73
3188A27j91j04m8M01j99J42r7k84K60j6j4j03K6n5R9%j95K70J43l36J99K33l36
$$ plain form
3211 -78 -43 -41 22 -156 175 -92 -174 155 120 342 30 -29 -53 -265 -98 -24 38 139 23 252 175 -44 87 261
3235 261 -45 28 -57 197 15 102 -132 -172 3 -222 150 -16 -267 -42 161 74 286 -11 189 339 274 30
3257 30 -227 -40 -219 -123 44 -295 387 246 -121 121 -57 35 44 -110 -21 -350 -244 -223 169 82 -332 -94 182
3280 182 94 171 -30 121 259 -8 136 40 118 -18 -262 257 249 -215 153 241 120 7 -111 195 -28 181
3302 181 -97 41 206 163 40 108 -18 304 110 -103 -177 1 126 -76 70 57 237 -258 147 143 63 -122
3324 -122 -142 30 -156 -72 112 -281 127 226 9 -71 -184 7 -178 62 61 71 -77 0 -197 128 355 183 -35
3347 -35 36 -164 1 200 -252 200 80 -129 -168 -138 127 -385 230 -273 -107 -12 240 -55 -463 -152 10 193
3369 193 -123 181 -41 144 78 121 -80 -69 -101 -184 -134 -33 -18 -112 18 -298 7 -9 46 65 28 -87 135 -133
$$ packed form
3211g8L5KO3j78L31k67q2L29l5K22l12n9k4k12J67P4O2J01j16K29p7k19J31J74
3235B61l06P3q5K54j82Q7k34m0J75k25L72j66k51K25K03q7K12k97K00J50o5k44
3257C0k57J87j79R6J67l39O82j41l67K42j78R2Rj54Q9l29J06K1L92q7m14K38K76
3280A82q8P7k01J51J38k67J44r6P8j36k44N19qm64L68Q8j21j13j18L06k23K09
3302A81k78J38J65m3j23O8j26L22j94k13p4J78J25k02J46j3J80m95M05mq0j85
3324a22k0J72j86Q4J84l93M08R9k17q0j13J91j85K40jJ0j48P7j97L25K27j72k18
3347c5P1k00J65J99m52M52j20k09l9L0K65n12O15n03J66R5K52k95m08L11J62J83
3369A93l16L04k22J85o6M3k01J1l2q3N0J01J5r4J30l16L05j6N5J9l7j15K22k68
$$ plain form
3393 -133 -222 31 61 47 227 147 216 66 -74 159 64 -197 -469 -17 126 6 -256 17 -37 23 153 -29 -120
3416 -120 -267 -10 -235 -128 -231 23 169 42 107 -174 -180 -56 -142 45 234 161 82 -2 -283 -53 -44 83 -148
3439 -148 -281 -69 55 -92 90 231 269 -71 -411 -117 55 46 27 95 314 448 -40 321 -333 -102 -344 -465
3461 -465 109 123 49 -122 -39 -96 155 -25 -129 -23 35 146 129 -97 -234 -241 50 114 -102 -110 -217 -194 127 -22
3485 -22 79 42 168 182 -91 -294 -116 252 -140 -77 260 -55 -160 130 224 -76 56 242 -145 -70 150 158 48
3508 48 86 141 -16 165 159 -420 55 113 -309 -31 -226 23 -71 -263 64 109 57 102 -138 106 300 -214 -150 57
3532 57 29 -120 16 -128 25 -230 -77 384 403 130 71 -341 309 -11 193 -185 222 -18 201 -56 20 -41
3554 -41 18 66 -204 -201 -75 171 5 -20 -355 -180 -130 62 158 -67 -314 29 18 -136 -21 77 252 170 48 23
$$ packed form
3393a33q9K53L0j4J80q0O9j50j40K33r5k61k72M52J43j20k62K73n4O0J30j82r1
3416a20j47K57k25J07j03K54J46j27O5k81oJ24q6J87J89p3p9q4k81K30RJ27k31
3439a48j33K12J24j47J82J41L8l40l40K94J72rj9O8K19J34m88L61o54K31k42j21
3461d65N74J4p4j71Q3n7K51j80j04J06N8J11j7k26j37pK91O4k16qj07K3L21j49
3485b2J01l7J26J4k73k03J78L68l92O3L37l15j05K90R4l00J32J86l87P5K20Qj10
3508D8L8N5j57J81on79M75N8m22K78j95K49r4j92L27M5n2M5k40K44J94n14O4K07
3532E7k8j49J36j44J53k55J53M61J9k73n9m12O50l20K04l78M07k40K19k57P6o1
3554d1N9M8k70LJ26K46j66k5l35J75N0J92R6k25k47L43j1j54J15R8J75q2j22k5
$$ plain form
3578 23 47 93 16 -266 59 -412 98 -71 -105 217 -65 -195 320 -107 -216 -280 -50 23 53 122 2 -80 84
3601 84 261 68 102 50 38 135 269 19 -506 15 -89 343 -83 157 171 -223 216 -150 14 -151 -83 -299
3623 -299 -82 -227 -211 1 -47 92 141 132 157 186 163 -301 -321 65 -185 95 18 246 392 -211 -129 120 177 -268
3647 -268 93 -256 49 -100 -166 71 165 49 13 -145 -68 -166 175 -117 -65 8 90 28 -175 418 -222 -68 114
3670 114 212 -186 481 -87 430 244 -130 -243 -68 -145 13 69 -3 112 38 52 353 74 -93 60 143 242 43
3693 43 -28 -71 50 142 99 32 315 220 -150 165 -151 133 35 -146 149 9 -14 202 -127 -54 -27 152 -60 -270
3717 -270 198 68 -53 249 30 -194 239 141 -52 -190 -6 93 -253 -122 -41 -369 106 -65 -61 185 411 -4
3739 -4 -80 184 -223 -63 -68 121 -173 292 -357 -43 -89 2 159 48 27 -56 -126 245 121 -16 -48 10 19 75 -354
$$ packed form
3578B3K4M6p7k82L25m71N10j69l4L22k82j30N15m27j09o4K30P3L0O9j20q2J64
3601H4J77j93L4n2j2R7J34k50n25N21j04M32m26K40J4l94M39l66J64j65O8k16
3623b99K17j45J6K12m8J39M9rK5K9k3m64k0L86k50K80p7K28J46o03Q2K49N7m45
3647b68L61l49L05j49o6K37R4j16l6j58P7r8L41k92N2P3Q2o2k03N93o40J54J82
3670A14R8l98O67n68N17j86l74j13J75p7J58N6p2J15p4J4L01k79j67J53Q3R9j99
3693D3p1m3J21R2m3o7K83r5l70L15l16K84r8j81K95j40k3K16l29P3K7J79k12k10
3717b70M68j30j21L02k19k24M33r8j93j38J84R9l46J31Q1l28M75j71MK46K26m15
3739dp6K64m07J60nJ89k94M65o49L14m6R1J57j11k1q3p0L71j24j37l2N8RN6m29
$$ plain form
3764 -354 65 -7 -131 15 331 64 -159 48 -243 -135 54 37 -374 51 -307 -133 -34 -111 -64 -122 -112 -283
3786 -283 81 294 -47 198 -148 216 198 -129 113 13 281 68 -88 207 -139 7 -11 -40 28 326 26
3807 26 -85 47 50 -44 -44 76 10 47 -49 102 -70 95 -199 -162 205 227 -32 47 -243 31 473 158 169 -203
3831 -203 290 379 282 188 83 7 -161 -227 307 -70 11 -185 33 -171 -57 -31 72 273 -110 -79 -159 -289 40
3854 40 243 77 100 -166 212 -120 42 -60 121 -74 149 258 274 -399 19 -48 -120 122 -265 273 350 76
3876 76 -100 -345 -192 -262 76 16 17 183 94 -276 181 148 21 -157 22 -34 33 38 -406 218 94 204 8 73
3900 73 225 71 -58 229 -377 287 260 -52 -90 -149 -188 -22 159 131 91 134 -340 -107 247 -160 18 -36 116
3923 116 -190 -29 -58 359 161 -270 348 72 50 74 159 -145 76 223 -70 -175 271 -92 51 -151 -80 278
$$ packed form
3764c54M19p2j24J46L16k67k23K07k91J08J89j7m11M25l58J74R9p7M7n8J0j71
3786b83L64K13l41K45l46L64j8l27K42j00K68k13j56K95l46J46j8k9O8K98l00
3807B6j11J32Lr4%J20o6L7r6J51j72J65k94L7L67K2k59P9k90K74M42l15J1l72
3831b03M93Q9r7r4j05p6j68o6N34l77Q1j96K18k04J14K6J03K01l83L1q0j30L29
3854D0K03j66K3k66L78l32J62j02J81j95K23J09J6o73M18o7p2K42l87N38P7k74
3876G6j76k45J53p0L38o0JJ66q9l70M57l3j27j78J79n6O7Nm44O24j24J10j96O5
3900G3J52j54j29K87o06O64k7l12l8n9l9J66J81k8m0M3m74K33L54m07J78n4J52
3923A16l06J61k9M17j98m31O18k76k2K4Q5l04K21J47k93j05M46l63J43k02P1L58
$$ plain form
3945 278 -26 -109 -345 10 114 -124 99 -22 370 -20 -167 214 -163 242 152 110 312 -121 17 -360 190
3966 190 217 266 14 19 76 -49 -139 155 70 139 98 -137 -67 199 88 -13 141 -222 150 205 -56 -90 14 -187
3990 -187 -14 -49 -81 222 -159 -27 155 150 77 -14 107 -125 162 -131 -189 175 36 -411 115 108 23 212 183 150
4014 150 20 14 165 -54 -287 -16 77 -44 261 -341 -306 -61 -451 -287 -26 -100 239 -101 -51 -299 -219 -57
4036 -57 -21 -22 8 -180 -84 -138 -162 -189 -183 28 -175 -70 187 -47 -34 -144 412 -88 365 -115 61 -18 -55 110 -101
4061 -101 90 56 26 262 78 77 -30 70 239 29 -303 -39 42 47 -21 14 190 182 -128 -135 125 -41 101 120 232
4086 232 128 53 256 270 51 49 -224 -50 297 -167 189 98 -146 41 -175 75 2 132 -329 107 -63 -104
4108 -104 85 -141 204 39 55 280 -112 107 -40 -183 155 24 1 -341 -166 -66 127 -116 -242 34 -38
$$ packed form
3945B78l04q3k36L55J04k38K23j21L92l90j47L81l77M05r0m2K02m33J38l77N50
3966A90K7M9k52NN7j25r0K94q5O9m1k35P0K66j11j01J54l63L72N5k61l4J04k01
3990a87J73l5l2L03l81J32J82np3r1J21k32K87k93n8L64j39m47N26pq5J89k9l3
4014A50j30oJ51k19k33K71R3j21L05o02L5K45l90J64K61p4L39l40N0k48Q0J62
4036e7L6jL0j88R6n4k4k7OK11k03J05K57k34J3j10N56n00M53m80J76p9l7J65k11
4061a01J91l4l0K36j84jj07J00J69k10l32K64Q1No8L5J76ql10pK60j66J42J9J12
4086B32j04p5K03J4k19kk73J74L47m64L56r1k44J87k16K50p3J30m61M36j70m1
4108a04J89k26L45j65J6K25l92K19j47j43L38j31k3l42J75J00J93k43j26K76p2
$$ plain form
4129 -38 -1 -81 -9 -53 -113 -162 -79 195 -32 109 147 238 54 15 28 8 74 68 50 -173 11 318 -18 -233 149 -149
4155 -149 -21 -212 23 223 3 354 -65 -3 -129 20 144 30 -252 -2 152 -213 78 204 -72 148
4175 148 392 -73 -23 78 -37 -68 274 -16 -122 -26 -300 67 85 -70 -117 -101 288 -222 -158 119 17 63 159
4198 159 43 38 -226 -154 -36 -101 178 -101 126 123 96 99 -155 255 2 -32 224 172 -20 -364 -99 18 94 -195
4222 -195 -42 -160 21 -62 46 -188 -117 23 177 174 -106 -27 -112 -28 -112 207 -62 -2 -14 130 -96 -379 166
4245 166 39 85 -103 73 80 -86 -81 150 -46 -198 93 86 -129 -160 -48 154 404 149 -49 163 169 271 -58
4268 -58 -348 -131 -6 152 -138 377 206 -26 222 64 -89 96 -64 28 10 -186 34 -104 -62 32 35 -271
4290 -271 -210 -25 -49 171 176 -109 -40 -124 172 -23 80 65 50 178 125 -28 35 -106 -50 131 305 48 -51 112
$$ packed form
4129c8L7q0P2m4o0m9Q3K74k27J41L8R1j84l9J3k0O6oj8k23J84L07l36k15L82k98
4155a49J28j91K35K00k20L51m19O2j26J49J24j14k82K50J54l65K91J26k76K20
4175A48K44m65N0J01j15l1L42k90j06R6k74L67J8j55m7J6L89n10O4K77j02M6R6
4198A59j16nk64P2J18o5K79k79K27lk7Lk54M10k53l4K56n2j92l44K65J17P6k89
4222a95J53j18J81q3J08k34P1J40J54lk80P9q5Q4q4L19k69O0j2J44k26k83N45
4245A66j27M6j88J76Pj66NK31j96j52K91pk15l1J12K02K50k55j98K12OJ02l29
4268e8k90K17J25J58k90N15j71k32K48j58j53J85j60R2j8j96K20j38M2R4Ll06
4290b71O1J85k4K20Nk85O9q4K96j95J03j5j5J28n3j53O3j41N6J81J74k57r9J63
$$ plain form
4314 112 -3 103 -22 58 80 -256 241 -178 124 -30 -107 -18 -52 53 11 132 -233 -70 118 18 90 62 -102
4337 -102 209 -36 -7 -57 142 -142 -45 271 190 46 2 179 134 502 -59 -87 -150 131 -95 81 99 -109 200
4360 200 -242 -95 -44 0 259 -155 -31 104 45 -176 84 -79 -92 117 -86 84 294 -21 116 -42 -91 184
4382 184 139 -101 144 18 -362 -20 45 305 -130 -81 -6 -126 -10 249 -133 91 112 175 72 -85 9 56 -15
4405 -15 116 22 -341 66 -18 -21 -181 -101 166 -184 5 -182 64 -237 149 -7 -201 -81 -1 2 58 58 180 231
4429 231 97 49 -51 24 141 -9 3 216 -136 213 -190 -40 -52 -159 -291 -138 -209 -179 205 95 99 242 58
4452 58 -73 -187 -152 29 -113 256 184 -39 -185 3 203 -101 -211 -19 -78 -80 -84 26 260 21 272 -2 69
4475 69 58 36 14 -122 -130 6 31 -70 -103 -128 125 -7 109 37 -55 -165 9 162 432 -128 -127 216 250 13 -134
$$ packed form
4314A12j15J06j25Q0K2l36M97m19L02j54p7Q9l4J05m2J21l65J63J88j00P2k8j64
4337a02L11k45K9n0J99k84R7L16q1j44m4J77m5L68n61k8o3K81k26J76J8k08L09
4360B00m42J47N1M4K59m14J24J35n9k21K60j63j3K09k03J70K10l15J37j58m9K75
4382A84m5k40K45j26l80L42O5K60m35M9P5j20J16K59l82K24K1O3j03j57R4M7p1
4405a5J31r4l63M07q4lj60Q0K67l50J89j87K46l01L86j56j94J20Q0LN6%J22N1
4429B31j34m8j00P5J17j50J2K13l52L49m03J50j2j07j32J53p1L0L84j10MJ43j84
4452E8j31j14L5J81j42L69p2k23j46J88K00l04j10J92n9kmJ10K34k39K51k74P1
4475F9j1k2k2j36qJ36K5j01l3k5K53j32J16p2r2j10J74J53K70n60JL43L4k37j47
$$ plain form
4500 -134 -30 -164 -97 -180 18 93 -62 114 -15 -152 206 42 2 -199 -181 -291 128 106 -64 -115 261 305 231
4523 231 -141 -32 -92 -388 -61 -84 -112 160 25 -86 -87 77 137 106 -62 -121 -15 102 -182 -176 -140 225 217 -192
4547 -192 -72 3 118 153 -157 159 158 95 -21 50 92 -111 79 -36 324 248 113 38 -362 -319 -143 -10 -199
4570 -199 -444 -124 149 105 -203 304 82 -166 175 121 23 81 -91 87 -17 -253 54 -286 -4 -120 54
4591 54 70 136 25 139 -141 32 -39 -175 252 61 -184 106 3 -52 151 91 -115 70 172 -43 71 3
4613 3 -77 -32 -77 150 137 -20 -232 -46 116 -83 123 -285 -128 -93 -61 -186 10 2 -11 -32 157 9 15 15 -139
4638 -139 58 -94 -17 96 88 49 99 -32 -16 -67 -148 -173 -107 -163 67 -47 67 -71 -94 -243 255 -9 273 99
4662 99 -76 80 3 22 45 -76 -2 41 86 3 125 60 -384 -248 22 -310 128 -6 -30 79 130 1 -187 -145
$$ packed form
4500a34J04j34O7q3J98P5j55J76j29j37L58j64m0k01J8j10M19k2j70n1L76M4p4
4523B31l72J09o0k96L27k3k8K72j35j11jJ64O0l1j68n9J06J17k84OL6L65qm09
4547a92J20P5J15L5l10L16jo3j16P1M2k03J90j15L60p6j35p5m00M3J76J33j89
4570a99k45L20K73m4l08N07k22k48L41n4r8N8j72J78j04k36L07l40K82j16J74
4591E4J6O6j11J14k80J73p1j36M27j91k45K90j03n5K03o0k06J85J02k15J14o8
4613Cq0M5m5K27j3j57k12J86J62j99K06m08J57L5L2j25J96qj3k1J89j48O%j54
4638a39J97j52P7J13ql9N0j31J6n1q1k5O6n6K30j14J14j38k3j49M98k64K82j74
4662I9j75J56p7J9K3j21P4M3M5q3J22o5m44J36K70l32M38j34k4J09N1j29j88M2
$$ plain form
4686 -145 -176 -146 63 -75 -95 -119 230 -151 -85 27 -38 -355 30 -148 -174 39 -87 -425 109 -59 48 21 -81
4709 -81 223 211 449 173 3 -120 -99 221 76 143 -17 136 129 -366 -61 -103 175 -126 -281 -21 -142 179
4731 179 -303 -203 168 99 -114 -86 27 -166 0 38 84 49 104 134 351 231 8 -333 -55 63 149 -193 190
4754 190 153 -150 129 -73 77 81 -33 -65 -72 -107 25 -166 81 -285 37 26 -173 74 -14 146 53 -41 -265 286
4778 286 98 -79 210 -140 143 -6 124 -404 13 174 81 -11 33 77 -64 89 -42 149 -99 14 1 -21
4800 -21 -150 -152 150 251 359 -361 -123 33 106 247 68 -39 141 -34 57 108 256 -93 -131 6 -48 -142 -11
4823 -11 -119 187 21 115 -40 -115 202 -27 53 -69 38 139 125 -82 -146 170 -234 -9 66 -106 87 -142
4845 -142 103 125 4 21 34 -162 -377 -62 -2 57 -46 106 -92 30 268 -35 -242 -54 43 -86 192 -123
$$ packed form
4686a45l1L0K09j38k0k4L49l81O6J12o5l17L85j78k6K13j26l38N34j68J07k7j02
4709h1L04j2K38k76j70j23K1L20j45O7j60J53pm95L05m2K78l01j55K60j21L21
4731A79m82J00L71o9k13K8J13j93J66L8M6l5N5L0K17j20k23l41K78J18Q6l42L83
4754A90l7l03K79k02J50Mj14l2pl5J32j91K47l66L22j1j99K47q8J60r3r4k24N51
4778B86j88j77K89l50K83j49J30n28M17J61r3r2M4M4j41J53j31J91k48J13j3k2
4800b1j29kL02J01J08p20K38J56P3J41j79j07J80j75R1N1J48l49l8J37n4r4J31
4823a1j08L06j66R4j55p5L17k29Q0j22J07J01j4k07o4L16m04K25P5j72J93k29
4845a42K45K2j21J7J3j96k15L15O0N9j03J52j98J22K38l03k07J88R7j29K78l15
$$ plain form
4867 -123 183 -353 87 -81 -36 381 -292 -303 -56 -88 -81 25 -99 -99 -20 -25 -385 -256 66 -48 43 -197 -236 -83
4891 -83 -194 -98 -239 -71 83 97 -189 29 65 15 -150 -91 -124 89 23 25 154 -100 -33 -34 95 -115 -1 129
4915 129 88 -275 233 237 -137 55 86 -17 5 174 -386 -9 177 -61 323 89 31 -146 -160 -89 91 0 -273
4938 -273 -163 10 -84 -202 337 -187 -236 57 -257 0 118 227 312 -259 54 -191 203 47 -205 133 -259
4959 -259 -308 -331 107 228 5 -196 370 -60 -15 129 87 -294 -196 -134 114 -285 -247 -132 222 76 109 121 -106
4982 -106 -259 292 40 -5 491 -122 -64 -138 60 -76 244 -19 371 -240 -194 263 71 120 159 117 -48 -34 255
5005 255 -45 -71 2 -27 52 300 -66 52 -108 -151 175 -87 -212 163 -368 -334 283 168 145 -181 -59 133
5027 133 -91 -385 -112 47 -170 70 124 337 54 -87 -268 107 -26 -47 154 -32 38 -129 111 188 74
$$ packed form
4867a23L06n36M40j68M5M17o73j1K47l2PJ06j24%P9nl60J29L22j14R1k40l9J53
4891h3j11R6j41J68J54J4k86K18L6n0j65N9l3K13o6KJ29k54O7jJ29k10J14J30
4915A29m1l63N08Ml74J92L1j03K2J69n60L77J86k38L84k34n8j77j4P1J80r1k73
4938b73J10J73r4j18N39n24m9K93l14K57J18J09Q5n71L13k45L94j56k52L38l92
4959b59m9k3M38J21k23k01N66m30M5J44m2l81R8O2K48l99L8J15L54j46L3J2k27
4982a06j53N51k52m5M96o13N8p4J98j36L20k63L90o11M6M57j92M9L9m2j65J4K89
5005B55l00k6P3k9P9K48l66J18j60m3L26k62j25L75n31L4O17j15k3l26J22J92
5027A33k24k94K73J59k17K40N4K13k83j41j81L75j33k1K01j86P0j67K40P7j14
$$ plain form
5048 74 -340 -384 108 9 -155 124 -30 -33 -117 200 33 -165 161 -45 209 -278 -137 -16 60 50 270 81 -94
5071 -94 -39 -72 -11 144 83 29 284 -142 120 -182 315 -319 -60 -126 103 88 -64 97 59 79 34 27 186 68
5095 68 76 307 -16 23 173 148 -57 121 -192 270 109 -60 -156 92 238 -281 104 79 -278 -1 124 -180
5117 -180 34 -106 -190 -47 24 33 -29 7 -204 -321 -203 203 183 -239 171 453 -63 80 114 299 -154 373 17
5140 17 -136 16 -125 -76 69 -252 -99 124 417 342 179 -102 -163 -41 -100 -38 -339 -168 -113 -130 132 -75 -177
5163 -177 -153 94 57 -266 -51 11 -122 -113 392 -218 -354 -135 70 -47 148 -156 -92 15 300 -21 -28 -35 -362
5186 -362 -338 -159 -27 -47 -159 33 234 -151 -57 149 -17 56 -55 -39 -57 239 92 149 34 -210 92 49 -215
5209 -215 238 -225 -62 73 -30 -113 -116 37 -244 9 -114 -118 190 -27 228 63 -183 -48 162 -246 -522 30
$$ packed form
5048G4m14m4M92r9j64K79j54lq4L17j67j98L26k06K54m87J41J21P6j0K20j89j75
5071i4N5l3O1J55o1n4K55m26K62l02M97o34K59o6K29j5j52J61l8K0m5pJ59j18
5095F8QK31l23L9J50k5k05J78l13M62j61j69r6K48J46n19L85k5l57K77J25l04
5117a80K14j40q4J43P1Ro2L6k11j17J18M06k0m22M10K82n16J43L4J85m53N27l56
5140A7j53J52j41M9J45l21J53K23K93p5j63k81o1J22n9O2l01J71N5j7K62k07j02
5163a77K4K47l7l23K15O2j33RN05o10j36K19K05j17J95l04O4J07K85l21ppl27
5186c62K4J79J32k0j12J92K01l85R4K06j66P3j11J6j8K96j47N7j15k44L02m3k64
5209b15M53m63J63J35j03q3lJ53k81K53j23mL08k17K55j65k46J35K10m08k76N52
$$ plain form
5231 30 0 145 -232 -287 124 -71 8 218 172 31 -161 137 -228 255 -117 147 -130 92 -67 196 -99 60
5253 60 -60 193 43 33 -84 -134 -104 -175 -28 19 99 -326 94 -36 238 -20 -4 86 90 64 313 116 -203 -110
5277 -110 74 -163 130 -108 -51 9 235 -226 135 -267 -42 -42 225 -177 -387 -69 -114 -78 72 190 25 69
5299 69 86 13 182 -89 159 -173 3 245 69 9 -47 220 -280 84 -172 16 11 45 -170 187 144 -6 -351
5322 -351 -224 -278 29 -26 -101 151 218 153 -83 -46 48 -38 62 183 135 -145 -58 71 151 237 -234 -18 -49 -53 -28
5347 -28 87 278 -4 63 337 -331 8 -225 165 14 7 -66 -88 291 152 282 -108 273 -209 -43 -19 -65 -80
5370 -80 -273 -35 143 -188 -55 -19 -91 84 -208 152 -87 152 -33 -58 89 -312 105 -194 118 208 109 -26
5392 -26 58 -370 153 -11 138 150 -69 0 147 -252 174 138 -303 -28 -162 -48 -15 -333 -60 53 72 253
$$ packed form
5231C0l0J45l77n5M11j95P9K10m6j41j92K98l65M83l72K64k77K22j59K63k95J59
5253F0j20K53j50j0j17n0L0p1J47M7Q0m25M20j30K74k58J6R0Mk6K49j97l19R3
5277a10J84k37K93k38N7O0K26m61L61m02K25%K67m02k10L18m5L6J50J18j65M4
5299F9J7p3J69k71K48l32J76K42j76o0n6K67n00L64k56J88nL4k15L57m3j50l45
5322c51J27n4L07n5p5K52O7o5k36L7R4q6J00J21m8k80Q7J29Q0Q6m71K16l1mK5
5347b8J15J91k82O7K74o68L39k33L90j51pp3k2L79j39J30l90L81m82J66K4m6j5
5370h0j93K38J78l31J33L6p2J75k92L60k39K39j85k5J47m01M17k99L12R0r9j35
5392b6Q4m28N23j64J49J2k19O9J47l99M26l6m41K75j34J14L3l18K73J13J9J81
$$ plain form
5414 253 49 -125 9 -88 -80 -156 -90 -59 134 18 -165 135 54 -52 -43 -117 68 -112 115 363 -206 30 139
5437 139 -39 -447 111 31 34 -278 -100 158 -161 229 -152 -91 57 286 147 65 -37 169 80 219 94 106
5459 106 -137 213 -67 132 151 -196 194 78 55 -232 8 76 -215 96 20 83 -281 151 -180 5 -193 -158
5481 -158 19 6 192 34 -40 -87 94 -54 -42 -49 -53 -108 -31 241 -259 -218 -153 -65 -258 133 4 257 -132 108
5505 108 57 173 151 -203 95 329 39 5 -74 -171 -185 -87 -4 -299 -29 -220 -118 -91 -89 79 -293 12 -139 102
5529 102 -375 113 -30 -19 -5 -93 74 -144 123 77 78 -127 99 95 -72 -334 330 -21 141 51 -167 -57 47
5552 47 -28 84 -98 481 160 87 223 214 130 303 80 -148 87 39 107 -44 291 85 -78 173 -87 -3 -70
5575 -70 -513 -205 -164 154 -317 401 20 -18 -221 126 147 301 -328 129 -198 525 112 -87 -207 81 -98
$$ packed form
5414B53k04j74J34r7Qp6O6L1J93j16j83L00q1j06Rp4J85j80K27K48n69K36J09
5437A39j78m08N58q0Ll12J78K58l19L90l81O1J48K29j39q2j02K06q9J39j25J2
5459A06k43L50k80J99J9l47L90j16k3k87K40O8k91L11p6O3l64M32l31J85j98L5
5481a58J77j3J86j58p4m7J81j48J2pmn5P7K72n00M1O5Q8j93L91j29K53l89K40
5505A08n1J16k2l54K98K34k90l4p9r7j4R8Q3k95K70j91J02K7KJ68l72L05j51K41
5529A02m77M88j43J1J4q8J67k18K67m6Jk05K26mj67k62O64l51J62r0k18J10J04
5552D7p5J12j82N79l21p3J36rq4J73k23k28K35m8O8j51L35k06j63K51k60Q4o7
5575g0m43L08M1L18m71P18l81l8k03L47K1J54o29M57l27P23m13j99j20K88j79
$$ plain form
5596 -98 -61 336 -12 -139 -94 89 -52 7 213 127 11 -131 246 -99 73 46 -54 78 32 -144 -39 -105 -120
5619 -120 -119 54 72 97 -157 52 243 -21 107 -49 294 -121 166 -105 -14 -62 13 -3 -103 133 89 30 157
5642 157 -95 217 -99 363 17 -39 -135 162 -138 24 -328 -249 237 -93 -23 104 186 -66 -97 -51 -202 -14
5664 -14 -69 105 225 118 75 -112 -53 -106 32 -220 321 33 293 -243 -46 -42 -54 51 -201 -89 216 85 165
5687 165 -289 -60 84 -203 -248 -99 39 66 32 -26 96 13 120 -229 261 -19 284 -131 -78 -158 63 216
5709 216 112 5 -34 -44 -111 40 -9 -166 108 -108 -73 84 349 -79 61 -300 -68 -23 -286 -246 -22 338
5731 338 -178 156 -230 216 59 7 160 253 206 -2 39 -45 -190 -8 -42 -192 187 -48 80 21 -150 -97 -40
5754 -40 455 -57 -258 76 -87 -130 41 -202 -87 44 167 142 148 88 -121 218 16 -369 306 -108 242 167
$$ packed form
5596i8L7L97l48j27M5J83j41N9K06q6j16j42L77l45J72k7j00J32m6j76J05o6j5
5619a20JJ73J8K5k54K09J91k64J28j56L43m15K87k71R1m8P5j6j00K36m4n9J27
5642A57k52L12l16M62l46n6r6K97l00J62l52P9M86l30P0J27Q2k52l1M6j51J88
5664a4n5J74J20j07m3j87N9n3J38k52N41k88K60n36J97Mj2J05k52J12L05j31Q0
5687A65m54K29J44k87m5J49J38K7l4n8J22q3J07l49M90k80L03m15N3q0K21J53
5709B16j04j07l9j0o7J51m9j57K74k16L5J57K65m28J40l61K32M5k63M0K24L60
5731C38n16L34l86M46j57n2J53R3m7k08M1q4j45J82l4j50L79k35J28n9j71N3N7
5754d0M95n12k01L34j63m3J71k43J15J31J23k5Oo0k09L39k02l85O75m14L50p5
$$ plain form
5776 167 12 34 14 -75 -151 -115 113 -127 -396 26 -31 4 105 -101 31 -410 102 -154 -185 1 162 -66 -339
5799 -339 174 34 -88 50 -24 -16 28 43 282 -91 200 -172 385 101 -26 51 -116 230 -180 -45 197 98
5821 98 -24 140 120 81 172 -107 -124 -13 -30 -31 -58 99 4 109 -111 151 228 184 -8 6 -282 164 28 101 3
5846 3 -196 239 -146 -97 293 -23 -3 -9 -13 63 154 -138 -47 -176 70 105 -235 27 111 -60 -140 243 18 33 40 -143
5872 -143 -149 -141 -142 1 38 -42 103 -114 193 96 -35 -53 9 -120 234 29 131 -222 164 -178 228 -156 -196 36
5896 36 -237 53 31 -59 24 59 217 156 -73 228 84 4 48 -295 -79 -228 -74 33 -338 343 185 -165 -109
5919 -109 -380 114 -81 196 -173 134 98 -215 203 -96 203 29 185 -77 313 -175 -106 -116 128 352 -413
5940 -413 125 -84 -12 -57 -176 104 65 119 -94 -31 89 118 -205 -339 64 -238 -53 -12 -40 -316 177 -151 -19
$$ packed form
5776A67j55K2k0q9p6L6K28k40k69M22n7L5J01k06J32m41N12k56l1J86J61k28k73
5799c39N13j40j22J38p4QM4J5K39l73K91l72N57k84j27P7j67L46m10J35K42r9
5821I8j22J64k0l9R1k79j7J11j7jk7J57r5J05k20K62P7m4j92J4k88M46j36P3r8
5846Cj99M35l85M9L90l16K0omP6R1k92R1j29K46L5l40K62Q4j71q0L83k25J5Pj83
5872a43oQjJ43L7q0J45k17L07r7j31j8O2j29L54k05J02l53L86l42M06l84m0K32
5896C6k73K90k2r0Q3L5J58o1k29L01j44q0M4l43K16j49J54J07l71O81j58l50N6
5919a09k71M94j95K77l69L07l6l13M18k99K99j74J56k62L90m88O9j0K44K24p65
5940d13N38k09P2m5j19K80l9N4k13O3J20K9l23j34M03l02J85M1k8k76M93l28J32
$$ plain form
5963 -19 -292 178 149 76 -130 -238 -103 192 185 -145 -305 148 291 182 -23 22 -23 13 -328 -70 -127 -150 -17
5986 -17 -54 309 -289 9 106 44 -274 36 -6 46 -104 -67 15 38 37 168 -86 96 -16 74 -395 -98 -181 -190 155
6011 155 -81 -236 15 -4 17 65 -391 -124 32 -148 -159 -90 -37 -35 14 -230 -99 64 -221 -181 45 -194 -303
6034 -303 186 -239 103 -71 -53 -190 -118 59 32 31 -20 111 63 144 -51 -83 157 121 -4 167 -167 -149 45 100
6058 100 268 37 -395 99 424 70 75 -146 -125 -113 50 -60 -106 47 227 -35 57 174 -431 44 102 -186
6080 -186 -209 -281 41 163 -51 211 60 88 424 8 -138 93 356 60 -6 92 160 343 -144 -116 12 -97
6102 -97 -106 21 -168 339 -143 -24 65 256 -35 -306 205 241 45 67 52 -196 -176 -299 12 -69 -100 -208 79
6125 79 146 80 205 141 47 9 -168 -21 -251 76 -208 267 96 -142 294 -192 -115 -116 -90 523 123 60 -278 -94
$$ packed form
5963a9k73M70k9p3k06j08J35K95pl30j60M53J43j09k05M5m5L6l41K58n7k3J33
5986a7l7L63n98K98R7o2l18L10m2N2j50L7Q2K3jJ31k54J82j12R0m69K97q3rL45
6011A55k36j55K51j9K1M8m56K67J56j80j1O9N3KM9k44J31J63k85M0K26k39j09
6034c03M89m25L42j74J8j37P2J77k7jn1J31m8Q1j95l2K40l6j25J71l34J8J94N5
6058A00J68k31m32M94L25l54Nk21K1J2J63j10m6J53J80k62R2J17o05M75N8k88
6080a86k3p2L22J22k14K62j51K8L36m16j46K31K63k96o6R8O8J83m87K8J28j09
6102i7rJ27j89N07m82J19Q9J91k91k71N11L6j96K2j5k48K0j23L11q1l1j08K87
6125G9O7o6J25o4r4l8j77J47k30L27k84M75j71k38M36m86P7jK6O13m00o3l38J84
$$ plain form
6149 -94 -226 -334 90 -195 184 4 118 65 137 122 51 65 121 240 -140 241 -115 233 172 -197 -35 -25 45
6172 45 -29 5 10 -359 68 -162 80 -92 -47 -22 202 114 -41 19 292 -254 155 -247 108 147 -158 -30 67 169
6196 169 33 93 113 -205 -37 9 197 -77 -83 -50 -64 167 -24 -109 39 -76 136 -177 294 -243 -112 -212 -129
6219 -129 -8 -68 47 -62 88 139 8 -81 161 12 58 140 294 -87 146 214 360 -1 -49 -49 14 -375 326
6242 326 163 -168 94 139 -127 95 -75 19 52 189 68 2 -302 14 -115 -163 -55 -79 -46 16 -45 -365 -420
6265 -420 -242 -45 -468 -9 24 -168 -51 -3 -131 -51 -100 257 -78 -146 324 291 207 -108 -111 -294 -62 83 -12
6288 -12 179 13 -38 -101 16 -119 123 22 -50 53 79 268 -39 48 78 183 19 -324 -137 380 412 65 -314
6311 -314 119 -23 -223 64 -296 -302 -194 -393 -36 164 230 -23 -288 -122 42 86 28 -43 -136 -154 119 -162 -24
$$ packed form
6149i4j32j08M24k85L79j80J14n3P2j5p1J4N6J19l80L81l56L48o1l69J62J0P0
6172D5p4L4Nl69M27k30K42j72M5K5K24q8j55O0K73n46M09m02L55L9l05J28R7J02
6196A69j36O0K0l18J68M6J88k74oL3j4K31j91q5J48j15K12l13M71n37J31j00Q3
6219a29J21o0J15j09J50N1j31q9K42j49M6Q2J54l81K33O8J46l61m8%O3l89P01
6242C26j63l31K62M5k66K22j70R4L3J37j21o6l04L16j29m8J08k4L3O2o1l20n5
6265d20J78J97m23M59L3j92J17M8j28Q0m9L57l35o8M70l3q4l15lj83K32J45r5
6288a2J91j66n1o3J17j35K42j01p2J03K6J89l07Q7L0J05j64l43J87N17L2l47l79
6311c14M33j42k00K87l60oJ08j99L57K00O6k53k65J66J64M4n8p1r3j8K73k81J38
$$ plain form
6334 -24 62 8 -83 -125 -67 -29 -425 109 -100 -131 -59 70 -80 145 -134 129 -21 -107 -64 86 97 -196 -8 173
6358 173 -98 289 55 -11 108 227 118 -218 -218 -51 -191 11 16 -167 78 169 -333 210 -13 -3 -93 34 168
6381 168 74 -45 -166 -123 89 216 -337 254 -23 107 -165 -138 34 169 -146 71 -10 348 -189 123 323
6402 323 -204 -57 -95 114 36 -122 139 -37 220 176 72 140 -98 119 -55 109 -67 174 20 129 -164
6423 -164 138 -6 -286 86 148 -349 -9 56 43 242 -122 -229 150 -64 -18 -195 -290 90 85 -92 294 -258
6445 -258 -124 15 -81 209 60 -43 243 121 -167 101 -281 -42 82 97 68 258 73 -131 81 -53 82
6466 82 -251 -76 5 -182 -125 107 89 -168 -173 -78 147 -439 191 -205 -132 47 40 -11 11 121 -18 -60 -61 122 49
6491 49 184 -122 62 -66 -74 -176 206 -416 270 -31 40 133 133 105 355 165 197 -105 -160 72 125 144 -177 -135
$$ packed form
6334b4Q6n4r1m2N8L8l96N34k09l1P2J29j50K25k79K63j50q6M3J50J1k93J88J81
6358A73k71L87k34o6J19J19j09l36%J67j40K02Nj83K45R1n02N43k23J0r0J27J34
6381A68r4j19j21M3K12J27n53N91k77J30k72K7J72J35l15K17q1L58n37L12K00
6402C23n27J47l8K09p8j58K61j76K57m4j04O8k38K17j74J64j76K41j54J09k93
6423a64L02j44k80L72O2m97L40O5j3J99l64j07L79k14M6j77r5L80nj77L86n52
6445b58J34J39r6K90j49j03K86j22k88K68l82K39J24J5k9J90j85k04K12j34J35
6466H2l33J75Q1j87N7K32j8k57nR5K25n86O30l96P3J79pn1K2J10j39m2jJ83p3
6491D9J35l06J84j28qj02L82o22O86l01P1R3%k8K50j90L2l02n5K32N3J9l21M2
$$ plain form
6515 -135 -140 135 -113 -139 -178 77 -26 -48 -128 173 11 -150 172 -205 -134 -102 -118 187 -164 -56 -156 -270 -77
6538 -77 -122 93 -6 135 -111 -79 -170 1 -105 324 132 202 -24 -328 193 37 -94 -148 270 46 24 -162 -75
6561 -75 -187 200 -259 -87 -113 194 -54 -51 -128 -142 -210 123 -80 -46 -3 91 -21 216 264 67 168 164 64 -102
6585 -102 -112 17 39 202 -166 214 -93 205 275 -179 84 -61 -222 -48 98 -64 379 -172 149 167 -10
6606 -10 30 -230 131 -129 -59 94 -77 -96 81 -21 53 -56 -141 -127 -100 29 -26 -123 -209 352 300 -35 22 32 9
6631 9 -35 189 -8 98 -32 66 -24 -207 171 28 61 181 117 -32 -230 19 -65 -23 -140 5 230 -232 317
6654 317 -248 -361 -142 -42 -50 182 -13 50 -179 -343 117 -58 212 -57 158 182 -64 -260 -58 -26 17 -24
6676 -24 227 -120 236 -42 115 68 69 -63 -26 257 119 -57 -97 138 -63 61 30 -44 69 -498 -36 -130 -331
$$ packed form
6515a35nK75k48k6l9K55j03k2q0L01j62j61L22l77P1L2j6L05l51J08j00j14J93
6538g7m5K15r9J41k46L2r1J71j06M29j92P0k26l04N21j56j31n4M18k24k2j86Q7
6561g5j12L87m59J72k6L07k48Lp7j4o8L33k03L4M3R4j12K37M8j97J01mj00j66
6585a02j0J29K2J63l68L80l07K98P0m54K63j45j61J74J46j62M43n51L21J8j77
6606a0M0k60L61k60P0J53j71j9J77j02P4j09q5J4K7J29n5r7q6N61n2l35N7J0k3
6631Im4K24j97J06j30R8r0j83L78j43L3J20o4j49j98K49q4M2j17J45K25m62N49
6654C17n65j13K19J00qK32j95O3k29j64M60j75K70k69K15K4k46j96K02L2M3m1
6676b4K51l47L56k78J57m7Jj32L7K83j38j76m0K35k01J24l1p4J13n67M62r4k01
$$ plain form
6699 -331 -103 -172 -92 390 363 -60 -226 -124 -181 61 153 196 120 -80 106 -84 -112 210 -68 -133 -291 241 5
6722 5 9 -85 109 -60 42 -24 -54 29 -141 4 245 167 227 -40 -156 69 -92 -74 158 -78 -112 67 4 162
6746 162 -243 -57 2 60 70 239 -2 -23 5 40 -26 159 50 -183 135 -141 -40 -361 190 -135 -19 44 227
6769 227 -279 151 -38 -190 -40 125 50 -82 -119 12 -14 72 84 -63 54 -148 325 -12 -27 -123 0 26 47
6792 47 125 -17 214 209 -204 347 -155 156 -123 156 58 -139 -85 102 -25 12 203 106 -122 371 169 -61 44
6815 44 44 -134 -80 -85 87 153 324 -215 -5 -139 117 -163 174 414 -118 -191 29 12 202 2 -135 -32 34
6838 34 -158 -85 -80 147 1 -172 75 -231 -57 -14 -50 335 157 -36 -158 101 -85 -131 156 5 -75 31 -38
6861 -38 -165 -105 62 100 73 267 84 12 -79 -66 -73 -59 -81 26 25 -47 241 -91 -114 48 -117 77 -300 104 -87
$$ packed form
6699c31K28o9Q0M82k7m23j66J02n7K42R2M3p6k00J86j90k8L22k78o5j58N32k36
6722EMr4J94j69J02o6l0Q3j70J45K41p8O0k67j16K25j61J8K32k36l4J79o3J58
6746A62m05J86N9N8J0J69k41k1K8L5o6J85j09k33L18k76J01l21N51l25J16O3J83
6769B27n06M30j89j52J50J65p5j32l7J31k6Q6J2j47J17k02M73l37j5r6J23K6K1
6792D7P8j42K31nm13N51n02L11k79K79r8j97N4J87j27L7J91r7k28M93k02k30J05
6815D4%j78N4nJ72O6J71n39K10j34K56k80L37K40n32p3K20j7J90k00j37J03O6
6838C4j92P3NK27j46j73K47l06J74M3l6L85j78j93j22K59j86m6K87j51q0J06o9
6861c8j27O0J67L8k7J94j83p2r1J3pJ4k2J07jp2K88l32k3J62j65J94l77M04j91
$$ plain form
6886 -87 121 -49 -270 -142 -279 69 188 51 -167 22 -277 230 28 150 -176 -174 222 166 -250 61 -224
6907 -224 284 209 -6 111 61 11 -74 412 131 39 330 -213 40 235 125 -133 -222 158 350 29 -95 42
6929 42 -151 -142 -171 341 21 176 -45 -32 97 -193 -30 -213 88 -209 4 4 0 36 31 199 10 140 -87 -324
6953 -324 -36 239 -165 -3 -121 -73 51 -85 69 -114 137 99 81 -8 119 -86 32 190 -82 -128 174 42
6975 42 -9 -167 220 -83 256 -168 -71 -180 -238 -154 97 -5 40 -126 -188 53 1 -113 -17 181 -14 -316 273
6998 273 33 -46 110 51 -156 116 19 56 -178 -280 14 -161 56 -182 89 11 146 361 -2 -9 -83 58 -166
7021 -166 275 160 -215 71 308 -144 -154 -320 -227 174 -174 -120 -78 -236 -138 59 -262 -90 122 -41 123 95
7043 95 -109 24 3 224 -25 105 348 -334 -19 -101 313 10 275 -57 254 -11 -20 -88 -192 77 -29 203
$$ packed form
6886h7K08j70k21J28j37L48J19j37k18J89k99N07k02J22l26KL96n6m16L11k85
6907b24N08p5k15J17n0n0q5M86k81r2K91n43K53J95j10k58q9L80J92l21j24J37
6929D2j93Rk9N12l20J55k21J3J29k90J63j83L01k97K13%mL6nJ68j89J30k27k37
6953c24K88K75m04J62j18M8J24j36J54j83K51l8j8q9J27k05J18J58k72m6L02j32
6975D2n1j58L87l03L39m24R7j09n8Q4K51j02M5j66o2K41n2j14R6J98j95l02N89
6998B73k40p9J56n9k07K72r7L7k34j02K94j75K17k38K71p8J35K15l63pp4J41k24
7021a66M41j15l75K86K37m52j0j66R3M01l48N4M2j58R8J97l21J72K12j63J64k8
7043I5k04J33k1K21k49J30K43o82L15q2M14l03K65l32L11k65ro8j04K69j06K32
$$ plain form
7065 203 118 46 -129 -354 19 -37 -216 -127 13 122 67 72 100 173 80 -63 -91 -75 -176 -220 -177 -44 55 -64 109
7090 109 -83 46 115 -13 -36 174 67 324 -468 336 57 -168 194 243 -45 -14 -128 -19 107 -18 250
7111 250 65 -245 253 -32 38 -36 50 -94 -14 133 198 -113 -254 -63 -312 6 9 -27 85 108 276 -23 71
7134 71 -60 -64 -9 54 35 25 -257 24 228 301 173 174 -102 -202 212 -17 271 75 205 228 86 99 -168 -141
7158 -141 -164 -71 -65 -45 -209 34 -3 -81 26 -248 -27 -193 97 -231 -131 -199 -58 118 -329 -166 -14 -299 -9
7181 -9 -71 161 218 99 -8 -189 -255 -128 26 143 -215 9 190 11 231 -121 -78 235 -72 -328 -104 99
7203 99 -63 158 4 -71 82 267 -16 -30 -47 -72 -201 -219 65 -225 -247 297 72 -393 -8 116 -17 -238
7225 -238 -32 -247 111 -139 15 167 -195 72 251 -294 179 -130 12 97 206 107 -229 -257 15 113 -261
$$ packed form
7065B03q5p2j75k25L73n6j79Q9J40J09n5NK8P3r3j43k8J6j01m4M3J33R9j19J73
7090A09j92J29O9j28k3K10j07K57p92Q04k79k25L62M9k88L1j14J09J26j25K68
7111B50j85l10M98k85P0p4Q6j44Q0J47O5l11j41J91k49L18Ll6J12K3J68k99R4
7134G1j31mN5O3j9j0k82K81K04P3j28Jk76j00M14k29K88j96J30K3j42J3k67K7
7158a41k3R3OK0j64K43l7p8J07k74K21j66K90l28J00o8J41J76m47J63J52k85K90
7181io2K32N7j19j07j81o6J27J54J17l58K24J81j79K20l52M3L13l07k56K24K03
7203I9j62K21j54p5J53J85k83j4j7k5j29j8K84k90k2N44k25m65L85J24j33k21
7225b38K06k15L58k50J54J52l62K67J79n45M73l09J42Q5J09r9l36k8K72R8l74
$$ plain form
7246 -261 31 48 153 53 4 -119 2 -41 56 -267 -245 99 -129 35 -172 9 143 -4 -276 17 -46 -166
7268 -166 134 136 42 80 325 -133 -29 -130 67 5 -31 9 63 -39 205 -142 -164 -181 -74 404 19 200 -60
7291 -60 109 -103 -22 59 110 17 -150 216 -3 -249 -189 -1 -92 333 278 -29 -282 -120 -187 -80 37 -35 28 -108
7315 -108 -31 -50 -93 259 44 -135 37 37 44 -117 98 115 -165 -49 -161 327 84 110 4 -50 -145 -95 -202 60
7339 60 324 10 201 49 -115 -100 68 201 288 -315 187 4 57 217 -64 -121 -30 -121 55 71 89 -116 216
7362 216 -49 -52 -28 184 9 78 -51 174 -61 -148 181 166 -247 -83 -9 116 205 -27 -174 -239 19 -121 57
7385 57 -56 205 -30 -67 -251 6 -135 -5 50 143 270 -69 -198 289 -87 121 86 95 1 -322 86 -168 -21
7408 -21 112 -365 -105 -19 -129 -82 2 22 23 -143 -43 133 -85 -37 165 39 -5 120 124 -66 -76 85 170 161 -111
$$ packed form
7246b61K92J7J05j00m9j23J21m3R7l23K2L44k28J64k07J81J34j47k72K93o3j20
7268a66L00Kr4L8K45m58J04j01J97o2l6M0N4j02K44l47k2j7J07M78l85J81k60
7291f0J69k12Q1Q1N1r3j67L66k19k46O0J88r1M25n5l07k53J62o7J07J17p2O3j36
7315a08P7j9m3L52k15j79J72%Pj61K15J7k80J16j12M88k43K6j06n4r5N0j07K62
7339F0K64l14J91j52j64J5J68J33Q7o03N02j83N3J60k81n7R1r1J76J6J8k05L32
7362B16k65lK4K12j75O9j29K25k35q7L29j5m13J64P4J25Q9k32j47o5K58j40J78
7385E7j13K61k35l7j84K57j41J30N5R3J27l39j29M87l76K08l5Rr4l23M08k54J47
7408b1J33m77K60Q6j10M7Q4K0Jj66J00J76k18M8K02j26m4J25Mj90j0J61Q5rk72
$$ plain form
7433 -111 240 69 205 102 -143 -92 -152 -48 14 -257 135 -196 83 -155 66 353 146 -200 62 118 -159
7454 -159 -91 7 -22 95 11 110 -132 -114 217 141 -135 -204 268 274 -141 -40 221 -229 115 47 -65 -39 -30 -172 19
7479 19 311 -113 43 -211 -135 -98 -13 175 153 -310 -310 157 90 -345 -216 104 -299 -207 -86 -40 6 -8 181 18
7503 18 106 389 28 -107 -169 210 -15 132 171 95 -20 103 287 -134 -326 5 54 -103 175 -245 34 16
7525 16 -117 -203 -28 38 -40 62 178 -252 -182 8 321 -54 2 84 -164 15 -436 -149 24 -170 -150 -79 -29
7548 -29 -174 56 135 -148 137 -59 170 -208 -161 -155 -205 223 21 -132 15 -145 47 60 -275 -165 218 -69
7570 -69 70 -65 -55 223 211 -150 -153 194 -91 172 -123 -246 106 230 -577 -46 -86 212 33 -69 -186 -135
7592 -135 -5 -154 -16 168 -210 153 106 276 65 79 97 33 -11 -299 390 -155 179 -5 21 -256 -323 -7
$$ packed form
7433a11L51j71J36j03k45N1o0J04O2k71L92l31K79k38K21K87k07l46K62N6k77
7454a59O8R8k9J17q4R9k42J8L31p6k76o9M72Om15J01K61m50L44o8j12K6Rj42J91
7479A9K92m24J56k54P6L7Q5J88k2m63%M67o7m35J29L20m03R2J21M6M6j4J89j63
7503A8Q8K83l61j35o2L79k25J47L9p6j15J23J84m21j92L31M9j57K78m20K79j8
7525A6j33q6J75O6p8J02J16m30P0J90L13l75N6Q2k48J79m51K87J73j94K0P1N0
7548b9j45K30P9k83K85j96K29l78M7On0M28k02j53J47j60J92J3l35J10L83k87
7570f9J39j35J0K78j2l61lL47k85K63k95j23L52J24q07N31m0K98j79j02j17N1
7592a35J30j49J38J84l78L63m7J70k11J4J8o4m4k88O89n45L34j84K6k77o7L16
$$ plain form
7614 -7 -176 113 19 207 118 71 -126 9 -214 129 -178 23 77 39 27 -103 -202 53 -264 57 143 -132 49
7637 49 -30 -142 -277 -114 -83 134 306 15 101 -191 164 342 -235 -77 -70 -361 -78 -105 -68 -273 54 -194 -43
7660 -43 176 45 161 160 201 138 411 -179 101 -66 82 106 206 -103 21 52 -99 -31 35 -41 -149 238 -126
7683 -126 63 60 127 84 -118 -125 47 -124 119 75 -62 -118 -102 97 240 -83 -38 194 -141 293 -67 -23 -20 166
7707 166 283 96 -130 48 -188 -25 -149 70 -59 5 19 -249 88 -346 309 -171 -243 -126 -10 92 -10
7728 -10 215 -157 242 273 -286 -134 315 -103 -49 115 74 -91 85 216 227 10 119 -123 -70 -247 -160 102
7750 102 -166 -164 214 2 -136 -38 3 -15 102 -51 22 62 -53 287 -245 155 -331 7 -140 -428 229 290 232
7773 232 -19 -145 115 -135 -91 -107 -205 -32 -166 -260 -42 -265 -19 -49 -117 35 216 69 6 34 144 169 99
$$ packed form
7614gj69K89r4J88q9m7j97J35k23L43l07K01N4l8j2j30r9K55l17L21Q6k75J81
7637D9p9j12j35J63L1K17J72k91Q6k92L55J78n77J58Pk91K83k7L7k05L27k48J51
7660d3K19j31J16jM1o3K73n90K80j67J48K4J00l09J24L1j51O8O6p6j08L87l64
7683a26J89lO7m3k02pJ72j71K43m4j37n6J6J99J43l23M5K32l35M34l60M4LJ86
7707A66J17j87k26J78k36J63j24K19j29O4J4k68L37m34O55m80p2J17J16J02j02
7728a0K25l72L99L1n59J52M49m18N4J64m1j65J76J31J1k17J09k42N3j77Q7K62
7750A02k68KL78k12j38R8M1j8J17j53P3M0j15L40n32M00m86L38j47k88O57O1n8
7773B32k51j26K60k50M4j6r8J73j34r4K18k23K46l0o8J52J81j47o3K8J10K5p0
$$ plain form
7796 99 -185 -262 264 -23 246 -71 -54 115 52 -276 -29 41 -38 111 207 -205 115 -83 144 368 -14 -44 -225
7819 -225 -100 -175 -175 -101 28 -69 123 -154 -191 26 -72 -39 -103 62 -162 -146 301 -227 260 -4 230 22 -214
7842 -214 235 188 -201 -12 -77 186 -200 71 261 -183 121 101 9 -601 24 70 -136 425 -284 38 -141 -87
7864 -87 -82 -150 140 -167 4 -61 -36 217 -155 -17 -107 10 233 -183 -333 -250 -111 91 -42 264 152 -83 -395
7887 -395 62 390 121 -269 247 -19 -54 190 -1 93 -123 130 -6 -73 -161 171 -234 -87 -69 -141 -13 23
7909 23 -8 -139 -108 -32 58 -149 34 65 -65 51 39 -47 -230 -174 53 159 -156 -65 -53 -79 50 -104 84 48
7933 48 114 -7 200 -401 -471 -92 -111 -131 -199 -58 99 -24 317 139 -161 91 111 62 103 280 385 54 -289
7956 -289 -122 -125 -46 -130 -67 203 197 -450 -98 -184 120 -197 -79 -195 -316 150 -154 -360 76 28 200 98 162
$$ packed form
7796I9k84p7N26k87K69l17J7J69o3l28K47P0p9J49R6m12L20j98K27K24l82l0j81
7819b25J25p5%P4J29r7J92k77l7K17r8L3o4J65k24J6M47n28M87k64K34k08k36
7842b14M49m7l89J89o5K63l86K71J90m44L04k0r2o10O25M6k06N61p09L22j79N4
7864h7No8K90l07J71o5K5K53l72J38r0J17K23m16j50Q3J39K02j33L06j12k35l12
7887c95M57L28k69l90N16k66l5K44j91R4k16K53j36o7q8L32m05J47J8p2J28L6
7909B3l1j31L1P6R0k07J83L1j30J16j2q6j83N6K27J06l15R1J2k6J29j54J88l6
7933D8O6j21K07o01p0L79j9k0o8J41J57j23L41j78l00K52K0m9M1J77J05l31l43
7956b89J67lP9q4O3K70oo47L52q6L04l17J18j16j21M66l04k06M36m8J72j02O4
$$ plain form
7979 162 -13 -194 288 -129 -42 -176 95 -143 3 -64 -141 -9 15 -203 204 122 -28 100 -176 209 128 -251
8001 -251 -115 94 -8 -124 -109 -30 178 130 -70 -76 155 -53 -224 -21 -41 -92 181 -173 9 296 60 13 -66
8024 -66 42 -276 -28 -123 -58 114 -104 160 79 -93 -466 -293 72 -306 -274 97 -145 -311 161 92 -99 200
8046 200 -375 32 46 -97 2 -163 -137 -85 -147 -250 -72 -178 340 35 -175 98 -45 -195 -46 85 -285 64
8068 64 -120 -78 172 -172 46 -230 153 128 56 -99 94 -346 -82 -227 -82 -36 -84 -337 -19 15 4 -34 -204
8091 -204 -264 259 8 -50 -298 -19 173 8 41 84 -154 -50 -85 91 338 -139 26 -90 304 -49 -113 -54
8113 -54 -34 -182 -37 -37 125 40 -197 312 30 186 412 -34 53 -170 -18 -130 -4 183 23 -21 169 392
8135 392 151 14 -72 267 127 52 -66 120 194 -232 -158 83 -203 256 -159 199 29 -7 347 -82 35 0
$$ packed form
7979A62j75j81M82m17Q7j34K71k38J46o7p7J32K4k18M07q2j50J28k76L85q1l79
8001b51J36K09j02j16J5P9K08m8k00oK31k08j71K03k0n1K73l54J82K87k36m7p9
8024f6J08l18K48r5O5J72k18K64q1j72l73J73L65l78L2L71k42j66M72o9j91K99
8046B00n75M07J4j43R9j65K6N2o2j03J78j06N18l05k10K73j43j50J49J31l70L49
8068F4j84M2K50l44K18k76L83k5p2j55J93m40K64j45J45M6m8k53L18L4j1l8j70
8091b04o0N23k51n8k48K79J92j65L3M3k38J04l5J76K47m77J65j16L94l53o4N9
8113e4K0j48J45%J62q5k37N09k82J56K26m46Q7k23J52j12J26J87j60m4J90K23
8135C92k41j37q6L39j40p5j18J86P4m26P4K41k86M59m15L58j70l6L54m29J17l5
$$ plain form
8157 0 -71 -110 133 120 -127 -58 151 160 -175 20 -57 -62 -137 -146 -3 -43 242 -50 -81 71 -13 63 237 247 -134 -34
8183 -34 -5 26 18 18 -11 6 -124 79
$$ packed form
8157@p1l9K43j3k47O9K09Rl35J95p7np5rJ43m0K85k92l1J52q4P6J74J0l81J00
8183c4K9L1q%k9J7j30K03
8191G9
$$ Imaginary data points
##PAGE= N=2
##DATA TABLE= (X++(I..I)), XYDATA
$$ plain form
0 0 0 0 0 0 0 0 1 -8 8 -8 14 -16 16 -24 30 -32 40 -48 56 -67 80 -93 105 -123 142 -161 183 -207 238 -268
30 -268 303 -338 380 -425 473 -528 586 -652 724 -802 887 -980 1088 -1204 1334 -1481 1645
47 1645 -1832 2049 -2298 2595 -2950 3388 -3940 4660 -5646 7086 -9389 13664 -24265 104558
61 104558 108867 -101774 23223 21716 -46791 -19582 -9976 -40540 16829 33906 21233 12297
73 12297 13024 1501 -21271 -23622 7642 -19156 -29565 19871 30969 5794 13182 5652 -7780
86 -7780 -8276 -9959 -12033 -15198 -5809 23102 15316 1983 15276 -2417 -19280 5050 -5007 -24174
100 -24174 1077 12110 4426 11718 7289 -2135 -3085 -4765 -2097 -7727 -13164 5490 9786 -9
114 -9 11596 6768 -10782 1749 4105 -14465 -7939 3621 662 4227 9095 4468 -2529 -2985 1681
$$ packed form
0@%%%%%%JrJ6j6K2l0L2m0N4o2P2q8J04j23J47j73J98k28K65l03L44l90M45n06
30b68N71o41P18q05Q98j001J114j238J376j526J689j867K068k292K538k815L126
47A645l477L881m347M893n545O338p328Q600j0306J2732j6475K3053l7929J28823
61A04558M309k10641J24997j507o8507K7209R606l0564N7369J7077j2673q936
73A2297P27j1523k2772k351L1264k6798j0409M9436J1098k5175P388p530j3432
86g780m96j683k074l165R389K8911p786j3333J3293j7693j6863K4330j0057j9167
100b4174K5251J1033p684P292m429r424r50j680K668n630n437J8654M296r795
114iJ1605m828j7550J2531K356j8570O526J1560k959L565M868m627o997m56M666
$$ plain form
129 1681 -4280 -10311 127 2880 -1844 8379 7977 -5098 -690 4417 -5385 -6666 -521 -710 -35
144 -35 4276 6004 1023 -2007 2149 -564 -7197 -1589 115 -3965 3401 7147 -495 -249 3051 -1656
160 -1656 -4200 -1473 -1622 -2251 981 4116 2425 246 1525 658 -2904 -1840 -544 -3238 -152 3458
176 3458 1037 695 2447 342 -1835 -889 -1586 -1909 -1227 1456 1992 362 1505 1845 -1168 -1373 -339
193 -339 -1928 -1962 1100 1059 -69 1570 1748 -616 -829 -43 -1250 -1726 358 1142 93 514 1691 -89
211 -89 -828 593 -900 -2320 73 441 -947 795 1728 -26 -129 523 -409 -1537 -322 321 -378 143
229 143 1531 353 -179 631 -215 -1233 -338 240 -350 -205 629 787 174 329 285 -684 -518 140 -154 -198
249 -198 458 884 -75 111 685 -652 -379 -197 -291 -679 164 411 56 301 36 -213 -445 220 50 -408
$$ packed form
129A681n961o031J0438K753m724J0223m02j3075M408N107r802j281O145j89O75
144c5M311J728m981l030M156k713o633N608J704m080P366L746p642K46L300m707
160a656k544K727j49o29L232L135j691k179J279q67l562J064J296k694L086L610
176C458k421l42J752k105k177R46o97l23O82K683N36j630J143L40l013k05J034
193c39j589l4L062m1j128J639J78k364k13P86j207m76K084P84j049M21J177j780
211h9p39J421j493j420K393L68j388J742R33j754j03O52r32j128J215O43o99N21
229A43J388j178n32Q10q46j018Q95N78n90J45Q34J58o13J55m4r69J66O58k94m4
249a98O56M26r59J86N74j337K73J82r4l88Q43K47l55K45k65k49k32O65j70m58
$$ plain form
269 -408 289 116 -100 309 411 -241 -194 165 -326 -94 -25 79 185 109 319 47 -317 32 -77 -361 -240
290 -240 263 -13 46 353 124 -31 305 -178 -143 -167 -92 38 35 347 -76 -160 -292 -48 -241 303 257 -256 262
313 262 187 129 63 -118 -7 -315 -154 -100 -48 -126 367 307 -293 71 175 -320 -113 -10 125 52 47 117 -131 215
337 215 196 240 13 82 -185 -282 304 262 -216 105 103 2 -200 60 -127 14 18 -78 110 124 182 -401 231 116
361 116 -116 -75 251 71 -55 229 -66 326 -291 -213 167 -87 6 -45 160 141 26 -139 62 -111 143 -145
383 -145 -404 -125 -29 82 197 -203 -184 42 -150 18 17 4 102 146 179 319 8 29 161 -50 202 -5 15 -55
407 -55 211 -39 120 -42 163 157 -73 167 -71 -99 14 -42 -138 75 -111 -27 226 -197 145 -14 132 164 -259
430 -259 226 -83 170 181 142 -39 62 192 -251 -178 -211 130 142 35 -97 -135 -99 4 215 -199 115 170 -25
$$ packed form
269d08O97j73k16M09J02o52M7L59m91K32O9J04J06p6K10k72l64L49j09k84J21
290b40N03k76N9L07k29j55L36m83L5k4P5J30lL12m23q4j32K44j93N44m6n13N18
313B62p5n8o6j81J11l08J61N4N2p8M93o0o00L64J04m95K07J03J35p3nP0k48L46
337B15j9M4k27O9k67r7N86m2m78L21kj01k02K60j87J41Mr6J88J4N8n83O32j15
361A16k32M1L26j80j26K84k95L92o17P8L80k54R3n1K05j9j15j65K01j73K54k88
383a45k59K79R6J11J15m00J9K26j92J68jj3R8M4L3J40l11K1J32k11K52k07K0p0
407e5K66k50J59j62K05ok30K40k38k8J13n6r6K13j86Q4K53m23L42j59J46L2m23
430b59M85l09K53J1l9j81J01J30m43P3l3L41J2j07j32l8L6J03K11m14L14N5j95
$$ plain form
453 -25 18 -55 58 -222 215 -115 -94 0 -253 282 187 37 -92 66 -3 92 109 72 26 -214 21 85 83 -151 -15
478 -15 -21 -105 41 204 -242 -147 30 -4 -194 11 -17 6 174 -70 121 -167 39 -273 -116 233 -38 83 -5
501 -5 -145 293 -33 7 30 -33 60 -106 182 14 105 29 2 -166 116 34 -72 -35 -177 353 -100 101 -53 151
525 151 -98 11 217 -81 -12 -249 -17 128 -41 138 -218 -66 -157 -44 223 20 -127 285 308 -128 28
546 28 189 34 163 -87 8 -241 -125 228 37 132 -3 -183 168 -73 -140 -21 -136 -90 -124 273 30 -40 132
569 132 -137 -107 103 -317 19 -129 467 -154 17 -101 183 163 236 -142 -221 -62 135 -292 10 -88 176 101
591 101 -71 63 45 -122 276 142 -36 140 -246 165 58 -89 126 -82 -295 -32 -192 -31 245 226 -141
612 -141 139 64 62 -133 -40 18 84 -19 -31 193 -246 -189 -54 -92 -20 62 -359 106 -98 -317 181 209 -128 -2
$$ packed form
453b5M3p3J13k80M37l30K1R4k53N35r5j50j29J58o9R5J7l7m6k40K35O4kk34J36
478a5oq4J46J63m46R5J77l4j90K05k8K3J68k44J91k88K06l12J57L49k71J21q8
501ej40M38l26M0K3o3R3j66K88j68R1p6k7j68K82q2j06L7j42N30m53K01j54K04
525A51k49J09K06k98O9k37K32J45j69J79l56J52r1J13K67k03j47M12K3m36J56
546B8J61j55J29k50R5k49J16L53j91R5j35j80L51k41o7J19j15M6l4L97k43p0J72
569A32k69L0K10m20L36j48N96o21J71j18K84k0P3l78p9J59J97m27L02r8K64p5
591A01j72J34j8j67L98j34j78J76l86M11j07j47K15k08k13K63j60J61K76j9l67
612a41K80p5kj95R3N8O6j03j2K24m39N7J35l8P2Q2m21M65k04k19M98K8l37J26
$$ plain form
636 -2 32 111 12 311 222 -7 61 133 -112 -225 216 -52 193 17 274 -113 -61 22 -343 -234 -116 117 80 -3
660 -3 -59 81 97 75 -82 102 7 110 33 115 -77 204 131 63 17 245 -150 139 -204 -291 -49 -355 -164 261
684 261 -323 119 -157 123 -466 -216 -68 -267 -77 -46 11 -206 43 -332 -256 -240 52 161 168 -180 46 -168
706 -168 -271 -21 426 -88 -236 -48 18 -25 -2 -48 11 -100 -19 -147 98 75 -126 -80 -252 -51 118 -118 -104
729 -104 -52 -198 41 25 -110 105 250 -20 169 32 125 -242 181 196 375 231 -132 214 51 -217 29 148
751 148 -40 54 -108 -218 -55 305 59 -295 5 -207 30 -231 -105 57 497 -156 24 -49 -220 -101 -359
772 -359 139 -107 -106 -30 84 66 -284 -124 95 -74 -120 167 237 -33 328 -64 110 66 -23 402 265 -160 62
795 62 -141 70 0 84 52 26 -127 -157 -252 237 10 -44 15 -68 -395 -266 230 -10 137 262 310 286 -29 -78 69
$$ packed form
636bL4P9r9K99q9k29O8P2k45j13M41k68K45j76K57l87N2Q3l65J09J18K33l7q3
660cn6J40J6k2j57J84r5J03p7Q2j92K81p3o8m6K28l95K89l43q7K42l06J91M25
684B61n84M42k76K80n89K50J48j99J90L1N7k17K49l75P6J6K92J09Pl48K26k14
706a68j03K50M47n14j48J88O6m3K3m6N9j11Q1j28K45k3k01M6j72K01J69k36J4
729a04N2j46K39j6j35K15J45k70J89j37R3l67M23J5J79j44l63L46j63k68K46J19
751A48j88R4j62j10J63L60k46l54L00k12K37k61J26J62M40o53J80p3j71J19k58
772c59M98k46JP6J14j8l50J60K19j69m6K87P0k70L61l92J74m4q9M25j37m25K22
795F2k03K11p0Q4l2k6j53l0r5M89k27n4N9q3l27J29M96k40J47J25M8k4l15m9J47
$$ plain form
820 69 49 -188 308 67 56 -67 -62 -19 -55 192 222 -150 172 -76 -285 5 -83 230 14 -94 52 156 132 -73
844 -73 83 240 35 148 -46 -146 -121 116 179 -276 -215 -140 -12 238 13 -47 -64 -201 -41 5 128 51 -53
867 -53 54 54 5 -79 -257 -311 -60 -67 77 -132 158 22 -23 80 -115 -67 -170 -148 -148 -23 330 -43 -190 -240 -318
892 -318 94 -39 13 173 18 -12 18 -31 132 105 6 -154 31 -272 57 58 96 -59 146 259 160 225 17 -178
916 -178 125 -78 -115 133 267 -14 -201 -105 103 -98 307 2 -355 73 -144 -70 -104 -8 -5 -184 176 90 -168
939 -168 62 -413 -78 -46 155 191 117 21 -197 -29 -56 -180 6 99 -363 -33 -7 -142 -178 168 102 -99 65
962 65 98 -55 116 180 -91 318 124 -50 -312 -92 153 96 273 144 142 56 -106 -49 -47 -174 -135 -48 -235 -20
986 -20 -416 -133 -23 51 25 -121 -104 -148 -32 -57 183 110 81 -121 143 257 263 -171 341 168 136 22 28 -124 21
$$ packed form
820F9k0k37M96k41j1j23NM3l6K47L0l72L22k48k09K90q8L13k16j08J46J04k4k05
844g3J56J57k05J13j94j00K5K37O3m55O1P5J28K50k25o0j7j37J60M6J23p7j04
867e3J07%m9q4j78n4K51pJ44k09K90j36m5J03j95M8j03K2%J25L53l73j47n0p8
892c18M12j33N2J60j55l0L0m9J63k7r9j60J85l03L29JL8j55K05J13r9O5k08j95
916a78L03k03l7K48J34k81j87R6K08k01M05l05l57M28k17P4l4R6Lj79L60q6k58
939a68K30m75L35L2K01L6p4r6k18J68k7j24J86R3m62L30K6j35l6L46o6k01J64
962F5L3j53J71O4k71M09j94j74k62K20K45n7J77j29kq6j62N7Kj27L9Q7j87K15
986b0l96K83J10P4k6j46J7m4J16k5K40p3k9k02K64J14Om34N12j73l2j14Oj52J45
$$ plain form
1011 21 250 -22 135 274 224 9 -53 -112 85 20 -51 137 91 5 -370 -175 -81 193 -40 121 28 -243 138
1034 138 -111 2 88 -67 -302 -8 263 -45 28 -279 -25 257 -156 -197 239 89 33 -47 64 277 -146 224
1056 224 -110 -14 -11 14 -416 -88 107 113 -57 -52 -70 94 -34 2 -48 120 -273 -3 209 443 -122 -30 -217 181
1080 181 -74 -120 113 -251 -18 -330 186 -189 -60 -13 0 -162 -248 105 164 68 -20 -5 -68 248 108 -88 68
1103 68 -119 104 278 -9 -365 -174 227 1 -98 -136 137 -15 -91 37 121 -149 -267 -70 54 -36 -41 -178 -148
1126 -148 20 47 -210 156 254 54 136 48 -166 413 68 319 192 20 36 43 224 34 82 -295 -28 86 64
1149 64 163 -137 -148 -25 67 -56 -29 -131 126 -194 50 271 -134 -53 92 -187 -255 145 -141 79 231 -106
1171 -106 229 183 -87 -270 -98 344 -18 -192 -70 33 -266 40 91 241 35 -9 169 -80 98 332 -79
$$ packed form
1011B1K29k72J57J39n0k15o2n9J97o5p1J88m6q6l75J95R4K74k33J61r3k71L81
1034A38k49J13Q6j55k35K94K71l08P3l07K54K82m13m1M36j50n6q0J11K13m23L70
1056B24l34R6LK5m30L28J95Oj70Nj8J64j28L6n0J68l93K70K12K34n65R2j87L98
1080A81k55m6K33l64K33l12N16l75J29M7J3j62q6L53N9r6q8J5o3L16j40j96J56
1103F8j87K23J74k87l56J91M01k26r9l8K73j52p6J28Q4k70j18J97J24r0nj37L0
1126a48J68K7k57L66R8k00Q2q8k14N79l45K51j27j72J6PJ81j90M8l77K67J14k2
1149F4R9l00j1J23R2j23K7j02K57l20K44K21m05Q1J45k79o8M00k86K20J52l37
1171a06L35m6k70j83J72M42l62j74J22J03k99L06N1J50k06m4J78k49J78K34m11
$$ plain form
1192 -79 25 -141 82 -199 -267 27 -44 74 -10 -238 102 264 -287 -54 44 -261 -257 99 81 187 -85 16 -256
1215 -256 -186 -95 -127 -252 191 52 235 -50 65 184 82 -137 208 255 95 -186 -115 73 270 18 -347 66
1237 66 -96 350 -41 -36 -178 -144 -106 77 -111 -67 -131 205 65 -44 -69 95 -163 15 18 -210 103 232 42
1260 42 -354 -202 45 108 -21 -79 -168 -11 -23 35 83 79 147 -19 228 118 82 -42 227 59 86 69 260 -176
1284 -176 -268 247 -226 -11 -124 53 281 454 38 95 -14 34 -83 128 20 -79 36 -51 33 102 57 -29 167
1307 167 -93 -29 22 177 61 139 267 -151 -92 -112 66 -45 187 -156 -176 -153 -60 120 -138 148 78 13 274
1330 274 5 -75 -170 -260 -149 73 -274 111 3 -392 4 67 271 -85 -43 -68 -31 -130 126 -32 -114 253 -84
1353 -84 -47 -129 -13 123 -85 -32 -57 -52 -116 -113 -120 42 -2 103 134 95 -314 89 31 149 116 153 -6 -171 -110 105
$$ packed form
1192g9J04j66K23k81o8K94p1J18q4k28L40J62n51K33R8l05ML56j8J06k72J01k72
1215b56P0R1l2j25M43j39J83k85J15J19j02k19L45M7j60k81P1J88J97k52l65M13
1237F6j62M46l91Nj42L4L8J83j88M4o4L36j40j09k5J64k58J78Lk28L13J29j90
1260D2l96J52K47O3j29n8q9J57j2N8M8mO8j66K47j10l6j24K69j68K7j7J91m36
1284a76r2N15m73K15j13J77K28J73m16N7j09M8j17K11j08r9J15q7Q4O9m5q6J96
1307A67k60O4N1J55j16P8J28m18N9k0J78j11K32l43k0K3R3J80k58K86p0o5K61
1330B74k69q0r5r0J11K22l47L85j08l95L96O3K04l56M2k5L7r9K56j58q2L67l37
1353h4L7q2J16J36k08N3k5No4LpJ62m4J05L1l9m09M03n8J18l3L7j59j65O1K15
$$ plain form
1379 105 242 10 -12 -101 72 16 -63 349 150 -287 -134 -290 -53 87 -62 -158 178 -205 -77 15 7 -71 -94
1402 -94 83 -105 238 58 -175 34 18 -97 251 66 23 2 136 -190 -269 -52 -3 -85 -244 93 199 -159
1424 -159 -70 137 169 -56 196 -67 -41 105 -112 79 101 -7 119 -66 -146 392 46 -94 -209 207 -42 48
1446 48 -125 -86 -164 -327 -196 8 277 37 -217 -81 14 49 -55 128 202 -154 89 42 192 122 -12 -263 98
1469 98 14 -216 -338 194 -76 167 -82 48 155 158 -24 264 66 15 193 -43 -20 -180 -150 -114 163 152 103
1492 103 155 2 -210 68 368 -80 -421 69 -15 -104 59 -219 -79 -98 -63 -93 -301 -54 -63 143 169 279 -83
1515 -83 -45 266 -423 -138 169 -248 -166 -292 -89 -108 -22 -29 -331 -337 151 -31 58 -58 206 58 67 -73 -32 -251
1539 -251 -344 40 49 284 129 -245 190 89 117 -154 -72 31 -120 230 -154 -29 3 -9 94 -271 34 -276
$$ packed form
1379A05J37k32k2q9J73n6p9M12j99m37J53j56K37J40j49r6L36l83J28R2qp8k3
1402i4J77j88L43j80k33K09j6j15L48j85m3k1J34l26p9K17M9q2j59L37J06l58
1424a59Q9K07L2k25K52k63K6J46k17J91K2j08J26j85q0N38l46j40j15M16k49R0
1446D8j73L9p8j63J31K04K69k40k54J36R5L5j04J83P4l56K43m7J50p0j34k51L61
1469I8q4k30j22N32k70K43k49J30J07Lj82K88j98n1J78k36K3j60L0L6K77j1m9
1492A03N2j53k12K78L00m48l41M90q4q9J63k78J40j9L5l0k08K47rK06K6J10l62
1515h3L8L11o89K85L07m17Q2j26K03j9Q6pl02oM88j82Q9j16K64j48Rj40M1k19
1539b51r3L84RK35j55l74M35j01K8k71Q2J03j51L50l84J25L2j2J03l65L05l10
$$ plain form
1561 -276 -91 8 22 -353 -190 -294 158 20 109 62 -420 -205 -46 -43 -29 141 286 -17 -235 296 -30 -47 -194
1584 -194 17 218 96 263 134 -150 -328 78 -45 -37 77 -179 -70 190 183 -110 -133 -10 98 -500 -300 -17
1606 -17 153 141 258 -249 396 245 55 -6 173 -34 -75 102 160 292 39 45 -166 -232 186 3 57 -191 108
1629 108 214 108 -136 -130 287 196 -2 -262 -4 108 -351 -66 -125 -27 -118 92 28 -253 14 119 58 -81 -168
1652 -168 -164 411 -188 104 404 -225 159 -72 5 14 -274 200 40 -252 -99 -126 112 -114 195 -185 117 -91
1674 -91 -87 2 184 77 62 -27 12 78 -35 -218 53 132 155 19 -135 -102 17 157 -98 -122 -47 -82 84 21 189
1699 189 -4 45 -310 305 -305 -15 -77 -85 -76 -115 140 13 235 86 -120 -223 313 -91 56 -14 29 187 72
1722 72 -75 172 -181 -69 61 -172 -41 -26 13 -51 12 -261 58 -248 210 -87 -58 -54 141 -12 -199 150 157
$$ packed form
1561b76J85R9J4l75J63j04M52j38Q9m7m82K15J59LJ4J70J45l03k18N31l26j7j47
1584a94K11K01j22J67j29k84j78M06j23QJ14k56J09K60pk93k3J23J08n98K00K83
1606a7J70j2J17n07O45j51j90o1J79k07m1J77N8J32k53Ok11o6M18j83N4k48K99
1629A08J06j06k44OM17r1j98k60K58J12m59K85n9R8r1K10o4k81K67J05o1j39q7
1652a68MN75n99K92L00o29L84k31P7Rk88M74j60k92J53k7K38k26L09l80L02k08
1674i1MQ9J82j07j5q9L9O6j13j83K71P9K3j36j54L3J19J40k55k4P5l5J66o3J68
1699A89j93M9l55O15o10K90o2qRl9K55j27K22j49k06j03N36m04J47p0M3J58j15
1722G2j47K47l53J12J30k33J31J5L9o4O3k73L19l06M58k97K9MJ95j53j87L49P
$$ plain form
1745 157 165 -145 144 -156 -151 127 110 53 -169 -54 -173 -104 70 244 68 29 -10 -179 42 -200 -91 -386 -382 411
1769 411 233 27 -288 67 -148 -222 -104 -185 -101 -33 51 -95 -37 6 -63 45 330 -242 70 177 222 -104 95
1792 95 41 -135 5 -237 206 116 -68 45 331 100 255 -5 78 -108 183 260 192 14 162 95 75 47 -195
1815 -195 143 180 417 -247 -8 27 198 -190 -99 35 103 -237 434 146 135 -195 -63 118 -1 -81 -65 66
1837 66 -184 84 -145 1 -142 -119 -290 -30 -7 144 385 184 -193 99 -46 -212 -74 192 62 50 -199
1858 -199 -205 -254 30 -191 -15 146 -241 112 -178 -140 -2 -78 123 -9 -252 -104 -82 -204 52 175 -211 86
1880 86 137 -4 35 62 89 35 -40 -22 108 -26 -142 271 -93 10 192 -19 159 -19 183 374 312 49 89
1903 89 -88 -73 -254 102 92 146 242 -127 31 106 -165 -34 5 -174 -167 -146 -107 -117 -113 -311 104 -108 -33 290 -65
$$ packed form
1745A57Ql10K89l00NK78j7n7k22J15j19O9J74J74j76l9l9j69K21k42J09k95MP93
1769D11j78k06l15L55k15p4J18q1Q4O8Q4j46N8M3o9J08K85n72L12J07M5l26J99
1792I5n4j76J40k42M43r0j84J13K86k31J55k60Q3j86K91P7o8j78J48o7k0k8k42
1815a95L38L7K37o64K39L5J71l88R1J34O8l40O71k88j1l30J32J81j19q0J6J31
1837F6k50K68k29J46j43K3j71K60K3J51K41k01l77K92j45j66J38K66j30j2k49
1858a99om9K84k21J76J61l87L53k90L8J38p6K01j32k43J48K2j22K56J23l86K97
1880H6N1j41L9K7K7n4p5J8J30j34j16M13l64J03J82k11J78j78K02J91o2k63M0
1903H9j77J5j81L56j0N4R6l69J58P5k71J31L9j79PK1L9j0Mj98M15k12P5L23l55
$$ plain form
1928 -65 -161 -291 -140 182 70 -212 -124 58 63 73 37 -153 -242 152 167 297 183 -10 -153 89 160 36 79 133
1952 133 271 287 268 -139 26 -86 184 81 -7 16 -130 64 118 -347 22 184 -267 99 -27 -409 12 114
1974 114 -111 95 -117 -161 170 -308 -337 71 -18 292 -149 244 -4 101 -6 90 113 -127 1 -137 163 -322
1996 -322 -138 -51 -74 209 159 -313 494 16 -100 -14 315 68 -231 -179 -36 -293 14 230 52 213 -108 150
2018 150 43 -56 385 -66 47 -70 -85 76 129 -220 69 -78 -142 112 76 -80 -120 -223 6 76 107 -199 18
2041 18 420 -156 116 155 135 -66 15 -39 144 15 196 -131 -90 -149 -206 -267 -95 -66 31 -11 -83 355 146 -72
2065 -72 -87 2 56 -224 -447 -599 164 33 160 -224 -138 -280 -208 -384 2 -135 -206 -104 326 204 -81 132
2087 132 -20 63 -128 240 -9 307 -197 -303 84 144 299 192 80 -8 -61 82 -27 200 -75 -206 218
$$ packed form
1928f5r6j30J51L22j12k82Q8J82NJ0l6j90q9L94J5J30j14j93j43K42P1j24M3N4
1952A33J38J6j9m07J65j12K70j03q8K3j46J94N4m65L69J62m51L66j26l82M21J02
1974A14k25K06k12m4L31m78k9M08q9L10m41L93k48J05j07R6K3k40J28j38L00m85
1996c22J84Q7k3K83n0m72Q07m78j16Q6L29k47k99N2J43k57L07K16j78J61l21K58
2018A50j07r9M41m51J13j17j5J61N3l49K89j47o4K54l6j56m0j03K29P0L1l06K17
2041A8M02n76K72L9k0k01Q1n4J83j29J81l27M1n9n7o1J72K9R7m2p2M38k09k18
2065g2j5Q9N4k80k23j52P63j31J27l84Q6j42P2j76L86j37p1J02M30j22k85K13
2087A32j52Q3j91L68k49L16n04j06L87O0J55j07j12q8n3J43j09K27k75j31M24
$$ plain form
2108 218 126 -82 195 -188 -104 -40 61 -130 -166 45 -319 -65 317 41 -61 169 -135 -147 34 51 17 -102
2130 -102 79 -182 -102 6 61 -83 86 76 -88 75 -128 41 95 -43 -320 -188 -170 75 113 -37 305 -230
2152 -230 -225 -265 -169 2 -104 38 -186 -77 -105 84 36 -83 -123 36 66 200 -342 86 98 237 -48 -311 98
2175 98 -153 80 11 124 -340 144 -339 165 169 294 -225 123 366 -152 27 -155 222 -47 -132 -68 170 23
2197 23 -88 0 287 224 247 163 93 32 -202 -165 250 -71 -11 -189 357 304 53 79 -38 -230 -92 -95 -192 -26 -247
2222 -247 -172 113 156 77 -138 43 9 -60 115 -13 -191 -185 123 116 -105 -65 21 -59 -179 -116 1 -153 -201 -61 -60
2247 -60 37 183 248 -238 190 134 56 -224 44 121 119 -22 224 -193 135 119 385 114 147 -116 -50 55 -74 -120
2271 -120 -69 -30 0 236 -74 -165 -298 -164 -235 -225 -121 58 -185 309 -194 -356 99 -67 18 -85 39 -207
$$ packed form
2108B18r2k08K77l83Q4O4J01j91l6K11l64K54L82k76j02K30l04j2J81J7l4j19
2130a02J81k61Q0J08N5j44J69j0j64J63k03J69N4j38k77J32J8K45L8j50L42n35
2152b30Nm0R6J71j06J42k24J09k8J89m8j19m0J59L0J34n42M28J2J39k85k63M09
2175I8k51K33o9J13m64M84m83N04MJ25n19L48K43n18J79j82L77k69q5O4K38j47
2197B3j11Q8K87o3K3q4p0o1k34L7M15l21O0j78N46n3k51K6j17j92J38lr7J66k21
2222b47P5K85M3p9k15J81l4o9J75j28j78OL08pk21M0Q6q0j20O3J17j54m8J40J
2247f0R7J46O5m86M28n6p8k80K68P7kj41K46m17L28j6K66k71L3k63O6J05j29m6
2271a20N1L9L0K36l10r1j33J34p1J0J04J79k43M94n03j62M55j66Q5j03J24k46
$$ plain form
2293 -207 -109 -95 151 -319 -142 9 -21 -90 -55 21 52 44 87 402 18 138 -147 53 -65 281 152 79 55 -50
2317 -50 -58 -37 -258 415 96 6 -256 -330 -53 -15 407 -182 306 164 108 147 14 122 -246 -436 -104 -227 257
2340 257 -7 127 413 -123 -180 32 -98 58 -142 -52 18 -286 195 -235 254 19 149 18 39 -55 -408 184
2362 184 35 -95 -69 189 -45 -106 11 -8 -333 -206 239 169 118 -188 355 109 -256 110 199 -21 196 48
2384 48 -243 -187 -290 275 280 -93 269 72 -109 -106 263 -102 -148 -73 -83 153 -143 398 206 -6 226 -102 -260
2407 -260 6 -89 27 90 93 -58 -308 -27 -92 -309 -266 -17 44 -181 -145 -292 38 3 -46 90 191 -159 -274
2430 -274 244 89 189 -143 -32 -140 -9 -61 -47 230 198 -100 -128 -87 -536 102 -216 79 189 -258 16 -152
2452 -152 -116 -217 -94 166 -235 285 43 -54 -374 171 238 -16 63 72 209 -215 -186 -94 34 -199 217 -64 -133
$$ packed form
2293b07R8J4K46m70J77J51l0o9L5P6L1qM3L15l84J20k85K00j18L46j29p3k4j05
2317e0qK1k21O73l19r0k62p4K77L8M22n89M88j42n6L9j33J08l68j90L32j23M84
2340B57k64J34K86n36n7K12j30J56k00R0P0l04M81m30M89k35J30j31K1r4l53N92
2362A84j49j30K6K58k34o1J17j9l25J27M45p0n1l06N43k46l65L66Q9k20K17j48
2384D8k91N6j03N65Nl73L62j97j81LL69l65m6P5j0K36k96N41j92k12K32l28j58
2407b60K66r5J16O3Lj51k50K81o5k17M3K49O1k25L6j47L30l5m9J36J01l50j15
2430b74N18j55J00l32J11j08J31n2J4K77l2k98k8M1m49O38l18K95J10m47K74j68
2452a52L6j01J23K60m01N20k42r7l20N45O7k54P9RJ37m24K9R2J28k33M16k81o9
$$ plain form
2475 -133 -137 -86 56 -57 -18 150 -95 92 -216 -35 -153 -415 14 -66 -91 -95 -54 -187 61 -189 39 -159 -80
2498 -80 102 -86 215 200 -236 -40 195 66 -3 -84 -25 -295 -45 -179 84 86 -113 -268 -134 49 151 -84
2520 -84 114 -70 -144 202 -274 -298 19 24 30 -55 70 85 -83 112 -167 243 -56 101 -136 -211 -137 -55 180 -143
2544 -143 90 -99 79 274 -79 -9 171 -270 -188 -219 -174 -145 -179 -44 129 -166 49 -25 41 25 249 33 178
2567 178 15 -64 166 -185 10 187 131 32 230 -80 87 -33 -60 -258 117 6 -157 59 -46 114 8
2588 8 -110 -80 -122 -14 -41 -59 -19 22 18 306 256 11 -51 -122 99 -167 -369 -96 -137 -213 147 202 -10 228 169 -96
2614 -96 -86 -220 -148 -110 349 -145 -175 119 -69 -199 197 99 -379 40 427 188 -297 -188 121 190 -170 -39
2636 -39 -20 -200 -148 117 -47 -164 -280 -2 268 180 -37 268 -220 306 141 -139 34 -195 -8 -139 -122 360
$$ packed form
2475a33mN1J42j13L9J68k45J87l08J81j18k62M29q0k5mM1j33K48k50K28j98P9
2498h0J82j88L01j5m36J96K35j29o9q1N9k70K50j34K63Kj99j55J34J83J02k35
2520h4J98j84p4L46m76k4L17NOq5J25J5j68J95k79M10k99J57k37p5P4Q2K35l23
2544a43K33j89J78J95l53P0J80m41Q2l1M5K9l4J35J73k95K15p4O6j6K24k16J45
2567A78j63p9K30l51J95J77n6r9J98l10J67j20k7j98L75j11j63K16j05J60j06
2588Hj18L0m2J08k7j8M0M1mK88n0k45o2p1K21k66k02K73m1p6L60N5k12K38n9k65
2614i6J0j34P2L8M59m94l0K94j88j30L96r8m78M19L87k39m85J09L09O9l60J31
2636c9J9j80N2K65j64j17j16K78K70q8k17L05m88N26j65k80J73k29J87j31J7M82
$$ plain form
2658 360 -194 -50 -184 -97 -132 -53 -182 25 -171 -65 33 -201 57 -270 -190 -100 203 -266 270 -88 160 7
2680 7 78 -117 18 198 84 294 305 -127 160 135 32 -187 -275 -164 -16 146 -93 -209 -349 127 139 284
2702 284 -195 -20 188 -44 29 142 -61 298 -111 -70 77 -27 46 -29 -9 -37 135 -513 -87 202 209 -141 86
2725 86 -349 173 114 -135 49 -432 266 -269 -85 -135 -83 223 152 -115 -76 -42 -182 206 34 -101 58 -30 -316
2748 -316 176 -226 204 81 399 61 83 -73 73 -74 65 88 -108 138 -3 156 -329 -198 236 -31 89
2769 89 -13 191 -69 -140 4 199 165 201 4 -11 -55 -227 -60 322 31 2 -42 -101 32 -169 -26 308 -5
2792 -5 197 6 -165 -259 57 -82 134 152 -303 -364 -162 -51 64 -49 166 -34 -119 -30 73 -86 130 -55
2814 -55 -286 -133 -25 33 35 -156 -277 -4 -237 -120 205 -11 -146 56 45 234 -189 291 364 88 164 175 88
$$ packed form
2658C60n54J44j34Q7l5P9j29K07j96J06R8k34K58l27Q0R0L03m69N36l58K48j53
2680GP1j95J35J80j14K10J1m32K87k5j03k19q8J11J48J62k39j16j40M76J2J45
2702B84m79J75K08k32P3J13k03L59m09M1J47j04P3p5K0k8J72o48M26K89Pl50K27
2725H6m35N22n9k49J84m81O98n35J84n0N2L06p1k67L9L4j40L88j72j35J59q8k86
2748c16M92m02M30j23L18l38K2j56J46j47J39K3j96K46j41J59m85J31M34k67J20
2769H9j02K04k60p1J44J95l4L6j97j5m4j72J67L82k91k9m4n9J33k01J43L34l13
2792eK02j91j71r4L16j39K16J8m55o1K02J11J15j13K15k00q5Q9J03j59K16j85
2814e5k31J53J08N8Kj91j21K73k33J17L25k16j35K02j1J89m23M80P3k76P6J1q7
$$ plain form
2837 88 -69 170 -249 -87 -34 153 -50 100 -245 -28 -17 48 53 -149 229 -225 -68 -223 103 91 228 -213
2859 -213 117 -31 158 221 -113 -240 -146 -8 -2 55 31 -149 -172 -258 241 72 -148 113 27 267 386 313 -279
2882 -279 -388 -111 -22 -2 -63 -12 29 -44 -82 -14 -105 63 50 161 11 21 220 219 27 -198 -322 101 223 -3
2906 -3 57 126 -202 49 -83 -103 79 -75 111 29 -32 -85 -48 18 -52 -151 -69 169 195 -169 -68 85 295 -33 227
2931 227 -171 239 66 -51 -70 -49 96 -31 -204 51 -6 -96 -52 102 -193 28 101 -155 51 -365 -225 -322
2953 -322 23 223 10 35 95 -27 330 -37 -119 -68 31 325 -302 263 -81 -49 -23 -282 -201 153 -130 -92 258
2976 258 -360 172 -196 -140 83 -197 31 -1 428 90 -248 -181 -33 -29 -113 34 6 65 -82 -71 69 65 198 2
3000 2 -164 52 -77 -139 -54 47 11 8 8 -174 179 -282 273 -144 -168 -273 -421 -117 -2 47 -77 161 -157 67
$$ packed form
2837H8j57K39m19J62N3J87k03J50l45K17J1O5Nk02L78m54J57j55L26j2J37m41
2859b13L30j48J89O3l34j27R4J38ON7k4j80k3q6M99j69k20K61q6K40J19p3n92
2882b79j09K77Q9K0o1N1M1p3l8O8r1J68j3J11j50J0J99jj92k25j24M23J22k26
2906cO0O9l28K51j32k0J82j54J86q2o1n3L7O6p0r9Q2K38K6l64J01J53K10l28K60
2931B27l98M10j73j17j9K1J45j27j73K55n7r0M4J54k95K21P3k56K06m16J40r7
2953c22L45K00k13K5O0j22L57l67q2N1R9K94o27N65l44L2K6k59Q1L54k83L8L50
2976B58o18N32l68N6K23k80K28l2M29l38l38O7J48Mq4J47k8N9j47J1J40mJ33j96
3000Bj66K16j29o2Q5J01l6l%j82L53m61N55m17k4j05j48L04J15M9j24K38l18K24
$$ plain form
3024 67 179 90 -68 132 -52 193 91 67 -228 50 -64 -97 190 213 -281 -33 130 -101 73 -24 7 194
3046 194 -70 -118 80 145 66 22 174 85 141 -61 -205 310 -93 -187 70 -236 -6 273 79 190 368 64
3068 64 57 120 183 -47 123 -138 84 10 163 157 84 98 -437 72 123 -208 229 82 -52 -148 51 241 129 -71
3092 -71 194 92 -215 -57 -16 69 216 -82 94 78 170 -146 -53 -151 -17 16 140 -61 332 44 175 46 -183
3115 -183 -84 -97 -42 1 2 99 -10 -206 -182 170 -104 85 -283 -167 -43 113 85 53 -19 60 -109 253 31 229
3139 229 142 -42 -293 100 17 -365 129 109 -217 -16 -464 42 -164 -23 -279 115 -48 -416 -83 -85 -7 -79
3161 -79 143 11 43 63 107 228 -23 18 120 -44 340 -28 184 188 -12 -70 -153 -47 76 -192 263 398 144
3184 144 -534 285 173 258 -90 39 181 177 183 -275 490 -129 262 126 203 -200 -303 148 -100 17 -277 -310
$$ packed form
3024F7J12q9j58K00j84K45j02k4k95K78j14l3K87K3m94K48J63k31J74r7L1J87
3046A94k64m8J98O5p9m4J52q9N6k02j44N15m03r4K57l06K30K79j94J11J78l04
3068F4pO3O3k30J70k61K22p4J53op3J4n35N09N1l31M37j47j34r6J99J90j12k00
3092g1K65j02l07J58M1Q5J47k98J76j6R2l16R3r8J34L3J24k01L93k88J31j29k29
3115a83R9j3N5M3JR7j09j96K4L52k74J89l68J16J24J56k8l2p2P9j69L62k22J98
3139B29q7j84k51L93q3l82M94k0l26K01m48N06k06J41k56L94j63l68L33kP8p2
3161g9K22j32L2K0M4J21k51M1J02j64L84l68K12Mk00n8q3J06J23k68M55J35k54
3184A44o78Q19j12Q5l48J29J42mOm58P65o19L91j36P7m03j03M51k48J17k94l3
$$ plain form
3206 -310 68 -57 -30 48 159 -20 -142 41 -55 120 -156 -257 4 307 206 -49 -157 67 -84 -377 -97
3227 -97 -100 108 9 -185 169 79 134 80 -98 -282 -26 -157 -81 -307 -304 122 -223 -53 -96 217 -27 -29 -158 185
3251 185 -237 -352 115 130 212 103 -67 96 18 96 90 6 60 -85 -26 140 -46 -35 115 -76 183 162 78 221
3275 221 -20 124 -171 46 129 90 48 95 132 24 166 20 -245 -186 -54 -216 -133 19 74 205 -169 106 245
3298 245 106 -23 -357 -131 108 130 279 -25 184 -88 -58 -90 4 -24 -77 -189 -340 -51 -262 -33 -6 -74 8
3321 8 223 -164 -126 -57 103 -226 51 -38 -116 309 -182 -279 342 44 130 -129 -176 -56 -148 -3 -86 339 -39 -85
3345 -85 72 30 -75 125 211 168 190 -7 -176 126 40 -121 163 -191 215 182 -53 210 -54 223 70 -176
3367 -176 -238 8 342 -203 177 -21 89 -71 136 -268 18 83 -174 -28 -24 21 143 -5 206 -12 -9 -158
$$ packed form
3206c10L78j25K7P8J11j79j22J83r6J75k76j01K61L03j01k55j08K24j51k93K80
3227i7lK08r9j94L54r0N5n4j78j84K56j31P6k26LM26l45J70m3L13k44kj29L43
3251A85m22j15M67J5Q2j09j70J63p8P8oq4N4j45N9J66j86J1J50j91K59k1q4J43
3275B21k41J44k95K17Q3l9m2M7L7j08J42j46k65N9J32j62Q3J52N5J31l74K75J39
3298B45j39j29l34K26K39K2J49l04K09k72L0l2R4k8n3j12j51K89k11K29K7o8Q2
3321HK15l87L8O9J60l29K77q9p8M25m91r7O21k98Q6k59m7J20r2J45q3M25l78m6
3345h5J57m2j05K00Q6m3K2j97j69L02q6j61K84l54M06l3k35K63k64K77j53k46
3367a76o2K46L34n45L80j98J10j60K07m04K86O5k57J46MM5J22j48K11k18Lj49
$$ plain form
3389 -158 -119 -239 -92 76 101 285 -54 -139 236 -170 203 -126 59 -53 -114 -188 6 260 -299 -256 -213 50
3411 50 -65 1 -26 -357 -161 -223 31 -61 -2 164 -169 165 259 -49 -275 152 101 111 -108 -28 -28 -48 160 -163
3435 -163 -240 -121 -18 64 189 -44 69 56 -139 -182 -59 255 -266 11 -113 -219 -163 -7 -117 -58 76 28
3457 28 -266 29 118 168 84 165 38 -303 -167 85 153 59 114 -11 -269 -192 132 137 205 -72 -212 152 156 -42 92
3482 92 -231 -63 -152 42 -37 -65 -221 -75 -149 -104 122 -103 -140 85 -252 -64 -247 -15 -106 -99 247 15 -47 -1
3506 -1 -29 -101 213 11 -74 -232 -276 190 132 -232 181 -256 -66 -262 -353 -51 -24 -187 34 -165 47 -143 -33
3529 -33 161 -302 -103 63 -162 -49 279 -96 126 46 -126 -284 -156 272 58 -239 43 66 203 63 -53
3550 -53 28 138 46 -44 -79 -72 6 -95 -208 -59 -266 13 -191 51 173 -346 -39 -376 213 -173 111 -334 -48
$$ packed form
3389a58L9j20J47J68K5J84l39q5L75m06L73l29J85j12o1p4J94K54n59M3M3K63
3411E0j15O6k7l31J96o2K54r2N9J66l33L34R4l08k26M27n1J0k19Q0%k0K08l23
3435a63p7J19J03Q2J25k33J13j3j95m3J23L14n21K77j24j06N6J56j10N9J34m8
3457B8k94K95Q9N0q4Q1j27l41J36K52O8r4N5j25k58P7L24NO8k77j40L64Mj98J34
3482I2l23J68q9J94p9k8j56J46p4M5K26k25l7K25l37J88j83K32r1PL46k32o2M6
3506ak8p2L14k02q5j58m4M66n8l64M13m37J90j96r1L02K7j63K21j99K12j90J10
3529c3J94m63J99J66k25J13L28l75K22q0j72j58J28M28k14k97K82K3J37j40j16
3550e3Q1J10r2r0l5PP8j01j13J49k07K79k04K42J22n19L07l37N89l86K84m45K86
$$ plain form
3573 -48 76 -84 -92 -43 216 -96 250 11 -21 -71 -98 -194 -113 -54 7 -15 156 217 190 161 189 79 79 -157 -114 126
3599 126 247 -134 202 -223 -14 262 -100 -251 86 -58 68 243 -20 -115 61 93 238 -66 -7 -134 -62
3620 -62 -81 -245 -102 -76 28 239 33 124 260 -517 138 251 173 110 -246 -218 110 72 187 50 140 -89 -17
3643 -17 142 -20 94 -143 -22 -67 -206 -210 146 75 257 72 202 123 25 -188 24 -6 58 -141 218 -52 18
3666 18 -48 -290 -308 -81 18 121 -177 -191 73 -308 152 -111 34 109 -4 111 24 130 -195 39 169 -69
3688 -69 30 -395 174 -102 140 -137 51 -182 78 242 -137 -7 27 7 -150 101 279 -34 22 -203 -296 57
3710 57 -196 288 158 -69 -49 -292 -257 156 -12 -69 -176 66 -20 34 -222 176 -68 -3 -223 182 -183 196
3732 196 -78 198 325 -72 37 179 119 -137 201 -30 270 -65 26 68 -106 166 121 -478 27 116 -45 -284
$$ packed form
3573d8J24j60qM9K59l12L46k39l2n0k7r6Q1N9O1k2J71O1k7k9K8j10%k36M3K40
3599A26J21l81L36m25K09K76l62j51L37j44J26J75k63r5J76L2J45l04N9j27P2
3620f2j9j64J43K6J04K11k06R1J36p77O55J13p8o3l56K8L28l8J15j37R0k29P2
3643a7J59j62J14k37J21m5j39mL56p1J82j85J30p9r8k13K12l0O4j99L59k70P0
3666A8o6k42j8K27R9J03k98j4K64l81M60k63J45P5j13J15q7J06l25K34J30k38
3688f9R9m25N69k76K42k77J88k33K60J64l79J30L4k0j57K51J78l13N6k25r3L53
3710E7k53M84j30k27K0k43L5M13j68n7j07K42q6N4k56L98k44O5k20M05l65L79
3732A96k74K76J27l97J09J42o0k56L38k31L00l35R1M2j74K72m5n99N05Q9j61k39
$$ plain form
3754 -284 -52 96 -27 -235 140 -53 235 -210 98 83 62 149 245 58 67 228 436 -1 16 176 -99 -250
3776 -250 62 203 88 -118 109 -116 272 -267 339 65 -8 -95 260 127 135 113 24 229 309 -223 -181 -42 -24
3799 -24 70 233 -15 160 -46 116 105 180 204 -98 -109 -21 123 -92 5 155 158 94 -91 -57 64 192 -231 369
3823 369 -266 -106 -127 45 111 -58 -69 -252 -266 -60 223 -123 101 -73 212 -115 -217 88 -39 -108 -78 47
3845 47 91 -254 -119 214 -116 -164 343 -82 120 -30 -274 -174 148 -52 -179 -350 -26 65 132 -124 90 19
3867 19 -155 -96 -95 160 -113 212 -196 140 -250 -159 -85 -291 10 337 63 220 -337 96 256 -86 316 82
3889 82 -24 167 -56 -102 -220 -271 5 -214 54 58 -6 -39 130 192 -102 -209 193 311 107 478 -28 -206 -11
3912 -11 -174 175 -236 -181 130 -16 29 93 12 -188 -76 75 -283 -21 283 -87 -175 43 289 -132 -39 -28 -39
$$ packed form
3754b84K32J48j23k08L75j93K88m45L08j5k1Q7R6j87RJ61K08m37J7J60k75j51
3776b50L12J41j15k06K27k25L88n39O06k74p3q7L55j33Qk2q9K05Q0n32M2J39J8
3799b4R4J63k48J75k06J62j1P5K4l02j1Q8J44k15R7J50Lo4j85L4J21J28m23O00
3823C69o35J60k1J72O6j69j1j83j4K06K83l46K24j74K85l27j02L05j27o9L0J25
3845D7M4l45J35L33l30m8N07m25K02j50k44J00L22k00j27j71L24R1O7k56K14p1
3867A9j74N9JK55k73L25m08L36l90R1P4k06L01L27k74J57n57M33J60l42M02k34
3889H2j06J91k23m6j18n1K76k19K68Mo4l3J69O2k94j07M02J18k04L71n06j78J95
3912a1j63L49m11N5L11j46M5O4q1k00J12J51l58K62L04l70q8K18K46m21R3J1j1
$$ plain form
3935 -39 -277 109 73 -11 120 -72 139 24 -191 -319 311 -36 -91 -197 -188 -59 117 -66 9 -26 194 -185 -53
3958 -53 60 -311 10 32 173 31 119 86 -229 103 130 -29 -12 178 -156 -238 226 -64 112 110 -23 97 -87
3981 -87 124 550 -214 122 -21 -56 -76 -44 -16 -12 -59 268 202 341 84 -29 -54 -7 -25 -95 -196 -105 218 -188 159
4006 159 54 463 158 -39 -136 -232 -60 181 127 -146 -111 -48 16 136 -243 -74 10 232 260 193 34 -20 -156
4029 -156 9 -68 34 324 112 -52 89 181 -211 -28 -189 126 -22 -24 99 -60 118 155 69 -310 -20 -106
4051 -106 -120 -109 -56 -186 80 -261 -193 16 162 238 -157 82 -188 109 -100 -83 -97 17 253 97 47 238 -335
4074 -335 -123 42 33 -224 -138 -245 76 366 10 -308 -109 -3 168 -121 260 -14 135 -56 -183 39 -34
4095 -34 -318 -5 -120 -181 91 105 -172 -10 -223 -136 -306 121 261 24 145 -144 30 118 141 179 -143 -14
$$ packed form
3935c9k38L86l6q4J31j92K11j15k15j28O30l47n5j06RJ29J76j83P5l5K20l79J32
3958e3J13l71L21K2J41j42Q8l3l15L32K7j59J7J90l34q2M64k90J76kj33J20j84
3981h7K11M26p64L36j43l5k0L2K8Mm7L27o6J39k57j13k5M7j8p0j01R1L23m06L47
4006A59j05M09l05j97r7r6J72K41n4k73L5O3O4J20l79J69Q4K22K8o7j59n4j36
4029a56J65p7J02K90k12j64J41R2l92J83j61L15j48kJ23j59J78L7q6l79K90q6
4051a06j4J1N3j30K66l41O8K09J46P6l95K39k70K97k09J7j4J14K36j56n0J91n73
4074c35K12J65rk57Q6j07L21K90l56l18J99J06J71k89L81k74J49j91j27K22p3
4095c4k84L13j15o1K72J4k77J62k13Q7j70M27J40k37J21k89J74Q8K3L8l22J29
$$ plain form
4117 -14 217 113 -85 50 -97 -79 -52 134 -7 -66 -112 -46 -67 -139 -34 -122 -142 94 -157 -91 70 -119 138 10
4141 10 275 -274 60 -175 -122 51 119 49 -73 25 152 -58 -140 44 107 115 -330 124 -39 37 90 90 85 -86 150
4166 150 -358 59 1 38 129 -94 165 -210 199 -51 104 45 -84 -6 67 77 -179 -30 -90 -4 -24 -144 42
4189 42 293 219 -136 -42 160 -227 151 -113 187 222 -32 22 18 -77 -98 102 -110 357 -107 169 -300 -19 43
4212 43 15 188 -282 12 -210 -66 -369 -360 -63 -55 -88 101 16 108 -178 94 -35 164 -133 -188 -12 -10 -273 -226
4236 -226 11 -163 -40 -80 -48 76 -285 -130 -66 368 -187 194 -9 -459 60 -131 -94 -168 211 68 192 -191
4258 -191 -109 150 474 111 67 -62 247 -229 85 220 -27 -140 -16 394 65 -110 -138 286 -72 -86 -40 263
4280 263 -49 195 101 446 55 445 -95 277 334 128 -95 -131 -227 90 -99 51 133 -96 115 -62 40 -8
$$ packed form
4117a4K31j04j98J35j47J8K7J86j41n9m6O6k1p2J05q8k0K36k51O6J61j89K57j28
4141A0K65n49L34k35N3J73O8p0j22R8J27k10q2J84O3Qm45M54j63P6N3%nj71K36
4166A50n08M17n8L7R1k23K59l75M09k50J55n9j29P8P3J0k56J49o0Q6k0j20J86
4189D2K51p4l55R4K02l87L78k64L00L5k54N4mr5k1K00k12M67m64K76m69K81O2
4212D3k8J73m70K94k22J44l03RK97Ql3J89q5R2k86K72j29J99k97n5J76Kk63M7
4236b26K37j74J23m0L2J24l61J55O4M34n55L81k03m50N19j91L7p4L79j43J24l83
4258a91Q2K59L24l63m4j29L09m76L14J35k47j13J24M10l29j75k8M24l58j4M6L03
4280B63l12K44r4L45l91L90n40L72N7k06k23l6r6L17j89J50Q2k29K11j77J02m8
$$ plain form
4302 -8 173 -18 72 71 134 45 20 136 -71 -221 101 39 -224 -50 24 206 71 127 204 297 -257 -176 -102 227 -49
4327 -49 0 -84 -185 -196 247 53 40 145 -167 42 -94 -357 -92 -236 138 152 99 1 108 -116 33 233 -2
4350 -2 177 -120 -107 -158 -311 195 209 -199 0 133 -38 -37 253 -92 -173 -202 -54 -136 -132 -56 184 31 35 -131 -132 38
4376 38 380 68 0 -180 8 -79 -85 68 3 80 -133 -33 -67 -88 -8 -94 -94 -15 25 175 -80 -31 -190 215 146 280
4402 280 -277 -101 95 48 261 -341 -67 94 66 118 -148 -140 5 -247 13 362 23 -25 -79 227 -28 67 -39
4425 -39 157 -109 347 122 1 52 19 -142 268 165 -142 -71 -1 161 102 18 -73 165 219 64 -273 70 -162
4448 -162 79 4 348 71 -30 -260 74 1 391 50 91 210 -287 24 49 -165 122 39 201 147 -189 129
4470 129 296 22 5 228 -259 -33 205 -168 58 30 140 -155 -18 -180 121 -27 -46 -47 -127 -36 54 -403 -77
$$ packed form
4302hJ81j91R0jO3q9k5J16k07j50L22o2k63J74P4J82j35N6P7R3n54Q1P4L29k76
4327d9M9q4j01j1M43j94j3J05l12K09j36k63K65j44L74J4n3r8J07k24J49K00k35
4350bJ79k97J3n1j53N06J4m08J99J33j71JK90l45q1k9J48q2MP6K40j53Mj66jJ70
4376C8L42l12o8j80J88q7oJ53o5P7k13J00l4k1Q0q6%P9M0J50k55M9j59M05o9J34
4402B80n57J76J96m7K13o02K74J61k8N2k66QJ45k52K60L49l39m8n4L06k55R5j06
4425c9J96k66M56k25j21N1l3j61M10j03l07P1P0J62n9q4r1K38N4j55l37L43k32
4448a62K41p5L44k77j01k30L34p3L90l41M1J19m97L11K5k14K87q3J62n4l36L18
4470A29J67k74j7K23m87K26K38l73K26k8J10k95J37j62L01j48j9jq0R1R0m57L26
$$ plain form
4493 -77 -166 95 232 79 -212 -79 21 216 -128 -253 303 -94 235 -52 -81 -127 153 -66 305 -300 209
4514 209 -67 5 117 -220 33 -171 -111 -22 12 -79 107 149 82 -53 -61 213 -306 147 83 -141 76 -234 -192 -35
4538 -35 66 120 122 43 167 46 -125 269 83 74 248 308 232 -91 -29 -45 -115 19 -50 -27 -112 -280 27 289 166
4563 166 -77 255 -10 -13 123 -32 -100 90 7 111 -264 76 -152 11 -59 150 3 -23 35 -109 209 234 232
4586 232 -88 -61 -69 307 79 -7 163 -116 172 125 -287 -245 -103 -149 223 -15 171 -44 11 -321 235 248 109
4609 109 37 -10 130 92 -66 298 -109 354 228 -6 -34 -198 124 -201 29 -145 -321 204 42 -11 -31 150
4631 150 166 -182 239 -205 -88 221 75 6 -91 117 -157 -385 314 227 -227 -71 -27 -74 152 133 -152 51
4653 51 -81 -224 120 112 245 97 171 136 0 -63 8 141 -93 -7 130 119 -126 163 326 -280 -3 -34 -1 -16
$$ packed form
4493g7q9K61J37j53k91J33J00J95l44j25N56l97L29k87k9m6K80k19L71o05N09
4514B09k76P2J12l37K53k04O0Q9L4r1J86M2o7j35qK74n19M53o4k24K17l10M2J57
4538c5J01N4Kp9J24j21j71L94j86rJ74O0p6l23O2j6p0J34o9K3q5j68L07K62j23
4563A66k43L32k65lJ36j55o8J90q3J04l75L40k28J63p0K09j47k6N8j44L18K5k
4586B32l20K7qL76k28q6J70k79K88m7m12M2J42m6L72k38J86k15N5l32N56J3j39
4609A09p2m7J40l8j58L64m07M63j26k34k8j64L22l25K30j74j76N25j62n3k0J81
4631A50J6l48M21m44J17L09j46o9r7K08k74k28O99q7m54J56M4m7K26j9k85K03
4653E1j32j43L44qJ33j48P4l5j36o3P1J33k34Q6J37j1k45K89J63o06K77l1L3j5
$$ plain form
4677 -16 -40 -170 156 245 -78 -153 14 -10 -74 53 -47 -202 -127 -51 -10 -111 93 -91 -130 -39 -60 10 -8 -344 -84
4702 -84 297 1 -181 -77 26 1 32 -3 -417 -192 122 60 -28 -7 313 167 261 30 158 157 -47 333 -73
4725 -73 248 -274 -166 -248 146 28 44 -108 -248 117 -89 -116 -87 -166 -231 141 -294 50 -25 -3 -46 291 328 95
4749 95 -199 -179 -10 -101 398 366 73 81 -382 224 3 75 34 -114 -117 -251 33 -117 -177 -20 42 -195 -157 195
4773 195 -75 162 36 -20 -16 -63 156 -195 116 -6 -101 -15 -45 94 61 -6 -89 -161 136 -32 -80 -55 -110 10 151
4798 151 199 -65 -111 165 264 43 -148 187 -148 -384 120 191 -189 32 -267 108 -43 90 -11 -248 -11
4819 -11 -238 -175 28 18 -24 -93 -258 15 -270 -41 -235 337 -42 -138 245 126 199 -228 -20 118 116 192 102 113
4843 113 -19 8 -293 228 -114 98 3 -241 210 -150 -158 -1 6 -221 52 312 96 35 -110 38 20 -81 -21
$$ packed form
4677a6k4j30L26Q9l23p5J67k4o4J27j00j55P5P6M1j01K04j84l9R1k1P0j8l36K60
4702h4L81k96j82J04J03k5L1l5m14K25L14o2q8K1L20j46R4k31J28jk04L80m06
4725g3L21n22J08q2L94j18J6j52j40L65k06k7K9p9o5L72m35L44p5K2m3L37L7k33
4749I5k94K0J69r1M99l2k93Qm63O06k21P2m1j48lj34K84j50o0J57O2k37L8L52
4773A95k70K37j26n6Mm7K19l51L11j22r5Q6l0J39l3o7q3p2K97j68m8K5n5J20J41
4798A51M8k64m6K76R9k21j91L35l35k36N04P1l80K21k99L75j51J33j01k37K37
4819a1k27O3K03j0m2o9j65K73k85K29j94N72l79r6L83j19P3m27K08J38kP6r0J1
4843A13j32K7l01N21l42K12r5k44M51l60qJ57Pk27K73K60k16o1j45J48j8j01O0
$$ plain form
4866 -21 11 102 202 -283 -58 36 -211 5 -169 -257 -97 277 -263 -381 -80 -57 245 26 -175 -43 -125 -30 25
4889 25 -20 126 196 -85 -48 -24 -33 -91 308 60 -35 72 120 -56 -120 281 11 380 180 357 205 83 18 49
4913 49 -51 106 128 -20 -39 88 172 121 -2 -27 -78 222 256 -148 -46 63 119 85 67 84 11 -399 -95 -100 19
4938 19 -28 -86 -27 15 396 -87 24 136 137 -103 -316 -295 156 122 -37 -43 -84 190 162 -46 61 218 -260 -77
4962 -77 182 -119 62 157 102 -39 205 -53 155 -60 165 -76 296 -3 -89 67 140 -57 -37 -147 45 398
4984 398 55 -129 23 80 15 56 87 85 -117 -84 78 217 -321 -53 -101 -71 -148 145 66 158 -190 -18 177 405
5008 405 103 -32 147 -408 199 26 3 29 -61 45 -230 -36 -324 -148 -130 46 -127 86 -51 -65 -25 302
5030 302 114 -5 92 -243 22 89 -15 160 172 -208 -228 71 32 -60 -156 138 -117 -42 -238 -127 -50 -214 -124
$$ packed form
4866b1L2R1J00m85K25R4k47K16j74q8J60L74n40j18L01K3L02k19k01J32q2R5N5
4889B5m5J46P0k81L7K4rn8L99k48r5J07M8j76o4M01k70L69k00J77j52j22o5L1
4913D9j00J57K2j48j9J27Q4n1j23k5n1L00L4m04J02J09N6l4j8J7p3m10L04nJ19
4938A9m7n8N9M2L81m83J11J12Jk40k13K1M51l4j59om1K74k8k08J07J57m78J83
4962g7K59l01J81R5n5j41K44k58K08k15K25k41L72k99q6J56P3j97K0j10J92L53
4984C98l43j84J52N7o5M1L1kk02L3J62J39n38K68m8L0p7K93p9R2l48J72J95K28
5008D05l02j35J79n55O07j73k3K6r0J06k75J94k88J76J8J76j73K13j37j4M0L27
5030C02j88j19R7l35K65O7j04J75J2l80k0K99l9r2r6K94k55P5j96J11P7j64R0
$$ plain form
5053 -124 -254 54 104 -5 46 142 125 -168 22 126 173 -55 263 -29 15 130 -21 -84 -94 238 -222 139 190
5076 190 11 111 -18 -27 -40 134 -81 -325 -102 64 89 56 37 215 44 411 -30 -25 129 -124 142 -264 92
5099 92 205 -41 -92 129 -55 159 100 98 -22 -46 -75 -139 -168 158 148 -151 -193 108 66 -60 45 210 -22 -61
5123 -61 59 325 -82 73 125 -10 -8 176 -51 -342 19 1 -60 70 -37 20 -13 -140 -49 86 -173 20 -67
5146 -67 -223 -63 3 204 297 187 -15 -101 36 67 -231 136 -41 -256 -120 38 -192 79 252 0 33 141
5168 141 128 102 -41 312 113 187 -33 -71 111 -33 -26 87 207 84 172 -34 65 136 153 181 -41 64 -21 -152
5192 -152 85 -136 -143 -104 -137 13 30 -142 213 -104 201 -85 -273 -73 153 -5 -10 -43 159 72 72 20 249 -129
5216 -129 -268 73 -87 -18 227 177 -100 -64 214 78 -86 -133 -162 -146 14 -26 -220 85 92 176 204 -336 88 60
$$ packed form
5053a24j30L08N0j09N1R6j7k93J90J04M7k28L18k92M4J15j51o3j0L32m60L61N1
5076A90j79J00j29rj3J74k15k44K23J66K5l3j9J78j71L67m41NJ54k53K66m06L56
5099I2J13k46n1K21j84K14n9kj20k4k9o4k9L26j0k99m2L01m2j26J05J65k32l9
5123f1J20K66m07J55N2j35KJ84k27k91L61j8o1J30j07N7l3j27R1J35k59J93q7
5146f7j56J60O6K01R3j10k02q6J37L1k98L67j77k15J36J58k30K71J73k52L3J08
5168A41j3k6j43L53j99P4k20l8J82j44PJ13J20j23Q8k06R9P1J7K8k22J05q5j31
5192a52K37k21pL9l3J50J7j72L55l17L05k86j88K00K26j58nl3K02q7%n2K29l78
5216a29j39L41j60O9K45n0k77L6K78j36j64m7k9J6J60m0j94L05PQ4K8n40M24k8
$$ plain form
5240 60 -373 12 -89 -61 -47 -15 97 11 151 -105 98 123 2 227 77 113 -184 33 -27 -199 161 115 -35
5263 -35 159 76 125 84 13 140 -2 104 -27 -94 -54 146 -120 -114 191 -103 6 32 46 182 -49 130 119 71
5287 71 -375 -37 118 104 339 -117 117 89 378 -46 6 -279 40 -156 94 78 -21 -152 -317 107 -28 59
5309 59 -28 86 236 121 158 -2 84 -20 86 198 -174 5 -311 -85 -199 278 -176 52 -158 -249 -197 15
5331 15 -181 114 -275 -12 20 355 143 -68 -208 -142 105 -271 -3 116 20 58 239 -16 233 -8 -2 -10 -47
5354 -47 -44 -186 1 -21 26 -38 198 -158 -114 86 390 -90 186 -47 -94 -273 -126 -39 28 -247 28 -49 -57 -311
5378 -311 54 -43 -62 -231 -35 30 28 -65 -74 16 250 -69 -64 -114 -220 286 142 -194 -274 -126 -26 45 147 -371 -9
5403 -9 -60 177 -90 -104 -139 -84 -187 -266 211 -112 67 -299 -155 -110 34 -67 -9 -93 -144 -48 179 76 195 -164
$$ packed form
5240F0m33L85j01K8J4L2J12q6J40k56K03K5j21K25j50L6k97K17o0j72L60m6j50
5263c5J94q3M9m1p1J27j42J06j31o7M0K00k66OL05k94J09K6J4J36k31J79j1m8
5287G1m46L38J55j4K35m56K34k8K89m24N2k85L19j96K50j6r9j31j65M24j35Q7
5309E9q7J14J50j15L7j60Q6j04J06J12l72J79l16K26j14M77m54K28k10r1N2K12
5331A5j96K95l89K63L2L35k12k11j40O6K47l76K68J19r6L8J81k55K49k41Oql7
5354d7Lj42J87k2M7o4K36l56M4K00L04m80K76k33m7j79J47Q7O7k75K75p7qk54
5378c11L65r7j9j69J96O5kr3rR0K34l19Nn0j06N06j44l36q0J48J00P1J02n18L62
5403in1K37k67j4l5N5j03p9M77l23J79l66J44M5J44j01N8q4n1R6K27j03J19l59
$$ plain form
5427 -164 44 -112 82 144 -224 -241 27 118 -89 174 -4 -77 14 146 -211 169 41 151 -14 -82 73 276
5449 276 67 -60 125 -151 -300 78 141 -133 98 257 -250 -85 70 193 6 38 -99 18 36 139 241
5470 241 -245 53 -118 41 206 -33 72 87 101 306 -63 240 79 89 -44 -334 -413 178 41 -165 -228 143
5492 143 -89 77 -265 -204 -202 128 -209 -7 36 -136 207 81 467 197 -114 279 201 179 98 11 28 -48 6 -116
5516 -116 -58 -62 -20 -349 -29 268 6 -59 100 203 -144 18 42 199 -34 -48 -101 -46 103 56 257 164 50 -60
5540 -60 -98 -167 185 -176 153 -351 -42 -151 200 -6 -197 162 -196 -263 -13 212 116 115 -11 6 -93 48 47 18
5564 18 -8 256 297 121 -198 40 -296 81 -123 281 163 -62 128 190 -86 -109 283 65 143 56 252 31
5586 31 -145 -244 -39 53 -225 -120 132 11 -126 -64 140 51 42 145 70 37 -63 -99 -93 123 -140 -40 85 67
$$ packed form
5427a64K08j56J94O2l68j7K68R1k07K63j78p3R1J32l57L80j28J10j65o8J55K03
5449B76k09j27J85k76j49L78O3k74K31J59n07J65J55J23j87L2j37J17J8J03J02
5470B41m86K98j71J59J65k39J05J5J4K05l69L03j61J0j33k90p9N91j37k06o3L71
5492A43k32J66l42O1KL30l37K02M3j72L43j26L86k70l11L93p8k2q1q7J7p6N4j22
5516a16N8mM2l29L20K97k62o5J59J03l47J62K4J57k33j4n3N5J49m7K01r3j14j10
5540f0l8o9L52l61L29n04L09j09L51k06j91L59l58o7K50K25r6jj26J7r9J41jk9
5564A8k6K64M1j76l19K38l36L77k04M04j18k25J90O2k76k3L92k18P8q7J96k21
5586C1j76r9K05R2k78J05K52j21j37O2K04q9rJ03p5l3j00l6OK16k63J00J25j8
$$ plain form
5610 67 -46 -107 78 409 29 -304 -145 85 205 -88 -144 -21 -139 -71 233 195 -90 -103 -75 164 227 92 -168
5633 -168 92 -202 -80 -187 183 -131 161 66 -233 84 -13 -63 -89 -286 75 -40 -163 -33 -67 -109 -42 -33 80
5656 80 -192 234 131 -253 -283 86 394 244 143 298 47 41 122 84 213 0 191 -27 110 216 70 6
5678 6 -51 -316 -62 283 120 10 114 -151 166 -333 24 209 -90 -101 -126 12 160 -47 -372 -207 -195 115
5700 115 133 0 -124 -17 99 -77 71 171 22 -37 102 465 19 147 50 -173 10 188 -165 -253 -133
5721 -133 -183 39 135 166 48 -154 51 -296 -50 142 -103 41 -69 216 93 -20 -85 -192 -123 166 -165 160
5743 160 -348 -272 137 -193 16 -105 88 -64 -127 190 -144 236 -243 95 130 -176 118 334 -124 -41 35 -35
5765 -35 54 -187 -66 17 -57 -167 65 90 -163 -61 -223 3 42 298 333 -12 -213 -124 -256 272 -35 33 126
$$ packed form
5610F7j13o1J85L31l80l33J59K30J20k93n6J23j18O8L04l8k85j3K8K39O3j35k60
5633a68K60k94J22j07L70l14K92r5k99L17r7n0k6j97L61j15j23J30l4m2O7RJ13
5656H0k72M26j03l84l0L69L08j50j01J55k51oQ1l8J29k13J91k18J37J06j46o4
5678Fn7k65K54L45j63j10J04k65L17m99L57J85k99j1k5J38J48k07l25J65J2L10
5700A15J8j33j24J07J16j76J48J00j49n9J39L63m46J28r7k23J83J78l53q8J20
5721a33n0K22R6L1j18k02K05l47K46J92k45J44j10K85j23j13o5j07O9K89l31L25
5743A60n08P6M09l30K09j21J93j52o3L17l34L80m79L38L5l06K94K16m58Q3P6p0
5765c5Q9k41J21Q3p4j10K32K5k53J02j62K26L9K56L5l45k01Q9j32N28l07O8R3
$$ plain form
5788 126 -197 194 236 99 221 -40 -20 108 -28 161 72 -240 -91 -179 77 250 165 140 -128 -129 315 -19 91
5811 91 7 -223 -49 67 88 -19 164 -12 149 249 -142 -269 -21 9 -56 -280 267 85 121 137 309 139
5833 139 -4 -43 54 82 26 -117 -68 0 98 -112 171 295 -179 -66 -81 -261 -164 -79 -47 94 170 109 247 -83
5857 -83 -141 -49 118 -49 72 -92 86 -90 30 82 -105 -204 -335 -140 -5 -142 -115 -105 132 -86 23 65 107
5880 107 562 -56 33 -145 -103 -6 123 -139 -31 144 64 -109 207 209 -24 161 86 38 -33 -51 246 24 -45 101
5904 101 -111 247 -69 -2 6 -119 163 -69 -123 -194 -52 -527 218 -142 -114 140 -239 -161 163 -139 101 216
5926 216 162 179 -62 186 -424 176 173 65 -20 275 -157 58 -114 68 -291 -57 -154 23 -84 267 40 -49
5948 -49 -226 147 -9 226 530 -187 -60 294 304 -155 380 58 44 85 139 113 -7 -58 291 -71 117 112 -43
$$ packed form
5788A26l23L91M2j37J22k61K0J28j36J89q9l12J49q8K56J73q5k5k68jM44l34J10
5811I1q4k30J74J16K1j07J83j76J61J00l91j27K48L0o5k24N47j82L6J6J72j70
5833A39j43l9R7K8n6j43M9O8R8k10K83J24m74J13j5j80R7Q5L2J41P6o1J38l30
5857h3n8R2J67j67J21j64J78j76J20N2j87r9j31J95J35j37K7J0K37k18J09M2M2
5880A07M55o18Q9j78M2R7J29k62J08J75q0j73L16Kk33J85p5m8p1j8K97k22o9J46
5904A01k12L58l16O7Qj25K82k32n4p1J42m75P45l60K8K54l79P8L24l02K40J15
5926B16n4J7k41K48o10O00lj08q5K95m32K15j72J82l59K34r7J77j07L51k27q9
5948d9j77L73j56K35L04p17J27L54J0m59N35l22j4M1N4k6j20n1L49l62J88nj55
$$ plain form
5971 -43 -63 -221 -260 47 -14 -21 153 -37 -116 -9 -21 436 55 -341 19 160 42 -84 -80 -408 -45 -106 12 -223
5995 -223 -157 -56 -183 179 -363 -195 136 -76 -302 186 -54 -181 171 -133 119 -153 -75 10 127 -120 -172
6016 -172 -194 27 -80 102 -245 145 344 21 141 100 -54 -11 -93 -319 -82 93 -62 -350 108 -188 92
6037 92 -184 267 -64 12 42 337 -113 -172 -211 -104 208 109 -29 -27 50 82 -33 -196 -33 196 -45 -394 286
6060 286 69 -30 -112 -61 121 -31 183 93 164 -111 49 209 -220 26 310 -11 105 -65 -23 337 205 -209
6082 -209 114 -19 102 -178 -256 156 152 -103 -155 -6 112 -129 -10 -23 -30 -140 95 104 -214 454 -178 -40 -76
6105 -76 -195 74 122 -115 39 149 -193 10 118 -60 153 -14 75 56 80 3 176 -11 57 -63 192 16
6127 16 88 -352 96 213 -113 144 -109 121 128 250 84 -52 -62 67 -7 127 -36 169 -228 -104 -130 137
$$ packed form
5971d3k0j58l9L07o1pJ74j90p9J07j2M57l81l96L60J41j18j26Ml28L63o1J18k35
5995b23O6J01j27L62n42J68L31k12k26M88k40j27L52l04K52k72P8Q5J17k47n2
6016a72k2K21j07J82l47L90J99l23J20m1j54M3q2k26K37J75j55k88M58k96K80
6037I2k76M51l31P6L0K95m50n9l9J07L12r9j38KP7L2j15j63J63K29k41l49O80
6060B86k17r9q2N1J82j52K14r0P1k75J60J60m29K46K84l21J16j70M2L60j32m14
6082b09L23j33J21k80p8M12mk55n2J49J18k41J19j3pj10K35Rl18O68o32J38l6
6105g6j19K69M8k37J54J10l42K03J08j78K13j67Q9j9K4p7J73j87O8j20K55j76
6127A6P2m40M48J17l26K57k53K30PJ22j66j36j0J29p4J34j63K05l97J24k6K67
$$ plain form
6149 137 -242 -190 205 220 6 -86 103 167 -9 252 -366 -59 -238 -34 208 -210 2 -33 -138 54 -50 -88
6171 -88 122 89 -241 -34 325 -43 223 19 -116 -129 -141 -97 26 16 -58 -103 163 157 389 -210 -137 402 109 -257
6195 -257 13 4 -233 -65 -259 -119 -137 -320 -100 120 -28 35 -217 -285 80 -256 -53 -140 -131 -164 174 40 -48
6218 -48 -17 -85 27 120 -82 12 287 4 -161 113 -45 288 -33 -140 -267 -284 166 -156 39 -126 41 -132
6240 -132 -46 184 -39 -182 -75 -224 29 -38 -123 -195 79 -142 74 -150 27 -3 -128 45 65 -73 -52 65
6262 65 117 -225 -186 169 17 -71 -163 -58 201 -169 -56 134 260 -17 -59 -238 -35 -276 158 12 -165 68
6284 68 -259 -250 -59 128 -36 177 -78 -56 -56 -234 34 -127 0 28 -24 135 -195 77 -454 120 257 5 -104
6307 -104 137 83 -17 242 -347 -50 147 -96 -31 -120 -201 -160 64 365 184 62 234 -72 115 -122 147 -128
$$ packed form
6149A37l79N2L95J5k14r2J89O4j76K61o18L07j79K04K42m18K12l5j05J92j04l8
6171h8K10l3l30K07L59l68K66k04j35j3j2M4J23j0p4m5K66oK32n99P3N39k93l66
6195b57K70rk37J68j94J40j8j83K20K20j48O3k52o8L65l36K03q7Rl3L38j34q8
6218d8L1o8J12R3k02R4K75k83j65K74j58L33l21j07j27j7M50l22J95j65J67j73
6240a32Q6K30k23j43J07j49K53o7q5p2K74k21K16k24J77l0j25J73K0j38K1J17
6262F5N2l42L9L55j52q8r2J05K59l70J13J90J26k77m2j79K03k41M34j46j77K33
6284F8l27RJ91J87j64K13k55K2%j78K68j61J27K8n2J59l30K72n31N74J37k52j09
6307a04K41n4j00K59n89K97J97k43O5q9q1M1K24L01j81j22J72l06J87k37K69k75
$$ plain form
6329 -128 2 -182 -71 -128 -288 -33 83 -26 54 44 -308 24 -41 30 -18 -1 56 -21 -93 -175 -184 -143 144 71 36
6354 36 80 43 119 46 21 -59 43 -221 -74 82 -161 -121 -164 65 -321 -43 -27 233 -47 171 -33 74 -456
6377 -456 32 -345 140 -52 -199 199 367 -62 -363 148 -70 -41 37 -201 248 61 -78 -162 -312 -18 20
6398 20 -283 30 72 -178 30 145 124 -397 209 -115 15 386 -102 79 -132 55 -143 75 -99 183 -327
6419 -327 -319 -287 226 102 -70 47 159 94 -118 -261 129 -260 -86 -153 108 1 -208 96 -195 206 165 -55
$$ packed form
6329a28J30j84J11n7j60K55J16j09Q0j0l52L32o5P1m8J7N7p7p2q2rM1K87p3l5
6354C6M4l7P6p3k5q0J02k64J47J56k43M0m3K29l86K78J6K60k80K18k04J07n30
6377d56M88l77M85j92j47L98J68m29l01N11k18K9P8k38M49j87j39q4j50K94L8
6398B0l03L13M2k50K08J15k1n21O06l24J30L71m88J81k11J87j98K18j74K82n10
6419c27QL2N13j24j72J17J12o5k12j43L90l89J74o7K61j07k09L04k91M01m1k20
$$ [...]
8191a20
##END NTUPLES=NMR FID
##END=
