##TITLE=1H_DE-30_AciW
 Acetone-d6
 8 sc, 
 31.7.2024
##JCAMPDX= 6.0         $$ Bruker NMR JCAMP-DX V2.0
##DATA TYPE= NMR FID
##DATA CLASS= NTUPLES
##ORIGIN= UXNMR, Bruker Analytische Messtechnik GmbH
##OWNER= root
$$ XWIN-NMR		Version 3.5
$$ Wed Jul 31 16:26:40 2024 Russian Standard Time (UT+4h)  she@DPX200
##.OBSERVE FREQUENCY= 200.1315
##.OBSERVE NUCLEUS= ^1H
##.DELAY= (6, 6)
##.ACQUISITION MODE= SIMULTANEOUS
##.ACQUISITION SCHEME= undefined
##.AVERAGES= 8
##.DIGITISER RES= 18
##SPECTROMETER/DATA SYSTEM= spect
##.PULSE SEQUENCE= zg30
##.SOLVENT NAME= DMSO
##.SHIFT REFERENCE= (INTERNAL, DMSO, 0, 15.7039)
##AUDIT TRAIL= $$ (NUMBER, WHEN, WHO, WHERE, WHAT)
$$ ##TITLE= Audit trail, XWIN-NMR		Version 3.5
$$ ##JCAMPDX= 5.01
$$ ##ORIGIN= Bruker BioSpin GmbH
$$ ##OWNER= she
$$ F:/spectra/data/she/nmr/H-F/1/audita.txt
$$ ##AUDIT TRAIL=  $$ (NUMBER, WHEN, WHO, WHERE, WHAT)
(   1,<2024-07-31 16:25:29.64 +0400>,<she>,<DPX200>,
      <created by zg, POWCHK disabled, PULCHK disabled
       configuration hash MD5:
       00 E9 B6 7A A2 85 ED C7 34 08 36 98 17 FE 4E 26
       data hash MD5: 16K
       8A CD 90 D7 49 8F 74 6D D2 7B 5B 8B 32 0F 54 4A>)
$$ ##END=
$$ 
$$ hash MD5
$$ 9F 03 6D F9 2D 44 B2 E2 E8 DB EF AA 1E F3 92 07
##$RELAX= 
##$RELAX= 
##$RELAX= 
##$RELAX= 
##$RELAX= 
##$RELAX= 
$$ Bruker specific parameters
$$ --------------------------
##$DU= <F:/spectra>
##$EXPNO= 1
##$NAME= <H-F>
##$PROCNO= 1
##$TYPE= <nmr>
##$USER= <she>
##$AMP= (0..31)
100 100 100 100 100 100 100 100 100 100 100 100 100 100 100 100 100 100 
100 100 100 100 100 100 100 100 100 100 100 100 100 100 
##$AQSEQ= 0
##$AQ_mod= 1
##$AUNM= <au_zg>
##$AUTOPOS= <>
##$BF1= 200.13
##$BF2= 200.13
##$BF3= 200.13
##$BF4= 200.13
##$BF5= 200.13
##$BF6= 200.13
##$BF7= 200.13
##$BF8= 200.13
##$BYTORDA= 1
##$CFDGTYP= 0
##$CFRGTYP= 5
##$CHEMSTR= <none>
##$CNST= (0..31)
1 1 145 1 1 1 1 1 1 1 1 1 1 1 1 1 1 1 1 1 1 1 1 1 1 1 1 1 1 1 1 1 
##$CPDPRG= <>
##$CPDPRG1= <>
##$CPDPRG2= <>
##$CPDPRG3= <>
##$CPDPRG4= <mlev>
##$CPDPRG5= <mlev>
##$CPDPRG6= <mlev>
##$CPDPRG7= <mlev>
##$CPDPRG8= <mlev>
##$CPDPRGB= <>
##$CPDPRGT= <>
##$D= (0..31)
0 1.2 0 0 0 0 0 0 0 0.06 0 0.03 0 0 0 0 0.0002 0 0 0 0 0 0 0 0 0 0 0 0 
0 0 0 
##$DATE= 1722428729
##$DBL= (0..7)
120 120 120 120 120 120 120 120 
##$DBP= (0..7)
150 150 150 150 150 150 150 150 
##$DBP07= 0
##$DBPNAM0= <>
##$DBPNAM1= <>
##$DBPNAM2= <>
##$DBPNAM3= <>
##$DBPNAM4= <>
##$DBPNAM5= <>
##$DBPNAM6= <>
##$DBPNAM7= <>
##$DBPOAL= (0..7)
0.5 0.5 0.5 0.5 0.5 0.5 0.5 0.5 
##$DBPOFFS= (0..7)
0 0 0 0 0 0 0 0 
##$DE= 6
##$DECBNUC= <off>
##$DECIM= 24
##$DECNUC= <off>
##$DECSTAT= 4
##$DIGMOD= 1
##$DIGTYP= 9
##$DL= (0..7)
0 120 120 120 120 120 120 120 
##$DP= (0..7)
150 150 150 150 150 150 150 150 
##$DP07= 0
##$DPNAME0= <>
##$DPNAME1= <>
##$DPNAME2= <>
##$DPNAME3= <>
##$DPNAME4= <>
##$DPNAME5= <>
##$DPNAME6= <>
##$DPNAME7= <>
##$DPOAL= (0..7)
0.5 0.5 0.5 0.5 0.5 0.5 0.5 0.5 
##$DPOFFS= (0..7)
0 0 0 0 0 0 0 0 
##$DQDMODE= 0
##$DR= 18
##$DS= 0
##$DSLIST= <SSSSSSSSSSSSSSS>
$$ [...]
##$SUBNAM2= <"">
##$SUBNAM3= <"">
##$SUBNAM4= <"">
##$SUBNAM5= <"">
##$SUBNAM6= <"">
##$SUBNAM7= <"">
##$SUBNAM8= <"">
##$SUBNAM9= <"">
##$SW= 24.0689530833862
##$SWIBOX= (0..15)
0 0 2 0 0 0 0 0 0 0 0 0 0 0 0 0 
##$SW_h= 4816.95568400771
##$TD= 16384
##$TD0= 1
##$TE= 0
##$TE2= 300
##$TE3= 300
##$TEG= 300
##$TL= (0..7)
0 120 120 120 120 120 120 120 
##$TP= (0..7)
150 150 150 150 150 150 150 150 
##$TP07= 0
##$TPNAME0= <>
##$TPNAME1= <>
##$TPNAME2= <>
##$TPNAME3= <>
##$TPNAME4= <>
##$TPNAME5= <>
##$TPNAME6= <>
##$TPNAME7= <>
##$TPOAL= (0..7)
0.5 0.5 0.5 0.5 0.5 0.5 0.5 0.5 
##$TPOFFS= (0..7)
0 0 0 0 0 0 0 0 
##$TUNHIN= 0
##$TUNHOUT= 0
##$TUNXOUT= 0
##$USERA1= <user>
##$USERA2= <user>
##$USERA3= <user>
##$USERA4= <user>
##$USERA5= <user>
##$V9= 5
##$VALIST= <valist>
##$VCLIST= <CCCCCCCCCCCCCCC>
##$VD= 0
##$VDLIST= <DDDDDDDDDDDDDDD>
##$VPLIST= <PPPPPPPPPPPPPPP>
##$VTLIST= <TTTTTTTTTTTTTTT>
##$WBST= 1024
##$WBSW= 4
##$XGAIN= (0..3)
0 0 0 0 
##$XL= 0
##$YL= 0
##$YMAX_a= 172735
##$YMIN_a= -150616
##$ZGOPTNS= <>
##$ZL1= 120
##$ZL2= 120
##$ZL3= 120
##$ZL4= 120
##$ABSF1= 10
##$ABSF2= 0
##$ABSG= 5
##$ABSL= 3
##$ALPHA= 0
##$AQORDER= 0
##$ASSFAC= 0
##$ASSFACI= 0
##$ASSFACX= 0
##$ASSWID= 0
##$AUNMP= <proc_1d>
##$AZFE= 0.1
##$AZFW= 0.1
##$BCFW= 1
##$BC_mod= 2
##$BYTORDP= 1
##$COROFFS= 0
##$CY= 11.3945322036743
##$DATMOD= 1
##$DC= 2
##$DFILT= <>
##$DTYPP= 0
##$F1P= 15.6554695791079
##$F2P= 12.8336369535428
##$FCOR= 0.5
##$FTSIZE= 0
##$FT_mod= 4
##$GAMMA= 1
##$GB= 0.15
##$INTBC= 1
##$INTSCL= 1
##$ISEN= 128
##$LB= 0.24
##$LEV0= 0
##$LPBIN= 0
##$MAXI= 10000
##$MC2= 0
##$MEAN= 0
##$ME_mod= 0
##$MI= 1.114404
##$NCOEF= 0
##$NC_proc= 0
##$NLEV= 6
##$NOISF1= 3.799351
##$NOISF2= 2.8
##$NSP= 1
##$NTH_PI= 0
##$NZP= 0
##$OFFSET= 15.70392
##$PC= 1
##$PHC0= -25639.9
##$PHC1= 15.18749
##$PH_mod= 1
##$PKNL= yes
##$PPARMOD= 0
##$PSCAL= 0
##$PSIGN= 0
##$REVERSE= no
##$SF= 200.130013532006
##$SI= 16384
##$SIGF1= 3
##$SIGF2= 2
##$SINO= 400
##$SIOLD= 16384
##$SREGLST= <1H.CDCl3>
##$SSB= 0
##$STSI= 0
##$STSR= 0
##$SW_p= 3612.71676300578
##$SYMM= 0
##$S_DEV= 0
##$TDeff= 0
##$TDoff= 0
##$TI= <>
##$TILT= no
##$TM1= 0
##$TM2= 0
##$TOPLEV= 0
##$USERP1= <user>
##$USERP2= <user>
##$USERP3= <user>
##$USERP4= <user>
##$USERP5= <user>
##$WDW= 1
##$XDIM= 8192
##$YMAX_p= 0
##$YMIN_p= 0
$$ End of Bruker specific parameters
$$ ---------------------------------
##NTUPLES= NMR FID
##VAR_NAME=  TIME,          FID/REAL,        FID/IMAG
##SYMBOL=    X,             R,               I
##VAR_TYPE=  INDEPENDENT,   DEPENDENT,       DEPENDENT
##VAR_FORM=  AFFN,          ASDF,            ASDF
##VAR_DIM=   8192,          8192,            8192
##UNITS=     SECONDS,       ARBITRARY UNITS, ARBITRARY UNITS
##FACTOR=    0.0002076,     1,               1
##FIRST=     0,             0,               0
##LAST=      1.7004516,     0,               0
##MIN=       0,             -150616,         0
##MAX=       1.7004516,     172735,          0
$$ Real data points
##PAGE= N=1
##DATA TABLE= (X++(R..R)), XYDATA
$$ [...]
1944B84j70j1j40n5L72J91n64j99O13L31j116L29N04l81NL45l92m2L16k61O2M3
$$ 284 114 103 -37 -92 280 471 -93 -292 321 652 -464 -135 369 -12 -7 338 -54 -96 220 -41 21 64
1966F4J59k43j98K33nl07K37K65m87L45o0l4m40O31J99l12l35L96j57l51J128
$$ 64 223 -20 -218 15 10 -297 -60 205 -282 63 3 -31 -471 160 359 47 -288 108 -49 -400 728
1987G28o88k16M78j00o84K38M45m54j54N18n2k21P17m91r0K83K5n21k51P99qo19
$$ 728 40 -176 302 202 -482 -244 201 -253 -407 111 59 -162 555 64 -26 257 282 -239 -490 309 301 -318
2009c18J06K28k2N63k37m04l46Q19k36o32K06P07o24k52O39l4l67O99m39k10K15
$$ -318 -212 16 -6 557 320 -84 -430 389 153 -479 -273 434 -190 -442 197 163 -204 495 56 -154 61
2030F1J60n66k11P40J37m82rM96m12J89J52m40r2N23j69p06N29N67l73m54N93
$$ 61 221 -345 -556 184 321 -161 -170 326 -86 103 255 -185 -277 246 77 -629 -100 467 94 -360 233
2051B33j54l30K14K1l76N48N08r34o3O26k23k18J14J05l25N46m3m01j42M39j12
$$ 233 79 -251 -37 -16 -392 156 664 -270 -333 293 70 -148 -34 71 -254 292 249 -152 -294 145 33
2072C3n21L13O84m69l69L64j10K0N01l38o86O60J79m73j97P21j85m31L32j45K71
$$ 33 -488 -175 509 40 -329 35 -75 -55 446 108 -578 82 261 -212 -409 312 127 -304 28 -117 154
2093A54j33k7n56M77K27j59q43R42J71l73k7L94n84J38L53j44n29L83N25p41J68
$$ 154 21 -6 -562 -85 142 -17 -860 82 253 -120 -147 247 -337 -199 154 10 -519 -136 389 -352 -184
2114a84L93J88l45O6J18l32J37P9n16L85K41k73l42L02L99m03L6K62m95O12j16
$$ -184 209 397 52 118 236 -96 41 120 -396 -11 230 -43 -385 -83 316 -87 -51 211 -284 328 212
2135B12j72l81O22k6o04R7Q15m01l37M54m8p51J028l04o92M39L20p6p87O57j83
$$ 212 40 -341 281 255 -349 -252 563 162 -175 279 231 -520 508 204 -488 -49 271 195 -592 65 -118
2156a18k6M0j29j62K14N86n51k62K89N25n67l4L29j75n3M40j40p72P40K74r51
$$ -118 -144 -104 -233 -395 -181 405 -146 -408 -119 406 -161 -195 134 -41 -94 346 206 -566 174 448 -503
2177e03L36M99j42q66R01k3o53N00K68o97j31R49o51l11N26M25p03N61m04j18
$$ -503 -167 332 190 -676 225 202 -451 49 317 -380 -511 438 -213 -524 2 427 -276 285 -119 -237
2197b37K11M5k62J1N58J96p36q9P03l17j04l5K39j62o8L2K31P0j62k22k42P12
$$ -237 -26 19 -243 -232 326 522 -214 -303 400 83 -21 -56 183 21 -47 -15 216 286 124 -98 -340 372
2219C72p9n48q2Q55n72j85L42j02n00Q08j66l66K75M31p75N1L31M96o55K89J64
$$ 372 293 -255 -337 518 -54 -239 103 1 -499 309 143 -223 52 483 -292 -241 90 586 -69 220 384
2240C84q69N35N05n25l24N49J94m06J20On75M57J92p58N3J013o40n24N19j7K27
$$ 384 -485 50 555 30 -294 255 449 43 163 169 -406 51 243 -515 -462 551 -89 -613 -94 -111 116
2261A16n06N30k37j27N93k00n62J36M97k75j60L03K85m30j03P5n0j8O03j006J79
$$ 116 -390 140 -97 -224 369 169 -393 -257 240 -35 -195 108 393 -37 -140 -65 -115 -133 470 -536 -357
2282c57N85J8o50M03N43n28K9K53m04j29M71J9o33M97J89o36l94J239j90l67P
$$ -357 228 246 -404 -1 542 14 43 296 -108 -237 234 253 -380 117 306 -330 -724 515 325 -42 -35
2303c5K09O1k39K25k91j10K78l3j22JP8j09q8K73n67J51M72k82l02P36M4m02k60
$$ -35 174 235 -4 221 -70 -180 98 65 -57 -56 22 -87 -175 98 -469 -318 154 -128 -430 306 350 -52 -312
2326c12J68K83m9j04J01k07L09J1o11j20Q52l54n48O60L1j76j87M92n26j06R73
$$ -312 -144 139 90 -14 87 -120 189 200 -411 -531 321 -33 -581 79 110 -66 -253 239 -287 -393 580
2347E80r34q2O38j5n06J86M08j18k12J53Rl71K70K20k03l33N39l28n9j46M80m35
$$ 580 -354 -436 202 187 -319 -133 275 157 -55 98 107 -264 6 226 23 -310 229 -99 -158 -304 176 -259
2369b59N19r5k64K18P7p4n19L35N05q15Q2N79l62qJ45k92J54K57l1m74K3N24O9
$$ -259 260 165 -99 119 196 122 -397 -62 443 -372 -290 289 -73 -81 64 -228 -74 183 152 -322 -299 225 294
2392B94l82J23k1j53K90k7l90N7N70k12m25N39J52o85jM58k21O3J43l10l14Q16
$$ 294 -88 35 14 -139 151 124 -266 -209 361 149 -276 263 415 -270 -271 187 -34 29 172 -138 -452 364
2414C64j47o78K87N58n42n0Q6n6L44k7J84m53MK51o2l77J37M43l93Q3L67m67J76
$$ 364 217 -461 -174 384 -158 -208 -122 -178 166 139 323 -130 -126 125 63 -314 -177 266 -127 -44 323 -144 32
2437C2L07n36L12Q6K07q86J94N40m86J59j32L03J20j01m32L43O8K63n93j6M36
$$ 32 339 -197 115 201 408 -478 -284 256 -230 -71 -203 100 220 119 -313 30 98 361 -232 -248 188
2458A88p1j82J39j4m28J59L05k9k63M05n8l54J32M07l56J68k19O6k04J50Q0n18
$$ 188 117 -65 74 60 -368 -209 96 67 -196 209 151 -203 -71 336 -20 148 -71 -5 -209 -59 21 -497
2480d97P27K6n70j7P46k02n89L66N3l62K95J98j90l46N73j58j55k3O8M01l13N1
$$ -497 230 256 -314 -331 415 213 -376 -10 43 -319 -24 174 -16 -362 211 53 -102 -125 -57 344 31 82
2502H2L9l51N4m5j60J14N59k99k6k3J5l37M59J56n31L75l5K43n45N24j78j96L4
$$ 82 121 -230 -176 -221 -381 -267 292 -7 -33 -56 -41 -378 81 237 -294 81 46 289 -256 268 90 -106 -72
2525g2J53k82J7M80l65j43K52L53n08K35M4n6o17P39j76l51M00j60k28K63K7l33
$$ -72 81 -201 -184 296 -69 -212 40 393 -115 120 164 108 -509 230 54 -297 103 -57 -285 -22 5 -328
2547c28%O19n93J29K09j16J64M0j69J25j36J85k29l99K11K92M94q47N70l49L2
$$ -328 -328 291 -302 -173 36 -80 84 124 -45 80 -56 129 -100 -499 -288 4 498 -349 221 -128 -96
2568i6L18j97j80L80J61o23mQ22o47j57Q1J75k52L26j54l06L28N55n47p5j5J73
$$ -96 222 25 -155 225 386 -237 -241 581 -66 -223 -142 33 -219 107 -47 -353 -25 530 -17 -92 -107 66
2590F6j91J83j27J4J49l14K84l09K77J40k07j23K28j2j93j16L13j15n6L43n87
$$ 66 -125 58 -69 -55 94 -220 64 -245 32 172 -35 -158 70 58 -135 -251 62 -53 -109 234 -353
2611c53K24M11m65K51j1j1K49l63L90k61j39M18k76k37J89j4k16J69K15q2k01
$$ -353 -129 282 -183 68 57 46 295 -68 322 61 -78 340 64 -173 16 2 -214 -45 170 88 -113
2632a13J49q2k87L15K33m45l3K44K43j01j1J27j70L4l41J72J84k26k1J7K44l1
$$ -113 36 -46 -333 -18 215 -230 -263 -19 224 123 112 239 69 103 -238 -66 118 -108 -129 -112 132 101
2654A01l1j62n3K36k19j14M7K97K45j49m62M59p0k4j83k64N43k73K47k68q1L13
$$ 101 70 -92 -145 91 -128 -242 -195 102 347 198 -264 195 125 101 -82 -346 197 -76 171 -97 -178 135
2676A35R6n53J35L08j35j15K06j17L34m32o4M21m96J11J14l3jJ37j0k25J5K51
$$ 135 231 -322 -187 121 -14 -129 77 -40 294 -138 -202 219 -277 -166 -52 -85 -86 51 41 -184 -169 82
2698H2J96k02RLp3l8k25J19J47K7k25J18K10m45K56j79pL53K64n74J80kJ57l42
$$ 82 278 76 85 88 15 -23 -248 -129 18 45 -180 -62 148 -297 -41 -220 -227 126 390 -184 -4 -6 151 -191
2722a91R0M92l96qR8k34J96q9K81k20l44K40QK32m24L61J38l00J69j65L3L96l77
$$ -191 -101 391 -5 -13 85 -149 47 -42 239 19 -325 -85 -77 155 -269 92 230 -70 99 -66 -33 363 -14
2745a4o3k7M16l73J03l1k86L43J41n90J64J88J68o67N49o0K23j51j81R0j40NJ93
$$ -14 -77 -104 312 -61 42 11 -275 68 209 -381 -217 -29 139 -528 21 -39 184 33 -148 -58 -198 -193 0
2768@k75L58O0L10o72M13l15K20j79R1p0K50o2k57J48K37j58j18n0l5J84o1k96
$$ 0 -275 83 143 453 -219 194 -121 99 -80 11 -59 191 129 -128 20 257 99 -19 -69 -104 80 19 -277
2791b77J71P2j75J02n0K19Q3q4k90J40J11J9j0K5N0j76K71m95K48J41k75r9J51
$$ -277 -106 -34 -209 -107 -157 62 145 61 -229 -89 22 41 31 56 106 -70 201 -294 -46 95 -180 -279 -128
2814a28K46k0R4k01L2qj79K31j50R8M0K01j79l98N06l21J21n7k92N04k30j22N7
$$ -128 118 98 192 -9 23 15 -164 67 -83 15 55 256 77 -321 185 -136 -15 -72 -364 140 -90 -212 -155
2837a55K38J68m94J41O9k2J1o9O32k47k79l5J44k81J98K36o45K38M0L07k04J82
$$ -155 83 251 -243 -102 -33 -55 -44 -113 519 272 -7 -42 102 -179 19 255 -390 -152 -112 195 -9 173
2859A73k59r2K13J64k08R1l57J12J53m4J08j36L33j02k8m7l02K5J30J39M38o07
$$ 173 -86 -178 35 199 -9 82 -275 -163 -10 -54 54 -82 251 149 121 74 -228 -203 -73 66 504 -103
2881a03M0M7J53k8k18L70j7l59%K5K8J98l53K37M1j5l60J34J29l6K61r1J92l04
$$ -103 -63 -16 137 109 -109 261 244 -115 -115 -90 -62 136 -217 20 61 46 -314 -180 -51 -87 174 83 275 -29
2905b9K12j86L17m97K36o7R3j04mJ72k44M3K14J61k83L03j96j81K3M34m90K04
$$ -29 183 -3 314 -183 53 -14 79 -25 -29 143 -101 -58 156 317 34 337 141 -40 -17 417 -73 131
2927A31j27j68j58J86O3R8J55k09K33k60J36j91Q0O8J30j99k24j47K04K94l5Q1
$$ 131 4 -164 -322 -136 -73 25 180 -29 204 -56 80 -111 -31 37 167 -32 -256 -403 -199 95 60 141
2949A41j92j06N26k61k71L57j47L58p97M53j81J17q5J7L08k73K4J7O9J37k16k30
$$ 141 -51 -157 369 108 -163 194 47 405 -392 61 -120 -3 -88 -71 237 -36 -12 5 74 211 -5 -235
2971b35L00j20J58J28j46j81J1J83n6j33K87m64K25P2n0J24k7r9k53M45o8o9m36
$$ -235 65 -55 103 231 85 -96 -85 98 42 -91 196 -268 -43 29 -21 103 76 -23 -276 169 101 32 -404
2994d04K36j4L47R6m36L02j73O9j64P1K41R1l96K67k80M44m72K23N7j79M12l52
$$ -404 -168 -182 165 261 -175 127 -46 23 -141 -70 171 262 -134 133 -147 297 -175 48 105 -74 338 -14
3016a4K63l63N68j84k32l35L89J11l84K17J00Q0o9l94M8P3M42m66J38J39L09m69
$$ -14 249 -114 454 270 38 -297 92 203 -181 36 136 216 147 -247 -199 -126 316 -150 -12 127 436 -33
3038c3k00K51l5J00o9Q3l55K71l20L60l25K07J01K94m47J77m18L51m5j33P5j23
$$ -33 -233 18 -17 83 14 97 -258 13 -307 53 -272 -65 36 330 -117 60 -358 -7 -52 -185 -110 -233
3060b33K43J60m1j53J1R6Q1k06J18m1q5Q0N0K03n62l02P81k04J62r2n7J24M2m00
$$ -233 10 170 129 -24 -13 83 164 -42 76 35 -50 30 80 283 -279 -581 200 -4 158 66 9 133 175 -225
3084b25J75j89M41l5l59K14j55Q0P6l43J18M31l24O8k91K30P6L4J38m3N2k39O6
$$ -225 -50 -239 202 167 -192 22 -133 -53 23 -320 -202 229 -95 -27 -318 -88 -12 22 160 117 169 -70 -4
3107dJ68j35J18J5k17k7K33j0l89J43K38L2rp5K66j69j85p1nj47L05j86K36j5
$$ -4 164 29 147 162 -55 -82 151 141 -248 -105 133 165 156 81 347 178 -7 -78 -83 -230 75 -111 125 110
3131A10k53R6r6N4N3N4j89K78j13J27M0j78K51j42M9r8Q2l40K94L4n6j5J92n85
$$ 110 -143 -47 -143 -89 -36 18 -171 107 -6 121 161 -17 234 92 141 43 125 -215 79 113 57 42 234 -351
3155c51J80J11J6l18L51o0K72j31j38K89l38M60J6r7J7qp9l09J68K69k10l14K97
$$ -351 -171 -60 -44 -362 -11 -71 201 70 -68 221 -117 343 359 262 279 271 192 -117 51 320 110 -204 93
3178I3j35M5J50j37P3j94R0K12o0m05K41mmQ4l01K36k66N40nl08Qj34L63l46J33
$$ 93 -42 3 153 16 89 -105 -15 197 137 -268 -27 -31 -35 49 -252 -16 -282 258 253 -55 -47 -181 182 -164 -31
3203c1N6j32lL41l28k4J99K12k59P0P0j58l13L16j32J3K0K46j46j31K61k42K08
$$ -31 25 -107 -110 231 -97 -121 78 290 31 101 171 13 -300 16 -116 -103 -83 163 17 -114 147 -95 113
3226A13K42n91o9J06K79k95L02k54K36O3j32j77L91l93M64k21j27J55po1j44J4
$$ 113 355 -236 -305 -199 80 -215 87 -167 69 132 0 -177 214 -179 285 64 -63 92 85 24 -120 -106
3248a06k15K45P9M06o95M6J77J20l00L49J7J0k55K26r1J04k42K09k76L45j92k91
$$ -106 -321 -76 3 409 -286 -240 -63 57 -243 106 123 133 -122 104 13 117 -125 84 -192 153 -39 -330
3270c30K96J58j35l48L31L92n31q3L73k68K78k06Q3P4j05j37L49n8r4r3j43L29
$$ -330 -34 124 -11 -359 -28 364 -167 -250 123 -145 133 -73 10 84 -21 -158 191 133 39 -54 -197 132
3292A32M5k22j79K80L1J47j98K58k98k02Q6K20L6l03L69q2m13K93l9j90L04k23
$$ 132 177 -45 -224 56 87 234 36 294 -4 -206 -120 100 136 -167 202 120 -293 0 -39 -229 75 -148
3314a48K44k00M47n30N56n10J34L60n50K13j36O7J66K41n81K41J58l27J12J75
$$ -148 96 -104 343 -187 369 -141 -7 353 -197 16 -120 -53 113 354 -227 14 172 -155 -43 132
3334A32j29r1O5j7K02k06j80J04P5N0J1P3j75K24j45r5N9q2j52L11j58m3O7K34
$$ 132 3 -88 -23 -40 162 -44 -224 -120 -45 5 16 89 -86 138 -7 -102 -43 -125 -277 34 -124 -167 -100 134
3358A34q6j53j41K36k05K35m09O22j87N9R0k71l1n8Q3J09j53r5L5L86j79j14R0
$$ 134 48 -105 -246 -10 -215 20 -389 233 46 105 195 -76 -107 -165 -82 27 -126 -221 -186 200 21 -93 -3
3381cj77K41j35J06o8o3K64l03O3N0J08k2j72J67Lj39M9j77K68k33J91L8j5k21
$$ -3 -180 61 -74 32 -36 -99 165 -138 -75 -25 83 61 -111 56 59 -80 -31 -208 60 -173 18 56 41 -180
3405a80J00J14n1P1L9J70k25k0k14L03p9j05K7J20l29N09l30mJ24j61m1r9K60
$$ -180 -80 34 -17 54 93 263 38 18 -196 107 28 -77 -50 70 -259 250 -80 -84 40 -121 -162 -261 -1
3428aL3j88J62n4J83Rm1j11J00K10j54n5Qj41j01L6J80k01Q6j05J17j15K36mP
$$ -1 32 -156 6 -48 135 144 103 -8 92 302 148 93 101 -40 -141 -105 75 -126 -40 -145 -28 -143 93 89 96
3453I6pM21l26kq0l97N13k73K01J30l07K26r5n2l8j21K56l01J10mk00K87j46N2
$$ 96 89 510 184 182 102 -295 218 -55 146 276 -31 195 100 48 10 -111 145 -156 -46 -50 -250 37 -109 -57
3477e7K61m96L05k73K50K35j28O0l09J57j0Q4J16k79J82k3j00N23q72L22j10K01
$$ -57 204 -292 13 -260 -10 225 97 157 -152 5 -5 79 195 -84 98 75 -25 498 -374 -52 -162 39
3499C9j80Q8k5k20M28l95M06l25j02N54k16L9k21J07k0j64M07l32K10j30Q5k38
$$ 39 -141 -53 -78 -298 130 -265 141 -184 -286 268 52 91 -130 -23 -43 -207 200 -132 78 -52 33 -205
3521b05L60m03L47j37K58r3k26J49j63K92j68q6J90j95kk03j39L58J80j41q6L68
$$ -205 155 -248 99 -38 220 127 -99 50 -113 179 11 -75 115 -80 -82 -285 -424 -66 114 -27 -113 255
3543B55m84K56j87O4J60j10M5O8o9Q8K0r0k19J38J34K9j13L09k08J79k88q1jJ01
$$ 255 -229 27 -160 -96 64 -46 -1 67 -2 86 106 16 -203 -65 69 98 -15 294 86 265 -23 -104 -105 -4
3567dJ52j90j14K84k38j6J56K4J12n9l0j67K77l56K55j00K6l58L97j32j78L51
$$ -4 148 -42 -156 128 -110 -126 30 54 166 107 77 -90 187 -169 86 -14 12 -346 51 -81 -259 92
3589I2n2K15M7l43k7rK01o8K4n3L3q3J65M6n8O4k07R0j08J23k01j7K91j37j70
$$ 92 40 255 302 -41 -68 -77 124 56 80 27 60 -23 142 188 130 194 -13 77 -31 92 -109 -126 165 28 -142
3614a42pK55n8j7K18k71j32O3Q5j9k16M41l5o7L2l37M57k56j69M80k75O9l01L21
$$ -142 -149 106 48 31 249 -22 -154 -91 -6 -25 -241 200 165 98 130 -207 250 -6 -175 305 30 99 -202 119
3638A19k18J27J03%j33j29K2N8q4J60Pj56J51J74j68m9J31k28J66o3K4J79l05
$$ 119 -99 28 131 131 -2 -131 -109 -51 -135 25 32 -124 27 201 33 -16 115 -113 53 -10 14 193 -112
3661a12lk49M90j37m4r3R2J12J53j87j66J28m4O7J24K1k50J29O7K02k50m3L61
$$ -112 -115 -364 126 -11 -55 -148 -56 56 209 22 -144 -16 -60 7 131 152 -98 31 98 300 50 7 368
3684C68k50m26N92l62J50K58l25n0r5J75k66k4M41j84k44J41R5K24j29k30K0J20
$$ 368 118 -308 284 -78 72 330 5 -45 -140 35 -231 -255 186 2 -242 -101 -6 218 89 -141 -121 -1
3706aL40k05k49K5K50K13k90j3N6l45J89M28n18N1k5L5M6j65k4J52J26J96k47
$$ -1 339 134 -115 -90 160 373 83 70 126 -219 -30 398 -120 -69 -94 -59 -13 -178 -202 -50 76 272 25
3729B5K00k98N8K74l00ML11k73J13j63R5L06n26M1j23K52j12q3L91n41M77j2k5
$$ 25 225 -73 -15 259 -41 -37 274 1 114 -49 46 352 -174 -133 -256 -4 -116 -199 192 -349 128 116 91
3752I1J4m9J37r6j70n8p5L36K83n21L19K8j41k09K30j63p1Q8j65O81m69k32J80
$$ 91 105 56 193 97 -73 -131 -206 130 413 -108 211 239 98 -111 119 -44 -115 -27 -192 489 20 -212 -32
3775c2o7p0M39o1l28k74K14K45K13k76L35m87J83l14L49L1J20j54l3k70m2J91
$$ -32 -99 -169 270 209 -119 -393 -179 66 279 3 338 -149 34 -280 69 100 220 66 33 -237 -279 -88
3797h8J36j02K20l87L58n3J38j36p7j84n5N9J41j94J07J60K23k11J46j37j32K37
$$ -88 48 -54 166 -221 137 84 222 86 9 -175 -230 -171 -30 -224 -117 43 266 55 201 64 -68 169
3819A69k83K01l04j55N19p9l80N17ll20K18K26k94l45L49k98L89l46K76j17j76
$$ 169 -114 87 -217 -372 147 68 -312 205 202 -118 100 326 32 -313 36 -262 127 -219 57 -60 -236
3840b36N85l54J26pK13l95R3M8K2k43K2R7O4M4o5J75l32J47K55l67n9J36J5O2
$$ -236 349 -5 121 114 327 -68 25 73 95 -148 -126 -29 35 79 14 189 -143 4 259 -108 -167 -31 -16 46
3864D6J68o8j04j5k82J43K4j54K71J2p5k08L17j84P4j4R8m3P5l4j45R6L9k5J68
$$ 46 214 146 42 27 -255 -112 -88 -242 29 41 -34 -242 75 -109 -35 -49 49 6 81 47 -98 -2 37 12 180
3889A80j87o5j0K48l7k96M29k21N5j97K19j36ML49m34O6j07K06J01n6k50j2m7
$$ 180 -7 -72 -82 166 129 -167 262 41 96 -101 118 -18 -14 335 -99 -33 -140 66 167 111 -139 -151 -198
3912a98J27J88k08P9k21J45pM20m86M8M03o3k6P3n17K43J14J67n11l5K81p9J08
$$ -198 -71 117 -91 -12 -233 -88 -95 325 -161 -113 290 227 201 274 -243 0 114 281 -230 -265 16 -63 45
3935D5J21k66K73k10L2P9L0K2k03Q4j5K58j73j44L57m14J36Q3j74K47k66o6K18
$$ 45 166 -100 173 -37 -5 74 104 126 -77 7 -8 250 77 -67 290 -124 12 95 -79 168 -98 -164 54
3958E4J82l34R1r5J53M3r8j60N1K83l9J05j91k67J16Jj24L25j32pm8J33R6j90
$$ 54 236 -98 -7 -102 51 94 -4 -164 -113 170 131 236 45 -222 -106 -105 -229 96 -36 -43 -91 42 138 -52
3982e2K8Oq2M8J43j92J91R5k17o5J43j1j57J30j12K12k03R1J59k30J3j02O3L6
$$ -52 -24 -18 -100 -52 91 -101 90 185 -32 -97 46 35 -122 8 -104 108 -95 -4 155 -75 -62 -164 -101 -65
4006f5L53l83J85j22Q3k9q4L88l12m7Q7j27J60m8q4q0J13r0j17J62q8J49r2k2
$$ -65 288 -95 90 -32 51 22 -62 326 14 -33 54 -73 87 39 -45 -125 -12 -102 -219 -57 -145 4 -88 -110
4030a10J9J32KJ32j72j62k2K12j01n9J08J93l50L1J03K25j30K42m6k66l0j03L55
$$ -110 -91 41 43 175 3 -159 -181 31 -70 -129 -21 172 -178 -147 -44 181 51 293 247 -19 -49 -152 203
4053B03l89M22k29R7N1k07K89l65J78K08j23q8j11J52Q0j33l88L45J25q4J25k70
$$ 203 -186 236 7 104 155 -52 237 -128 50 258 135 47 -64 88 168 35 -353 -8 117 33 158 -112
4075a12K38j22j58J43k6l5k90K81K21n5j88J44P7j46K33k92J20J79j15Q9q8J75
$$ -112 126 4 -154 -11 -37 -72 -362 -81 140 85 -103 41 118 -28 205 -87 33 212 97 186 98 273
4097B73l64R9lp5m7J61N6M7k23J53J04k93J52N7j44j64O4K70k08M52l90k56n3
$$ 273 -91 8 5 -70 -117 44 100 147 -76 77 181 -112 40 97 -47 -211 -147 123 -85 367 -23 -279 -332
4120c32N01j12N2P2p9M6r6P7K01k00k41M8J14O8k79L16j99J60J23l46j35J82r5
$$ -332 169 57 109 181 102 148 52 129 330 130 -111 -63 51 119 -160 156 -43 117 240 -106 -241 -59 -154
4143a54L9k51L62L4j85j75M34k18O9m6M57k05l79J97j62K04J20j00L42l45L31
$$ -154 -115 -366 -4 30 -155 -330 104 -114 -45 -91 366 161 -218 -21 -183 21 141 41 383 38 369
4164C69l10K2ol55K18M4J0L05l52K56l08J23M0l9n5j9R4j02L30j87k61J90K58
$$ 369 59 81 75 -280 -62 -18 -8 297 -55 201 -107 16 56 17 -38 -57 37 -65 265 78 -183 7 265
4187B65j92O8N8k84m3K58k02M5p3K88j59J66L60m45j48K18k89j91L59k80K69K59
$$ 265 73 141 199 -85 -128 130 -72 -27 -100 188 29 195 555 110 -38 180 -109 -300 59 -221 48 307
4209C07j32j41J2L2Oj64M06j32m90K86J06k2j68L0K23m85N17l81L05m8Lj0l30
$$ 307 175 34 46 78 84 -80 326 194 -296 -10 96 74 -94 -64 159 -326 191 -190 115 67 70 60 -270
4232b70J64j42j58J9P8M53n4ok64J43J91j48r3lJ66r2L25n2l35J1J13N4j28j86
$$ -270 -106 -248 -406 -387 -309 144 90 84 -180 -37 154 6 -87 -90 76 -16 309 257 -78 -67 46 100 -28 -214
4256b14L09j47P9O6K35k75j32K25l32L45k14J89q3l36M49kn7%j90l1J71r3j80
$$ -214 95 -52 27 93 328 53 -79 146 -186 159 -55 134 51 -285 164 162 105 105 -85 -116 55 -38 -218
4279b18L04j21k74K8M10J6K7k75J77j14k34L30J81q7j83P7j5P6l7q4j09L53j71
$$ -218 86 -35 -309 -281 129 145 172 -103 74 -40 -274 56 237 150 -33 44 29 105 68 -16 -125 228 57
4302E7K95j84k13q7K14rm65N28l03L36k25J09j54P4J94j74M8J67k26J33l71M18
$$ 57 352 168 -45 -132 82 73 -392 136 -167 169 -56 53 -101 -27 167 -7 41 208 -18 115 -256 162
4324A62l3J9n1r6j21L3K34m2k49j7n9L09l95J85K45j28L32m82o6J56L31k75J11
$$ 162 129 148 97 1 -120 -87 147 105 -144 -161 -220 89 -306 -121 124 -4 328 -154 -220 -64 267 -8 103
4347A03J94j07k25m80O88l04k5J6P5P9L7J33j77J31n1L01l21R6j8j81q4J63m9
$$ 103 297 190 -35 -515 173 -131 -156 -140 -65 14 51 184 7 138 87 388 67 163 145 -36 -120 43 -6
4370fk83K27j60J17J84L1m62M19j6Q5r7n2q4k76O80r1m0l28K90m97L98l53K55
$$ -6 -289 -62 -222 -105 79 110 -352 67 51 136 39 -13 -97 -373 307 216 176 -152 138 -359 39 -314 -59
4393e9J02K51l58l82L82K44k07J79N8o15M13K10k55k12M95m37K31j42J60K60n21
$$ -59 43 294 -64 -446 -64 180 -27 152 210 -405 8 218 -37 -249 246 -191 40 -102 58 318 -203
4414b03m8N38l63J44o0J16l90J17K64j48K17o2l80J00J56K29J0k58K19j75kL07
$$ -203 -251 287 -76 68 8 124 -266 -149 115 -33 184 122 -258 -158 -2 227 237 -21 198 23 21 328
4436C28k51k19M26q3k69K31j11L5R2N7m43K69J68n5j47j74L14J39l22j34L38l12
$$ 328 77 -142 284 201 -68 163 52 87 179 236 -207 62 230 175 28 -146 168 307 -15 -149 189 -123
4458a23K88o2k05J44k72K23l67K82Q8j47K73k94M8J67J89j40k04M54n15J28K29
$$ -123 165 103 -102 42 -230 -7 -374 -92 -4 -151 122 -172 -124 43 232 92 -112 342 -173 -45 184
4479A84K02p8k23J1o1r5J48l78j07L67N6k16R0J40j4j66m6K04l9J76r3j53o3N43
$$ 184 386 308 85 96 35 -60 88 -290 -397 -30 26 -190 -100 40 26 -140 -186 18 -21 155 62 -91 -154 389
4503C89m21J84q7o6r9J3j31J99P4L7m3l71Q44n52L41l72J27Q9k15J93P1k80J18
$$ 389 -32 152 65 -1 -100 -87 -218 -19 55 92 49 -322 522 -30 311 -61 66 155 -60 133 204 -76 42
4526D2J23l02K83P0k8m48N79j32k36o6K27j30J36J71j24k52R3O4j40n6Q5j29K42
$$ 42 165 -137 146 216 188 -260 319 187 -49 -115 112 -18 118 289 165 -87 6 70 -70 -126 -41 -170 72
4549G2j68J26K22n25N2J19q5j14L68J59k27J91k59L07j84l90M54p0K4m36M71r0
$$ 72 -96 30 252 -273 -221 -102 -187 -301 67 226 -1 190 -69 238 54 -336 118 48 72 -364 107 17
4571A7j26J95K8j72k21O43l71k40J75J0p0O9L2O4J29j71l9j83J13K97k96j12L17
$$ 17 -109 86 114 -58 -279 364 -7 -247 -72 -62 -132 -63 -31 33 162 -9 -48 -231 -118 179 -117 -229 88
4594H8l05J09M86m35O4j56O14m25K08k01k63L28l38L39m17J36L82k93N5O0j6k86
$$ 88 -217 -108 378 -57 7 -149 465 40 248 47 -216 112 -226 113 -304 -168 214 -79 -24 36 20 -266
4616b66N65j63k84J93m7J47l83M85j22l01N83o07M24j78j87K02k43L31k84k6J11
$$ -266 299 136 -148 45 -2 145 -238 247 125 -176 407 -200 224 46 -141 61 -182 149 -135 -161 -50
4637e0j6j04rO6K53l85j8N1K93k93L87ol92O20l51p8m4J62k78L69J25j31K7k41
$$ -50 -66 -170 -179 -113 140 -245 -263 -212 81 -212 175 169 -223 397 46 -32 -76 86 -192 177 302 171 198 -43
4661d3o3L42n25P01l65l18J39L52l28J96P9l39L02k65M37l83j97L25j1j27K69
$$ -43 -106 236 -289 412 47 -271 -132 220 -108 88 167 -172 130 -135 302 -81 -278 47 36 -91 178
4682A78K5j51r5P4N1q7K09j83K49m58J57j49J0N5J5P4j5Jo5K57m96M92j20j17
$$ 178 203 52 -43 31 82 -5 204 21 270 -188 -31 -180 -170 -115 -100 -26 -41 -40 -105 152 -344 148 28 -89
4706h9j16L75k20J03j87L55k21j10L38l60r1J47L4J36j73K58l26J21q8J09p9l9
$$ -89 -205 170 -50 53 -134 221 0 -110 228 -132 -223 -76 -42 94 -79 179 -147 -26 -114 -5 -84 -123
4728a23L00k59R8k69J24L07j56k63J71l1K53K0k17M2J64r5o0N6%j17J86k84K72
$$ -123 177 -82 16 -253 -129 178 22 -241 -70 -101 152 172 -45 -3 161 66 6 62 62 -55 131 -153 119
4751A19k38n8l5J48L37j16k70J67k08Q5Q0J03k81K46K9o5j8K52k14j02M0j6M22
$$ 119 -119 -177 -212 -64 273 157 -113 54 -154 -69 11 114 -167 79 108 43 25 277 63 -39 1 -15 407
4774D07n95L0K4r1K06R8J27j04N3m3l41L09j39J37j12j87k37O74l22J91j63J39
$$ 407 -188 -158 -134 -225 -19 79 206 102 155 112 -229 80 -59 78 -34 -221 -458 216 -106 85 -78 61
4796F1J46l34L00l66J10k27M27K80k34R2j88r3j7k57L34O9j8k8K52j57J89m71
$$ 61 207 -127 173 -193 -83 -310 117 397 163 255 67 -26 -43 -300 34 103 85 57 309 152 341 -130
4818a30J47j29J04R8j62l52L10K50k36j6J4R5j17K48k03J13k32L89L07n60m0J21
$$ -130 17 -112 -8 90 -72 -424 -114 136 -100 -116 -102 -7 -124 124 -79 34 -198 191 498 -62 -102 19
4840A9J01l8n76N11k06J50Q2L2k82K67j37k22K46J34k80N4L1j34M07m32M71l64
$$ 19 120 82 -494 17 -189 -39 43 75 -207 60 -77 -299 -53 81 -199 -145 -114 -248 159 -273 198 -166
4862a66J54j00K60j33j0O7l02L08N3p7n8p0j22L33l30jL51m28J84M7M4q0r9K35
$$ -166 -12 -112 148 15 5 72 -230 78 131 54 -4 -74 -196 137 -193 -194 157 -271 -87 -40 4 -76 -175 60
4886F0J48k47q8M65l63n2j81K16j07K28J81k35j15L40l52J64r9J41L8m99J35L22
$$ 60 208 -39 -127 338 -25 -77 -258 -42 -149 79 260 25 -90 250 -102 62 -37 104 142 -357 -222 100
4908A00K43k08o1k08n3K4J39K18k35K8J11o4M14k45k49O0J43J23k22J56r1j13
$$ 100 343 135 74 -134 -187 -163 -24 194 -41 -13 98 34 448 203 -46 14 157 280 58 214 123 10
4930A0j95O4J54K41m90M60R3l92J14L36k29j3j93J86q0q9J40j68k9m4K71j64k37
$$ 10 -185 -121 33 274 -216 244 337 -55 59 395 166 153 -40 146 66 -23 117 -51 -80 -124 147 -17 -254
4953b54J82L2J41k9k65l5L69K6k31J89l41N2K69r7L5j5o0j20K20n7p0r7r4L61
$$ -254 -72 -40 101 72 -193 -228 141 167 -64 125 -216 -164 105 8 43 28 -32 -152 68 11 -59 -156 -250 111
4977A11k63lP3j43K22N2k23kK17k27P6J81j92m3L67j07k80Q7j62Q1J7r2O73o38
$$ 111 -152 -155 -82 -225 -3 49 -174 -176 41 -186 -110 71 -121 -164 203 96 -184 -97 -259 -178 -161 -253 420 -218
5001b18M44k20P5j80K06j64k10L4K66J02R7l59J30m0j62J22J45l9J7j42j90K47
$$ -218 226 6 81 -99 107 -57 -267 -233 33 135 232 -127 3 -37 -199 -77 68 29 46 -96 -286 -39
5023c9J04j80L33K8m54O6J39N71o32J91o6J98m83J03J92l19L47r6o3J6m3J29k35
$$ -39 65 -115 218 246 -208 -142 -3 568 -64 127 61 259 -224 -121 71 -248 99 3 -60 -44 -87 42 -193
5046a93J24Q2M4j14L91n02K43j32j91J89k09K98j80L3j04l2L03r8K49j61K1j42
$$ -193 -69 13 57 -57 334 -168 75 -57 -248 -59 -268 30 -150 -117 -221 -253 50 -48 201 40 61 -81
5068h1M8J17J05l87K25j8P3m6L31n49N5R5K02m65K53J10k34J90m9K3l1J09r9o9
$$ -81 -33 84 189 -198 27 9 82 36 367 -182 -127 -32 170 -295 -42 68 -166 24 -25 -2 -33 76 -23 -92
5092i2L22m06J79j3J51L1j10O6L4m04M07j75J66m62J17K28j1Q7j86Q2rK78l08
$$ -92 230 -176 3 -10 141 172 62 128 162 -242 165 -10 156 -306 -189 39 28 115 -71 11 2 280 -28
5115b8k87M43l12J89o2L27n27L60r9k05L58k07n1R1j14K66k76j2J6k6J71K01k53
$$ -28 -315 128 -184 5 -57 270 -257 103 4 -201 157 -50 -101 -10 -124 142 -134 -146 -130 -156 15 216 -37
5138c7J87k63J79k21K38k8r1q8K64N2p7m67L94j9Q6J67j6k05k52R9N2L21n27O72
$$ -37 150 -113 66 -155 83 55 -36 -124 140 192 115 -352 42 23 109 276 260 55 -197 -98 -46 275 -252 420
5162D20l50j02j37l8J78l2L25l76k79O48m18P7J00j92J57j34j45K59j50l6Q5P3
$$ 420 70 -32 -169 -207 -29 -61 264 -112 -391 257 -161 -84 16 -176 -19 -153 -298 -39 -189 -225 -140 -67
5184f7M9l03M10j46j01K37L2j45k41K46J01K79o26K90l00M02J89k18r8K82k48
$$ -67 -18 -321 89 -57 -158 79 111 -34 -275 -29 72 351 -275 15 -285 117 306 88 -10 272 24
5205B4J3j70K31j04K53k78J85j99j69K71l06p0J21j26K55K54l0m58M00m4j15J16
$$ 24 37 -133 98 -6 247 -31 154 -45 -214 57 -249 -319 -198 -324 -69 185 155 -303 97 53 -62 54
5227E4j30m8K71r5M1j58m3K39j07j49J15J19j37j44J97J70k96J85r2R0p8k23Q8
$$ 54 -76 -124 147 52 93 -65 -108 131 24 -125 -10 109 -28 -172 25 195 -101 84 -8 82 4 -219 -131
5250a31j95K69O0J21P9l07M66k88j47JM06l18n6j22O8L20l68j06M34m6l55N98
$$ -131 -326 -57 3 124 203 -104 362 74 -73 -72 334 16 -40 -162 -94 226 -142 -248 186 140 -215 383
5272C83m75j9J74j12k02n1L58K8M1j21l7j37k7M57k81m1J3L85j02k75K00l31p6
$$ 383 -92 -111 63 -49 -251 -302 56 84 125 4 -33 -170 -197 260 -21 -62 -49 336 234 -41 159 -172 -248
5295b48L39k04j49J20O18k05k48M10k80k46J66J26l73n8K41nl2j15M73m82k8J48
$$ -248 91 -113 -262 -142 476 271 23 433 153 -93 73 199 -174 -232 9 4 -28 -143 330 -152 -180 -32
5317c2J57l61K09J73l33J99Q9k09J79l5Qj30k08L09Q2j94J36k14N5M18j85L4K6
$$ -32 125 -236 -27 146 -187 12 101 -108 71 36 44 -86 -294 15 97 -97 39 -175 -120 298 113 147 173
5340A73k44L2J8J93j09k37R9M50p29J27Q3K7j6J56j0k34J95R0K29m46O6l2J2K92
$$ 173 -71 -39 -21 172 63 -174 -75 375 -354 -227 -144 -117 -133 23 13 -221 -26 64 293 -153 -87 -119 -107 185
5364A85k27K25k5k51J34K37j75p6o5K28m81M11j1m1k75L15k9K35j77j00j73M56
$$ 185 -42 183 158 -93 41 278 103 27 -38 190 -291 120 109 68 -207 108 79 314 137 37 -136 320
5386C20m31J71j19k2J97O2j8J11l75j14J48j00j71M32j75J21j17J58N2PP2k79
$$ 320 -111 60 -59 -81 116 178 160 271 -104 -218 -70 -170 -341 91 -84 37 -80 78 130 137 209 -70
5408g0r4L90l65K35j08m2J5J70K2j52J94k81J57j7j73M2p7l0J72r7O23o81K04
$$ -70 -164 226 -139 96 -12 -54 -39 131 153 1 195 -86 71 54 -119 -77 -154 -184 -12 -109 514 -167 37
5431C7J21l04K65j62K6J63j97J09p8l1L83n3m74J31o7J50j02J85j5n8jk12M34
$$ 37 158 -146 119 -43 -17 146 -51 58 -20 -51 332 279 -195 -64 -131 19 -83 102 87 29 28 -184 250
5454B50k59j07L61j34r8r7JJ99k00j05L3M41l8k63p6j56J86L17k06k01M40j77
$$ 250 -9 -116 245 111 13 -84 -83 116 -84 -189 -156 285 247 -16 -92 -248 -62 255 49 -152 288 111
5476A11m90N06L9n9K0j39J10L95n67J78l6q8KR6k76K56k51rM82j48J44k12l64
$$ 111 -379 127 166 107 127 -12 98 493 -74 104 68 -20 -18 78 -198 58 -193 -202 280 132 276 64 -300
5499c00L67L8r1K82k90j88q5L24R4k11j69jK9r3pL62l18K70P3k23p5Q1K37m6j24
$$ -300 67 105 14 296 6 -182 -267 57 151 -60 -229 -230 -201 -294 -301 61 -257 13 86 -137 -212 -131 106 60 -64
5524f4o5K11m9j29k6L18k20M7J42k73L07l13L65j15l16K99r0p0J62K56m61r4K35
$$ -64 -129 82 33 -96 -122 196 -24 23 165 -108 199 -114 251 136 -180 119 29 -41 121 377 -84 -178 57
5547E7O6m08K08K2J30m49L06qq6K7L76k66K32k60O5J86k54J91l96L18L49l93k58
$$ 57 123 -285 -77 -55 75 -374 -68 -76 -162 -135 241 -25 207 -53 12 198 -56 135 -261 57 406 13 -245
5570b45L88j09kj49J98j02J5k90J15K57p4J12j90J66j53K13P2k62j20K20K07J89
$$ -245 143 34 32 -117 81 -21 -6 -296 -181 76 2 114 -76 90 -63 150 222 -40 -160 60 267 456
5592D56m01J14q6K15k68l20M71j89J99k29K05l59K20m05M11M4j76M25k97l60K72
$$ 456 55 169 83 298 30 -290 181 -8 191 -38 167 -192 28 -377 34 78 -98 327 30 -330 -58
5613e8J84n2M1K1p8m7r3j87M48k03N1j28J27j00o7N17m63J13l59K74R1j05K56
$$ -58 126 74 115 136 58 11 -82 -269 179 -24 27 -101 26 -74 -141 376 -87 26 -333 -59 32 -73 183
5636A83q9r0l9J8P2Kj42L28j95j24J69l30L07k54J67j7J15j92K44j13r5K21r5
$$ 183 94 4 -35 -17 55 57 -85 243 48 -76 93 -237 70 -184 -17 -34 81 -111 133 20 -75 146 51
5659E1l1N6M6k33l0J64K25n6O4k85p6J48j27L38k00l30K50J02k95L5K44l92M94
$$ 51 20 76 122 -111 -141 23 248 192 256 -29 -105 43 -84 254 54 -276 -26 76 -219 -184 60 -332 162
5682A62m51M39k44j43r3L94O7o7l10L29Jj28J23l53N12l79L56j39j76r6L30r5
$$ 162 -289 150 -94 -237 -330 64 131 64 -246 83 84 -44 79 -274 238 -141 215 76 -100 -196 134 39
5704C9O5k21R5n0q2R4J6N9J42K03l24J49j05J63o04N52l11K69n74J21J29P9Q3
$$ 39 104 -117 -22 -72 -154 -60 -44 15 157 360 36 185 80 243 -361 191 -120 149 -425 -304 -175 -96 -13
5727a3o0K62l18J52k89L93j93jL70m67J17J81l20J07J76R2o6k99J57L34m02L84
$$ -13 -73 189 -129 23 -266 127 -66 -67 303 -164 -47 134 -186 -79 97 189 123 -176 -19 315 -87 297
5749B97m71N46l16K35k86J23q8Q8p0l9j18J15k72K08J65l27L00j93Q9qK15k91
$$ 297 -174 372 56 291 5 128 40 128 58 19 -99 16 -256 -48 117 -210 90 -103 -14 -22 193 -98
5771i8kNJ69k36M21n01J99K70j24p2p7J8p4L61n51JJ37L17k23K70k24k11K73j30
$$ -98 -100 -95 74 -162 259 -242 -43 227 103 31 -46 -28 -102 259 -292 -291 -154 163 -60 210 -14 -225 48 -82
5795h2J52KL5k57J88J63l19l07M76p2J55m50M05o7k24J26K35j34P4j8k2j18j50
$$ -82 70 72 107 -150 38 201 -118 -425 51 -21 134 -316 89 22 -202 -76 159 25 99 81 59 -59 -209
5818b09j25L40J00k28P3M0j74K65kk96J62K27n9j10L7K7k24L00r5m5N2J76L8k13
$$ -209 -334 6 106 -122 -49 -9 -183 82 80 -216 -54 173 114 4 41 68 -156 144 49 4 56 232 270 57
5842E7J45k97M5j91L85l24K91m8r0PL0r0k64L88J91l24J85j42Q5j68Q3j60J39
$$ 57 202 -95 -50 -241 144 -180 111 63 -27 -20 10 -80 -344 44 235 -89 96 -46 39 -129 -46 -206 -67
5865f7K84k76J40lk9j55R3n8N2K71k02J02R3m13JP6J01P3K47l94Q7J36k60J42
$$ -67 217 -59 81 78 49 -106 -13 -71 -19 252 50 152 245 -168 -167 -91 10 83 330 -64 23 159 -101 41
5889D1K08j65k3r6J11k31J46r2K50l61L79k26R1k99J71J07j34K90j04P8k78J7
$$ 41 249 84 61 -35 76 -155 -9 -101 149 -212 167 -59 32 -267 -96 11 -123 167 63 141 -137 -120
5911a20o7K09k80K61L6j42K57N2q0j65j95M39j26j89J8N5k34J79j7M17q1j30L8
$$ -120 -187 22 -258 3 39 -103 154 206 126 -39 -234 205 79 -110 -92 -37 -271 -92 -109 308 227 97 135
5934A35j02O2m12K42J29M7j9m9P3J71l57K1J43K22k89j61M9m4L90m53j84L14K04
$$ 135 33 95 -317 -75 54 101 82 33 106 277 -80 -59 84 306 17 -144 -95 -139 251 -202 -386 -72 132
5957A32l54M02k07L02j41k82L5J26k0n7j3j26J21K45m6j0N3l45j08K91k1n5K54
$$ 132 -222 180 -27 275 134 -148 -113 13 -7 -64 -77 -203 -82 163 117 107 160 -185 -293 -2 -23 -78 176
5980A76m64M43o43M31J45k42J27j99L53l28M12l31n3J85k49J79J18j80J34l46
$$ 176 -288 155 -488 -57 88 -154 -27 -226 127 -201 211 -120 -173 12 -237 -58 60 -120 14 -332
6000c32L90k12J37K06o7j94N0J11j88L17K05j59o85O33k99M97k67j5l69M7q3K43
$$ -332 58 -154 -17 189 122 -72 -22 89 -99 218 423 264 -421 212 -87 410 143 128 -241 -194 -277 -34
6022c4K99l35N0k9J55m61M94l62N54l32n0l5m2p0M78m11k7K00k54K98m52N94m82
$$ -34 265 -70 -20 -49 106 -355 139 -223 331 -1 -51 -86 -128 -198 280 -131 -158 42 -212 86 -366 228 -254
6045b54J78J83j15j99K97j74j38N77k70J4k95j0K22J90j64j47L25k71j00J69P6
$$ -254 -76 107 -8 -207 90 -84 -222 355 85 99 -196 -206 16 206 42 -105 220 -51 -151 18 94
6066I4n7j60q1K56k84Q9j90L55K59m6k68N2K84k18l55L78j00j28p3J74o1K21p5
$$ 94 37 -123 -204 52 -232 -143 -333 22 281 235 -33 19 303 85 -270 108 8 -120 -193 -19 -80 141 66
6089F6r1k67L00j5j19J22K08k72n7J04J10O2k24j16K02j09p4J86j2J7K05k12M
$$ 66 -25 -292 8 -7 -126 -4 204 -68 -125 -21 89 151 -73 -189 13 -96 -170 16 4 21 226 14 18
6112A8R4k38L36l1r9r5n1j81M07m18L42J39k59J24k96M2K66J50j6J1j51K2j46
$$ 18 112 -126 210 179 80 -15 -66 -247 160 -258 84 223 -36 88 -208 -166 100 250 234 245 94 116 -30
6135c0K20l10p4J81r3J56j95KK74l81J89M84m31K0k39J48R2J51J63l61qJ27m22
$$ -30 190 -120 -194 -13 -106 50 -145 -143 131 -250 -61 423 -8 12 -227 -79 13 164 327 -34 -42 85 -337
6158c37M46k01n0j5K15l55K38K10J22m24L37j75j39Q6Q5J46m87K8J49m9k52M79
$$ -337 109 -92 -142 -157 58 -297 -59 151 273 -151 186 11 -128 -42 43 189 -298 -270 -121 -170 -422 57
6180E7j96K74n26J63L32j37j09K85q4p9J33j22j09J50j81L43j45j18Q2l3K11k26
$$ 57 -139 135 -391 -228 104 -33 -142 143 59 -20 113 -9 -118 32 -149 194 49 -69 13 -20 191 -35
6202c5j56M09k70MJ33j33j4p4N29o46L46o6k4L31m5l20k4L30k65j08j81K17J20
$$ -35 -191 218 -52 -48 85 -48 -62 -136 393 -253 93 27 3 334 289 -31 -55 275 10 -98 -279 -62 58
6225E8k15N19l34q3J15j61m2N0J06k2l48J37M39m07K17M9r0N7O2p5J41k25L50
$$ 58 -157 362 28 -55 60 -101 -143 -93 13 -9 -357 -220 219 -188 29 78 -12 45 107 32 173 -52 298
6248B98n40J91K60l1QJ09j36j28J8L1K1k39O4J18k9j77K59j77L6J39J23l78J74
$$ 298 -242 -51 209 178 186 295 159 31 49 80 101 -138 -74 44 15 -162 97 -80 -44 95 218 -160 14
6271A4p2R2J45q9J06j32l3k95N50l14k21j04M03j14j09l1J33K25R7k14J76k76
$$ 14 -58 34 179 90 196 64 31 -264 286 -28 -249 -353 50 -64 -173 -204 -71 154 251 37 213 -63
6293f3J91jJ8j6p3K05k44P1Lk40P5j25P4L12m9j47Jj5j8J39j72j92L50o5Q6k36
$$ -63 128 127 145 129 56 261 17 88 91 -149 -74 -199 -125 187 138 -9 -8 -23 -41 98 -74 -266 84 19 105 -131
6319a31K10k47K06Jql0j7J32M6J61m10m7J51K26k06o8Nn4k60P11n45J20k02M41
$$ -131 79 -168 38 39 31 1 -16 116 162 323 -87 -134 17 243 37 -31 -26 -80 -340 371 -174 -54 -256 185
6343A85j53k4o5j9n9K9K20m89L50m7k55N27k00k2j52L3O3K22P1m18K42k39J55
$$ 185 32 8 -57 -76 -135 -106 114 -375 -25 -72 -327 200 0 -22 -174 -141 -78 144 215 -203 39 -200 -45
6366d5j07K0L88j22k45L76k71k32JON4L19j85R4r3L69m00n4N3J45J58j05k74m1
$$ -45 -152 -132 256 134 -111 265 -6 -238 -237 -231 -177 142 -43 51 -42 327 -73 -127 -74 71 229 124 -150 -191
6390a91M47k00l1k71M85J5k59r3J34K91k07m93M82m7k76J97Oj09J49J08k89L38
$$ -191 256 56 25 -246 239 254 -5 -98 36 327 120 -373 109 62 -214 -17 -11 -120 29 137 -152 186
6412A86J68o16M34l62K00l28K58Q6l74M10k72K12k84M66k7k47K15j85L17o4q1
$$ 186 354 -262 172 -190 10 -318 -60 26 -348 62 -210 2 -282 184 157 -90 125 -60 257 193 112
6433A12n6j55J6N8j28K89L09p03Qo6L74m3m4K03k86K05j19J56k41rK92j84K3o2
$$ 112 56 -99 -83 -25 -153 136 445 -258 -250 -316 58 15 -29 174 -112 93 -26 130 -111 -120 172 -12 11 -51
6457e1j66k71N23O5j13N1j46k37M14m9q0o0L8N9j6P7k87K17k15L62mJ05j33M0
$$ -51 -217 -488 35 100 -13 38 -108 -345 69 20 -60 -120 -82 -23 -39 38 -249 -32 -247 115 111 216 83 123
6481A23p4NPL5l66l37K57J87k09O23l96J50J15m6k87J74n3K46Q9j11j43J70j83
$$ 123 49 54 61 96 -270 -607 -350 -163 -372 251 -145 5 120 74 -213 -39 -92 154 243 132 -11 159 -24
6504b4J66q7l04L5K04R3j28K2k04M01O8j44l3P9k13L37j90J3k50J78k11K37k15
$$ -24 142 55 -249 -214 -10 83 -45 -23 -227 174 242 98 65 144 -69 268 78 91 -159 19 -192 45 -170
6527a70J37k07L00L0k30k1K59j82j5j67K95L63m50q1K13J34l08J01l2M07m12J02
$$ -170 -33 -240 60 90 -140 -161 98 -84 -99 -266 29 392 -58 -139 74 208 -100 1 -31 376 -36 66
6549F6k95L67M2j14P7j74K98k61j5j61J76Rj5j64P2M9J00l22M76kn14L11O1M4
$$ 66 -229 138 180 66 143 -31 267 6 -9 -170 6 15 0 -164 -92 -43 57 -265 211 209 -305 6 67 111
6573A11j06K81l40j44L49J92o27K63O4K72j27M2k36k21K68j05j48M09j46j71K26
$$ 111 5 286 -54 -198 151 343 -284 -21 43 315 188 230 -6 -227 41 -64 -212 197 51 -120 106
6594A06k0K08l97J21N6j29K9RJ90N3l98r7L29j54M7P4L98n08N5JJ03k6j4j57O6
$$ 106 86 294 -103 18 74 -55 -26 -17 173 226 -172 -269 60 -94 -47 27 425 -83 -28 -27 76 50 36 -121 -55
6619e5k70K59L05l50r7L33O0j01K1k42%K52p4l0M8K6o4j23j03O7J68l1J67j70
$$ -55 -325 -66 239 -111 -208 125 185 84 105 -137 -137 115 41 11 59 85 21 -102 -205 -138 30 -1 166 -4
6643dP4Q6l75j41M83k68N4K73R6l27p3K30j94K13p6j05K40k13J73k19n6qmJ70
$$ -4 70 156 -219 -360 123 -145 -91 182 278 -49 -122 108 -86 127 51 -54 186 -27 146 -73 -129 -137 -141 29
6667B9j86J46j22J78J06j77K36j32j37Q6k36J73K03m08K48k33K26j06J90j70K67
$$ 29 -157 -11 -133 45 151 -26 210 78 -59 27 -209 -36 167 -241 7 -226 0 -106 84 -86 181
6688A81j14K33l73Q7j77L88k38M26n18L7O5J97l52J09K66m37M3J21O2M1j90J37
$$ 181 67 300 -73 14 -163 225 -13 413 -105 -68 -3 194 -158 -49 217 -220 -177 -56 6 47 -143 -6
6710fJ31k35J51k22J88J2k0M6L5l80M12j46r3k5J71n7q8N9R8L2j6Q9l4K00l2k88
$$ -6 125 -110 41 -181 7 19 -1 45 80 -300 112 -34 -127 -152 19 -38 -126 -67 31 63 47 136 102 302 270 -18
6736a8N4p5k21M61o6j72j58L23l6o6J74n46O31k59K25k02J50j01k24O5N9n5J06
$$ -18 36 -39 -260 201 135 -37 -195 128 92 26 200 -346 285 26 251 49 199 98 -126 -61 -2 -57 49
6759D9k31q8M47j90MJ91l09J56j34k8J20M17k01r8o0qm26M13k40k0J05Q1j55J45
$$ 49 -182 -270 177 -13 -9 182 -127 29 -105 -133 -13 404 203 105 45 37 -389 24 -216 -236 -131 -50 -205 -60
6783f0L21j76j9j17K15Rk52K9L66l2q2j61O4l28O0J77L83l17Lj03J12M9Q6k11
$$ -60 261 85 66 -51 164 173 -79 -50 316 284 202 41 105 -223 -163 14 397 80 83 -20 92 141 227 16
6807A6k31M79j13n3L22n74R8J59J1k42K65p8k00J53j26k64K48j21J98J12k65J06
$$ 16 -215 264 151 98 420 -154 -56 103 114 -128 137 59 -141 12 -114 -378 -130 -251 -53 59 -206 -100
6829a00O7L31k63n9k66K69j44L10k70M09l54M1L18k86P8j18J31k25p6J97O7oj67
$$ -100 -33 298 35 -24 -290 -21 -165 145 -125 284 -70 -29 289 3 81 -37 94 -131 -207 -10 57 51 -116
6852a16j12L52j85q3N4J24K45qk14L3R5l42L09J8l43K56k7N2j07PJ5K8q1J15l12
$$ -116 -228 124 -61 -144 -90 34 279 271 57 90 185 -157 152 170 -173 83 56 108 1 8 23 51 -30 85 -227
6877b27J81k14J55J04K49k25R9j31k64oJ16J50j34J81N1l91Q8M49l57O7R2N3p8
$$ -227 -46 -260 -105 -1 248 23 122 -9 -273 -279 -163 -13 -147 34 85 -306 -218 231 -126 -59 33 86 8
6900Hj23j97Q8JK55M6qm7j46J89j95J32j10R3k23M25l99J32K26l62J60KK2q8N5
$$ 8 -115 -312 -224 -223 32 78 70 23 -123 66 -129 3 -107 -14 -237 188 -211 -79 147 -215 -55 -53 -31 -119 -64
6925f4OJ78q1k3N8J18j64l3n1K15p9k5J02k31mJ37L56m37J7J92k35J37l32J04
$$ -64 -58 120 39 16 74 192 28 -5 -56 159 80 55 157 -74 -78 59 415 -22 -5 187 -48 89 -243 -139
6949a39M07m77L69k7l37L10Kj10p2mmJ73j22Q7k66J83K64l12Q5n9N4K58k60l25
$$ -139 268 -209 160 133 -204 106 108 -2 -74 -78 -82 91 -31 56 -210 -27 237 -75 10 -49 5 263 3 -322
6973c22K72%J86J88ll40k13K10O5o3J5K03j52m00M35l1k54K72L15m78K24J29j75
$$ -322 -50 -50 136 324 321 -19 -232 -22 43 -20 -5 198 46 -354 81 50 -204 68 383 -95 129 258 83
6996H3%p8k11K89Q1l68L09j48r1R5J60k72K84j91j79K18m2L84k18k03J20r5J1
$$ 83 83 5 -206 83 164 -204 105 -43 -134 -39 121 -151 133 -58 -237 -19 -61 323 105 -98 22 -73 -62
7019f2J46k61l0J29M5L97n19J49j35J41N1J10l98K02j00J29k51M55l1q0O6m44
$$ -62 84 -177 -207 -78 -33 364 -155 -6 -141 0 51 161 -237 -35 -135 -6 -257 198 167 87 153 -291
7041b91L61k7R4j61pl5l18L78m0L47j57k20J34j30k69O14l92L27j9j85j34m0K84
$$ -291 70 43 137 -24 -31 -66 -384 -6 -46 301 144 -76 58 -72 -341 273 -119 208 189 4 -130 -170 114
7064A14N1k2j9L6j11j10Q3J29o5j79K45J52m14l0M32l36k6M11o59M25m4JO7j7
$$ 114 165 143 124 160 49 -61 22 151 86 -93 152 304 -110 -140 292 -44 -70 341 -318 107 63 64 131 114
7088A14m02N40k27j91L14J1j92P7P7j81J6J33pQJ46l37r8K05l92P40m86J48M3
$$ 114 -288 252 25 -166 148 159 -33 44 121 -60 -44 89 82 90 236 -101 -199 6 -386 354 -132 16 59
7111E9k86j40O95k84J66n2k88j64M11k54Q8q0K49K6J92n16Q8K02l18K79j79L35
$$ 59 -227 -367 328 44 210 158 -130 -294 117 -137 -49 -129 120 146 338 -178 -90 112 -206 73 -106 229
7133B29j43m42N03M4k64j31J00j14J00J01J01K5J26J01m64K70j81J58L4j53P4
$$ 229 86 -356 147 191 -73 -204 -104 -218 -118 -17 84 109 235 336 -128 142 -39 119 153 0 74
7154G4q5j26K63n8o5k44K43J46m9j68M5R3l01K50l02L62j49L0j63kL06R1k82n9
$$ 74 -11 -137 126 68 3 -241 2 148 99 -69 -24 69 -232 18 -284 78 -71 -41 -204 -206 100 191 -91 -150
7178a50K17j35K2j24O3j37M1NK13j79j7L10J85m31K4Q7J00j46K12m24K28k9J0
$$ -150 67 -68 -46 -170 -107 -244 -203 -198 15 -164 -181 129 314 -117 -93 -6 94 -52 160 -264 -36 -65 -55
7201e5p8K08l18J09O21n28J79l03Ml0L4j27J17L1K28j91j39M80k01m01L58L11
$$ -55 -133 75 -243 -134 487 -41 138 -165 -161 -191 -157 -284 -167 -136 92 -99 -238 242 41 -360 -2 309
7223C09n5l25J1j09L57N6k00lM2k76Q6J30M7Kk99K93j00J87j62k53L14j69L32
$$ 309 254 -71 -60 -169 188 244 44 41 83 -193 -107 23 70 72 -227 66 -34 153 -9 -262 52 -117 215
7246B15l0k09K16j7l66M33k76K12k61m20P10m39K21l5J52l71O36j83j06J0j10
$$ 215 185 -24 192 175 -191 242 -34 178 -83 -503 207 -232 -11 -46 106 -265 371 188 82 92 -18
7267a8k10K89P5p2j21K03k27j19L42n02P20k74j12J89J7j55K93m07K31j93Q6n3
$$ -18 -228 61 136 64 -57 146 -81 -200 142 -360 360 86 -26 163 180 25 318 -89 142 -51 35 -18
7289a8p0K22j53J9J61j12j73L62j11k86J07Q4j44J20J25O5K5q3j94P8P9Q3j08
$$ -18 -88 134 -19 0 161 49 -124 238 127 -159 -52 32 -112 8 133 198 223 140 -54 24 103 186 78
7312G8j46P7L3j39J56J41m84K35J87j55pJ5j97K12O8R1m14L01k65L97p8j93J59
$$ 78 -68 9 42 -97 59 200 -284 -49 138 -17 -24 -9 -206 6 74 165 -249 52 -213 184 106 -87 72
7335G2n8l7JJ08k45n8M73j69k2M09m94q9K18q1J89l98N6K38k61J61P9k4M0J68
$$ 72 14 -23 -22 86 -159 -217 256 87 65 474 -20 -109 109 28 217 -181 -125 113 -148 13 92 68 108 276
7359B76j14m34l7J65K17J09n45K07j13K95k14J46l08L93K54m14K06k46p5N48k50
$$ 276 162 -272 -309 -144 73 182 -363 -156 -269 26 -188 -42 -350 43 297 -117 89 -157 -232 316 66
7380F6l03M09k37R1j69O6J64k18M4O2L9N5j37J11PN5K7k8j99j8J26j85L68l32
$$ 66 -237 172 -65 26 -143 -77 87 -131 -87 -25 14 69 -68 43 50 105 132 104 -95 -113 13 -172 196 -136
7404a36L93o8j85j03P2k9J05Q8l47J55o4m1J99m57O91m34j00L35k50oL08j56K20
$$ -136 257 189 4 -99 -27 -56 49 137 -210 -55 -119 -160 39 -418 273 -161 -261 74 -176 -182 126 -30 190
7427A90l34k40K84J23m05K41M26k07j05k5j80J91J83m02K09J95k25R7J10N3o8
$$ 190 -144 -384 -100 23 -382 -141 285 78 -27 -52 -232 -41 142 -260 -51 144 -81 16 126 179 111
7448A11m8K21k05k3P3o6j96k70L34J08m06M64P4k35k59K74j03N8K4K26k49J71
$$ 111 63 284 79 56 129 63 -133 -403 -69 39 -367 97 171 -64 -323 -49 -152 -94 -70 156 -93 78
7470G8l68L32j20L56k38j22M31j90m55N26J0n39M51M3l41j59nK97K53p06P70k85
$$ 78 -290 42 -78 278 40 -82 349 159 -296 230 240 -299 152 195 -146 -305 -310 -13 240 -466 304 19
7492A9K02k99k3K74l90m33P23m0l88L64Q0j43J20k26J45J90j17j3k02j1J7J74
$$ 19 221 -78 -101 173 -217 -650 73 33 -355 9 89 -54 66 -160 -15 175 58 45 -157 -168 -151 23
7514B3m01O77k73k2K6K10m42K80j5J7P0j22O3r3m9k8R1K10n1j23j04M8Q7j40q
$$ 23 -378 299 26 4 30 240 -202 78 63 80 150 28 91 -2 -51 -79 12 222 171 48 -56 -8 79 -61 -69
7539f9o5J41q8j73K37P1k98L17j09J9K32k65j62J29M16k14j71j21L7J3K83j58
$$ -69 -134 7 -81 -254 -17 54 -244 73 -36 -17 215 -50 -212 -83 333 119 -52 -173 -136 -123 160 2
7561Bk00L60j4L8j52r8L41k41j62N1J62k31O1j2r7J53j8m6QK41n06J95K33j04
$$ 2 -198 162 148 186 34 -64 277 36 -126 -75 87 -144 -83 -95 -192 -39 -57 -103 -95 146 -360 -165 68 -36
7585c6L21l19M28k92j65k82q0N34m5MJ31l40N11k86K5j20r3J82p8J02J1Pj98J92
$$ -36 285 -34 394 102 -63 -345 -425 109 64 68 199 -141 370 84 109 -11 -104 78 0 102 113 120 -78 114
7609A14q9J04j92j37L01O5j58j39Mj60J96K98r0j7j36L9j38K19M9j66J16M0j7
$$ 114 25 129 -63 -200 101 166 8 -131 -127 -287 -91 207 117 100 -36 3 -135 84 133 -33 83 123 106
7632A06j07r4q3K46p1J21k51J54K62k78J39j55m4j46L11J34l9l94K11nll4K20
$$ 106 -1 -95 -178 68 -3 118 -133 21 283 5 144 -11 -55 -201 110 244 205 -189 22 17 14 -20 200
7655B00J30l33J28k10Q2N2M2m1q1K22j12o6k53L46K9j41J98N4k71k86K84k8J3
$$ 200 330 -3 125 -85 -3 49 91 50 -31 191 79 13 -240 106 135 -6 192 246 -25 -311 -27 -55 -42
7678d2J94j15L3l6j62J09Q8l08O71k87o4K04k53J44k62J89k39K36J6q5J21k79
$$ -42 152 37 70 34 -128 -19 69 -239 432 145 81 285 32 176 -86 103 -136 100 116 31 152 -127
7700a27L04J64n16K03L34j68L7l55k68P08l14L6J47j81l7m3L34n7l17J70J5K0
$$ -127 177 341 -175 28 362 194 231 -124 -392 316 2 38 185 4 -33 -76 258 201 -116 54 69 89
7722H9J14k81K41j79j77p6L19Ok29J6K23j90J20k39K3L47m45NO33l48K81j51r9
$$ 89 203 -78 163 -16 -193 -269 50 56 -173 -157 66 -124 -4 -243 -220 127 -318 -313 320 -28 253 102 3
7745Cj3J64k2j40m61L59M0J17j14k50K97m3l8k1K92l11J5J86N2r2m28O15k3j56
$$ 3 -10 154 132 -8 -469 -110 -70 47 -67 -317 -20 -63 -101 -122 170 -141 -126 60 112 20 -408 207 184 28
7769B8j28n6K38nK30j41k76J94K57k74j92J77p2R1j70M00l48O7j15K43l63J79
$$ 28 -100 -156 82 77 307 166 -110 84 341 67 -125 52 -20 71 -99 301 -47 20 -95 148 -215 -36
7791c6l8J01J37n38M08k98J5K06k5j75J32J30K50j23k89R2L43k83L30n04L64l54
$$ -36 -74 27 164 -374 34 -264 -249 -43 -68 -243 -111 19 269 146 -143 -51 292 9 339 -165 199 -155
7813a55o9L23k16K08k7oq2p8n4J98j31K04j21J15l11J15L73k65j48o9J90K93L9
$$ -155 -224 99 -117 91 64 58 -24 -102 -156 42 -89 115 -6 109 -202 -87 286 21 -127 -196 -6 287 326
7836C26j24j58J51k54L15m0j20n5j62L51l02j66J78L04m33L02q8l4j92M85j07
$$ 326 202 44 195 -59 256 216 96 41 -121 230 -72 -238 -60 244 -189 113 25 -9 -201 284 177
7857A77q9l18K8J90n2j6J08l3j48M12l69L32k41P4n1oR4K25m59M75n31K09l97
$$ 177 88 -230 -202 -12 -64 -80 28 -5 -153 259 -110 222 -19 55 4 -2 92 317 -142 333 -198 11 -386
7880c86N39k9l64M25k10J60k82L76k90j60J98L6K41o8r9j16j34J34l72K78J84
$$ -386 153 124 -240 185 -25 135 -147 229 -61 -221 -23 13 254 186 87 -29 -163 -29 -401 -123 61
7901F1J3r7P0j12n3J36k23n9L77o6Q1k01K04j05j02j67J02M62l18J06J20l39L39
$$ 61 74 -23 47 -65 -118 18 -205 -264 113 47 128 -73 131 26 -76 -243 -141 321 3 109 229 -110 229
7924B29l16K27k14K45j7m10K00L20l31J08m8L42m01K11n8k80L49k29L4J15m0q0
$$ 229 -87 140 -74 171 154 -256 -56 264 -67 41 -7 335 -66 145 87 -193 156 -73 -39 76 36 -44
7946d4j11J38j09L49k24O2j30j33K70K49k35j14j78J28J48J1K4r3oM4k0J32j76
$$ -44 -155 -17 -126 223 -1 61 -69 -202 68 317 82 -32 -210 -82 66 77 101 8 2 46 26 158 -18
7969a8L0k70J70J3L5o3p6K05M8p2l5k06L48j63J79O4k38J45o3j42o8K25K15k72
$$ -18 12 -258 -88 -75 -40 -103 -179 26 74 2 -33 -239 109 -54 125 189 -49 96 33 -109 -177 48 263 -9
7993iJ70k18NJ53M7j81K07r5k13K43n6r6j51L05j83P8R8K90n65j11L76l4oJ08
$$ -9 161 -57 -52 101 148 -33 174 79 -134 109 53 -43 -194 111 -72 6 104 394 -171 -282 94 60 54 162
8017A62k35P4Q7j59LP3j26K11K4k02L11q0j46K91m90L67j4l54K07j25QP6r8K57
$$ 162 -73 1 88 -71 -68 5 -121 90 114 -88 223 143 -3 288 -202 165 151 -203 4 -121 -113 -37 -135 122
8041A22j02J0N14n87J02j01j8L1l11K69L2mj61J05K17m02K88j26K97j29n6K9k89
$$ 122 20 30 544 -43 59 -42 -60 -29 -340 -71 -39 -43 -204 -99 118 -284 4 -122 175 46 -10 19 -270
8064b70L11j45L7K73o23K39J22J75O0l51K53l03K90k78M45k53J01J22k31Q3j62
$$ -270 41 -104 -67 206 -417 -178 -56 119 179 -172 81 -222 68 -210 235 -18 83 205 -26 57 -105
8085a05J29K2l6p1J1m04K01J25K42k87L39Pm65M69K8l22N6J49j61J16jJ19O0k76
$$ -105 24 46 10 -61 -50 -454 -253 -128 114 -173 166 173 -292 177 205 -117 -61 88 -73 43 42 161 221 -55
8109e5K25K04k97j09k91L14p3J39Q3O0k89j48R4P2j08K98J56j48l73K46j27J16
$$ -55 170 374 77 -32 -323 -9 -82 57 140 200 -89 -237 -143 -71 -179 119 275 127 -246 0 -127 -11
8131a1L92o92L71l01N31l34j04J41L09k86J8o4j15J04K83j84K29j47j80l4K41
$$ -11 381 -311 60 -241 290 -44 -148 -7 302 16 34 -30 -145 -41 242 58 287 140 -40 -74 167
8152A67l06J79j84J15J94k92P6R4qp8K26l01j42M94k28K01n03L82k35l34L60R7
$$ 167 -139 40 -144 -29 165 -127 -51 43 35 -43 183 -118 -260 234 6 207 -296 86 -149 -483 -123 -26
8174b6r0J17q6n9K65jj31o3m7J37j10J54o2J57j67j10Q6
$$ -26 -116 1 -85 -144 121 120 -11 -74 -121 16 -94 60 -2 155 -12 -122 -36
8191c6
$$ Imaginary data points
##PAGE= N=2
##DATA TABLE= (X++(I..I)), XYDATA
0@%%%%%%Qj6J6j6K4l2M0m8N6p2Q8j04J21j43J67j93K25k60K99l44L93m46N06n74
$$ 0 0 0 0 0 0 0 8 -8 8 -8 16 -16 24 -24 32 -40 48 -56 65 -78 89 -104 121 -139 160 -184 209 -237 269 -305
30c05O46p25Q14r11J017j135J264j403J556j727J915k119K345k596K877l190L541
$$ -305 341 -384 430 -481 536 -599 665 -738 818 -909 1006 -1113 1232 -1364 1513 -1677 1864
47A864l941M400m930N552o294P199q329R784j1745J4542j8874K6538m4014J51468
$$ 1864 -2077 2323 -2607 2945 -3349 3850 -4479 5305 -6440 8102 -10772 15766 -28248 123220
61A23220J5902k89738J56191P9549j14964m842L2610r9580P3078J08574r2313
$$ 123220 139122 -150616 5575 85124 -29840 -34682 -2072 -101652 -28574 80000 -12313
72a2313o0080J47834M4655j28648o0215Q5858L0129o3620m2352l611J2577R7860
$$ -12313 -72393 75441 120096 -8552 -68767 17091 47220 -16400 -58752 -62363 -49786 48074
84D8074L4582j30891q466J69093k8339j49631M2891N8844p1501K37J7824m5375
$$ 48074 82656 -48235 -56701 112392 84053 -65578 -22687 36157 -35344 -35107 -17283 -62658
96f2658P2180Q5284j08687n3318J28852L6533r8760n0080J1924L0770K4062l6467
$$ -62658 9522 94806 -13881 -67199 61653 98186 -574 -50654 -38730 -7960 16102 -20365
108b0365m1040M5537P0223j1347o0839J2202P3854k6535r9034J0210N8133j6959
$$ -20365 -61405 -15868 54355 43008 -17831 -5629 68225 41690 -57344 -47134 10999 -5960
120e960q622k079l6659O3235R4764q1946q7953Q9001M3986q6674k6164K9157l919
$$ -5960 -14582 -16661 -53320 9915 104679 22733 -65220 23781 67767 -18907 -45071 -15914 -19833
133a9833J6652P768m1271K6361Q4777k4303r1117J5797P8610j9368q0130n456
$$ -19833 -3181 4587 -36684 -10323 74454 50151 -40966 -25169 53441 34073 -46057 -51513
145e1513M1123R526R527j034l6685L1868P6112n5277q4244O9900N0054r0437k9798
$$ -51513 -10390 -864 8663 7629 -29056 2812 78924 23647 -60597 9303 59357 -31080 -60878
158f0878N6792J455M159K4373m6202p525R0254j02j00872r71O8144j3481m9415
$$ -60878 -4086 -2631 1528 25901 -20301 -27826 62428 62326 -38546 -39517 28627 15146 -34269
171c4269L277K0638J4266J7553j4440k9614L5673N2386n3702p3174M8978N6880
$$ -34269 -30992 -10354 3912 21465 7025 -22589 13084 65470 11768 -61406 -12428 44452
183D4452n3933l8871L4991J5646R808J9572l8985j9188O9261M534q7194Q84O3368
$$ 44452 -9481 -48352 -13361 2285 12093 31665 -7320 -26508 42753 47287 -39907 -39023 24345
196B4345j6764l5890J1304O764J7391L1793k8510m4551M1657M6102n0647n3029
$$ 24345 7581 -28309 -17005 -10241 7150 38943 10433 -34118 7539 53641 2994 -50035
208e0035L5211L7336k5242k0956J2955J1465K0891J0560m4716j6721O3245O572
$$ -50035 -14824 22512 -2730 -23686 -10731 734 21625 32185 -12531 -29252 33993 40565
220D0565p9297l781N9831o673k6886J0863k667J0642L7550k6281n2032L9450M5503
$$ 40565 -38732 -42513 17318 10645 -16241 -5378 -8045 2597 40147 13866 -38166 1284 46787
233D6787n2631m2425L9031K7903j8044q902R64K173K7240J1534m5714k0168N1355
$$ 46787 -5844 -48269 -9238 18665 621 -8281 -7317 -5144 22096 33630 -12084 -32252 19103
246A9103J2069n9097q845M7670L206k0520K869l121J0105L4582k4806n5536L2558
$$ 19103 31172 -27925 -36770 10900 14106 -6414 -3545 -6666 3439 38021 13215 -42321 -9763
259i763N0944m0700m1602L1242K3815r850j546n198m588K5750P974m2249j3315
$$ -9763 41181 481 -41121 -9879 13936 4086 2540 -2658 -7246 18504 26478 -15771 -29086
272b9086M5298P970m6711q776L6628J2082j1290o276j1516R365L3191j6450m8626
$$ -29086 16212 24182 -22529 -31305 5323 17405 6115 -161 -11677 -2312 30879 14429 -34197
285c4197J8569M3447k6168l1530K5097J8534p564m63j1018p144L2336Q749m9393
$$ -34197 -15628 27819 1651 -29879 -4782 13752 6188 5725 -5293 -12437 19899 28648 -20745
298b0745j3868M6254J2337l5524r939K1494J1443l75p802j3410Q256K3524j6165
$$ -20745 -34613 11641 23978 -11546 -21485 9 11452 11077 3275 -10135 -1879 21645 5480
311E480l4818J8136L5640k0032k8870J7187J8481l2N10j7245j5068L0390J8521
$$ 5480 -29338 -11202 24438 4406 -24464 -7277 11204 11172 11682 -5563 -20631 9759 28280
324B8280m0656j7968L6524J0544k4920l341J4054O400K681j1426j6558J5327K5238
$$ 28280 -12376 -30344 6180 16724 -8196 -11537 2517 8917 11598 172 -16386 -1059 24179
337B4179j9935l3885J5109L4565q558k3501L821J1720N084L283j4229j4240K1444
$$ 24179 4244 -29641 -14532 20033 11475 -12026 -8205 3515 8599 11882 -2347 -16587 4857
350D857J4504l1987j2322L5093Q164k5873l545J1364O707Q892j1091k6020J1380
$$ 4857 19361 -12626 -24948 10145 18309 -7564 -11109 255 6962 15854 4763 -21257 -9877
363i877L0447j2278k8498Q924K2040k464j2173j192O740Q038j615j6953o940K3652
$$ -9877 20570 8292 -20206 -11282 10758 8294 -3879 -5071 1669 9707 8092 -8861 -15801 7851
377G851J1929l0237j5205L0341J5753j9787q318M588L772J0480l636k2763N086
$$ 7851 19780 -10457 -25662 4679 20432 645 -7673 -3085 687 11167 7531 -15232 -10146
390a0146K5377j0646k2082J2232J8012n542j0786l937M516J4300J207k2586q770
$$ -10146 15231 4585 -17497 -5265 12747 7205 -3581 -7518 -3002 11298 12505 -10081 -18851
403a8851K2367J3978j9506j4708J5874J3950r557q474K413M134N972l924j8664
$$ -18851 3516 17494 -2012 -16720 -846 13104 3547 -4927 -2514 1620 7592 3668 -14996
416a4996N519K6405q109k6216Q070K0671j949q300p187k405J4343O944j9677q129
$$ -14996 -9477 16928 8819 -17397 -9327 11344 9395 1095 -6092 -8497 5846 12790 -6887 -15016
430a5016J9056P457j5242o216J1246Q938n408r976k253Q384R373o057j7999K016
$$ -15016 4040 11497 -3745 -9961 1285 10223 4815 -5161 -7414 970 10343 4286 -13713 -11697
444a1697K2970J219k1554l56J5833J255o393m945l023J0685O628j7666q466K1273
$$ -11697 11273 12492 -9062 -9418 6415 7670 1277 -3668 -6691 3994 10622 -7044 -15510 5763
458E763P903j6670o556Q897P900O01r401r057P998J2406n964j3630K771J4753
$$ 5763 13666 -3004 -9560 -663 7237 7838 -1563 -10620 -2622 9784 3820 -9810 -7039 7714
472G714O82j3808j961J2036L316p709o814l21J0296P867j4652j1475J6370J1702
$$ 7714 8396 -5412 -7373 4663 7979 270 -6544 -6865 3431 11298 -3354 -14829 1541 13243
486A3243j2443q099N384N036L002n001j0952O152J4192p339j4290N906J4207j350
$$ 13243 800 -7299 -1915 3121 6123 1122 -9830 -3678 10514 3175 -11115 -5209 8998 7648
500G648j1796l952R084P379n697r399m21R700N664q996r276J0299J0009q698q422
$$ 7648 -4148 -8100 984 8363 2666 -6733 -7154 2546 8210 -786 -10062 237 10246 1548 -6874
515f874M806N201J692m459r389L681J5713l808j6141L295J3364J50q927m630M468
$$ -6874 -2068 3133 4825 366 -9023 -5342 10371 6563 -9578 -6283 7081 7231 -1696 -6326 -1858
530a858Q184k432j0394K1J0215M164q947p513Q119R664n372j0903K210P690K393
$$ -1858 6326 3894 -6500 -6479 3736 7900 -1047 -8560 -441 9223 3851 -7052 -4842 2848 5241
545E241m631q102K877J2119j510j2510J286J1120n48p280l227J979P907P87j0335
$$ 5241 610 -7492 -4615 7504 5994 -6516 -5230 5890 5342 -1938 -5165 -3186 4721 5508 -4827
560d827l163J1270N020p958o753L953Q529j227r058k316Q482M243n835p320L937
$$ -4827 -7990 3280 8300 342 -6411 -2458 6071 4844 -4214 -6530 1952 6195 360 -6960 -3023
575c023J0470j382j2106L32J0015J188o196l984J159O413L307q526n258R899N124
$$ -3023 7447 6065 -6041 -5709 4306 5494 -702 -4686 -3527 2886 6193 -2333 -7591 2308 7432
590G432p854n181M101N563j26o865l784P124O730n124q364K431R414P10r578k663
$$ 7432 -422 -5603 -1502 4061 3935 -2930 -6714 410 7140 2016 -6348 -3917 5497 6207 -3371 -6034
606f034P459L463m966m582J356O499K459p410m975Q332O630p912o844L912O267
$$ -6034 1425 4888 -78 -4660 -3304 3195 5654 -1756 -6731 1601 8231 319 -6525 -2613 3654
621C654M98n801m548N518O788m075o557K089O384k26n789l142M933N223l490o738
$$ 3654 4152 -1649 -6197 -679 6109 2034 -4523 -2434 3950 3724 -2065 -5207 -274 4949 1459 -5279
637e279J761O804K255o246n354N437O836m438o663J357N594J816m735m347M875
$$ -5279 -3518 3286 5541 -705 -6059 -622 6214 1776 -4887 -3530 2064 3880 -855 -5202 -327
652c27O693m490p210K998O072k48n196l012K997O406j278p326L19O598J823n346
$$ -327 6366 1876 -5334 -2336 3736 3488 -1708 -4720 -1723 4683 3405 -3921 -3602 2996 4819 -527
668e27l646L273M942k842n770J310N875J218m145m263L380O703j863p872K14O288
$$ -527 -4173 -900 4042 1200 -4570 -3260 2615 3833 -312 -4575 -1195 5508 3645 -4227 -4013 2275
684B275J101m063l010J877N519k43o748k95O834J292n768l430L956M894j750o524
$$ 2275 3376 -687 -3697 -1820 3699 3456 -3292 -3587 3247 4539 -1229 -4659 -703 4191 2441 -4083
700d083K27O064K113m006l169J179M787k94n589j254N572K010m802j987K004M750
$$ -4083 -3856 2208 4321 315 -2854 -1675 3112 2818 -2771 -4025 1547 3557 -1245 -3232 -1228 3522
716C522M48o688j582O374L040n569m213K926M226O35m981k011N208K895m135l195
$$ 3522 3970 -2718 -4300 2074 5114 -455 -4668 -1742 2484 3119 -1862 -3873 1335 4230 95 -3100
732c100K393L658n48n348j391O015K384m371l380K014M552O84n008k845M917L074
$$ -3100 -707 2951 2403 -2945 -4336 1679 4063 -308 -3688 -1674 2878 3562 -1446 -4291 626 3700
748C700m284k588K444K852k12k972k358M285L954l912n336K172N064J59m433k893
$$ 3700 -584 -3172 -728 2124 1912 -1060 -3418 867 4821 909 -4427 -2255 2809 2968 -1465 -4358
764d358M095M139k205m484J114M340J4l889k448M273L250m019m236L241L988n18
$$ -4358 -263 3876 1671 -2813 -1699 2641 2655 -1234 -3682 591 3841 -178 -4414 -1173 2815 2297
780B297k501k889K583M761k275n269P33M526k88k565j702J754M001j653m508J047
$$ 2297 -204 -3093 -510 4251 1976 -3293 -2560 1966 1678 -887 -2589 -835 3166 1513 -2995 -1948
796a948M592L74m392k433L013M349j869m895O28M516J394l057k694J464L846j234
$$ -1948 2644 3018 -1374 -3807 -794 3555 1686 -3209 -2581 1935 3329 272 -2422 -958 2888 1654
812A654m778P39M553k8l807j061K830L108j059m580m90M647R23l531j759J959
$$ 1654 -3124 -2385 2168 2140 -1667 -2728 102 3210 2151 -2429 -2919 1728 2651 -880 -2639 -680
828f80K653k0l385q22L578J606l133k315J897L388r77m127q28M713J795m177k154
$$ -680 1973 1953 -1432 -2254 1324 2930 -203 -2518 -621 2767 1790 -2337 -3165 1548 3343 -834 -2988
845b988K235L443m13l621j494L670J688l232j796K182K226p89k465q55L365K167
$$ -2988 -753 2690 2277 -1344 -2838 832 2520 -712 -2508 -326 1900 1111 -1354 -2209 1156 3323
861C323l303l158K239L063n99k658j555K998K361k224k584J507K578n17k371j434
$$ 3323 20 -3138 -899 2164 1565 -1093 -2648 350 2711 487 -2097 -590 1988 1471 -900 -2334
877b334K751K465k771l330K527K960m65k995j128K449K759k252l518J591L440
$$ -2334 417 2882 111 -3219 -692 2268 1803 -1192 -2320 129 2888 636 -2882 -1291 2149
892B149j057k460m34K389J606j902k512J700K638p65k436j284K326K486j545l353
$$ 2149 1092 -1368 -1802 587 2193 291 -2221 -521 2117 1352 -1084 -2368 -42 2444 899 -2454
908b454O28L554O8k299j110J338K134n35l797O43L793j54l163k48K059K158j372
$$ -2454 -1826 1728 1796 -503 -1613 -275 1859 1324 -2473 -1830 1963 1809 -1354 -1602 457 2615 1243
925A243l120J39L171J80k900p03K125J712p09k781K80L150J03k760q55J650J612
$$ 1243 -1877 -1738 1433 1613 -1287 -1990 135 1847 1138 -1643 -1363 1787 1890 -870 -1725 -75 1537
942A537o09k461j82L297O36l069q68J807J547m59k080j022K793J274k734j611
$$ 1537 928 -1533 -1715 1582 2218 -851 -1719 88 1635 1176 -904 -1926 867 2141 -593 -2204
958b204K171J777j056k087l7K515J021k500j889K567J322r28k184k75K701J025
$$ -2204 -33 1744 688 -1399 -1436 1079 2100 -400 -2289 278 1600 672 -1512 -1787 914 1939
974A939k607j102J628J433l76j546r82K012J409k216j565J528K164r33j596p33
$$ 1939 -668 -1770 -142 1291 915 -631 -1613 399 1808 -408 -1973 -445 1719 786 -810 -1543
990a543J885J710k158j893J885J787o53j880o65J463K117k137j880J744J543n65
$$ -1543 342 2052 -106 -1999 -114 1673 1020 -860 -1525 -62 2055 -82 -1962 -218 1325 760
1006G60j281n83J342J669j546k448J711K201j146j401m82J699J134j299k007R39
$$ 760 -521 -1104 238 1907 361 -2087 -376 1825 679 -722 -1204 495 1629 330 -1677 -738
1022g38J813m67j417J39Q26J326j074k044J187J901l92j977n75J603J315j092
$$ -738 1075 608 -809 -670 156 1482 408 -1636 -449 1452 1060 -917 -1492 111 1426 334
1038C34k322J294K624j051j468n67J160J046n29j525M67J269J84k012k14J686
$$ 334 -1988 -694 1930 879 -589 -1156 4 1050 521 -1004 -537 732 916 -1096 -1310 376
1054C76Q83j079j529M96J853J87j539r54J208J113n76j323J56J572J00j635l54
$$ 376 1259 180 -1349 -853 1000 1187 -352 -1306 -98 1015 439 -884 -728 844 944 -691 -1045
1071a045J160L47o8j402j55K377L0j871o76J596R86r80j185p4J620O47j703n71
$$ -1045 115 462 394 -1008 -1163 1214 1244 -627 -1303 293 1279 299 -886 -960 660 1307 -396 -967
1089i67J140M36k47j128N95J216k04j267q22J074J153n00j269l76J798M83j112
$$ -967 173 609 362 -766 -171 1045 841 -426 -1248 -174 979 479 -790 -1166 632 1115 3
1106Cr47R58J162r33q99l47J364Q94j522r31J197J245q56j492K57J254N62j055
$$ 3 -944 14 1176 243 -656 -1003 361 1255 -267 -1198 -1 1244 388 -1104 -847 407 969 -86
1124h6j256J064J063m47q82k25J145N32r81j083J178R21o89r93J84P36R84j226
$$ -86 -1342 -278 785 338 -544 -769 376 908 -73 -1156 22 943 254 -739 -555 181 1165 -61
1142f1r77P54J072K0j266k97P54P59p25q49L01J578q28j138O10O42P38j511j070
$$ -61 -1038 -284 788 808 -458 -755 -1 758 33 -816 -515 1063 235 -903 -293 349 1087 -424 -1494
1161a494J234J045k46j152l22J318M47n00j243Q76L64K83j113j03J139j10m16
$$ -1494 -260 785 539 -613 -935 383 830 330 -913 -37 327 610 -503 -606 533 423 7
1178Gn32L75J067j90j392o3R15M86m99r87P5J277n7n97n17R68K17l92p93M56P09
$$ 7 -525 -150 917 727 -665 -728 187 673 174 -813 -738 539 482 -115 -632 336 553 161 -632 -176 533
1199E33j2j321L07N82M84n87o19N3J188j26p54m40J317k88l90l20N8P38k70o20
$$ 533 521 -800 -493 89 573 -14 -633 -580 608 482 -272 -712 605 317 -73 -393 -335 403 133 -487
1219d87P3P66L62p83o13L99N94K38r83n38J167M74o58n80K17O59L12j077J3O08
$$ -487 -414 352 714 -69 -682 -283 311 549 -434 -972 195 669 11 -569 -352 307 619 -458 -445 163
1239A63L98o13k89M73J55k5n69k98P20N27o11o94O70J09K90m26n40O90M75m18
$$ 163 561 -52 -341 132 287 262 -307 -605 115 642 31 -663 7 116 406 -20 -560 130 605 187
1259A87n57J24P83L7q42l72O50O22l97j000M74O42J69m99r09Q44O12n15o29L83
$$ 187 -370 -246 537 574 -268 -640 10 632 235 -765 -291 351 520 21 -888 -44 568 53 -576 -193
1279a93P62j71m63l42N19N23j77r95N57J07K07j70n54K91N07n79j04M1P38j50
$$ -193 569 398 -65 -407 112 635 458 -537 20 127 334 164 -390 -99 408 -171 -275 -234 504 354
1299C54l29q01Q99R28r11r12O85L57K11m70l42L52M83k80p74L1M59L66n42l42
$$ 354 25 -776 123 1051 140 -772 -87 270 481 11 -331 21 504 224 -550 -519 -60 306 -236 -578
1319e78M21P63l66q71N11M97M4o15l78N82N9J58o87R1J069l44o43j36N9Q68l0
$$ -578 -157 606 240 -631 -120 377 421 -194 -572 10 69 227 -460 -369 700 356 -287 -423 -364 504 474
1340D74j156K12O27J72o88J56P4L51j66p43O23K93L30q64j44N60N32n32m32k2
$$ 474 -682 -470 157 329 -359 -203 -129 222 56 -687 -64 229 559 -305 -449 111 643 111 -321 -343
1360c43N69L29p49l2K89j39Q9o67O08J69M16p29j88L05J043k63r52K5M71N8l85
$$ -343 226 555 -194 -226 63 -76 13 -654 -46 123 539 -190 -378 -73 970 707 -245 -220 251 309 -76
1381g6l08L02N93l23m89P1L58N19j149K22J05L64K9p27L21K66M72p97O7j93Q80
$$ -76 -384 -82 511 188 -301 -230 128 647 -502 -280 -175 189 218 -509 -188 78 550 -247 -180 -373 507
1402E07np83r4M99n1j82j12J70L20j21k72l56P40J74k61o13M03O74p79J95m65
$$ 507 502 -281 -375 124 73 -109 -221 -51 269 148 -124 -480 260 434 173 -440 -37 637 -142 53 -412
1423d12O36O48p52n05L29K59k80l24L28O03o7l64o75P48J03J4q14L2L58M21k91
$$ -412 224 872 120 -385 -56 203 -77 -401 -73 530 463 99 -576 172 275 289 -525 -493 -135 286 -5
1444el57R8P73l83j20j57K20K53l72k68L2O96q7n78l23N86L68l98j66k94Q87k5
$$ -5 -362 -264 509 126 6 -151 69 322 -50 -318 -286 410 323 -255 -578 8 376 -22 -188 -482 405 380
1466C80o68MJ70M08k27m60K93L43j83k63q7M26J00m61k90K15N76l14j26j18M07
$$ 380 -288 -284 -114 294 67 -393 -100 243 60 -203 -290 136 236 -225 -515 -300 276 -38 -164 -282 125
1487A25J40l76O4j9M42j81p3l01J96N03n59n1j5N61j23o23J3K94K53M0m74o7M02
$$ 125 265 -111 -47 -66 376 195 122 -179 17 520 -39 -90 -105 456 333 -290 -277 17 270 310 -164 -231 171
1510A71j30l46J13L58J27m92R5KK66p5n97n2Q82P1o98k35M63M76j41m14j87J60
$$ 171 41 -305 -192 166 293 -199 -104 -102 164 89 -508 -560 322 393 -305 -540 -77 399 258 -156 -343 -183
1532a83M08j92l88J52M13j67m05j29M79O63r38l9K1K82M88n30l49L81N04l55j58
$$ -183 225 33 -355 -203 210 43 -362 -491 -12 651 -287 -326 -305 -23 465 -65 -414 -33 471 116 -42
1553d2K31K3M1m54k40M47M16l12l59J27O66j93m41k92J57Q49o31l83r3L09L93
$$ -42 189 212 253 -201 -441 6 422 110 -249 -122 544 351 -90 -382 -225 624 -7 -390 -483 -174 219
1574B19q6n95M60K18k35l62J21L60j22q7n49O94K25m28l4r3O82q6l31k86N55m8
$$ 219 133 -462 -2 216 -19 -381 -260 100 -22 -109 -658 36 261 -167 -201 -294 388 302 -29 -315 240 192
1596A92J0m81R6M12J92n51k90M48K84k19m54P6M53R6k46N3Q5M48k84m08q1K31
$$ 192 202 -279 -183 229 421 -130 -420 28 312 93 -361 -285 168 264 18 71 156 604 320 -88 -169 62
1618F2K68m08k31J53N58Kp07M6L03K6K8l10J09N09j80l08j74M61K86n84k25N89
$$ 62 330 -78 -309 -156 402 404 -303 -257 46 72 100 -210 -101 408 228 -80 -254 207 493 -91 -316 273
1640B73n4R9l31q2O11l48k67J00j48K40J25m95L72L54j08j7o58K3N64r1k45r0
$$ 273 219 318 -13 -95 516 168 -99 1 -147 93 218 -277 95 449 341 324 -334 -311 253 162 -83 -173
1662a73K48K29k98k73L40M54n41k05k58O01o2Q3l05j71K68L06o85J66q3L08j66
$$ -173 75 304 6 -267 73 527 -14 -219 -477 124 62 145 -160 -331 -63 243 -442 -276 -359 -51 -217
1683b17K35K8P1K32m72l00P82J90o25Lk03N21j23m13p4L42K01k51j09K06nL9m20
$$ -217 18 46 117 349 -123 -423 359 549 -76 -73 -276 245 122 -291 -365 -23 178 -73 -182 24 19 58 -362
1706c62J2N93K53l79l64L62R7j12j45r8M02J19o43N7L88k7K06m78j33K81j3N4
$$ -362 -350 243 496 117 -247 115 212 100 -45 -143 259 378 -265 -208 180 153 359 -119 -252 29 16 70
1728G0l94L77K32j76o1k05K65J71J42o46j55O07K69p33j26L88J52j90m66P4M20
$$ 70 -324 53 285 109 48 -157 108 279 421 -225 -380 227 496 -237 -363 25 177 -13 -479 -405 15
1749A5J35l08K65J53l3L1k70l31L51J81o23j32M20J1M36n17O1L63L33n68L1K78
$$ 15 150 -158 107 260 227 258 -12 -343 8 189 -434 -566 -146 -135 301 -216 -155 208 541 -27 4 282
1771B82K49k19o95m7N13p3J05m39P5Q76m85l30l08N82N5l16K76j51m0J51k34K13
$$ 282 531 312 -383 -430 83 10 115 -324 -249 627 142 -188 -496 86 141 -175 101 -50 -90 61 -173 40
1793D0M40j42p87L15M03L8j82l82O87r6M6n10r5J69M48k91l02L14J36k41k03K42
$$ 40 480 338 -449 -134 269 307 125 -257 430 334 380 -130 -225 -56 392 101 -201 113 249 8 -195 47
1815D7j10L42J83q03j10P87M7k29k74j0L22J01k17m67L13J47r7j90J03N2jl08
$$ 47 -63 279 462 -341 -451 336 383 154 -120 -130 192 293 76 -391 -78 69 -28 -218 -115 -63 -64 -372
1837c72J64J76j07r4Q5lJ21M01l35k60K95P5l01n8L37j29j39J30l09L52J76J28
$$ -372 -208 -32 -139 -233 -148 -151 -30 371 36 -224 71 146 -155 -213 124 -5 -144 -14 -323 29 205 333
1859C33r59M61O58r40J45J13K30J06l88K56j59M13L1k83m50O34o7n28K9M41MJ22
$$ 333 -626 -165 493 -447 -302 -189 41 147 -241 15 -144 269 300 17 -433 201 134 -394 -365 76 80 202
1881B02K1l88L26J77j95p15N07K31l65k07K41J82j74J92k65J6M54K9n90K45r2
$$ 202 223 -165 161 338 143 -572 -65 166 -199 -406 -165 17 -157 35 -230 -214 240 269 -321 -76 -168
1902a68O47p51l8L95j45L07k88l04o4J004p32k83L82M12m28n3q6K85L4K14k71
$$ -168 479 -272 -310 85 -60 247 -41 -345 -409 595 -137 -420 -38 374 -54 -107 -193 92 126 340 69
1923F9r6K43J18n35K4N40j88k43l55L33N8L44k17l86J05K57p5m45N8P27l35l37
$$ 69 -27 216 334 -201 -177 363 175 -68 -423 -90 -32 312 95 -291 -186 71 -4 -449 -391 336 1 -336
1945c36L33K7L0K98m19n12R46m02r1k40P07n17l0K36k90o2O58K28p80k25P43n29
$$ -336 -3 24 54 352 -67 -579 367 -35 -126 -366 341 -176 -206 30 -260 -322 336 564 -216 -441 302 -227
1967b27j09K31L97L7n62M83l50Q5L72l15k84L96L88q01m82R49j00m24L50m9k07
$$ -227 -336 -105 292 329 -233 250 -100 -15 357 42 -242 154 542 -259 -741 208 108 -316 34 -15 -222
1988b22K47K19n25mO59o90k26M66K64k45j8J21N2j25K66k61k22M61j4m73j08N56
$$ -222 25 244 -281 -285 374 -316 -542 -76 188 -57 -75 46 98 -27 239 -22 -244 217 203 -270 -378 178
2010A78j18k56K15Q2n16R80Q5j038j20R12n93k91P91j61m87K09m2J03L4M11m75
$$ 178 60 -196 19 101 -415 565 650 -388 -508 404 -189 -480 311 150 -337 -128 -170 -67 -33 378 -97
2031i7k61L19L81n55l1M51l48J57m9L6m06O36j53m13j0O09j2n06N94k90k08K42
$$ -97 -358 -39 342 -213 -244 207 -141 16 -33 3 -403 233 80 -333 -343 266 254 -252 342 52 -156 86
2053H6r1o26N60M01q35J90M55j61P6k40O56n62J02J58j61j82N06k64p08K98R21
$$ 86 -5 -631 -71 330 -505 -315 140 -21 55 -185 471 -91 11 169 8 -174 332 68 -640 -342 579
2074E79l26o91O99l18p1M12j26o39N14L13m43m01J139l86n69K42L05o4l15M11
$$ 579 253 -438 261 -57 -128 284 158 -481 33 346 -97 -498 641 255 -314 -72 233 169 -146 265
2094B65j87l38O11k57m06L9N65l83j91M33J57l50K34M1n85M67J79l07m65R53r7
$$ 265 78 -260 351 94 -312 -273 292 -91 -282 151 308 -42 192 233 -352 115 294 -13 -478 475 378
2115C78n78J63J04m53N73R4o55N3M62O3n74O34j86O0l76N29k47l15M70k94m23
$$ 378 -200 -37 67 -386 187 281 -374 -321 141 204 -370 264 78 138 -238 291 44 -271 199 -95 -518
2136e18N75M53q71M6O56j46n05K63r7k08K26L04m24Q2O60p47j72L42O40n39K1
$$ -518 57 510 -361 -315 341 195 -310 -47 -144 -352 -126 178 -246 -164 496 -251 -423 -81 559 20 41
2157D1O31o72n04O64j8q47P56J08o3n25P23l49j27J14l0K80k86M54m30j69O60
$$ 41 672 0 -504 160 142 -705 51 159 96 -429 294 -55 -182 -68 -98 182 -104 350 -80 -249 411
2178D11k35p11P11j89n1j00L96m01K8L35l52l71O49O4o82N06M80l92m06L44n2
$$ 411 176 -535 176 -13 -64 -164 232 -169 -141 194 -158 -529 120 184 -498 8 488 96 -310 34 -18
2199a8k82L22K48n64K94K97k89l90M32K6m83M77K5n8r5N23n97l26O87L48p33L6
$$ -18 -300 22 270 -294 0 297 8 -382 50 76 -407 70 95 37 -58 465 -132 -458 229 577 -156 -120
2221a20M87m62P7M3O0k46J93K87o12Q1O69l30p48P40J29l36p6M06k66j43L22k04
$$ -120 367 -95 -18 25 85 -161 32 319 -293 -212 457 127 -621 119 248 -88 -164 242 -24 -167 155 -49
2243d9k50L32K04m44K9M31m49n2M95k21j69M46j78m04J01P85p65k79M53J46l96
$$ -49 -299 33 237 -207 -178 253 -196 -248 247 26 -143 303 125 -279 -178 607 -158 -437 16 162 -234
2264b34K63n3l82J65O29o15j88P31On15L15m5k84k42N49k50j55N93J53q94K04
$$ -234 29 -24 -406 -241 388 -227 -415 316 322 -193 122 77 -207 -449 100 -150 -305 288 441 -453 -249
2285b49R24p19j64K39J72k90J73j6k43K2M30l38l1K49k59j2L64l55j77L77K08
$$ -249 675 -44 -208 31 203 -87 86 70 -173 -151 279 -59 -90 159 -100 -112 252 -103 -280 97 305
2306C05p17K6R94k65r15N35L48n3n95L71J41l59K25R0n12M62J07n40K12J48L65
$$ 305 -412 -386 608 343 -572 -37 311 258 -337 34 175 -184 41 131 -381 81 188 -352 -140 8 373
2327C73n42r0K24L6K54j57l56j13N98j14k17O2J82m26R2K78Ok87M49l34l04N69
$$ 373 -169 -259 -35 1 255 98 -258 -371 227 113 -104 -42 140 -286 -194 84 90 -197 252 -82 -386 183
2349A83j24l54K61O7K12k59L78m71k40O44J75o95m42O46K09m55K74N21n34Nr2
$$ 183 59 -295 -34 33 245 -14 364 -107 -347 297 472 -223 -665 -19 190 -265 9 530 -4 1 -91
2370i1j16o5L74J98n10K21J42m65K07M43l01l74L82k36K98k52J47m78L77L94l00
$$ -91 -207 -272 102 300 -210 11 153 -312 -105 338 37 -337 45 -191 107 -145 2 -476 -99 295 -5
2391ek01J90L67l91R8J97m61QK54J63o40Q20j36o15mN58l16o3K33j61k42N09J8
$$ -5 -206 -16 351 -40 58 255 -206 -198 56 219 -421 399 263 -352 -356 202 -114 -177 56 -105 -347 162 180
2414A80m97J71N37M1p23M64k61r8J45M1k78J91P12o57l69M45L59n72p0L74j23
$$ 180 -317 -146 391 432 -291 173 -88 -186 -41 0 -278 -87 625 -32 -401 44 403 -169 -239 135 12
2435A2k92L77j02n67Q23ol69P5J76l25L98m12O25n19N5J0l88L65K05j75K8n3R2
$$ 12 -280 97 -5 -572 251 245 -124 -49 127 -198 200 -212 413 -106 -51 -41 -429 -64 141 -34 -6 -59 33
2458C3l93M05K91m22j53L92K6n85N69k37k02L1N74p8p07N98p9k54K78j48k78L53
$$ 33 -360 45 336 -86 -239 153 179 -406 163 -74 -276 -245 329 251 -456 142 63 -191 87 -61 -339 14
2480A4L41n85Qk9L92l73J93R8Q0k23O8j10N7P0q6j82K50O23n01m11P21l61o8Q8
$$ 14 355 -230 -222 -251 141 -232 -39 59 139 -84 -16 -126 -69 1 -85 -267 -17 606 105 -306 415 54 -14 74
2504G4k0k83K14L75j69p8P3j84k84K96j39k00M49L95p00J60N00m31l21J96J71
$$ 74 54 -229 -15 360 191 113 186 2 -282 14 -125 -325 124 519 -181 -21 479 48 -273 -77 94
2525I4l8j14K19M2l51j30L11k89K86K91n04L8L84l4k80j97L65l09K88j93k44N3
$$ 94 56 -58 161 203 -148 -278 33 -256 30 321 -183 -145 239 205 -75 -272 93 -216 72 -121 -365 -312
2547c12L61r9l69M84J13l64L32J83m66K04j18L8K9K02K50k94m93K61J03K14j80
$$ -312 49 -50 -419 65 178 -186 146 329 -137 67 -51 -13 16 218 468 174 -319 -58 45 259 79
2568G9m29R0L18M08l38j83K95k61n13K04N69j60m0j93O2M0k08N39n81N2O75p07
$$ 79 -350 -260 58 466 128 -55 240 -21 -534 -330 239 79 39 -154 -92 -52 -260 279 -302 -250 425 -282
2590b82J30J31j20m6J84K69j79J37j89j31q1K88r8o18O83p6r7R1L23l91m3L39
$$ -282 -152 -21 -141 -187 -3 266 87 224 35 -96 -177 111 13 -605 78 2 -95 -4 319 -72 -115 224
2612B24q8o61O97R7l75J48jK17l79M12m07J2J32Q4k58l09M56N1K6k03J13L61m02
$$ 224 136 -525 172 269 -106 42 41 258 -121 291 -116 -104 28 112 -146 -455 1 52 78 -125 -12 349 -53
2635e3m2n9QM78k57k75P28n00j34j83N9K68J28l16N3jK20j12q1O5l8lk80L98j14
$$ -53 -95 -154 -146 332 75 -200 528 28 -106 -289 -230 38 166 -150 -97 -98 122 10 -71 -6 -44 -47 -327 71 -43
2660d3k96L68j29n1M3L98l37k31J31J25J15j15l7K37j90J57l84L4K92k57M2j4
$$ -43 -339 29 -100 -151 -108 290 -47 -278 -147 -22 93 -22 -59 178 -12 145 -239 -205 87 -170 -128 -142
2682a42J41J6J1p3j21k7L07m3Q7j40j67L56m45K34o4j22L44k4o3J00o5j11p2J14
$$ -142 -1 15 26 -47 -168 -195 112 69 156 16 -151 205 -240 -6 -70 -192 152 128 65 165 100 -11 -83 31
2706C1j9k45L76j57O6l4k12K25j32J53j45l29J90N41m42P8J91jN4k61oJ09j0j37
$$ 31 12 -233 143 -14 52 18 -194 31 -101 52 -93 -422 -232 309 -133 -55 136 135 189 -72 -78 31 21 -116
2730a16K63m44O28j66k98L23j90o5L8k23M50l36L13r2k49P2Pj77J37p7Pp0K63
$$ -116 147 -297 331 165 -133 190 0 -65 -27 -250 200 -136 177 85 -164 -92 -85 -262 -125 -202 -195 -265 -2
2753bJ24p8p1J58j72q3J41J22j61M0O9m1r7j52L59l67K10R8q3j77K90R3k77J49
$$ -2 122 44 -27 131 -41 -124 17 139 -22 18 87 46 -51 -203 156 -211 -1 97 14 -163 127 220 -57 92
2777I2P3j22j44K37j61j03N29n70L26k40kQ8l2J30L4n9q0j81l8K18k4JK28k83
$$ 92 165 43 -101 136 -25 -128 401 -169 157 -83 -85 3 -29 101 135 76 -4 -185 -223 -5 -29 -28 200 -83
2801h3N66m14p2m8J00p9j6Q2L3o1l25J84N39m60J3J27k35J41K55p6J5m51J88J46
$$ -83 483 69 -3 -51 49 -30 -46 36 69 8 -317 -133 406 -54 -41 86 -149 -8 247 171 186 -265 -77 69
2825F9q4l4M5j7j33J05j35J72k52J57k22N62p1j36j87O3K36l12J20J6K40j82j04
$$ 69 -15 -49 -4 -21 -154 -49 -184 -12 -264 -107 -329 233 162 26 -161 -98 138 -174 -54 -38 202 20 -84
2848h4J31K66j74P6j98r8m5K41j12k7M30k49k19j27M00l75J74L77n23K7K98l22
$$ -84 47 313 139 215 17 -81 -126 115 3 -24 406 157 -62 -189 211 -164 10 387 -136 -109 189 -133
2870a33K18k46K97l37J28pJ03L8l02J11N9nK3L7K73j11P2k37L37k51k08K89k29
$$ -133 85 -161 136 -201 -73 -80 23 61 -241 -130 -71 -76 -53 -16 257 146 218 -19 318 67 -141 148 -81
2893h1j06J05J09m6Jo2k59M88l3l07K23J60oj13K0l78M63m79J63L8Q9J69k55J81
$$ -81 -187 -82 27 -19 -18 -80 -339 149 116 -191 32 192 186 73 93 -285 178 -301 -138 -100 -11 158 -97 84
2917H4j42J54n15K47L0J27q3L7K11K1r3R1j61j50K13O0l85J41K36j96J51J33j82
$$ 84 -58 96 -419 -172 -142 -15 -98 -61 150 171 78 169 8 -142 71 131 -254 -113 123 -73 78 211 29
2940B9J7j10L62l60L60q2m14N2j54K56r0k08M75l2R4o2k20O6r0J90n04K20L95
$$ 29 46 -64 298 -62 298 216 -198 -146 -300 -44 -134 -342 133 101 195 133 -87 -21 -111 79 -425 -205 190
2963A90j54p4p3O3J20k91j41L26J3p3N35k13r0j69J88m01L15Rn09J40J01L63p3
$$ 190 36 -38 -111 -48 72 -219 -360 -34 -21 -94 441 228 138 -31 157 -244 71 80 -429 -289 -188 175 102
2986A02q0k28L64k46J96j82M62k22l69N00m52K19k84L89m4m6Q9k14K07J6l51M73
$$ 102 22 -206 158 -88 108 -74 388 166 -203 297 -155 64 -220 169 125 79 168 -46 161 177 -174 299
3008B99k63k15K75n7j78J76K07k33j58m4M06K2J33k14l95K88l71L72J58m07M12
$$ 299 36 -179 96 39 -139 37 244 11 -147 -191 215 237 370 156 -239 49 -322 50 208 -199 213
3029B13j02j33j08L33o9l22N24n04J3K35n4j50L29k63J70k41J81k27p1M42L0j85
$$ 213 111 -22 -130 203 134 -188 336 -168 -155 80 26 -124 205 -58 112 -129 52 -175 -246 196 226 41
3051D1M5K35k08J2J63l10O4k5j62J33q6N7J44j11J76l4k26K29P6l32K82k1l18
$$ 41 86 321 113 125 288 -22 42 17 -145 -12 -98 -41 103 -8 168 134 -92 137 213 -119 163 142 -176
3074a76K29J45j67j84J28p3K80k51K08j03K14j79k95J82K49L45o32l81K73l1K02
$$ -176 53 198 31 -153 -25 -98 182 -69 139 36 250 71 -224 -42 207 552 -80 -461 -188 -219 -17
3095a7J7P3j73K26j37k3N7P8k9N8j00j35K32j08O5j76M69l88k62L76p6J11N3m63
$$ -17 0 73 -100 126 -11 -34 23 101 72 130 30 -105 127 19 84 -92 377 -11 -273 103 27 138 191 -272
3119b72J35P8N1J30j35P8Qj14J4J3K95k94L0O8J3m19J24k03L12J78k4J03j18o0
$$ -272 -137 -59 -8 122 -13 65 73 -41 -27 -14 281 -13 17 85 98 -321 -197 -400 -88 90 66 169 51 -9
3143iL32rk44o2J68j7l9k56L53l59Q6J20J85k43M0k03o1L95n05J93K19j58J63
$$ -9 323 314 70 8 176 159 120 -136 217 -142 -56 64 249 6 46 -157 -218 177 -328 -135 84 -74 89
3166H9j95nK86J6l29J88j30J11k24J88Q8j7k9k02K37q8m84K49N48l04j11J45p7
$$ 89 -106 -111 175 191 -138 50 -80 31 -193 -5 83 66 37 -165 72 -16 -500 -251 297 -7 -118 27 -50
3189e0j12q9M01nk92L01j82J04j06j00K76l60K04k17K6J77j14P9j01j04N04k54
$$ -50 -162 -251 150 145 -147 154 -28 76 -30 -130 146 -214 -10 -227 -201 -24 -138 -59 -160 -264 240 -14
3211a4j0J10l5k93j0L48l53L28K34j36l84K67J86l53K18j60J5J48K82m16J00M0
$$ -14 -24 86 51 -242 -252 96 -257 71 305 169 -215 52 238 -115 103 -57 -42 106 388 -28 72 112
3233A12N1q3k55r3N19j95j78K36j65M29k93pJ82l61K54k42l8k1J9J18q6K36l31
$$ 112 163 80 -175 -268 251 56 -122 114 -51 378 85 78 260 -101 153 -89 -127 -148 -129 -11 -97 139 -192
3256a92J33K24k82K35k45L17j64q2R7k7J32o0k39K15J76l65J35M3j37K74m93N85
$$ -192 -59 165 -117 118 -127 190 26 -56 41 14 146 86 -153 62 238 -127 8 51 -86 188 -305 280
3278B80l04j17P0m3K19J1k32j10P6J10p8J31j11M00l68k28L64K06j18k84J99k37
$$ 280 -24 -141 -71 -114 105 116 -116 -226 -150 -40 -118 13 -98 302 -66 -294 70 276 158 -126 73 -164
3300a64K86J7J20l19r7j12K86R8j27j36q3J92P1P8j01k8P7j53J15jL3k26r9M36
$$ -164 122 139 259 -60 -157 -269 17 115 -12 -148 -231 -39 32 110 9 -19 58 -95 20 19 52 -174 -273 163
3324A63r1j59J34m3J80K1l33j52L34K4O7k96J0L9M30n29L01p6O4j98j3L7J24J0
$$ 163 72 -87 47 4 184 205 -128 -280 54 78 145 -151 -141 -102 328 -201 100 24 88 -110 -123 -86 38 48
3348D8l17J12L01q9j26q5l3J09K37n0k83J46p8K82k07p2K19r2J86l72M07m40L34
$$ 48 -269 -157 144 55 -71 -156 -189 -80 157 107 -176 -30 -108 174 -33 -105 114 22 208 -164 243 -197 137
3371A37j24k07M05k03p3R7k50K27q0M04l81P6K1j11J11j96J9J07j25K73j51J26
$$ 137 13 -194 211 8 -65 32 -218 9 -71 333 -48 28 49 -62 49 -147 -128 -21 -146 127 -24 102
3393A02p0p5j82P4J78j01J96j93N7k16K89k21J28K5j00Q2M76m72J7m9O2k1j79
$$ 102 32 -43 -225 -151 27 -74 122 -71 -14 -230 59 -162 -34 -9 -109 -27 449 -23 -6 -55 7 -14 -193
3416a93M11j38j4j19J25j61N33k91jK5k44N9N9L97m37Q9k47K89q4l30K68J00k00
$$ -193 218 80 66 -53 72 -89 444 153 152 177 -67 -8 51 448 11 100 -147 142 58 -272 -4 96 -104
3439a04M19j82l6n0j9L07k94J23j85J71r6k15J84J95l0j20P6k01N2j24J05Q7j03
$$ -104 315 133 97 47 28 335 41 164 -21 150 54 -161 23 218 188 68 144 -57 -5 -129 -24 63 -40
3462d0K48r1p2k64L26M0k30J39j54j9j50N00l08J27Q3N0j03P5l06J26J6J81Rl25
$$ -40 208 117 45 -219 107 147 -83 56 -98 -117 -267 233 -75 52 135 185 82 157 -149 -23 -7 174 183 -142
3486a42L48l58K91l31J49k96L73j73l4K55j83J4J51j9K0m55L95Q7j79K84k19J5
$$ -142 206 -152 139 -192 -43 -339 34 -139 -173 82 -101 -87 64 45 65 -390 5 92 -87 197 -22 -7
3508gP9j76j26J3O80n57Qn1K73k82j35N02k25J29m1j38J09l30L30p7l3K77j50
$$ -7 72 -104 -230 -217 463 -94 -86 -137 136 -146 -281 221 -4 125 84 -54 55 -275 55 -22 -55 222 72
3531G2j34L4K45l18l1j2J88P3k1m3l5P0OJ23k80Q3J17j38jJ87j25k25J47p3M8
$$ 72 -62 -28 217 -101 -132 -144 44 117 96 53 18 88 94 217 -63 20 137 -1 -2 185 60 -165 -18 -91 -43
3556d3N9Q2j36j13M76l38J55j44r0J51p8j00K40j92J42j56J30l60J71J5L08M4
$$ -43 16 98 -38 -151 325 -13 142 -2 -92 59 -19 -119 121 -71 71 -85 45 -315 -144 -129 179 223
3578B23j48j03j00Q6Oj31L44j35j6l3j52K15k87J35N3J37n5k61l6K11J09j12K74
$$ 223 75 -28 -128 -42 -36 -167 177 42 26 -7 -159 56 -231 -96 -43 94 39 -222 -258 -47 62 -50 224
3601B24j37k2j54j51R0K7J07m2J24k32N3P1L47j80l3l7j17K19j39k19K91k76M44
$$ 224 87 65 -89 -240 -150 -123 -16 -58 66 -166 -113 -42 305 125 92 55 -62 157 18 -201 90 -186 258
3624B58r2J48l74o7K86j24k04L40k50K6rJ27j45k13O2N8J14L86j88J4l82K56k39
$$ 258 166 314 -60 -127 159 35 -169 171 -79 -53 -62 65 -80 -293 -231 -173 -59 327 139 153 -229 27 -212
3647b12J40Q8n6P3L35m65K35J83k22K48l44j73K25j6J9j88J75K52m56M23j26J7
$$ -212 -72 16 -40 33 368 -97 138 321 99 347 3 -170 55 39 58 -130 45 297 -159 264 138 155
3669A55k18N2j34j01L22O9j30q8K05R2k73M47k67j67J5j10J7K89j89J82k48K35
$$ 155 -63 -11 -145 -246 76 145 15 -73 132 224 -49 398 131 -36 -21 -131 -114 175 -14 168 -80 155
3691A55l63Q7M7J29p2J23j15O0N4l18N39j15p4j84P0J07k68J99k0o1P6J74o56
$$ 155 -208 -121 -74 55 -17 106 -9 51 105 -213 326 211 137 -47 23 130 -138 61 41 -20 56 230 -426
3714d26L89rJ34j47J0J59k79L92j08j38j1K15kl51n1K50LR5r4k97K45K68j25l3
$$ -426 -37 -46 88 -59 -49 110 -169 223 115 -23 -34 181 179 -172 -223 27 30 125 31 -266 -21 247 122 89
3738H9L5k04Q6Lr6J09k4M5k21J70L9J54j14k23J21M7o3J63rJ00J24m77N3j07J82
$$ 89 124 -80 6 9 -87 22 -2 43 -178 -8 31 185 71 -152 -31 16 -47 116 107 207 331 -146 -93 -200 -18
3763a8K47j80J15j03l17L80j16L7J79j48k12l3k59L74P0l2k42J19K85j94J24m6
$$ -18 229 49 164 61 -256 124 8 45 224 76 -136 -169 -428 -54 16 -16 -258 -139 146 -48 76 30
3785C0O5o9r4K81p10M48m0J81k40P3O1j13PJ88n7R4JP2l15K52J03J23j39k35O6
$$ 30 95 26 -68 213 -497 -49 -89 92 -148 -75 -14 -127 -120 68 11 105 106 178 -137 115 218 341 202 -33 33
3810C3j45O5K79j41J70k29m0mM20n46kN5l4J30k31K14J66k51J6K00j33J98l31
$$ 33 -112 -47 232 91 261 32 -8 -12 408 -138 -140 -85 -119 11 -220 -6 160 -91 -75 125 -8 190 -141
3833a41J25j01j55k2r3L66pm0K00KK2l21L44l3J95m45R1o3J25rR3L1l82J43M0
$$ -141 -16 -117 -272 -294 -387 -21 -28 -68 132 134 156 -165 179 146 341 -104 -13 -76 49 40 133 164 -218 -75 -35
3858c5J67K9l44K53L06k09K47n66PK04j13m5J0J62j01J06j00J8J40j33j51O1j78
$$ -35 132 161 -183 70 376 167 414 -152 -145 59 -54 -99 -89 73 -28 78 -22 -4 136 3 -148 -87 -265
3881b65K40J36k82L29k86p8K44J6k05J24j9Q8pk4k09K96k2p8R0m08k4N13k72L26
$$ -265 -25 111 -171 158 -128 -206 38 54 -151 -27 -46 42 35 11 -198 98 76 -2 88 -320 -344 169 -103 223
3905B23o4j80J37j23j72j15M42o1o0l7n6qj03J88Q3N6j24j74J03jJ77n38O27j02
$$ 223 159 -21 116 -7 -179 -294 148 87 27 -10 -66 -74 -177 11 94 150 26 -148 -45 -46 131 -407 220 118
3929A18K9J34j85k04J22K5J67p9j04j5j92K01J10J94l58J40l5J21k63m6J42L2
$$ 118 147 281 96 -108 14 39 206 127 23 8 -184 17 127 321 -37 103 68 189 -74 -120 22 54
3951E4j20njj74J05K61j52n0J97j80J63j80M1J36j61L4o1p7J86m9K68k05M2M9
$$ 54 -66 -71 -72 -246 -141 120 -32 -82 115 -65 98 -82 -41 95 -66 -32 -93 -170 16 -33 235 30 72 121
3975A21m0k86J00j6j60L08O6q6k73K59K69m91L00j60L16o4k36K41j89N3M2k64
$$ 121 81 -205 -105 -121 -281 27 93 7 -266 -7 262 -229 71 -89 227 163 -73 168 -21 32 74 -190
3997a90L77o3j0r1p0R4o5J9O9k09j7K76l8j55N8j39J10j63K93J95j47K8n54J79
$$ -190 187 124 114 23 -47 47 -18 1 70 -139 -156 120 82 -73 -15 -154 -44 -207 86 281 134 162 -392 -213
4021b13J65k3J12R0m22M59k5k11LJ03K54k16k18K30k64L82j70K8j29L57l48l3
$$ -213 -48 -71 41 131 -291 168 143 -68 -65 38 292 76 -142 88 -176 206 36 64 -65 292 -56 -89
4043h9N9Q2p7J86j67j87J64L46n25M67j19j49L81o32O8K23l79M59p0mj86n4L9
$$ -89 -30 52 -25 161 -6 -193 -29 317 -208 259 140 -9 372 -260 -192 31 -348 111 41 37 -149 -203 -164
4066a64k12O18j96J84m04L99n05L59k01Q6j3J41l55L33j01j05Q0R2j59j60M67
$$ -164 -376 242 46 230 -174 225 -280 79 -122 -36 -49 92 -263 70 -31 -136 -56 36 -123 -283 184
4087A84k33J45r2M3j46mp2K28n6K05L3m04K31K26m79R6QJ6N4nj30J91p9J4k87
$$ 184 -49 96 4 47 -99 -103 -175 53 -3 202 235 -169 62 288 -191 -95 -87 -71 -17 -22 -152 39 -40 -26 -313
4112c13L10K79K81k38m18j7k64M78l16L98ml37L07k32K87J23m90L39j18RKk57
$$ -313 -3 276 557 319 -99 -116 -380 98 -218 180 176 -161 146 -86 201 324 -166 173 55 64 66 -191
4134a91N12l85k5K04J50j02l74N2L65l78L15k77M02k79R8M4l11O3J22J03l79K11
$$ -191 321 -64 -89 115 265 163 -211 -159 206 -172 143 -134 268 -11 87 131 -180 -117 5 108 -271 -60
4156f0J10j98K42K3p2Q3j22j81L74l49J99j53Q9J66j36J10k34K39l43J37R4l30
$$ -60 50 -148 94 117 45 128 6 -175 199 -150 49 -104 -15 151 15 125 -109 130 -213 -76 18 -312
4178c12L44j46j60L13k73P4j00J26j27O53l98p3J55J1J51k11J75m92q4N5K68o3
$$ -312 32 -114 -274 39 -234 -160 -260 -134 -261 392 -6 -79 76 87 238 27 202 -290 -374 -319 -51 -114
4200a14K04j82P0j35L32j44k65K23n8L54k82J23k29J13K5j51P3ln1N3J08j81K92
$$ -114 90 -92 -22 -157 175 31 -234 -11 -69 285 3 126 -103 10 35 -116 -43 -46 -97 -44 64 -117 175
4223A75k67J06M8j61J0OL9Q6o5M6P0l40L59J49m09L84j72m3q8J37j40J32r3j3
$$ 175 -92 14 62 -99 -89 -83 -44 42 -23 23 93 -247 112 261 -148 236 64 21 -67 70 -70 62 -31 -44
4247d4k20J00L65j23L4k01J68j64N4M28l91j84Q0K69k20J31N3k42L45k16k57O4
$$ -44 -264 -164 201 78 112 -89 79 -85 -31 397 6 -178 -98 171 -49 82 135 -107 238 22 -235 -171
4269a71J51m4l7K3K2j55R1J69K48k78r3J78J45j79L28k76n1%J88m24J27k67K69
$$ -171 -20 -64 -101 -78 -56 -211 -120 49 297 19 -74 104 249 70 398 122 71 71 259 -165 -38 -305 -36
4292c6l8L04j08k08N0L19k50R1j06k02j7L83j80p0r5kk6J20O2P6PJ03k23j06K44
$$ -36 -74 230 122 -86 -36 283 33 124 18 -184 -201 182 2 -68 -163 -165 -191 -71 -9 67 74 177 -46 -152 92
4317I2j77j26L91k38q4K5K20q1j69J85J74r3J3l6r5k62N17k14l1J29j0j41qj10
$$ 92 -85 -211 180 -58 -142 -117 103 22 -147 38 212 119 132 96 1 -261 256 42 11 140 130 -11 -19 -129
4341a29O0K40j56k02R7J75m35M70j82l26K60O2J63j82J48k46R7P2j2K3k80J67
$$ -129 -69 171 15 -187 -90 85 -350 120 -62 -388 -128 -66 97 -85 63 -183 -86 -14 -26 -3 -283 -116
4363a16J05j79K32K38q11M30%l2J6J13j7J02k97J65j68L17n6J7N4k88K56M6k40
$$ -116 -11 -190 42 280 -531 -101 -101 -133 -117 -4 -21 81 -216 -51 -219 98 42 59 113 -175 81 127 -113
4386a13J04J56j12kR3q2J61o0K29o56K50K69l75J71j63M50o27M72J11J6r6K8k21
$$ -113 -9 147 35 33 126 44 205 145 374 -282 -32 237 -138 33 -130 320 -307 165 276 292 196 224 3
4409Cr0L35k03j15K00J56m70O6J39j12P3l4N6Q8ONj77L71j77j89m9L01q5l69J33
$$ 3 -87 248 45 -70 130 286 -184 -118 21 -91 -18 -52 4 92 98 103 -74 297 120 -69 -118 183 98 -271 -138
4434a38J85j44K40j69K64k09K52j65k17K11R5r5k99O32n92J03j32L66j60j65O0
$$ -138 47 -97 143 -26 238 29 281 116 -101 110 205 110 -189 443 -149 -46 -178 188 28 -137 -77
4455g7l9j0O1L97l94j35L9Q0p9J92n5K17n15M1Q8J08r2K69l5j5Pk27M08J1n68
$$ -77 -116 -126 -65 332 -62 -197 -158 -78 -157 35 -20 197 -318 -277 -189 -81 -173 96 61 46 53 -174 234 245 -323
4480c23L15O3j55J94j16j3K64r0r7q5L7Q9Q5j75J18q3K41Rl63J15k0j80J09k3
$$ -323 -8 55 -100 94 -22 -35 229 139 42 -43 -6 83 168 -7 111 28 269 278 -85 30 10 -170 -61 -84
4504h4K37j54l5k46K71M2m54L54O4j31JP0K49j87Q8p7l48L43O9j64k2L07n0k81
$$ -84 153 -1 -36 -282 -11 31 -423 -69 -5 -136 -135 -65 184 -3 85 8 -340 3 72 -92 -114 193 143 -138
4528a38K79k03j7o4L87j46m25L62J16k62K53j41k07L62k1p1l37L60R3L4q2m5j29
$$ -138 141 -62 -79 -143 244 98 -327 35 151 -111 142 1 -206 156 135 64 -273 87 180 214 132 87 -42
4551d2m1J76j82K68J74k38J51k13K08l06j78M48l84L3K08k6J73j10j35J29k02
$$ -42 -83 93 -89 179 353 115 266 53 261 -45 -223 225 -159 -126 82 56 229 119 -16 113 -89
4572h9L68j91ol3K5J1j14M49o53K14k99P8J26K20k7k72K64m1j09M2J88k77J38
$$ -89 279 88 82 49 74 85 -29 420 -233 -19 -318 -240 -114 106 79 -193 71 30 -79 -37 151 -126 12
4595A2L72n25j12j6K44k45J80J21l5P0o6j13o5J11L35j86kL3O2J13m27P4j59J04
$$ 12 384 -141 -253 -269 -25 -270 -90 31 -4 66 0 -113 -178 -67 268 82 80 113 175 288 -139 -65 -224 -120
4619a20L86n13k74N04L50m70p9J52R2J6n42M43P9L86o18L18Nj60m3J29J5P4j95
$$ -120 266 -247 -521 -17 333 -137 -216 -64 28 44 -498 -55 24 410 -208 110 115 -45 -88 41 56 130 -65
4642f5j57L14P3j18j24K47j92L28k40l79p6J13O9M71o4j42j69K13j89k29L05J21
$$ -65 -222 92 165 47 -77 170 -22 306 66 -313 -389 -276 -207 264 200 58 -111 102 -87 -316 -11 110
4664A10n8R0k07j10K78k97K67nN2o5o2n2P0J74l73J49L54l84J09q2N0j09P0J53
$$ 110 52 142 -65 -175 103 -194 73 68 120 55 -7 -59 11 185 -188 -39 315 -69 40 -42 8 -101 -31 122
4688A22k50q5N30k10j88J1L20l07j40M36k43L51l91Q2rj25J86n2N5k00J19m55
$$ 122 -128 -213 317 107 -81 -70 250 -57 -197 239 -4 347 -44 38 29 -96 90 38 93 -107 12 -443
4710d43M11J79k67J15l5n49Q17k99k30N28j9M8k27L80n44K44n3j0k6N4j06m9J13
$$ -443 -32 147 -120 -5 -40 -589 228 -71 -301 227 208 256 29 409 -135 109 56 46 20 74 -32 -81 32
4733C2J12l43O9N7J53r7K11ql46K05k60K57o7N7j43L37j83K9k43L74j98K01l13
$$ 32 144 -199 -130 -73 80 -17 194 186 -160 45 -215 42 -25 32 -111 226 43 72 -171 203 5 206 -107
4756a07j87L10n2K26O9j18m24L24j71r6K19J47J25nk29N4n4p2J03J54r3j36R5
$$ -107 -294 16 -36 190 259 141 -283 41 -130 -226 -7 140 265 260 31 85 31 -41 62 216 123 -13 82
4779H2j07n5k3j96M06L4k03K08l25O6R2J4J0j43L30j23mj91J44J93r5j21J81l5
$$ 82 -25 -80 -103 -299 107 141 -62 146 -179 -113 -21 -7 3 -140 190 67 63 -128 16 209 114 -7 174 139
4803A39J6r2j55Lk10M48k51r8K5J52J3O6j87K96l77J59J63m71J70l9K46j43j88
$$ 139 155 63 -92 -89 -299 149 -102 -200 -175 -23 -10 56 -131 165 -212 -53 110 -361 -191 -230 16 -127 -315
4826c15J28K75j14n2J94K8k57J56M1j3L1j21M45k06K66o09J23n7n3o5K84j00m91
$$ -315 -187 88 -26 -78 116 144 -113 43 84 71 102 -19 426 220 486 -123 0 -57 -110 -175 109 9 -482
4849d82L48Lr4L42j17l00P0k50L10J98J19L3J01J40o79J86j20K25P8l8J9n3pj4
$$ -482 -134 -131 -225 117 0 -300 -230 -480 -170 28 147 180 281 421 -258 -72 -192 33 111 73 92 39 32 18
4873A8P7J03j06lP8l85K26j4J02j11J75n0J11k79R8l0J83J9l66L0K17j5k81J34
$$ 18 95 198 92 89 167 -218 8 -6 96 -15 160 110 221 -58 40 10 193 212 -154 -124 93 78 -203 -69
4897f9j5K04k15L08k08J25Q4R6l09l1J30j32q0K30R4L1j74j70J43k35L87m58J95
$$ -69 -84 120 -95 213 5 130 214 310 1 -30 100 -32 -112 118 212 243 69 -101 42 -193 194 -264 -69
4920f9J28k86K47R4J10k67P3j82K45k19L22n23M93k11J10j56N2K34k46J42j39
$$ -69 59 -227 20 114 224 -43 30 -152 93 -126 196 -327 166 -45 65 -91 -39 195 -51 91 -48
4941d8j16K46r9P4q3L57k89Q7k7k68M2J21k4J60r2J5k13K7K71m0j67m1J26p2j29
$$ -48 -164 82 -17 57 -26 331 42 129 102 -166 -124 -3 -27 133 41 56 -157 -130 141 101 -66 -107 19 -53 -182
4966a82N5n5j00M47k33O4JQ8m0O9n1k73J86J30j57K44j44M7j1l48K76N1j5j19
$$ -182 -127 -182 -282 165 -68 -4 -3 85 45 114 63 -210 -24 106 -51 193 49 96 85 -263 13 64 49 -70
4990g0l56L40K07k0k34k4M13l28O9j81J80n7R0k3r5J86j9J0L7O8k42m7J37r4j40
$$ -70 -426 -86 121 101 -133 -157 256 -72 -3 -184 -4 -61 29 6 -89 97 78 88 125 193 -49 -96 41 -53 -193
5015a93R0L3K35n7j28j51K8J72O5Q0j73N6k71L32l64J87l07K75K18l22J8j51K16
$$ -193 -103 -70 165 108 -20 -171 -143 29 94 174 1 57 -214 118 -246 -59 -366 -91 127 -195 -177 -328 -112
5038a12L09n04L67n2P5J10J34j38J08l41J14J42l68J35L7j23L27j57q2j15L85
$$ -112 197 -307 60 8 83 193 327 189 297 -44 70 212 -156 -21 16 -107 220 63 -19 -134 251
5059B51m43M11k01n7j4J71J28l41K06m65O39R6l07p3l0P8K09l47K9k49L16m08
$$ 251 -192 219 18 -39 -53 118 246 -95 111 -354 285 381 74 1 -29 49 258 -89 -60 -309 7 -401
5081d01K40L66l56k8J52k70L15J30k56N6N4o6J28r2L04j75k09j27L65k38K58r4
$$ -401 -161 205 -151 -179 -27 -297 18 148 -108 -52 2 -64 64 -28 276 101 -108 -235 130 -108 150 56
5103E6Qp0J1n4r4L39k44J33q6M53o30L10k13J09J59r2J79j25j07Jl2j32k5L86
$$ 56 64 -6 5 -49 -143 196 -48 85 -1 452 -178 132 -81 28 187 95 274 149 42 43 11 -121 -146 240
5127B40j30j72R3L3M2K55m70l5J92r0N5L09L8m84K97l10K97j03j0l54L73o2K06
$$ 240 110 -62 31 64 106 361 -109 -144 48 -42 13 322 360 -124 173 -137 160 57 47 -307 66 4 210
5150B10j23l19O1K62J72k51n6N7J8j04r2K15j24J93j75L12l25J5K74j00L2P5k53
$$ 210 87 -232 -171 91 263 12 -44 13 31 -73 -165 50 -74 119 -56 256 -69 -54 220 120 152 227 -26
5173b6k56K64o2K13m3J8j31j15O1J82J21q0m47O62k18l28K30L2l66L46J08k61
$$ -26 -282 -18 -80 133 90 108 -23 -138 -77 105 226 146 -301 361 143 -185 45 77 -289 57 165 -96
5195i6M50l47N8n6K30q1j06j01J93j92M8M5J35j59j09PK05k35m3K66k93K44L59
$$ -96 354 7 65 9 239 158 52 -49 144 -48 0 45 180 21 -88 -81 124 -111 -154 112 -181 63 422
5218D22k1l82P0o2N4K33o11N96j10k23J30j32J92l84J92K93j64J09q7L03l95n1
$$ 422 401 19 89 27 81 314 -297 299 189 -34 96 -36 156 -228 -36 257 93 202 115 418 23 -28
5240b8j53J70R9m33L90K7j16J71n1J8Q6p7l00L23k6m1K5j01q1k36K92O6K91k20
$$ -28 -181 -11 88 -345 45 72 -44 127 76 94 180 103 -197 126 100 59 84 -17 -98 -334 -42 24 315 95
5264I5r3j41K32l77K63m4L14M4n29R5L6j12L04J9k28J48j96K92J88m49K37j13
$$ 95 2 -139 93 -284 -21 -65 249 293 -236 -141 -105 -217 87 106 -122 26 -170 122 310 -139 98 -15
5286a5j09L05k18j47K80j61N6J87k57M54j23l77J35J65k93J77k11L1J26j21J16
$$ -15 -124 181 -37 -184 96 -65 -9 178 -79 375 252 -125 10 175 -118 59 -152 -121 5 -116 0
5307@J38j45k1l9O3P0O0m4P5j54K91j72j73q6J83J42l19L33k08r6K00k8Q9p9j16
$$ 0 138 -7 -28 -67 -4 66 126 82 157 3 294 122 -51 -137 46 188 -131 202 -6 -102 98 70 159 80 -36
5332c6J80l24J70j47K70j79J00j78L89k57q3J81l02J57j61M53j19K3j6j82J08
$$ -36 144 -180 -10 -157 113 -66 34 -144 245 -12 -95 86 -216 -59 -220 233 114 137 121 -61 47
5353D7j99J36K02j87K49l10L19m74K49k38L39l40K99j86p7N27l04P7j76mL38l26
$$ 47 -152 -16 186 -1 248 -62 257 -217 32 -206 133 -207 92 -94 -171 356 52 129 -47 -51 287 -39
5375c9l3j8J14j44o9K70l23K17k61J93j4K66j96K3k7J07L00j89l41R1J53r2j83
$$ -39 -72 -90 24 -120 -189 81 -242 -25 -286 -93 -107 159 -37 -14 -41 66 366 177 -164 -73 80 -12 -195
5398a95L2L49k29j10p5P7l5M02j85J99l54O4J6j98J70N43l70j52J65j31k00K57
$$ -195 -163 186 -43 -153 -228 -151 -186 216 31 230 -124 -60 -44 -242 -72 471 101 -51 114 -17 -217 40
5420D0n6k56L17j12L0k0L8L0k97L51j16O1J13l72J19K22J2q8q6k65K52J52n2K62
$$ 40 -16 -272 45 -67 -37 -57 -19 11 -286 65 -51 10 123 -249 -130 92 104 16 -70 -335 -83 69 17 279
5444B79J9k3m16k7J73j63L08k69k31L95R5q2r3J83j58k62Q05o45P9N%k4k46J00
$$ 279 298 275 -141 -168 5 -158 150 -119 -350 45 140 58 -35 148 -10 -272 533 -112 -33 -28 -28 -52 -298 -198
5468a98L62k01L1K95m91J26p6K93p4M5j7l37M86m7p6n5Q3j31Pk24QK60j69J99
$$ -198 164 -37 -6 289 -202 -76 -152 141 67 112 95 -242 244 197 121 66 149 18 25 -199 -191 69 -100 99
5492I9p2J59l76K44j97L25l4Jj90J78j57j27j2P2J42k04J84Pl6Rj99J07l2K01
$$ 99 27 186 -190 54 -143 182 148 149 -41 137 -20 -147 -159 -87 55 -149 35 42 6 15 -184 -77 -109 92
5516I2J6k22p2j50J20J36J54J5k28L31n20J90k50N92j13l88J42K67m67J14j14
$$ 92 108 -114 -186 -336 -216 -80 74 89 -139 192 -328 -138 -388 204 91 -297 -155 112 -355 -241 -355
5537c55N30l41L19m52N8K78j80n0J33Q0p3L3j04K44j71J31J3j85n8M77l37j05
$$ -355 175 -166 153 -299 -241 37 -143 -193 -60 20 -53 -20 -124 120 -51 80 93 -92 -150 327 -10 -115
5559a15M06l23kj61L42j51J7J42K2j81k4L1j56K55J48m17L29j1km38K93K07k4
$$ -115 291 -32 -34 -195 147 -4 13 155 177 -4 -28 3 -153 102 250 -167 162 151 149 -289 4 211 187
5582A87qk14R1k1K14l29l9kM5K31J34m11R2J00m1j4K7n09K28K10p7K45j62kj63
$$ 187 179 -35 56 35 249 -80 -119 -121 -76 155 289 -122 -30 70 29 15 42 -467 -239 -29 -106 139 -23 -25 -188
5607a88j3K71k01L68m68M92j31q6m6OM9k53K80p2J17k76L36k80o6J44j21K64l00
$$ -188 -201 70 -131 237 -231 261 130 44 -2 4 53 -200 80 8 125 -151 185 -95 -161 -17 -138 126 -174
5630a74K09N7r7J47J82m13J68l76L08K43l12j2M03m90j57J71n0M7M0J92l15K24
$$ -174 35 92 -5 142 324 -89 79 -297 11 254 -58 -70 333 -157 -314 -143 -193 -146 -106 86 -229 -5
5652em41L59J95OL6m03J0K10M01l98M8K05n58L84m6K75k29n2J43m01K24J91j78
$$ -5 -446 -87 108 114 150 -253 -243 -33 368 -30 18 223 -335 49 3 278 49 -3 140 -261 -37 154 -24
5675b4m1k90K07K08l43L16k20K44K1k08O3j32J54j77J97o4q7m6M21J49m00J66
$$ -24 -65 -355 -148 60 -283 33 -187 57 78 -130 -67 -199 -45 -222 -25 -89 -176 -222 199 348 -52 114
5697A14k01o9JK84M0l54J46J22k60J98J28m68L11K0RM3J26l17L68l25r0K32n2
$$ 114 -87 -156 -155 129 169 -185 -39 83 -177 21 149 -319 -8 12 21 64 190 -127 241 -84 -174 58 6
5720FJ91k85J88M4j12k5o9J67j43J8k63M65k22J17r6L01l21k7O3j25K7P4Q8On2
$$ 6 197 -88 100 144 32 7 -62 105 -38 -20 -283 182 -40 77 -19 282 -39 -66 -3 -128 -101 -27 61 67 15
5745A5J70j50k31J97j78J93l5OK01j93k19K33r9K31k99K8lK51K08m27m6K93l49
$$ 15 185 35 -196 1 -177 16 -19 -13 188 -5 -224 9 -90 141 -158 -130 -133 118 326 -101 -147 146 -203
5768b03K27q0l9L96m08n2j05N24l68K62j36j97J64N8L8j85M60r8k36K59k08j07
$$ -203 24 -56 -95 301 -107 -159 -264 260 -108 154 18 -179 -15 43 81 -104 356 258 22 281 73 -34
5790c4K28j60r6L17j25k87K05j27N8o9K22j32K17k65J52K45k71J45n2q7J24j84
$$ -34 194 34 -62 255 130 -157 48 -79 -21 -90 132 0 217 -48 104 349 78 223 171 84 208 24
5812B4k44J62J00l6j58L81m14K69j03j28l06L02j59n1L51J05J29k5k48N4j2p9
$$ 24 -220 -58 42 6 -152 229 -185 84 -19 -147 -453 -151 -310 -361 -10 95 224 199 -49 5 -7 -86
5834h6Q9K30m79N58m45j34J09j00K94j87N38o12Q0J05j46K31k12K64j11j54J57
$$ -86 3 233 -246 312 -133 -267 -158 -258 36 -151 387 -225 -145 -40 -186 45 -167 97 -14 -168 -11
5855a1j4N2J16j59j55L09O6J7j57J7j9K62k35jk61J31k94M29j15R6J96n48j47
$$ -11 -25 27 143 -16 -171 138 204 221 64 81 62 324 89 88 -173 -42 -336 93 -22 74 270 -278 -425
$$ [...]
8191A33
##END NTUPLES=NMR FID
##END=
