##TITLE=1H_DE-30H_kHCl
 D2O
 8 sc, 
 9.10.2024
##JCAMPDX= 6.0         $$ Bruker NMR JCAMP-DX V2.0
##DATA TYPE= NMR FID
##DATA CLASS= NTUPLES
##ORIGIN= UXNMR, Bruker Analytische Messtechnik GmbH
##OWNER= root
$$ XWIN-NMR		Version 3.5
$$ Wed Oct  9 16:16:47 2024 Russian Standard Time (UT+4h)  she@DPX200
##.OBSERVE FREQUENCY= 200.1318
##.OBSERVE NUCLEUS= ^1H
##.DELAY= (6, 6)
##.ACQUISITION MODE= SIMULTANEOUS
##.ACQUISITION SCHEME= undefined
##.AVERAGES= 8
##.DIGITISER RES= 18
##SPECTROMETER/DATA SYSTEM= spect
##.PULSE SEQUENCE= zg30
##.SOLVENT NAME= D2O
##.SHIFT REFERENCE= (INTERNAL, D2O, 0, 15.7039)
##AUDIT TRAIL= $$ (NUMBER, WHEN, WHO, WHERE, WHAT)
$$ ##TITLE= Audit trail, XWIN-NMR		Version 3.5
$$ ##JCAMPDX= 5.01
$$ ##ORIGIN= Bruker BioSpin GmbH
$$ ##OWNER= she
$$ F:/spectra/data/she/nmr/H-F/1/audita.txt
$$ ##AUDIT TRAIL=  $$ (NUMBER, WHEN, WHO, WHERE, WHAT)
(   1,<2024-10-09 16:15:53.53 +0400>,<she>,<DPX200>,
      <created by zg, POWCHK disabled, PULCHK disabled
       configuration hash MD5:
       00 E9 B6 7A A2 85 ED C7 34 08 36 98 17 FE 4E 26
       data hash MD5: 16K
       82 CF 88 69 9D C1 44 27 CC 8F EF 35 38 92 D8 F7>)
$$ ##END=
$$ 
$$ hash MD5
$$ 95 23 12 75 3A 83 5D 94 F6 40 E8 E2 ED F4 52 FE
##$RELAX= 
##$RELAX= 
##$RELAX= 
##$RELAX= 
##$RELAX= 
##$RELAX= 
$$ Bruker specific parameters
$$ --------------------------
##$DU= <F:/spectra>
##$EXPNO= 1
##$NAME= <H-F>
##$PROCNO= 1
##$TYPE= <nmr>
##$USER= <she>
##$AMP= (0..31)
100 100 100 100 100 100 100 100 100 100 100 100 100 100 100 100 100 100 
100 100 100 100 100 100 100 100 100 100 100 100 100 100 
##$AQSEQ= 0
##$AQ_mod= 1
##$AUNM= <au_zg>
##$AUTOPOS= <>
##$BF1= 200.13
##$BF2= 200.13
##$BF3= 200.13
##$BF4= 200.13
##$BF5= 200.13
##$BF6= 200.13
##$BF7= 200.13
##$BF8= 200.13
##$BYTORDA= 1
##$CFDGTYP= 0
##$CFRGTYP= 5
##$CHEMSTR= <none>
##$CNST= (0..31)
1 1 145 1 1 1 1 1 1 1 1 1 1 1 1 1 1 1 1 1 1 1 1 1 1 1 1 1 1 1 1 1 
##$CPDPRG= <>
##$CPDPRG1= <>
##$CPDPRG2= <>
##$CPDPRG3= <>
##$CPDPRG4= <mlev>
##$CPDPRG5= <mlev>
##$CPDPRG6= <mlev>
##$CPDPRG7= <mlev>
##$CPDPRG8= <mlev>
##$CPDPRGB= <>
##$CPDPRGT= <>
##$D= (0..31)
0 1.2 0 0 0 0 0 0 0 0.06 0 0.03 0 0 0 0 0.0002 0 0 0 0 0 0 0 0 0 0 0 0 
0 0 0 
##$DATE= 1728476152
##$DBL= (0..7)
120 120 120 120 120 120 120 120 
##$DBP= (0..7)
150 150 150 150 150 150 150 150 
##$DBP07= 0
##$DBPNAM0= <>
##$DBPNAM1= <>
##$DBPNAM2= <>
##$DBPNAM3= <>
##$DBPNAM4= <>
##$DBPNAM5= <>
##$DBPNAM6= <>
##$DBPNAM7= <>
##$DBPOAL= (0..7)
0.5 0.5 0.5 0.5 0.5 0.5 0.5 0.5 
##$DBPOFFS= (0..7)
0 0 0 0 0 0 0 0 
##$DE= 6
##$DECBNUC= <off>
##$DECIM= 24
##$DECNUC= <off>
##$DECSTAT= 4
##$DIGMOD= 1
##$DIGTYP= 9
##$DL= (0..7)
0 120 120 120 120 120 120 120 
##$DP= (0..7)
150 150 150 150 150 150 150 150 
##$DP07= 0
##$DPNAME0= <>
##$DPNAME1= <>
##$DPNAME2= <>
##$DPNAME3= <>
##$DPNAME4= <>
##$DPNAME5= <>
##$DPNAME6= <>
##$DPNAME7= <>
##$DPOAL= (0..7)
0.5 0.5 0.5 0.5 0.5 0.5 0.5 0.5 
##$DPOFFS= (0..7)
0 0 0 0 0 0 0 0 
##$DQDMODE= 0
##$DR= 18
##$DS= 0
##$DSLIST= <SSSSSSSSSSSSSSS>
$$ [...]
##$SUBNAM2= <"">
##$SUBNAM3= <"">
##$SUBNAM4= <"">
##$SUBNAM5= <"">
##$SUBNAM6= <"">
##$SUBNAM7= <"">
##$SUBNAM8= <"">
##$SUBNAM9= <"">
##$SW= 24.0689170037331
##$SWIBOX= (0..15)
0 0 2 0 0 0 0 0 0 0 0 0 0 0 0 0 
##$SW_h= 4816.95568400771
##$TD= 16384
##$TD0= 1
##$TE= 0
##$TE2= 300
##$TE3= 300
##$TEG= 300
##$TL= (0..7)
0 120 120 120 120 120 120 120 
##$TP= (0..7)
150 150 150 150 150 150 150 150 
##$TP07= 0
##$TPNAME0= <>
##$TPNAME1= <>
##$TPNAME2= <>
##$TPNAME3= <>
##$TPNAME4= <>
##$TPNAME5= <>
##$TPNAME6= <>
##$TPNAME7= <>
##$TPOAL= (0..7)
0.5 0.5 0.5 0.5 0.5 0.5 0.5 0.5 
##$TPOFFS= (0..7)
0 0 0 0 0 0 0 0 
##$TUNHIN= 0
##$TUNHOUT= 0
##$TUNXOUT= 0
##$USERA1= <user>
##$USERA2= <user>
##$USERA3= <user>
##$USERA4= <user>
##$USERA5= <user>
##$V9= 5
##$VALIST= <valist>
##$VCLIST= <CCCCCCCCCCCCCCC>
##$VD= 0
##$VDLIST= <DDDDDDDDDDDDDDD>
##$VPLIST= <PPPPPPPPPPPPPPP>
##$VTLIST= <TTTTTTTTTTTTTTT>
##$WBST= 1024
##$WBSW= 4
##$XGAIN= (0..3)
0 0 0 0 
##$XL= 0
##$YL= 0
##$YMAX_a= 243096
##$YMIN_a= -280758
##$ZGOPTNS= <>
##$ZL1= 120
##$ZL2= 120
##$ZL3= 120
##$ZL4= 120
##$ABSF1= 10
##$ABSF2= 0
##$ABSG= 5
##$ABSL= 3
##$ALPHA= 0
##$AQORDER= 0
##$ASSFAC= 0
##$ASSFACI= 0
##$ASSFACX= 0
##$ASSWID= 0
##$AUNMP= <proc_1d>
##$AZFE= 0.1
##$AZFW= 0.1
##$BCFW= 1
##$BC_mod= 2
##$BYTORDP= 1
##$COROFFS= 0
##$CY= 11.3945322036743
##$DATMOD= 1
##$DC= 2
##$DFILT= <>
##$DTYPP= 0
##$F1P= 15.6554695791079
##$F2P= 12.8336369535428
##$FCOR= 0.5
##$FTSIZE= 0
##$FT_mod= 4
##$GAMMA= 1
##$GB= 0.15
##$INTBC= 1
##$INTSCL= 1
##$ISEN= 128
##$LB= 0.24
##$LEV0= 0
##$LPBIN= 0
##$MAXI= 10000
##$MC2= 0
##$MEAN= 0
##$ME_mod= 0
##$MI= 1.114404
##$NCOEF= 0
##$NC_proc= 0
##$NLEV= 6
##$NOISF1= 3.799351
##$NOISF2= 2.8
##$NSP= 1
##$NTH_PI= 0
##$NZP= 0
##$OFFSET= 15.70392
##$PC= 1
##$PHC0= -26509.33
##$PHC1= 10.38743
##$PH_mod= 1
##$PKNL= yes
##$PPARMOD= 0
##$PSCAL= 0
##$PSIGN= 0
##$REVERSE= no
##$SF= 200.130013532006
##$SI= 16384
##$SIGF1= 3
##$SIGF2= 2
##$SINO= 400
##$SIOLD= 16384
##$SREGLST= <1H.CDCl3>
##$SSB= 0
##$STSI= 0
##$STSR= 0
##$SW_p= 3612.71676300578
##$SYMM= 0
##$S_DEV= 0
##$TDeff= 0
##$TDoff= 0
##$TI= <>
##$TILT= no
##$TM1= 0
##$TM2= 0
##$TOPLEV= 0
##$USERP1= <user>
##$USERP2= <user>
##$USERP3= <user>
##$USERP4= <user>
##$USERP5= <user>
##$WDW= 1
##$XDIM= 8192
##$YMAX_p= 0
##$YMIN_p= 0
$$ End of Bruker specific parameters
$$ ---------------------------------
##NTUPLES= NMR FID
##VAR_NAME=  TIME,          FID/REAL,        FID/IMAG
##SYMBOL=    X,             R,               I
##VAR_TYPE=  INDEPENDENT,   DEPENDENT,       DEPENDENT
##VAR_FORM=  AFFN,          ASDF,            ASDF
##VAR_DIM=   8192,          8192,            8192
##UNITS=     SECONDS,       ARBITRARY UNITS, ARBITRARY UNITS
##FACTOR=    0.0002076,     1,               1
##FIRST=     0,             0,               0
##LAST=      1.7004516,     0,               0
##MIN=       0,             -280758,         0
##MAX=       1.7004516,     243096,          0
$$ Real data points
##PAGE= N=1
##DATA TABLE= (X++(R..R)), XYDATA
$$ [...]
409G899P537q815j5494o150R757J5071M523j0478j4365l210J1157J3808J692j1796
423A136j2778n55J2327J1984q82j2681j0866K130J2668R983l254j2865q865M403
437h115J2790P766n367j2665o626O291J2408N487p143j2034m285P734J1635L219
451A1095q456j1137j905Q791J0474J087r409r745O1R611R064j012r933q262J995
466g681R933P428k809j0070o519L719R947N650m401r848m825N139R597L915n686
481C489r300l131O414Q834K124o625q473j414P201P964L96p352p425K79P640O948
497G569j161p745o253J816P798N648k494p866m923L148P828M051l634p556l595
512g369M189P532K788m729p161k080N059O877J466n467o560o38N583O088K11n902
$$ plain form
409 7899 15436 6621 -8873 -15023 -5266 9805 14328 3850 -10515 -13725 -2568 11240 12932 1136
423 1136 -11642 -12197 130 12114 11232 -1449 -12315 -10185 2483 12466 9212 -3653 -12518 -8115
437 -8115 4675 12441 7074 -5591 -12217 -5926 6482 11969 4826 -7208 -11493 -3759 7876 11095
451 11095 2639 -8498 -10403 -1612 8862 9949 540 -9205 -9144 467 9531 8519 -1414 -9676 -7681
466 -7681 2252 9680 6871 -3199 -9718 -5999 3948 9598 5197 -4651 -9476 -4337 5260 9175 3489
481 3489 -5811 -8942 -2528 6306 8430 1805 -6668 -8082 -881 7083 7479 127 -7298 -7019 621 7569
497 7569 6408 -1337 -7590 -5774 2024 7672 5178 -2688 -7611 -4463 3365 7416 3782 -3774 -7369
512 -7369 -3180 4352 7140 2411 -4750 -6830 -1771 5106 6572 1105 -5455 -6093 -510 5578 5789 -113
528a13n720M77O028N288j090o150m756J632O180M261k141o171l781K648O162L138
544E892l044n987k680L551N767K060l821n479j642M149N350R42m346n056m35M501
560b78M751K7m706m410N28M841M043j057m887l635J408M918L264j900m890k720
576d703K149M904K355k628m784j835K867M547J600l272m346j051L341M289N61
591C994l550l953k82L729L695j48l904l336O61L821L051q53l991k810J387L901
607A412K429j647l925k024J894L833J758k163l760j392K452L521J086k622l564
622b712n27K812L234K21k862l118O5L076K733k69l092k574O39L124K283r64l053
639i84k068J222L113J673j331l055j601J728L037J150j890k851q77J877K881O02
$$ plain form
528 -113 -5833 -5356 672 5960 4870 -1280 -6036 -4404 1776 6037 3896 -2275 -6056 -3408 2754 5892
544 5892 2848 -3139 -5819 -2268 3499 5559 1738 -3741 -5383 -1234 4116 5058 712 -4344 -4779 -278
560 -278 4473 4500 -206 -4616 -4088 753 4796 3739 -1148 -4783 -3375 1543 4807 2907 -1983 -4703
576 -4703 -2554 2350 4705 2077 -2707 -4542 -1675 2872 4472 1200 -3146 -4197 -856 3433 3994
591 3994 444 -3509 -3791 -62 3633 3485 -419 -3755 -3094 727 3778 2925 -1066 -3876 -2489 1412
607 1412 3841 2194 -1731 -3755 -1861 1972 3730 1567 -2193 -3585 -1133 2388 3474 852 -2712
622 -2712 -3239 -427 2807 3028 166 -2952 -2887 189 2922 2653 -439 -3013 -2374 750 3033 2069 -984
639 -984 -3052 -1830 1283 2956 1625 -1430 -3031 -1303 1734 2884 994 -1857 -2734 -857 2024 2626
655B626k171k616l10K274K460K6k349k184J19K410K084n04k375j810N04K541J695
672B420r54k387j381R88K376J304j325k287r50J399K198Q19j625k128m53J542
688d44K075L79j831j878o5J718J830j28j862j653L99J805J411l86j944j220P00
705a094J751J099p71j822q72Q57J711P92r93j671n11J069J522M34j149j514k48
722a410J182J369J40j213j339K2J418J081j63j270j134L62J336Q52m27j214q38
739a246N28J249O27n94j196o01P22J183M19p74j026m27Q83J043J43p89r78j29
757i63Q84R32m1r39p00R8Q98O45j52q69o18K64Q78M81l67p84l51L44P65L86m83
778C08p25l03M85P09K42n20o60j56N51O07M0n23n77ON81M22p0n07m52J30N25L87
$$ plain form
655 2626 455 -2161 -2471 -197 2263 2289 -60 -2244 -2125 285 2369 1865 -510 -2320 -1816 725 2420
672 2420 1466 -921 -2302 -1314 1062 2366 1041 -1246 -2196 -797 1401 2220 595 -1533 -1986 -444
688 -444 1631 2010 179 -1699 -1764 -46 1784 1656 -206 -1859 -1460 345 1756 1370 -574 -1794 -1094
705 -1094 657 1756 985 -837 -1709 -852 859 1651 658 -1013 -1524 -455 1067 1501 352 -1162 -1410
722 -1410 -228 1141 1281 68 -1271 -1249 169 1250 1087 -183 -1317 -955 381 1233 806 -408 -1246
739 -1246 -718 531 1158 564 -632 -1233 -511 672 1091 317 -709 -1136 -253 790 933 144 -834 -963
757 -963 -79 853 812 -127 -827 -729 169 814 662 -207 -825 -561 317 798 431 -353 -704 -360 405 791 308
778 308 -417 -720 -235 474 716 196 -464 -620 -69 538 578 55 -522 -516 65 487 417 -90 -542 -412 113 500
800E00j45n03l73J95N06L07k90l95k52K78L82J78k99l73j00K63M02O7k82l43n3
821c30K95L11l2k83l05R1K90J97p0k03k08L8K72J84q8k53p5J3K11K17j90k36L9
844a15K3K45j0q3j54j14J67R1J01j36j55oJ43Q9J0p2r8l7P5O7N1Rj68j2M0P6q
871A9k7j3q2R6k0Q3j12K0qjP8P1l6j06m9J4J58K6o2m3j18J24o9R4j3j01J0J8L6
900a3J45r8k1j73Q6J51K7n2j17K2%J18M3j09r9qO3J26J5j57p2n5J71P2j4o7j31
927a47L2J22J02k1j41j24J03J20J27n4j72j21J34Q6R3o8r8j55Q7J59J4j9j97j1
951a49J05K11M4j63j70J2R6J13Q3j54j40l9J90J53j9k02j32M3J87J09p8k27lj9
975a49J77J76j55j80o2J35J26R6j24j30q9J07J59P9j40j76LJ18J66l2j31r4L1
$$ plain form
800 500 355 -148 -521 -326 180 487 197 -198 -450 -172 210 388 89 -284 -384 -121 281 348 66 -277 -330
821 -330 -35 276 244 -39 -344 -253 37 234 164 -39 -247 -209 63 247 159 -94 -169 -156 55 272 82 -154 -115
844 -115 -92 153 143 60 -94 -208 -41 50 151 15 -140 -146 -3 86 96 24 -74 -111 -36 31 82 91 -77 -89 -49 27 19
871 19 -8 -21 -103 -7 -27 56 -56 -36 -44 -45 33 104 68 -38 -87 -73 85 111 49 6 -112 12 -57 37 24 -77 -67 -49 -13
900 -13 132 34 13 -160 -74 77 104 52 -65 -43 -43 75 118 9 -90 -98 -35 91 106 -51 -123 -178 -7 65 51 -16 -147
927 -147 -115 7 109 88 -53 -177 -74 46 173 119 -53 -174 -40 46 139 71 -27 -182 -95 64 78 59 -138 -149
951 -149 -44 167 211 48 -122 -110 -14 99 182 28 -112 -151 39 192 173 -29 -161 -118 69 178 100 -127 -130 -149
975 -149 28 204 49 -131 -193 -58 68 164 40 -90 -179 -72 87 166 26 -150 -147 -29 137 105 -26 -120 -89
998h9J59O8j7j48j32J21J12J21r2j49q2J02J18O7j58j24k6J33J74k9j59j13LJ53
1022A3R5l6q0j86P7R9J23k3j06j52M0J85O5N6k50j07J30N5J65j07j28j10Q8J92
1046I8J3j36n5l0L6K11Mk06j30pK35Q2j6j24o4m0J84R1p6r6o0L8P9J27r6j05o
1073d9l4J56L7r1n7k5R0R5o0l5q7ON7N7J2j45K3M7N7qK5q4r6N7J12p4N7q6m0O0
1103b3J19no4q2m3Q5R8j1j15j7O1k8J09o4m3j6KR3m9M8o5j2J1M2J6k2p2j3M2N9
1133D1Kqq8K1L0Q9n0o2j4K2LN1o2j3K5jO1j21M6M8k8k8j2L3L7k0l8P8k0J4l7j1
1165a2L0J7l7k5M3o7pN0J1j0M2k6j3l2L8%k2Q5J0p0N0q9j2Q7l7o0P3m2O9j6rJ6
1197C5qo8M7k6Om5PM6J9M4o9pqM7l4P9m1K3j22M5Q5no4K5m8O9K0l0Qm6j6nJ40
$$ plain form
998 -89 70 138 121 -27 -159 -38 74 195 103 -46 -128 -26 92 159 1 -123 -149 -16 158 129 -30 -143 -140 13
1022 13 108 72 -8 -194 -117 -18 105 82 -24 -176 -136 49 114 170 -80 -187 -57 -2 163 56 -72 -182 -94 98
1046 98 111 -25 -80 -110 -74 137 141 -65 -195 -202 33 115 99 -25 -89 -129 55 146 70 -26 -86 -48 31 158 62 -43 -49
1073 -49 -83 73 110 19 -38 -63 27 122 62 27 -60 -54 3 60 72 -73 -50 -3 54 46 71 -13 -109 -52 60 -14 43 -43 -83 -23
1103 -23 96 91 27 -55 -98 -13 85 74 -41 -58 3 -25 84 20 -23 -39 -37 56 7 55 -10 -22 -11 31 47 25 -47 -60 -18 41
1133 41 43 35 -53 -32 -2 87 37 -25 -39 -17 -14 37 -25 -38 -13 -14 47 -74 -28 20 -8 -36 -48 -15 22 2 -36 42 22 36 -1 -12
1165 -12 18 35 -2 -27 16 -51 -58 -8 3 -7 35 9 -4 -36 2 2 -20 65 75 5 55 -34 -46 41 4 -56 17 -25 44 28 19 35
1197 35 27 -41 6 -20 -14 -59 -52 -6 13 57 -12 -19 -27 20 -14 65 24 47 -75 -30 55 50 -14 11 -37 32 52 22 30 -16 -32 -37 103
1230A03j12N7j20J6N6L1P3j73QN5j1P8o5Mq8J01N8n5k7l0j5N0J26j32N2m5m5K2
1258b8L2L6j18L8K6L3Q4p9p3pL1R4qp4q7J8J16n1N3j6p9L6K8O3k2l8m8J5Q2J8
1288G5lr7k0k9J79jp7n9ml8J44j3n4l9k5J16J8l5m4j13M1J27O4q1q5j2j8J10L2
1317E9J0q1q6Q3J9L9J6q7p5L3J08K3p5k4n6Q2J18o2m8o5l6J24O6n6j3m3K3M6Q0
1346A22n4j27%N3P9K1o5n8o2Q6J45k8p1n4n2N8L9j2o9K5QJ4J05p9n3q4O5N8J09
1375A19j02r5k5M5P0J01l6j24k5O2J01k5q0Rq2P8J27l1m7j36kJ26M9k1k5r1m6
1402a06J32J18j44p4ROJ23rJ4j16p6N7J22k6o4k0n5J24LM4j5j54M3O5M2L7j16
1429c6q6Q0R4J8q5k3o7Q8L4O6o0m5p8Q8L0Q5n9j03j6Q9N7N1j53j2O2m4R8l6k3
$$ plain form
1230 103 -9 48 -72 -56 0 31 104 -69 -61 -6 -17 61 -4 0 -88 13 71 16 -11 -41 -56 -6 120 -12 40 -5 -50 -28
1258 -28 4 40 -78 -40 -14 19 103 24 -49 -56 -25 69 61 -13 -100 -82 34 -17 36 20 -59 -23 5 68 46 8 -40 -25 57 75
1288 75 72 -25 -45 -74 105 104 27 -32 -36 -74 70 57 3 -36 -61 55 73 38 -6 -119 -78 49 113 32 -53 -65 -83 27 59
1317 59 69 -12 -98 -15 4 43 59 -28 -103 -70 38 61 -14 -38 -94 -12 106 44 -4 -69 -105 19 85 29 16 -27 -4 42 122
1346 122 68 -59 -59 -6 73 94 29 -29 -91 -5 140 112 41 -13 -65 -7 32 20 -49 -24 -16 -2 103 24 -29 -113 -48 10 119
1375 119 17 -78 -103 -58 12 113 77 -47 -72 -10 91 66 -14 -5 -87 -9 118 87 40 -96 -98 28 77 56 31 -60 -106
1402 -106 26 144 0 -74 -65 -59 64 55 69 -47 -123 -66 56 30 -34 -54 -109 15 18 62 47 -107 -64 1 43 80 -36
1429 -36 -122 -42 52 70 -15 -38 -105 -17 17 83 23 -22 -100 -12 18 103 44 -59 -75 14 71 122 -31 -43 19 -25 73 37 14
1458A4o4J1J4P5j2k6l0k6P6L3K5j39qO9L9N8j23j01PJ23L9L0j02m4j2L0O4J11
1486A31j36p4N6J6K1O0k6r2K7QM3k6l8m0J4J30l0K9j1j21j9J1R5j3j6q6O4O7j0
1515C4k1l9n2O3Q9n8K7p2%ON0O2j04k9N4J5k9N1o2m0M2K2m1O5m9p3J5L8O3p3N
1546d1KN5L3j6l5M0l6pJ4P1q0rn0l3J15M1m3p1J4O7L7l0%m3J7l8O3j3m4M6q5R0
1578C1P3q3Jo9K8QJ2O4m0n3qO1O7q2Qr1L4K7J8j9k8l5jP6O0p1n4l4M3J01J5q6
1610b7n6K6O8Pk2j9rk4M0M6K8q1oL1J3M1l6L7j04N1K6J6l0j9l8O1J8P2p7o1j4
1641d2P2K0o6J9p2P1N5L4l1k2n1KlJ23q3r1J5M5P2j34Q0m5lK3N4m0Pp8R3km1K5
1673Fl2M1ok0P8l9k4m9KL8J5K5p0J7jK0M6L2q0nm7N3J05p3k8q2M2oR2o9J1knJ2
$$ plain form
1458 14 -50 -39 -25 50 38 12 -18 -44 32 65 90 -49 -57 12 51 109 -14 -115 -108 15 54 84 -18 -62 -74 -44 20 131
1486 131 -5 -79 -23 -7 14 74 48 -44 -17 -9 34 8 -30 -70 -56 74 44 73 62 -59 -78 -67 28 15 -1 -87 -23 44 34
1515 34 13 -26 -78 -15 74 16 43 -29 -29 -23 27 89 -15 -44 10 25 -4 47 -15 -55 -13 9 -32 33 -16 -89 -74 -36 27 -46 -41
1546 -41 -39 16 49 33 -2 38 2 -5 9 80 0 -9 -59 -92 23 64 21 -50 -36 31 68 38 38 -5 12 -26 37 24 -20 26 -59 31
1578 31 104 21 22 -47 -19 -11 1 65 25 -28 -36 25 92 10 18 -73 -39 -12 6 -13 -41 -76 -77 -1 59 -12 -66 -100 -57 44 59 -27
1610 -27 -83 -57 11 18 -4 -23 -32 -56 -16 30 58 -23 -29 2 15 56 20 57 -47 4 30 46 16 -3 -41 20 38 110 33 -28 -42
1641 -42 30 50 -16 3 -69 2 57 91 60 38 -13 -11 -14 109 26 -65 -50 -5 67 -67 13 -32 -35 -12 42 2 9 -69 24 22 -19 6
1673 6 -26 15 9 -11 67 28 4 -45 -43 -5 10 35 -35 -18 -19 1 47 79 -1 -6 -53 0 105 32 4 -78 -36 -42 50 -19 -8 -10 -15 -3
1707cP0m0j00O3K7l0K0L2p1ML8J6ll2j8L3l5Q6k4o4j9L1N2mK5j5o0J7oJ00o8o8
1739d6NJ06p5O8l5o0J8k4Q6L8p9K8k3l0M4NO5p8ml3NL6m1j5p8J50l3Ro4K3%N4
1771B2M7o9m3oJR6j4o1j6kk0P3K8m3k6m0J06M6L4r1p4k5O8M1%m8M9n4M1rJ9j3
1803A7o4J4P1qOr4j2P9qK7M3j06j4J5N1Jql1lN0PQ1j32j00O3R5qM8q4l7KL4%J0
1837EOp4K0J40o1jo7L3K6oO2q0Rn8L5Q4j2l2p3O6k4Q8n6l1l5O0R1p1j6j2p6R1
1869C1P0o3jq9J0NO2P5j11j2l7N4N9k3m3m9MQ2J6K0m7n0k4Q7L5j1q8jL1K6k3N4
1901D9j02QN3K4J7n7Jl1N7J5K2j3mq5N7J4kjp1JO5KK1k8k3L5j1K0n4Nn7J2O6P8
1935H3p0l6J2j7j7R5q8k3K9m5Q0J7j4k4M0j9J5l1L0n8Q1o1N9K6p9l6mJ2P8Kk8
$$ plain form
1707 -3 67 27 -73 -10 17 -13 7 39 -32 -28 10 26 23 -9 -27 6 -29 57 33 -31 -50 -19 33 29 54 39 -21 -4 -10 90 22 -46
1739 -46 -41 65 -10 58 23 -37 -19 -43 43 81 2 30 7 -23 21 26 91 13 9 -24 -19 17 -24 -39 -117 33 0 9 -55 -32 -32 22
1771 22 69 0 -43 -49 -48 48 34 -27 -43 -45 -65 8 36 -7 -33 -73 33 79 113 22 -52 -77 -9 32 32 -16 33 -21 20 11 30 17
1803 17 -47 -33 38 30 36 -58 -70 9 1 28 71 -35 -49 -34 17 18 10 -21 -24 26 33 114 -18 -118 -55 40 32 80 -4 -41 -39 -5 -5 5
1837 5 11 -63 -43 97 36 35 -32 1 27 21 83 3 12 -46 -11 73 61 29 -44 22 -2 86 30 -1 -36 24 115 44 28 16 -60 31
1869 31 101 38 37 -52 -42 -37 25 100 -11 -23 -60 -6 53 30 -13 -62 -58 24 40 60 13 -37 -61 26 61 50 -38 -39 -8 18 -5 49
1901 49 -53 -45 8 32 49 -8 -7 -38 19 34 56 43 39 -46 11 25 23 22 -49 -48 17 19 40 12 -11 24 13 33 -21 -16 -73 -61 5 83
1935 83 13 -23 -11 -28 -45 50 -38 -61 -32 -77 3 20 6 -18 22 3 18 -13 17 -41 40 -21 38 64 -15 -51 -55 -43 35 37 9
1966Ij0N5p6N2O5r5nJ5L7J1n9k4L0j7K0K5K5q6K5l8P8Kn2jRK3%n3Qj5M9P0p2N0
2000E5n8Ko2R5l0p5K9O8k8K2j8Kr0N4N5k1K7l5jj03J53m1lk2P8m1L3k8K2j01M4
2031a8J13m0oRr5K3J7N8l8J7p1Lk1R9J8o3o2L2K9l7NJ5nK2l8K4k2Jo2J5M4L7N
2064Hj6Qo0O0NqMJ5j6nJ4k1K5Jl5L3PK6n2M3j9O6k8r9PJ3N7o2n3N8l9nR2j6j7
2099in1O2k1j2R4lj19L9k7K9pM2n4M0m0RP4j62L3P9L8oj5l5k9N8k9J0L7k7K2l7
2131a7qP1Jq7l9P1j5M2j9J4rrR9q6%k9L3n1lR2o7n5L2L2nL3l4K4ol2kM1K7q9l3
2166h3L2L8k4K3k4L6jn9L8j5M1l8Q3o3moQ1Qn1n6L2o3O6k2K7Q5p0o2N5qP0n3R
2199B2l8L4K4o1O2j8Lj9nO6q7n1LN9Ooj9M0npl0K4o3%K8N1j9l2M7k3j5M4%M0q3
$$ plain form
1966 9 -1 54 -22 30 95 0 -5 10 47 58 -1 -25 5 -12 8 33 58 -28 -3 -41 37 39 -13 -14 -5 18 18 -35 -27 -42 7 77 5 55
2000 55 -3 -1 -63 32 2 -73 -44 24 -4 18 0 2 -88 -34 21 0 27 -8 -9 -112 41 0 -3 -25 53 12 45 17 39 -62 -18
2031 -18 95 55 49 58 -37 -14 3 61 23 40 -31 -28 -49 50 68 5 -57 -25 4 -33 -28 -13 -18 4 -34 -10 -32 -31 -93 -78 -34 3 8
2064 8 -8 0 -60 0 5 -3 1 16 0 -5 9 -12 13 14 -21 12 19 45 -7 36 17 83 55 -44 -37 -24 33 -29 -82 -24 -63 -68 24 8 -9
2099 -9 -60 2 -19 -31 63 60 -59 -20 -47 -18 -25 17 -37 3 -37 -28 46 -116 -83 -4 34 28 13 -22 -51 7 -22 -12 25 -2 20 -17
2131 -17 -25 46 47 -40 -79 -8 -23 19 0 14 5 -4 95 9 9 -20 13 -38 -41 51 -16 -71 -39 -7 -12 21 -13 11 5 -27 -29 12 39 -50 -83
2166 -83 -51 -13 -37 -14 -38 -2 -3 -62 -24 -39 2 -36 47 -16 -20 -26 55 63 12 -44 -12 -75 -9 -31 -4 81 11 -51 4 -4 66 13 22
2199 22 -16 18 42 -19 43 25 28 9 4 70 -17 -68 -65 -6 0 -6 -25 15 10 3 -27 -3 -66 -66 -38 13 -6 -38 9 -14 -29 15 15 55 -28
2234b8J7j1J5j1K7o8N0k5J0L7Mo0M1k6R9n9L9o0M7j9K5Pp7K6j3M5J5n1nl8O3J1
2266B7k4N2l5n6l2M0M7p6qO1k4L9M0o8j4j1N8o6Q6Ql9Jk5K7J0l6J7k8N9J6j5o9
2298c8J7J7L2R6j20J3m0L2L8j3q7K3K9KL9o1N8n9L0k7LN8k0J1pp5N9j5jk6MJ8
2330a0L2j0J9o8l7R2o0Q2l5l9K7M1n8J0l3O8Po8Q7k3l6n0P5K7jp9OK6j3L0N2p4
2362a3O4qo3Q0k6r2Qk7J01nm6MM5m2%k7N6j5j2L6jk9K8m4j2nN7k1P4l2q7JO9L
2396A9l2o9P9k3Qj5L2p3Q3Q5o6K5n2RNO7m0Ol2km4L2L0on2jO7q7O1m9LJ5K8L6
2430D7j16L1K1J6j2nK4kl0M1No2L6k5j7M1%jm1M5K0n7M8n5qK7J7P4n2Qm2%NQM0
2465B9K7n7j9mO1n5M1o8j1J24q4O0m7OJ1k1K2K0k4m0L1p2N7m0K0L9j0K7J4j9j7
$$ plain form
2234 -28 -11 -22 -7 -18 9 -59 -9 -34 -24 13 17 -43 -2 -28 71 12 51 -9 38 19 44 51 -26 0 -13 32 47 -4 -9 -47 16 27
2266 27 3 55 20 -36 -68 -28 19 -57 -65 -4 -28 11 51 -17 -31 -42 16 -50 36 44 5 6 -19 8 18 -18 -1 -29 30 46 31 -38
2298 -38 -21 -4 28 124 4 17 -23 9 47 34 -53 -30 -1 1 40 -21 37 -22 8 -19 -16 42 22 33 26 -49 10 -5 -6 -32 -28 -10
2330 -10 22 12 31 -37 -74 18 -42 40 5 -34 -7 34 -24 -14 -47 21 28 -40 47 24 -12 -62 13 40 39 -40 -34 -8 -21 9 61 -13
2362 -13 51 43 -20 60 34 -58 -50 -77 24 19 -27 -23 22 -20 -20 -47 9 -6 -18 18 17 -12 16 -28 -40 -45 12 -9 65 33 -54 -53 16 19
2396 19 -13 -82 -3 -26 -18 -33 -1 -74 9 94 28 53 1 10 15 82 42 48 16 14 -30 2 32 26 -26 -27 40 -47 14 -35 -32 -17 11 47
2430 47 -69 -38 -17 -1 -13 -18 6 4 -26 15 20 -42 -6 -31 -48 -7 -7 -8 -49 -4 16 -41 7 -48 -56 -29 -12 62 10 18 -24 -24 -19 -11 29
2465 29 56 -1 -20 -24 37 -18 23 -45 -56 68 -16 44 -3 3 14 -7 15 35 11 -29 2 -70 -13 -53 -33 6 -4 23 37 18 1
2496Ak4O9l2j0No7N3Lo8Q4L1r0N0l8qM3k4N0o9O5l7qL3o8qR4o7K7L2n9J8K6L2
2529C9n8J2l4Q4L9q9l2J4k6M6MpJ4k1k7N2l0M5p9N2LL9o6k8P8r6J02q7N1n4O8
2560Hm2j9N4j1K3l1M8p5O3p1P6k9mR9m8m6O2rm8M6qlr9O8j4rM6k6J9k6l5J6%n2
2594g7J08m5kK7j5L6j2l9O0l2Nl0j1l9O5J3J6j05J12o2mM1J2p9L3oj6P8m1Ml7
2625d2K2j9O4j2J8k2m3K8pRlLJ5L9Ml6L8l9Nk3ON3l2m2L0j9M0n1k5RN6k0j8J0
2659dlj7K2J6m6M0Jl6J6P5j33KO8Ok7j5N2o5N4Pm9J22n7p7J0L5m4O8J3k7m2R6
2691F1l6o7N5k8onM4m1k5Q3p9P5J6k9k4oL5m7%M1K2J9r7K3L3Qo0L3k0nR2j07K1
2724b1K0j9K3L0l8m9l5R0n2j4Q1N9qp7K3Lj4j2L8L5n7K8j0mpjm6QN0j5LJj6L7
$$ plain form
2496 1 -23 46 14 4 9 -58 -5 -2 -70 14 45 -45 5 -33 -41 2 -22 28 -41 24 -13 -21 12 -56 -64 30 -37 -10 22 -37 -19 7 39
2529 39 -19 -7 -41 43 82 -7 -39 -25 -51 -5 -1 -8 6 -15 -42 10 -20 25 -54 -2 1 40 -26 -54 24 -72 30 -57 -6 -60 8
2560 8 -34 -53 1 -10 13 -18 30 -45 18 -53 23 -6 -10 89 41 -5 57 48 0 46 38 35 -64 4 -10 -19 27 1 20 -6 -41 -25 -25 -77
2594 -77 31 -14 -16 11 -4 32 20 -19 41 9 14 -16 -27 -66 -1 12 28 -77 35 -27 -31 10 22 -57 -24 -30 -46 32 -9 -5 -42
2625 -42 -20 -39 25 13 31 9 -34 -6 -13 -4 -7 -4 11 50 54 18 56 17 22 -1 5 58 26 -16 14 -5 35 -16 -41 -32 24 4 -14 -4
2659 -4 -7 -24 -2 14 -32 8 9 -27 -11 64 -69 -67 1 7 -20 -35 17 -48 6 13 -36 86 29 -48 -38 -3 -47 21 34 7 -35 61
2691 61 25 -42 13 -15 -21 -26 18 -23 -48 35 -44 31 47 18 -6 -12 23 -24 -24 17 39 58 -39 -16 17 25 -35 -2 -22 -27 65 -42 -21
2724 -21 -1 -20 3 33 -5 -54 -89 1 -51 -65 16 75 67 -10 13 16 2 -10 28 63 6 34 24 20 13 12 -34 -26 24 9 12 13 -3 34
2758C4Pm6lJ7m3m8J3P0jM8j0m0K0n0L4qK3n8pK4K0Qn2L7j4m1L7p6Q6l5R9p9N3
2791A9pk0M5J8n1l9rR6j9Lj7k9P9o2j6ML2lo6Q0J5n0j1J6plkj4O4p0mQN3pO1p6
2827A1j8olm1j7J12p5M9m1L4k0k4L7j65Q4J22l2j6L0pm7L0J1qL3q2P6l3Q8m7j3
2858B2m6J37j34M2J3j7P7n4r7O6rj8mN6k4kjNM1p2L1J1j07J21j10J22o4J3K7j5
2888A0nk7j5O9n4j8L7k9R9q7n4qJ28%o5j6J1K2rrP3m6l2N3K6j12J00pk8rrOQQ
2922A1M9l0j1N5r6M2j6N8Nq7j2M5o5Q2jl0kn0M0K2k0Q0j31K1P6l2LL8p9%K6k7
2954c6P1m5M4p3N7l4Kjo2QP1j8J9K0KQm0L3%m8n0K3Q6M4j07k4L9M8n0j3O7MK0
2987F5j13L3K7o1Q6p2O6q8O2Q1r8j7J1k3P9ln7L0l5PL2nMjl7k4N1Rk7L5l5m7O7
$$ plain form
2758 34 41 -5 -8 9 -34 -82 -69 1 0 48 38 -2 18 -32 2 -6 17 -41 -48 -24 -4 4 -48 -11 -25 -66 -29 -105 -19 -54 45 -34 19
2791 19 12 -8 37 55 4 -35 -44 52 33 36 19 -10 69 7 -9 -5 27 24 -42 38 53 3 -8 8 1 -2 -4 -18 46 -24 -28 -20 33 26 87 11
2827 11 -7 -13 -16 -57 -74 38 -37 12 -29 5 -15 -39 -2 -167 -83 39 7 -9 21 14 -33 -3 8 0 33 -49 27 -6 82 35 22
2858 22 -24 113 -21 21 34 17 94 40 -57 9 0 -18 -22 34 10 8 7 12 53 -19 12 23 -84 37 -73 49 -15 -2 25 10
2888 10 5 -22 -37 32 -22 -40 -3 -32 67 -20 -74 -82 46 46 -19 -35 -24 -2 -11 -20 53 7 -25 28 54 -58 42 35 7 -2 -11 -5 3 11
2922 11 60 30 19 74 -22 20 4 62 67 -20 -32 13 -52 30 29 -1 -3 -53 -13 9 -11 69 -62 -41 35 3 6 44 -35 -35 -9 -36
2954 -36 35 -10 34 -39 18 -16 -14 -15 -77 -69 2 -16 3 23 25 33 -7 26 26 -22 -72 -49 37 81 -26 -50 -11 37 -13 -26 41 45 65
2987 65 -48 -15 12 -49 37 -35 31 -57 5 86 -12 -29 -18 -41 38 35 -22 8 -27 -20 12 7 11 10 -27 -51 0 9 -18 17 -18 -65 2
3020BRk2pL2jk3k3P0n7l5k1Q2j1N7n7N2K8q6KK0K8J5pKm4mk1M8k0j9n4M4nL9p8
3055f5P0Ll8k9L6J6N7o9J6j8j3lJ6Rk2p5O4Q5q0j4K6O4o6J8oN8po5k8R6n5J1L
3088ej0O8r8J9N9pk0o5P0qOJ9pN2m0m6j3J12j32Lk4j3J01qmj8M2K0r9L4k6k9J11
3121D4k5j5n9L0o3J00l8%KNk4N1j3K0l9K9K2l6K0L9o6N5j7k4kP6p4m0K8j8J25
3152I3p4p3M0P7o9MlK5J3k2j3K8n1J0l6M3k9RJ2Nk1pK5mj7J3L8l2kj6M1Rll4K0
3187aKnnJ8n3OP5l8k6M%M6rJ1L0No4k5N4k3J7r7L8LO5J7m9kJ5mn3Q5m2m0oM0l
3224a4M5k8qqN9p8j8J13o1MK6m4o0O3LKnk2O6m8rM5n1N3r9Q2J7j3k4L4J1ol5M2
3258C4q6N5j2J2qn4P4l3L7q1P5l3M3m0j6L2k5P7p3K5J0mj6J6j9op3M4K6N2l2J3
$$ plain form
3020 2 11 -11 -18 14 13 -10 -33 37 -20 -55 -76 6 -5 52 -5 47 75 -11 -9 11 39 54 47 49 5 1 -20 28 8 -11 -65 -21 -26 13 -65
3055 -65 5 8 -30 -59 -23 -7 50 -19 -3 -21 -34 -37 -21 -12 -34 -109 -45 40 -40 -54 -28 36 -30 -12 -18 40 33 -32 -60 36 -19 -8 -5
3088 -5 -15 53 -45 -26 33 26 6 -59 11 3 9 28 21 73 33 -13 -26 86 -46 -43 -67 -80 21 13 9 -9 33 53 -46 -12 -38 -67 44
3121 44 19 4 -55 -25 -88 12 -26 -26 -24 -19 -43 8 -5 15 -24 5 27 -9 11 50 -16 39 22 -2 -4 72 -2 -42 -14 -32 93
3152 93 19 -54 -14 63 -6 -2 -5 20 33 11 -2 26 -25 -15 -51 -8 -37 -28 -16 -11 -32 -39 -14 -18 -35 -22 16 -16 -18 -34 7 16 13 -21 -1
3187 -1 1 -4 -9 9 -44 -38 37 -1 -27 -23 -23 23 14 25 55 60 -4 -29 25 2 19 -78 -40 -37 28 45 -4 -6 9 5 -48 37 -5 -45 -51 -11 -14
3224 -14 31 3 -5 -13 46 -32 -50 63 2 6 32 -12 -72 -9 -6 -4 -9 -31 35 -13 -22 23 -28 25 -74 8 25 12 -12 22 33 27 -8 34
3258 34 -52 3 -9 3 -5 -59 15 -18 19 -62 13 -20 23 -17 -33 -1 -26 51 -22 3 13 9 -7 9 -10 -16 -89 -45 -19 33 1 14
3290A4k5j3M4j1l3J9J5Kk9K0j1j9J2Rk3O1o9Q2k7l0M6j8M5m5j9M4l9j6L2l9pN3
3322B5p7P8p0Q8Nm8L6m1N5l0Lk0j1o9M8L1MJK2k8M5rj8l6L0k5j4j0j4M9rK4KJ
3356A8J4m9k7J12p8j5P4k7m6M9l5j9ON3j9q3M3N7K8l7J4q5O9m7L1mJ3J2m7K4m0
3387d1P5N7q6m0K9J1M7m8ll7K9Km4M2M0l7j8j5L6Nj6M5o9O1j1Lj9J0kl2M6LK8
3420E1j28Q8p5M2K8j4R5n5m6J7m9L0OO2J1p3OKK6K9p7J04j03oM5l2L9Qn2J3K9
3451B1n9J8O2%o0l2M4M2j29J26p9K7N3o6p1P3L1L4Lrl7J5l1N8m4M6l1l5J3J1j
3482gqpK5K3o5M5m2P0k0N2p1l7k7L2RJ6L2m0oK0N1l6J9r9M9k8k6K0P8j5n9j0Q3
3515B1l9k2L4Np4R7k7mM6l3pk3L0O5k2o4L3j6O8r7P0q0M8oj3M7k3j3M5l8JJ6l5
$$ plain form
3290 14 -11 -24 20 9 -24 -5 10 12 -17 3 -8 -27 -15 -6 -29 32 -37 45 18 -12 34 16 61 16 -3 41 2 -14 18 -21 -28 25
3322 25 -52 26 -44 44 49 1 37 -4 51 21 24 4 -7 -76 -28 3 7 8 30 2 47 38 20 -16 14 -11 -25 -35 -49 0 -9 15 17 18
3356 18 32 -17 -44 68 -10 -25 49 22 -24 25 -10 -29 -23 30 11 -72 -29 28 56 19 33 -52 17 -30 1 -3 10 22 -25 -1 -41
3387 -41 34 91 5 -35 -6 5 52 4 1 -36 -7 -5 -49 -7 33 -4 -22 -37 -1 4 -12 33 -36 25 14 17 -2 8 6 -26 20 23 51
3420 51 -77 11 -64 -22 6 -8 87 32 -14 3 -46 -16 -10 52 63 -10 -4 -2 24 53 -24 80 -23 -29 16 -16 23 31 -21 -8 21
3451 21 -38 -20 42 42 -18 -50 -6 36 -93 33 -46 -19 34 -32 -103 -30 1 35 38 29 -8 7 -24 34 -10 36 5 -30 -17 -6 -7
3482 -7 -15 -22 3 26 -39 6 -36 34 14 66 -5 -42 -69 -37 -28 -12 20 -20 -26 -6 45 9 28 -71 -22 -50 -76 -56 22 7 -52 -62 21
3515 21 -18 -40 -6 -1 -75 22 -5 -9 37 4 -3 -26 4 69 47 -17 16 0 68 -29 41 -39 9 3 -10 37 14 1 46 8 9 25 -10
3548a0oj4Q7n1j6mN8Lr1M9j6k9J7k7Q4m4Ol0K4n2P7m6ol8L1J4M7k3k3M4p2J9L0
3581hkQ1o7N5m9l1k9k0Q0k0L9j3K3l3j1jRJ1k7M5mo1O2m9J02j09M2k6RpmMk7K2
3615a4L1l1k0QM0o1K8J6j9J2j5O5j01L8M9m6J3J2m8j2rL8Q3l3o2JM3Rn8Q1J6m3
3647A1O0j08J06j06J9m1K8P4qll3K7k6N5m7l6m0J08j8nJ2k3J6pj8k6K3Nj8J8l
3678dj1L9pk2k0O0kj6j3K6k3J2k3j6J5Om4j5L4k1N2K5l7rL4m1k0n6R2j1RMN9K4
3712H0j40P4K4j20Q8%%N8o2J6j8N7l2j11J35n9NPk8pL6k3Qo6O8K4m4l2Q9m2Ml9
3744e0K9L2q8N7k7L5j6M7L3n7m0O6j3L3l2L0m9KK4jM8p4k1O7r9J29o2L6l5l5N3
3775B2q5M2k1L9l0M0k7l7Q4q0N2jj1o0R3n0Q2j6j21Q6O6p4K6K7q7M9l2Jm4N9m
$$ plain form
3548 -10 -16 -30 57 6 -10 -14 44 47 -44 5 -11 -40 -23 -50 34 -10 -4 -34 -10 -62 15 -31 -37 -75 -44 -30 17 -6 -29 15 -57 -38 -8
3581 -8 -10 71 4 59 10 -21 -50 -70 10 -10 29 16 39 6 -5 -6 3 14 -13 32 28 -33 29 -20 82 -27 15 -11 -2 -9 -13 -9 -36 -14
3615 -14 17 -14 -34 -26 14 -47 -19 -3 -22 -10 -25 40 -61 -23 26 -20 -7 5 -43 -55 -64 -26 57 24 -38 -37 6 15 -43 38 54 11
3647 11 71 -37 69 -37 -18 -59 -31 43 35 32 -1 26 0 55 8 -28 -68 40 22 17 29 6 22 15 -3 -29 -6 -1 -19 -1 -4
3678 -4 -15 24 17 -5 -25 35 33 17 4 30 7 19 -4 -20 -5 1 -43 -58 -24 -45 7 32 -5 -14 20 -21 -41 -97 -5 -16 -7 -3 56 80
3712 80 -60 14 38 -82 6 6 6 64 2 18 0 57 25 -86 49 -10 -5 2 -26 -33 3 -20 -12 -78 -10 14 -30 -62 27 -15 -11 -50
3744 -50 -21 11 -77 -20 -47 -12 -28 19 52 -5 -45 21 8 41 9 39 -10 -8 16 15 63 -11 -32 35 -64 65 3 39 4 -31 22
3775 22 -63 -21 -42 -3 -33 7 -20 -57 27 -53 -1 -2 -13 -73 20 -30 52 36 -85 1 67 -7 19 46 -41 8 -24 -23 -67 -8 -12
3806a2k4lJ3oP6q8J5M3J7l9Qk6K0jJ3j1K3J9nn1M9j8nmk8nP9n6k3O1m5L7m3J4
3840fJ2QM9k4p7J02p7rJ8j0p3N6k2M5J4K7n9J9l0K1l1J0J3M3n9J2P6j01N3lM2
3871C9q6J2N1m1L6l8N2%n1N1K4k2Jo2N0m2N7o8J7N7n3M0J2o4K9m5LJO3l7O1m8
3903ak6J0j7n6P6n4Q9Jp3L9J9K6p3L4m6lQ5q2l1Q0mL3m9K8j2nrJ8J7m5L2J9m0
3936b0j9P5k7Oo1Q7m5k1PnK4mK3qk2j5L5J9j7k4K0L7l3k4j3L6L3p4P6q0N8m2j2
3969c0qL0J9m9l2N4L3m7J0j2L0J0L6J4q0L8J0m7N5n0JL8l6M4K4l6j5J8K2l2l7
4000b5LJ7J0k3J1L2j8L5k8Kp5K4J1KRL2r1J10j0m3N8q7N3n0K2q3J01l0L1mJ3j2
4032cJM3n8l2L1J0lk2N4Qo4NL5K9l8N5p0R5r0j4K6O8n5M0k4Oj5j4oLL2k0r1J12
$$ plain form
3806 -12 -36 -39 -26 -32 44 -44 -29 14 31 -8 0 -26 -6 -7 6 -5 18 37 32 -19 30 12 7 3 -25 -30 49 -7 -30 31 -14 23 -20 -6
3840 -6 6 14 63 39 -38 64 -13 -22 -4 -14 -87 -31 -53 -8 6 33 -26 -7 -37 -16 -47 -37 -24 19 -40 -28 48 -53 0 -3 39
3871 39 -47 -35 16 -25 11 -27 25 25 -26 25 49 27 28 -34 16 -26 31 -37 -20 37 -16 24 36 -28 1 -44 -41 -40 23 -14 47 -1
3903 -1 -27 -17 -34 -90 -14 -68 21 22 -51 -12 7 33 -40 -6 -52 -55 30 -52 -83 -3 -7 26 -23 5 -7 -12 -21 -3 14 -31 1 20 -20
3936 -20 -39 36 9 15 -46 41 -4 -25 -18 -23 1 -3 20 12 -10 -25 10 29 12 -12 8 45 12 -12 -25 11 44 -30 46 -34 24 -18 -30
3969 -30 -38 -8 11 -38 -70 -16 17 -30 -20 -32 -2 8 44 58 -22 16 26 -21 34 -16 -15 23 -13 31 55 19 4 22 44 12 -25
4000 -25 -22 -5 5 -18 -7 25 7 42 14 16 -59 -35 -24 -22 -13 19 -72 38 28 -15 43 -44 9 -41 -19 -102 -1 -31 0 -4 9 -3
4032 -3 -2 41 -17 -49 -18 -8 -11 -33 21 29 -35 -30 5 34 -4 51 -19 76 -14 -28 -2 66 11 51 27 33 18 4 -2 1 33 13 -78 34
4066C4m1R5q1p0N5n4O6Jn5N5l0kl4J6R6k9l7J6LJ1Qk3K7k3KKj1j7j4M3M5q2K2
4099fj8M5lK9q1jM2K3j1j1J0l7P6m5M2q8N7p6Q3j11K9O6pQ5p7j1NJ1J8q0M0l8
4131d0N1k5pN6q9M5k2j4kM3J9lj1J6k9k7J9J5N2j4p6L7J2K0m6O6n1M6m9O1on8
4163a1N5l9%n4J15p0QJ4l6J5j0M1j2K5l4k9M1n0k0L5J6mK7mq6Q4mk4k7M5oM0m7
4196fj3M9o3N1n9j2O2j5Jm5N1j8j4M5k3Rl6K0Q1l6kp0K8j9R1p8L4k0qK9j8j8N8
4229C6j1j2k4k1M5J6r2M2L0l9K7n7Q8l4l3k6O2j9qN7l7L0J0L3p8RJ7j4j5L9jK0
4261D0k8o1M1j7J1k0K7J0m8j5Q1K5l3O4nq8K4m1K4L8k0j0J3k5PMj3J2KK6l6J0
4293aj1l8Q8q7J7L9lJ7l6mm5O6m9K3RKl1P0j9l3j0N1Nk9L3k7N7p8L2n1O4n0Q3
$$ plain form
4066 34 -7 88 7 -63 -8 -62 4 5 -50 5 -25 -27 -61 -45 51 22 -15 1 4 15 23 0 27 4 6 8 -3 -20 -34 9 54 -28 -6
4099 -6 -24 21 18 47 -34 -35 7 30 19 8 18 -19 57 12 54 -34 23 -53 30 -81 -52 14 7 92 15 4 9 20 38 -42 -2 -40
4131 -40 11 -14 -21 35 -54 -9 -31 -45 -47 -4 15 12 1 17 -12 -39 -20 -5 47 33 -43 -6 6 26 -20 46 -5 41 -8 53 47 -11
4163 -11 44 5 5 -49 66 -4 4 18 -18 -3 -13 28 16 41 7 -22 19 -31 -51 -16 0 -4 23 19 -67 17 13 -11 -38 7 1 41 -6
4196 -6 -19 30 -33 18 -41 -53 9 -6 -5 -50 1 -17 -31 14 -9 0 -36 -16 65 29 27 -43 -15 -34 57 -21 13 -7 -15 14 -4 -22 36
4229 36 25 13 -11 -32 13 29 -63 -21 9 -30 -3 -60 28 -6 -39 -65 -3 -22 -30 27 -10 20 30 63 -15 -6 11 -3 -18 21 20 40
4261 40 12 -49 -8 -25 -14 -34 -7 3 -45 -60 21 46 13 77 72 -16 8 -33 -9 29 9 -1 12 -13 -6 -2 -15 -3 -1 25 -11 -1
4293 -1 -12 -50 38 -49 -32 7 4 21 -15 -19 -64 2 -47 -24 -15 -13 -44 26 7 -26 -36 15 20 -9 24 -3 54 -24 8 -43 21 -29 54
4326E4m4L3o0%L5n9J7K1K4n6L9P1km9K6k6M7m5K8o5MM2j4j8K0m0O7l7K1k5Qk8
4358a1L5n4L0j7k2Lk0M4j2O3ppn5O9q0R7q0K6nNk0N6j6n9M4L0l0J0J1q6J3K3P4
4391E2p7QN5j0m6J1%KM3q6J7K3j6L6QK1n9L8K1l7K1j8j12R6J5l6M0JM0r4M6l3
4423c0N6l3j0L4rj1plL2Rm7Q8o4L7o3K5KL1m8Qj2j2J5Q3m4NLr1O4P8p9k2P5r2
4457c2K8M6Ln8j4Om9M2K0O0k1r9Q7j3L0n1Kj5o0J14m2j2M1k0RJ1k9K2PJ1pm1J0
4490a4n1M2n5J56r3J8K0l0P7p6k1OJ5O8m3l4K8l8N3m0O7r1M0K4J8l0l2RJJ6m8
4521c8l3Q5k9L3j9m8Q0j18N3P5o7N8k2K2m8k2K4k1L1jj8M8J4j7k3nJ2L3o2M1j6
4552B%Jrj9%PM2n3Rn6J66Kj10O9o7L4n4Kl9P4k7%j3N0J0k1P1j11M5K3k7j7O5r8
$$ plain form
4326 54 10 43 -17 -17 18 -41 -24 -3 21 -35 4 75 73 24 50 24 71 26 54 -11 -7 35 21 3 23 -17 50 13 34 9 17 -11
4358 -11 24 -30 0 -17 -39 -36 -56 -12 -24 39 32 25 -30 39 -41 56 -24 2 -3 2 -18 38 22 -37 7 37 7 17 28 -58 -45 -22 52
4391 52 -25 -17 38 28 -18 -7 -7 -5 38 -48 -31 -8 -24 12 20 41 -18 20 41 4 25 7 -105 -9 6 -30 10 11 51 -43 3 -30
4423 -30 26 -7 -17 17 8 -3 -10 -13 19 28 -19 69 5 42 -21 4 6 37 -11 -3 -15 -27 -12 71 27 32 35 -56 8 86 7 -15 60 -32
4457 -32 -4 42 45 -13 -27 -21 -70 -28 -8 52 31 -68 19 6 36 -15 -13 -28 -88 26 -16 -28 13 -7 2 13 -16 6 13 24 17 -24 -14
4490 -14 -65 -23 -78 78 -15 3 23 -7 70 -6 -27 -21 -6 62 19 -15 13 -25 28 -12 55 -36 4 28 46 16 -16 -7 -6 10 -38
4521 -38 -71 14 -15 18 -1 -49 31 -87 -34 41 -26 32 10 32 -16 -38 -14 -35 -4 -5 -23 25 39 22 -1 -6 6 39 -23 18 2
4552 2 2 3 -6 -25 -25 -18 24 -29 -20 -76 90 92 -18 51 -16 18 -36 -34 -73 1 -26 -26 -39 11 21 0 71 -40 5 28 1 -16 49 -49
4586d9J8M5j2j1Qnl5J8JK9j8jMJ4J2l2n6M1M3k2J6MJJ4l4L8RNk2m5M1l7j2R1q8
4621b7O5o9N3J9m3k6J2M0n2M8Pj9n3%J2N6m9R4m0k7ok1j9J6N1m7k1oL3L2j7k6
4653c0p0J06k1k5K1M6N7k2m4M3o1k8K8pM9p7M8oll4M1K9MJ7m8l4O1m0j6Lj6NO9
4686D5J3r3J4K1M3m0L5n5k7N9L1l0o4P%n5J04o1M0l3M5J7k8N0m4K0l0j9K7r5J18
4717A5l8k7J4K5L6k5j9L3j5J1oN4n0N7k9J5p8J9N4o3j7J5P2p3LJ8oJ8J9l9r5Q3
4749a9Qo0O1K8l1rJ2rJpj9Q5o0J1J8k8k6K0O0m0l1j4KL5K1nM4l3k4Pj2LL3K4m9
4784cmN7n1Lj4J8l6j6N5l7L6l0k8Q0mn9lK8j6J6j5L9o7M8k9J2K9m9L7k6N1j6j8
4817a2Qk3n2P3J5k1k1M1j01R5L7r7M8M7n0L5k9k3K5J4kj9j4J5m1O7l1JlKK5l0
$$ plain form
4586 -49 -31 14 2 -9 -1 -6 -41 -23 -22 7 -11 -12 -8 6 18 -14 -70 -29 14 -8 8 12 13 27 -7 31 40 45 23 -22 19 -18 -30 61 -27
4621 -27 38 -31 22 41 -2 -28 -16 24 -28 20 27 8 -45 -45 -33 23 -26 68 28 1 -5 -26 -45 -29 22 -25 -46 -52 -19 13 -4 -30
4653 -30 -100 6 -15 -40 -19 27 84 62 18 61 0 -28 0 -7 42 -35 13 7 4 -30 11 40 44 61 13 -21 40 0 -16 -13 -29 -24 45
4686 45 58 -35 -21 0 43 3 38 -17 -44 15 46 16 -48 -41 -41 -96 8 -53 -13 -46 -1 16 -12 38 -6 14 -16 -35 -8 -103 15
4717 15 -23 -50 -36 -11 25 0 -19 14 -1 10 4 58 8 65 36 51 -27 -8 46 -17 -34 -19 53 -20 -17 1 -5 13 32 -7 -102 -19
4749 -19 -11 -71 -10 18 -13 -22 -10 -19 -18 -25 -44 41 -19 -8 10 -18 -44 -24 36 -4 -35 -49 -47 -12 9 4 48 15 -9 -2 -14 -11 22 46 -3
4784 -3 -7 50 -1 2 -12 6 -30 -46 9 -28 8 -22 -50 30 26 -33 -36 -8 -24 -8 -23 16 -51 -3 -32 -20 9 -40 -3 -29 22 6 -12
4817 -12 -4 -27 -79 -6 9 -12 -33 8 -93 2 39 -58 -10 37 -13 22 -7 -30 -5 9 7 -12 -26 -11 -52 15 -16 -15 -18 -16 9 -21
4849b1K7l7O1j02L2M1K2j0nn1N7m1M6k4Ml2l6O9mj0QN5l9j4j0L4q5R1J1m2kOM4
4882D3n8M1omrrm7L1R3q0pJ6J8l6l2N6J0k7Jn0jP2N5o4J9k9O9m8k5J4K1k3J0l1
4916a7k3O2k4m2m9J8Q0J9o5L2K7k3pJ5L9o5P0o1M4o4KQ4p8N2K6l8M9rn4J2J5j4
4948A3j3n3P3j4J1Klk3LM3l6Qm2K3M0l3J8k2j4O8o2J1k3J00j33O8L0nl4m6J5k
4980c2PK2k3M3n0OO0k3m9J1mm6P6o4M7l8M3k2L9J6n6R0mm5l8JN1n7M3k0L6J7o3
5013b6j7P0J5j5j0m1k5O8l7MN4m8M4qk0K4q2O0j3ppM6p7Q7n1j9J4J9J3k5K0n5
5045d5Q8o5N5Ok2M4r5K7k6k3P8Kj6j7K3j9N2p8K5RJ2p8L3N0l6K0n6M7kJ3n9M4
5077iM1n5N6j40P2K0K4j3NKq6O4J8j8J3M6lr2NL0M0j0l3k8K6j4LR5j15L1l1O8
$$ plain form
4849 -21 6 -31 30 -72 -40 1 23 13 8 -43 14 -27 19 -5 -1 -33 -69 0 -4 -14 -6 49 10 -4 -14 20 -65 26 37 -5 -7 -1 43
4882 43 -15 26 20 16 7 -2 -49 -18 75 -5 -12 4 22 -14 -46 10 20 -7 -6 -56 -57 15 70 6 25 -4 65 17 -8 6 27 4 14 -17
4916 -17 -40 22 -2 -44 -93 -75 5 24 -41 -9 18 -5 -12 3 42 -23 47 -14 30 -34 -32 52 -26 26 52 14 63 54 0 12 27 13
4948 13 0 -53 20 6 17 19 16 -7 -4 39 3 11 -31 -8 32 -1 17 -5 -19 49 -13 -2 -25 75 -58 10 40 35 1 -45 -30 -32
4980 -32 -25 -3 -26 17 -33 -27 33 10 -39 -28 -32 -78 -2 -66 -19 -57 -14 -36 3 19 -37 53 49 4 -34 -33 18 -39 4 -16 20 37 -26
5013 -26 -43 27 42 27 17 -24 -49 19 -18 -14 40 -8 36 28 8 32 -50 10 -3 -10 -17 29 -48 39 -12 -31 -17 2 15 -10 10 -45
5045 -45 43 -22 33 39 17 61 -34 -7 -33 -56 22 24 8 -9 14 -5 47 -31 -6 3 15 -63 -30 20 -16 4 -52 -5 -7 6 -53 -9
5077 -9 32 -23 33 -107 -35 -15 9 -4 1 3 -83 -19 -1 -19 -6 40 37 -55 -50 -20 20 10 -23 -51 -25 -39 -36 59 -56 -25 -56 12
5109A2n7P5o6L7O9p7L8n6L1mrN0o5opM5K3J3r4N5m4L0K6N4q6M5p5L9J8J5Kp0K4
5142a5j2j9L9K6j4J6p2N9L3n5M1J6r9K9j6J2k8O4m3Q8n7j4J9k4K5j5k1J9K7rJ6
5173A6J8k8lJ6L5j9j2k4M5ro3L2l8P6p5J0j9R9p8K4K7qk5MJ7l9L7l1mJ4l0jK6
5206a0j4j5k0O3mK2l2l9L0L2LK2n8K8J2L5m2J9q8N3k1M8j3QJ0p0J23j05j3Q3l5
5237A2jo1O7jPj4k3PK1K4l2M3o7N4k1L3l6K8pj08J7P6o6P8Knoqj3O4n0l9L3J9
5271B7n2ONj7J6qK2RM8k6J9o9K4rQK8qm3O9j29R3k5K0m0L9M1J1n0om8R6Mp1L3
5305A7j7O5p6m5P0k8o0J2Q7lm3N2k5MJ7q7N0NK6k0l9L3K2K0m5nl5M7n2Q2nN9j04
5338b1J8M0k4k2J4J7p1O7o2O6K6j7J2K5n9l4j9K8j9K2R1j03J2M9n4l6M7MLJ6k4
$$ plain form
5109 12 -45 30 -36 1 70 -7 31 -25 6 2 -7 43 -22 -28 -35 10 33 46 -48 7 -37 -7 19 73 -13 32 -43 -4 14 29 31 -39 -15
5142 -15 -27 -46 -7 19 5 21 -51 8 41 -14 27 43 -56 -27 -43 -31 -59 5 -38 50 -7 -21 -2 -26 -1 -16 -37 -18 9 0 16
5173 16 34 6 3 19 54 35 23 -1 44 35 -28 4 -34 42 -33 -23 -42 57 -21 3 30 22 -3 1 18 -21 16 -15 -19 -5 -35 -36 -10
5206 -10 -24 -39 -59 4 0 22 -10 -49 -19 13 16 38 -20 8 20 55 13 32 -56 -3 -24 24 11 19 29 -41 82 -23 -36 47 12
5237 12 11 -50 17 16 23 9 -14 -7 14 38 6 49 -18 36 15 48 12 40 33 -75 -58 18 -48 30 32 27 21 13 0 64 14 -25 8 27
5271 27 -25 -19 -14 -31 -15 -23 -1 8 56 30 49 -20 4 -5 3 31 23 -20 49 -80 13 -12 8 -32 7 48 59 9 3 -45 51 55 -16 17
5305 17 0 65 -11 -56 14 -14 -74 -62 25 22 -21 31 6 10 27 -60 -10 -5 21 1 -38 -5 17 37 -8 -13 -48 -1 -53 29 24 83 -21
5338 -21 -3 37 13 -9 5 22 -49 18 -44 22 48 31 43 68 9 -25 -44 -16 -35 -13 78 -25 -13 36 -18 -54 -7 -3 0 16 -8
5369hl8N7L1n3L4k5k8m9L5N2k9L7p5K7l7O9K7q4RP4q0P6J0j16L8K5J6j6M4k7o8
5400g2O7N3lk2j5J7jK7j2Kk5j0K5k6J1m5P8m8j1m2K2QL1l1K3n7Q6o2N0J5j5l3
5432a5K2J1mn4L0L5j3koL1m4k5M8J7k7k1nL9k6M9K2k0K6Mj23M1L3K0n7j5%NK9
5465EPK6j7j4K8p4J9j1K7l0J10o8m1L8l9K2L6n1P4o9j8pK5j5Qj0K8RL1n6j0O7
5497C0n5M9M3r7RK1J9n7M4k8K4l6j4P3m1k9O1L5n4j8K4nj4J8l7P8L1j6o1L6j8
5528A5m8m7Q1M5o5Q2q0J5Orj4M1k9Q9j16L8k8M9Jp2P3p2nK0J1j5K2K8kk9K1l3
5560b7L8N7o9j4Mk3J6O4p4N2Kl4L8j1j9M5mj2m2M3oj03Q9l7L0j9K8m5R2p9L8K7
5592D5l4k1j6M8l9M3o9N3k8M6l3lJ7q9R0j5o6Q4o5M2Qo9J12k8mo1M0K6k2O3l8
$$ plain form
5369 -8 -46 11 42 -11 23 -2 -30 -79 -44 8 -21 16 -59 -32 -69 0 27 -57 -48 26 -54 22 32 -84 -46 -21 -5 -21 23 -4 -72
5400 -72 -5 48 45 23 8 25 24 51 39 41 16 6 31 5 16 -29 49 1 -10 -52 -30 -22 9 -22 1 -56 30 -32 18 33 18 -15
5432 -15 7 18 14 -40 -10 25 12 10 4 35 -9 -34 14 31 4 -17 -22 17 -9 40 62 42 68 72 -51 -10 23 43 -14 -29 -29 -24 5
5465 5 12 38 21 7 35 -39 -20 -31 -4 -34 76 8 -33 5 -34 -12 24 -27 47 -22 -40 -47 -22 -37 -29 -39 -11 -2 29 -27 -37 30
5497 30 -25 24 67 -30 -21 0 19 -38 6 -22 2 -34 -48 25 -16 -45 16 51 -3 -21 3 -2 -16 2 -35 43 74 58 -3 33 15
5528 15 -33 -80 1 46 -19 63 -17 -2 4 -5 -19 22 -7 82 -34 4 -24 25 26 -46 27 -45 -50 -30 -19 -34 -12 16 14 -15 6 -27
5560 -27 11 68 -1 -15 -11 -34 -18 46 -28 24 26 -8 30 19 0 45 41 29 -13 30 24 -79 10 -27 3 -16 12 -33 59 -20 18 45
5592 45 11 -10 -26 22 -17 26 -43 10 -18 28 -5 -8 9 -80 10 -5 -71 13 -52 -10 -2 -71 41 13 9 -52 -12 14 -8 55 17
5623A7J0J0l6L9qk3K2RK7Kk5k7k9jnL9oPo4R0l8nJ7k5l2K5k2L8mK6n0J3k1M8n7
5658c9K1K1K6l5n5N2rLj5L2k4l9J04p4qL1k4L5omJ0k4nJ1L0J07q2n0l1m6R5n0
5690d2O0o9O1J4mk2K9m7M4jL0q3N0K5j19O8lJ7m2M4k8N2n4K4M9qn4J5l0j2M2m6
5722d0N6l9k9P4j8o7O1L8K1k8Pm0j9N6m3%j1K1j1k9Q8o5rK8O5%o3KQ7o8n5L0L4
5755C4K3l0nq8N2O5p3%K3k7K6J3j5j0PpLm1L5nJ0k9L4o8R3o1pN2j9JMO9k8j4m
5790A3oK3k0j3M2mj3j6%oMJ0M0o9O1j5j9k8L3n1M3K2m1J2K2l1J4L7o7P7m9o0P2
5823A7n2mR8m8p4J11r0M4M5k9ml0M5o0K4J5l3J02m3L8r8KN3J1pqL5n1k0O3n2L1
5855C1j01J14o1J4MRkKO9n4j5m9K0m2M7N1jQo8k6L4n5N9M2n5L4q9O6K0n4N5l2
$$ plain form
5623 17 27 37 1 40 32 9 31 40 67 69 44 17 -12 -13 -18 21 15 22 -42 48 10 5 22 -3 -35 -10 -32 6 2 28 -22 -9 -30 18 -39
5658 -39 -18 3 29 -6 -61 -9 -18 -15 -30 2 -22 -61 43 -31 -39 -8 -32 3 -3 -7 3 -21 -26 -15 15 122 40 -10 -41 -87 8 -42
5690 -42 18 -51 10 24 20 -2 27 -20 24 23 53 -30 20 45 -74 -6 -9 8 -34 10 -18 34 -20 4 53 45 -9 6 -24 -36 6 -40
5722 -40 16 -23 -52 22 4 -63 -2 36 57 29 36 -4 -23 33 -10 -10 -21 0 -11 -40 48 -17 -26 2 67 67 4 6 93 25 -30 0 34
5755 34 57 27 22 -66 -14 51 -22 -22 1 -26 0 13 -2 -12 -5 -12 -9 -50 -15 -20 -10 -39 -5 -73 20 -41 -48 4 -15 -14 -10 59 31 17 13
5790 13 7 30 10 -3 39 35 22 6 6 0 4 14 54 -15 46 31 12 -16 17 -34 9 31 -10 2 24 -7 7 44 -23 54 5 -55 17
5823 17 -35 -39 59 11 -63 48 -42 2 47 18 14 -16 29 -31 -7 8 -25 77 34 72 -26 -24 29 40 33 25 60 9 -11 52 0 31
5855 31 -70 44 -17 -3 1 10 8 10 79 25 10 -39 -19 -61 -14 37 36 44 -24 -50 -16 -71 -12 30 -25 9 -80 -14 6 -48 7 -25
5887b5J9JJ4m6K5J3pK0k1J8n5Q8m8k0RM9ml4M7m8k1J9NN7j05N1j4M1j1k1L3k5
5919Dm0ON1m8OL3jJ7j7m8N4J0o5K8M4Jk3lM1ol4j0Jj5nM5n9L3l7j9M2NrJ6l1L2
5955anM7Po6N7pm7NK9j9J9l6O6jj00R2m6k0pn1J26j4K7j13M5mpJ1J5m6k0Q9l4
5988iJN0j0k3M2n4P3j2n9j0R5o5m5K5J8Jp6M5j1M9l1m8J03n5j6k8J8K9M4J1l4
6019A8j8j0M0J0j8p4Q7k2O3q7J6O6l0n7MnM2k4OJ1l4L4J0j03N4Ql3O0K5o2k5N5
6051Go6J01m1o4M8m2N3J3k0J9j2J2l7o4Q2k0N4o8J01q0ON1m8K7j2l1O8jj1J8o1
6082a8JJ1P8j03L4N9j06P9m0K9kl8LN9o5j0K4j4K1j5kL7o3O5j8J3j7J6Lq0M9J8
6114HpK9nl9pL7j5M4p3J6O0q4P0o2OK1l2P2l0J4qJ5j7M2o2j0O8qj7l0l9O4rj0
$$ plain form
5887 -25 -6 -5 9 -37 -12 1 -6 14 -7 11 -44 44 -4 -24 -15 34 30 -4 43 -5 -26 -7 -2 55 -50 1 -13 28 17 -4 29 4
5919 4 -36 -30 21 -27 -21 12 11 28 11 -37 17 27 -38 -10 34 35 12 9 50 44 10 0 1 -14 -19 26 -33 0 -37 -56 -14 -9 -18 -2 -33 -1
5955 -1 -6 41 48 -18 39 32 -15 -10 19 0 19 -17 49 48 -52 40 -6 -26 -33 -84 42 28 55 -58 -13 -17 -24 -13 2 -44 -64 25 -9
5988 -9 -8 42 32 9 51 -3 70 58 -1 -11 84 19 -26 -1 17 18 -58 -13 -24 25 -6 -54 49 -6 -22 -50 -32 -3 41 52 18
6019 18 0 -10 30 40 22 -52 35 13 76 -11 5 71 41 -16 -12 -17 25 1 7 18 -16 18 28 -75 -21 -13 -46 14 39 -23 -48 7
6051 7 -59 42 1 -63 -15 -57 -4 9 -11 8 -4 8 -29 -93 -11 -31 23 -45 56 -24 -18 33 -15 12 0 -31 37 36 25 43 -18
6082 -18 -17 -6 72 -31 3 62 -44 35 -5 24 22 -16 -13 46 -19 -29 -5 -19 2 -13 -15 22 -41 24 6 19 2 18 21 -59 -10 8
6114 8 1 30 25 -14 -21 16 1 45 -28 -12 48 -36 34 -28 -22 -1 -33 39 9 23 15 30 13 55 -7 -17 51 43 26 -4 -43 21 12 2
6148Bk4OL5J0Lk7K5M6j48N8Jj8L4k0K2k3M8nk1k9oP4n9r3J34K0j03P1l8K5k1M2
6180B1j3k0M0k3l8N6qj7J8n0M8l9N5l8M0jM3j02K8J2kj6J5J4k2j2Mp4Q3mJ8L2
6212D8j4o2K5o8J4J08m3j3l3M6J3l4oRj1K1n9JO8K7q9M9KK6k3Q0q9K1K2n6M4J9
6244D3q3L6K3Jk5J5K8p3M5J0k2L1o1m1Q0N7m8o3M7J9l2J1j5M7k9j2M2m5QJ6J0
6275B0j9k3N5k8m7K8J7k8J1Rrj5KJ6L4m5ROL5k5l2o2J32K6j22K6M7J9Rrm1JK7
6308B4l0M0o6Q6r4P2l5J5n2K9l1P9j3q2O2N1k6l8M8q6R2r8J01n3m5J02k3l6L9
6337C2Jl8l3O2j03L7j0R0o1O1m8L1%k7j5K9L2j8k3K9j6L5n4L9Mp1M9j7K0k8P4
6368F3p5RK0m0L9k7K3oJ4j7On7N3Kl0K9k1O4Jm8k6Q3r2K2M4q1N5j7l0L6JL7m6
$$ plain form
6148 2 -22 -16 19 29 32 5 30 76 -72 -14 -13 -31 3 -17 5 -18 30 25 4 -25 -31 43 -16 -109 25 45 -58 13 -25 0 -21 21
6180 21 8 -12 28 5 -33 23 15 -2 16 -34 14 -25 30 -8 32 31 74 -28 0 12 10 -6 9 23 1 -11 -7 -81 2 -2 16 48
6212 48 34 -28 -3 -71 -57 51 8 -5 -38 8 21 -13 -19 -10 -21 0 -59 -58 10 37 -52 -3 -1 25 2 82 -7 14 36 -20 24 43
6244 43 -40 -4 19 20 -5 10 38 -35 10 20 -2 29 -32 -73 7 64 16 -47 0 19 -13 -2 -17 30 1 -11 31 -14 -6 10 20
6275 20 1 -22 33 5 -42 -14 3 -25 -14 -5 -14 -29 -27 -11 23 -22 -13 -7 28 3 -29 -91 41 67 -55 -29 18 37 46 37 -4 -3 24
6308 24 -6 34 -32 54 -40 32 -3 12 -40 -11 -42 37 24 -58 4 55 29 -9 39 -47 45 -53 48 -5 -50 52 29 -7 32
6337 32 33 -5 -38 24 -79 -42 -52 38 -23 38 -10 21 21 -6 -21 8 40 22 -1 28 12 47 -7 32 36 -35 14 -3 17 -11 63
6368 63 -12 -3 17 -23 16 -11 12 6 20 3 9 -48 5 7 -23 6 -15 49 50 2 -24 59 -33 -11 33 -48 7 -10 -40 -4 -3 34 -12
6401a2j1M3m7l0R4J5l9K4jn7l8O0J9MJoN1r9j1L0J00o8m5kN3m0K8Lj4k9M5o3J37
6434I5r1LL7k2o3Q5l4Ol1L5m5O3n6MK4m5O7l7K2n5K1J7jL7k4Pl2pJ6QJ6m6N1J7
6468D2ONK1j13J8O3m8j6mK2N3k3l5k1J2lP6q2J3N0m6k3N9j2m2N9m8K6Ml0M7l2
6500bj2j6L6np2J01l6l2N8j2J4o9NOJ1P2q8RL4j7L1k0k2J7O1m9j9KP4m2l6PN9
6533D8l3K8k1Nnl1l5P1k6RK4l4p2N4J9n9M2M9m9L5m9L2j5M4mn0J4o5J01j9j6m7
6565e5L2J3nk5RP3j1K4l2j6K5q6M5m1O8l8J5Jmm2J02l7K3k9j9M2n7K3L9l8J3K7
6597C9rJ7m2K5ql0L5o1P8k9m4M2k4r1Q9M1l4n0J2j6Q7m0K1O5o8l2K8j6j9OQkJ3
6630iO7n2j1L2n3O5n8RO1M4j03K6k1Q1k9l2k0M9n3NM6K7o0K3m9M8l6M6n8L5k1
$$ plain form
6401 -12 -23 20 -27 -57 37 52 13 37 36 -21 -59 1 20 24 25 19 70 -29 -40 -10 90 22 -23 -25 28 -12 16 19 5 -24 21 -42 95
6434 95 4 7 44 22 -41 44 10 16 -15 20 -25 38 -18 -14 10 -35 32 -5 17 -38 -17 0 -1 36 12 19 -13 -20 -4 4 20 -26 25 42
6468 42 48 53 74 -39 -21 42 -6 -22 -26 -4 49 26 -9 -30 -18 -21 55 -27 -14 36 -10 -33 26 14 -28 31 -17 9 13 -17 30 -2
6500 -2 -14 -30 6 1 -71 30 -6 -38 20 8 22 -47 -42 -36 -25 47 -41 -32 2 -15 16 -4 -26 -9 52 3 -16 -14 60 18 -18 -11 48
6533 48 15 43 22 27 22 -9 -44 27 1 10 34 0 -72 -18 1 -58 -16 33 -16 19 -30 2 -13 31 27 -23 -9 -74 27 8 -8 -55
6565 -55 -23 -10 -15 -40 -31 42 31 55 23 7 32 -54 -9 -50 18 -20 -5 -4 -8 -50 52 15 38 9 -10 32 -25 -2 37 -1 12 39
6597 39 30 47 5 30 22 -8 27 -34 44 15 -29 13 -11 -102 -13 28 -6 -56 -44 -60 27 -13 8 73 5 -27 1 -15 -34 -28 -20 -22 -9
6630 -9 58 6 -5 27 -26 39 -19 -10 51 95 -8 18 -3 78 49 17 -3 46 -7 -2 44 71 11 34 -15 33 -3 43 -15 20 -1
6661aL5kkk4Om6J5K7m9J3J1Qm5M4j3M9J8l5m8K6mK3k1J1L0n3%O1r3O3K4j8m6R0
6695E4m5QLl6l1M3lP5n1K7J2k5k4j3OlRm0K8M6j2k0K8l6j7M8o9L3j5L7M6p3Kj0
6729a8%J2jK5qqj6rK2L0Rm3kPl2M1MJ5k0M6k0m2L0L4k5K7j6%o9K3K9plM6p0mP
6766fJ2Kk6L2J4j4k8%OK2n3N1JrL1n1JjpJ4M3l3pj6K8k2l9J7OK1Lol2L7%J9o3
6803e3OJ08j7J1k8k9j3RK8o0J15j9r3O8m9O8n6O8l5j4j3K7k8J0pRk6O9n3j3k3
6834c3L7o1J8mK0jK8J1j9k4j9OM8l4nJ7j8N4Nk2J9k7J0m2L9J6mMk8L2Rn7N1l2
6868fL0prj9JM1m3J8k1L3j8k4J7J4RJ1L1qk2j24N2O8n1N1K4n6j8L0J1m0K1J9j6
6901ak8j2L8mml7M9l4L2Lk3L3mk1J8l7Rpk4O6k8P8o1P2q3K4M3m8n%K6%k9j6K4
$$ plain form
6661 -1 34 32 30 6 12 -34 -19 8 -41 -28 -17 -9 -54 -10 -23 26 44 9 -39 -13 -17 6 -15 -4 26 -27 -27 34 -59 4 28 10 -36 54
6695 54 9 17 20 -16 -47 -4 -7 68 17 44 56 31 7 -6 0 -3 6 -34 -6 40 28 8 36 0 -17 31 -38 -5 -20 17 63 -10 -8 -18
6729 -18 -18 -6 -7 18 10 2 -14 -23 -1 29 38 -5 -7 0 -32 9 13 28 8 54 34 -8 22 56 31 58 42 42 -27 -4 25 18 15 61 -9 -13 -6
6766 -6 6 8 -18 14 28 14 -14 -14 -8 14 -39 12 13 4 35 -16 -15 -16 -23 -9 34 1 -6 -22 6 -16 -55 -38 -32 -11 -8 -14 -46 -9 -9 10 -53
6803 -53 -47 61 44 55 27 -2 -15 -6 22 -38 77 58 -35 33 -16 52 -4 64 29 15 2 29 1 11 4 13 -13 56 3 -10 -33
6834 -33 4 -57 -39 -43 -23 -24 4 15 -4 -28 -47 -41 7 -27 -32 -15 -33 21 26 4 23 -4 6 -36 3 19 15 19 -9 23 32 -25 26 -6
6868 -6 24 17 8 -11 -10 31 -12 6 -15 18 0 -24 -7 7 16 27 58 50 28 -96 -44 24 -27 24 48 -8 -26 4 15 -25 -4 15 -1
6901 -1 -29 -41 -3 -7 -11 -48 1 -33 -1 2 -21 12 8 -13 5 -32 -23 -30 -54 12 -16 62 1 73 -10 14 57 9 4 4 30 30 1 -15 9
6936IJ7Jm6j8M8N2p0p7N2n8P2K7j2K3l0K3j06O8%M3Mj8j9K5k8J8p9N6K9n8K4M8
6968B0m5P6n3QL1n8P1r4N8j3l4N9q0P2l7L2m1Q0q3jJ2M4L%m9K8k8j8N5k3L6NJ9
7001E2m0k0m2jL1K8QJk4L2qomoO1j27N1k0nm3K7O2j2l6Q6k0p9O4M6m9L9m1L6j3
7035B8kK2m2K4K3k2o6N9J4K4k9l1N5o6RL0l3J4J4m1M3k5oJ9l7K6o6J1L2J8n8J2
7067d7K2O6m8K2m3Q6r9J8J2Lj0J9J9l0J7LM0q3J05n8KR1p2m3N9j04PR1J8j08K5
7098b0J5OL6l0rj0pM8l2K2k8J9pJ4j7RN4k8p8LK7J3K1l2J2j2pNM4l5L4oN2q6L4
7133B4K3J1k7l5NL1L9nm9ljk3K8j4pl1O4j6L7o6L2K1l0Ol1J9P2q8O3j10Q9M3%
7166G1m8l4J1k3J5k4J4j6K2K0l9M6k9k8M6K2m1l5O6K7m0M1p0M2L3m1jk5P4p1m1
$$ plain form
6936 9 26 27 -19 -37 11 63 -7 -84 -32 -90 -18 9 -3 20 -10 13 -93 -25 -25 18 22 4 -15 10 -18 0 -79 -23 6 -52 -28 20
6968 20 -25 51 -2 6 37 -21 50 -44 14 1 -33 26 -54 18 -19 13 -28 52 -31 -32 -20 24 27 27 -22 6 -22 -40 15 -8 28 33 52
7001 52 12 -8 -50 -51 -20 8 16 17 -7 25 17 11 7 1 62 -65 -14 -34 -39 -82 -55 7 -5 -41 45 25 -54 10 56 7 46 5 41 28
7035 28 26 48 6 30 53 31 -35 24 38 62 33 2 57 -9 0 30 -3 11 25 -16 27 2 -4 15 -22 4 -62 -51 -19 -1 -59 -47
7067 -47 -25 41 -7 15 -28 58 -41 -23 -11 -8 -18 1 20 -10 7 10 50 -33 72 14 16 107 35 -8 51 -53 -46 45 63 -45 -20
7098 -20 -5 1 37 7 -2 -12 -19 29 -3 19 -9 10 3 17 0 9 63 35 -43 -40 -13 0 21 -11 1 -11 -18 -13 31 -4 30 24 76 -10 24
7133 24 47 58 31 -4 1 32 71 66 17 14 13 -10 18 4 -3 -34 30 14 51 -15 17 38 8 14 -17 2 74 -14 49 -61 28 71 71
7166 71 23 -11 0 -23 -8 -32 -18 -34 -12 8 -31 15 -14 -42 4 26 -15 -50 16 43 3 44 -26 16 49 8 7 -18 56 -15 -56
7197e6k7P6pO9o6L0m1Q9J3o8J3k8J2J0k8m1Q8m8J9k7Kn3O0j1J41j62j9P5l9J8
7227fl7Q3o6L5m4k1K8RK4j5J9l6K8n7J30j00J3J9l8O3k3o4J37j26J12%n6M0m6
7256ELK7M0j23J02l9J8j5qk3N8m0N1k8n7M0l1J5K0%m2J06q8rm7L4r1J21K7k7o5
7287f6N5J1J6K0po8L9j5K0J8j9m5n5Q5l0j1J5P9n2J0O5j27O9k4K4Mj8j4L1lk1
7318a4lk9N5o5Q4Mo0MP1n1Q9l4j4k1Rn0M8k8PMm4J02n2j0L1m0Pl7mM5J2m1L0l2
7352b7kK3n2J3P6n7J8L5q2J10l9n2J3PlL3nj0JL6k2N5l4m0nP9l4O1r0l8L8Lm6
7385c7L0R2r7oM2j0rj4J0l6J8O4m1j8J6j3P5j05J2M7q4Q8k6l0NN1k2j1k5O5J7
7416D8m0j2RqkK9jk7k3P6m1jnO9m8J0pm7M8j9K9MPm6K7J9l2k1K6l5j7P6l1rrk4
$$ plain form
7197 -56 -83 -7 -14 55 -11 19 -22 67 80 12 25 -3 9 19 -9 -50 38 -10 9 -18 -16 -69 -9 -20 121 -41 -60 15 -24 -6
7227 -6 -43 40 -26 9 -35 -56 -28 -19 5 -10 9 -27 1 -56 74 -26 -13 6 -32 31 8 -56 81 -45 67 67 11 51 5
7256 5 8 35 75 -48 54 15 33 18 10 -13 45 5 56 28 -29 11 -20 -5 15 15 -27 79 -9 -18 -65 -31 -122 -1 26 -1 -66
7287 -66 -11 0 16 36 29 -39 0 -15 5 23 4 -41 -96 -11 -41 -52 -37 42 -10 0 65 -62 7 -17 7 11 -7 -21 10 7 -14
7318 -14 -17 -46 9 -56 28 32 -28 -24 47 -4 85 51 37 16 25 -25 23 -5 2 6 -38 64 12 2 33 -7 0 -37 -41 4 16 -25 5 -27
7352 -27 -29 -6 -58 -45 31 -26 -8 27 -55 55 16 -36 -23 -16 -19 14 9 -1 0 36 14 69 35 -5 -10 69 35 96 6 -32 6 9 -37
7385 -37 -7 85 -12 -18 24 14 5 -9 1 -35 -17 47 6 -12 4 -9 66 -39 -27 20 -64 24 -2 -32 -27 24 2 -9 -34 31 48
7416 48 8 -4 5 -3 -5 24 23 -4 -27 49 8 7 2 71 23 33 26 -21 27 8 37 41 48 2 29 48 16 -5 21 -14 -31 45 14 5 -4 -28
7452b8R0j24J3kK0L8n8M3M5q6J9K6k0P9ro5M8l0J8K6n2k2J8N7Rl1OrK1k3j8K4
7484B3K3o9J08m8j3Lj9J6m5P5q1Q0q6m0Q6m2m4J7L4K8qk9K3j9L4K6k5l6R1o7k2
7515b6K9J2k9j0M4m0K9JLl2Nk0L6MK2j7m0R6j06R7j20Q8j8k3PK3jn8O0k3L7n5
7547b5J3M8m5N8m5N7o5j7L0l4K1K8o0K6oqkL3J0L1m8Pj16N7K2K0L6n8LNN9r5J
7580e9J00r1J2J0K3l9K7K9k4K7Qj5p3L0M0L7o6N3q4N6L3k6%KM8q3m2O0p3N4J05
7611G9r3K6l0P5l4j2k7j1o8J24m1pMJ4MkKK6l1j0j8K4k0k9rM0j7MR1n7J3N0p2
7644a2j2Q8o3l2K2N9k1k1K9o9N6j9j9L2K7k0o1N5K1k4K2n8n4O9N9o2j3Rl0M9K5
7675C2n1%OJ6K4kkq3M0j2K3qn2N1lN0m7%M0P8q2rL1k0m1O0K9l8L0n1jOom7R0q3
$$ plain form
7452 -28 62 -62 -49 -51 -31 7 -51 -8 37 -49 -30 -4 -24 55 46 -19 29 -1 17 43 -9 -31 -13 44 53 22 28 19 40 17 -1 23
7484 23 46 -23 85 37 24 27 8 24 -21 54 -27 53 -33 -73 13 -29 -73 -56 -22 6 -2 -31 -8 -27 7 33 8 -28 63 -4 -26
7515 -26 3 15 -14 -24 20 -20 9 10 13 -19 -14 -34 2 6 28 11 -29 67 -39 58 -62 26 8 -15 -8 15 14 -44 16 -7 30 -25
7547 -25 -12 36 -9 49 4 61 -4 -21 9 -25 -4 24 -36 -10 -16 -24 -26 7 17 48 0 7 -109 -52 -30 -10 26 -32 -29 -24 35 -60 -59
7580 -59 41 -50 -38 -28 -5 -44 -17 12 -12 15 23 8 -65 -35 5 42 -24 29 -55 1 34 8 8 10 58 -25 -67 -7 -80 -26 79
7611 79 -14 12 -18 57 23 11 -16 -27 -95 29 -12 -19 -15 -1 3 1 3 29 -2 -12 -30 -6 -26 -55 -64 -24 -41 -37 54 -3 10 60 -12
7644 -12 -24 64 1 -31 -9 50 29 8 37 -32 24 5 -14 18 45 25 -36 19 40 16 38 -20 -74 -5 54 -8 -21 -12 -42 7 32
7675 32 -19 -19 -13 3 27 25 23 -60 -20 -32 -9 -17 -69 -18 -21 29 -18 -18 22 100 18 9 40 20 -21 39 68 30 60 9 8 14 8 -39 51 -32
7711c2J6M6J5k8K9k4k0N8j10J52q0pRk8k2K9L1j3k5Qo4N1J5l0J4J1n6L6N8j00
7741f1N1jK2L8j22P6j2l2ML7k6OrM1j5Jk8O8k0K2k9K3k3J2n7Q3j0j5m2J2M9k6
7773A7j0N0l6l9K8%L5k3j3pj3j3K8m7N2o2L5J3rK8N3j10M3N7j10P0j3l8KM5N9
7804G2r7MM4K2p7j9J31k9j01lM3M8p9M6NK2k7K4k9QK4p5OM3J9O2m7j2j6QM3j18
7836e5O0J0L3l4m5k9J2J00o5k1L5N8l8qK5o5KJ6j3oj3M7o5J1L6k2L4k5N1j9k2
7867a5MM9p0J21m9j7j7L5m1k5L5l5K2J0k2J0L1NK2q3O8p4N2qj4J7j5N2k4j7o4
7898e7Q5j12R9n2K1J1QqP8r5P1k1rk6m7O5p6NO5n3M7l5oK8J7L7n7p0P0O6m5K4
7930B8RmkL1j9n0M5m4Q0n7k4OL4k7K0k8j9P4J0m6qj0L6q2M1L6q9J26j00K2j1K1
$$ plain form
7711 -32 -16 30 45 17 46 22 2 60 -50 102 22 15 24 -4 -26 3 34 21 -4 4 -60 -9 6 -24 -10 1 -55 -19 39 -61
7741 -61 -10 -11 11 49 -73 3 -9 -41 -37 0 -26 -20 -29 12 -3 -2 -30 38 18 40 11 34 11 23 -34 49 39 24 -18 -6 43 17
7773 17 7 57 21 -18 10 10 45 22 9 2 -11 -24 4 -43 9 -53 -18 -5 -14 14 67 -43 0 57 -53 17 4 -34 -32 13 72
7804 72 -25 -21 23 45 -32 -51 80 51 -50 -53 -10 38 -41 5 10 32 5 29 0 8 32 -43 -37 6 25 87 40 28 12 20 63 -55
7836 -55 5 15 48 14 -31 -60 -48 52 -13 -34 1 59 21 13 38 -27 -25 -9 -22 -28 -41 6 -59 -48 -12 -34 0 -25 26 7 -15
7867 -15 -11 38 -32 89 40 23 6 41 0 -25 10 -25 -3 7 -15 -5 26 31 53 -30 38 -36 16 8 -6 11 -4 48 24 7 -57
7898 -57 28 -84 15 -37 -16 -5 3 -5 73 -22 49 28 19 -7 -54 11 -65 -60 5 -48 -1 -36 -42 -14 3 40 -17 -87 -17 49 4 28
7930 28 37 33 31 62 43 -7 38 -6 74 17 -7 -1 33 6 26 -2 -21 53 63 17 9 -1 35 -47 -6 30 -59 67 -33 -11 -22 -1
7962al5j1L1n0M0nM8k3l6K3J0K4n9M1j9PJ6j3OJ8k5O9j4JNj12P8P7r0P3j09N3
7994A8l7P7r7R8p7M6k0jJ3n0K4L7Mm9j3P5j8qn1L2J4n7J14o4m4L3pP5m2J8p2J7
8026a2pL8%l5J3L9m3J7M1o0mJ6MPQONl7Nk5j8N1M4n4J5j9pk8K4J6N0nm8%M1l4
8062DP4m5k1O5j01K4M4l8Ll3M8l7n3J03o9k1M2l0M4l4mm7J02l6nK3l5O4n4N5q7
8093e5J13r6L5J0N8j11J0J3qL3nN7j15R5l0L0k8lL6Ol5m3O9m8N0l2J0K5m6Qj3
8124a0K0l8O6j9Q3q7pl0J5K9n3P5j07M9j4m0R2qm4K0m6P9l0j6L4pm7N2J2l1QJ17
8156A17j02n8JnJ10p8J3PPo8P5k2k8K9K2j4m1M0k7P4l2k2jN3p4P4Nq2k1N5O1o3
8188Ep6N9k5
$$ plain form
7962 -1 -36 -47 -16 -66 -26 -31 17 -6 -42 -19 -9 15 -44 -3 -22 -15 1 -12 -6 12 -13 56 42 43 48 -64 14 91 1 74 -35 18
7994 18 -19 58 -39 59 -18 28 8 7 20 -30 -6 31 35 -14 -27 48 30 22 -29 3 17 -40 74 10 -34 -1 -8 67 25 43 -29 -12
8026 -12 -19 19 19 -16 -3 36 -7 10 51 -9 -13 3 7 14 22 28 33 -4 1 -24 -42 9 53 -1 14 -5 -12 -40 -16 0 50 45 -3 -3 38 4
8062 4 78 33 12 77 -24 0 44 6 9 -24 24 -13 -66 37 -32 -53 -11 -41 3 -31 -35 -82 20 -16 -21 2 -33 31 -23 32 -55
8093 -55 58 -38 -3 7 65 -46 -36 -23 -31 2 -3 54 -61 34 4 34 6 3 39 45 10 -33 36 -12 38 6 16 41 -5 3 -10
8124 -10 10 -28 38 19 102 15 8 -22 -7 22 -31 44 -63 -14 -28 -68 24 16 -28 -8 -54 25 -5 -21 13 6 -41 11 23 -8 0 117
8156 117 15 -43 -42 -47 63 -15 -2 5 12 -56 19 -3 -31 -2 20 6 -35 5 -22 52 20 -2 -3 50 -24 50 55 -27 -48 7 68 5
8188 5 -71 -12 -37
8191c7
$$ Imaginary data points
##PAGE= N=2
##DATA TABLE= (X++(I..I)), XYDATA
0@%%%%%%%Qj2J2j6J6k4L2l2M0n6O4p2Q8j04J20j41J65j87K13k42K75l15L55l99
31b12M52n06N64o31P03p81Q70r66J068j184J310j449J608j781J973k194K444k729
49a441L062l452L919m494N213o146P421r268J2195j7570L0635j18793j82039K19885
63f0873K29867O9768j77413k43526o0606K16609K26717J3504k06590k09431k247
74b04221K19551J96500k7548k22634j76123N2019K21312J51232o5721k17179j39872
85b12684Q7072K18752J13504j01895k10433r7249J19129K04396P1496j27156j93288
96a28356n7646J40444J84870L3761j44246j74097k1619J59117J62744q129j55197
107h354j42490J0582J61501J40108l8535j63940j12695M3897J57863J10928o1320
$$ plain form
0 0 0 0 0 0 0 0 0 8 -4 8 -8 8 -16 16 -16 24 -32 32 -40 48 -56 64 -77 88 -99 114 -128 147 -168 187 -212
31 -212 240 -266 298 -333 370 -411 459 -507 561 -623 687 -762 846 -935 1038 -1156 1288 -1441
49 -1441 1621 -1831 2088 -2406 2807 -3339 4082 -5186 7009 -10561 20074 -98719 -280758 -60873
63 -60873 168994 238762 61349 -182177 -242783 -26174 200543 214047 7457 -201974 -204221
74 -204221 15330 211830 184282 -38352 -214475 -162456 58856 210088 144367 -72812 -212684
85 -212684 -125612 93140 206644 104749 -105684 -202933 -83804 120592 192088 64932 -128356
96 -128356 -186002 -45558 139312 173073 28827 -145270 -166889 -7772 154972 146843 -8354
107 -8354 -150844 -140262 21239 161347 122812 -41128 -153823 -109926 47937 158865 97545
118I7545j64901q6737P5225J53600P4218q2256j50766o0771R1230J47715M6298
129A40400j03865j37834k8721J04748J31109J9414j14894j22342j400J14669J12244
140A13528o911j20063j03519K1145J19802R3689l1387j22554q0274M3082J16886
151D3424P1653m9255j19811n9893O1115J12887M9366o4920j12698l8561P5445
162c1248J04796K5956p6788j00285j8174Q3199R4706O810q6041q7750K560Q8587
174F328Q0211j1230r0107p3402K0847R0792O3795k7582q9211n8032L5070R0154
186C7633M8471m2466q6948m0258M7797Q4167L2273n2278q1508k4859N7888P7617
198E7529J5502o0146p2779r719O4135O9054L68o6006o2004N122O6493N8351j1805
$$ plain form
118 97545 -67356 -154093 -78868 74732 148950 66694 -84072 -144843 -53613 94102 140400
129 140400 36535 -101299 -130020 -25272 105837 125251 10357 -111985 -113385 1284 113528
140 113528 106617 -13446 -116965 -95820 23982 117671 86284 -36270 -116544 -73462 43424
151 43424 115077 65822 -53989 -113882 -52767 60120 109486 44566 -68132 -106693 -31248
162 -31248 73548 99504 22716 -77569 -95743 -12544 82162 88972 2931 -84819 -82259 6328
174 6328 86539 75309 -14798 -88200 -67353 23439 87234 59652 -29559 -87591 -52521 37633
186 37633 86104 43638 -43310 -83568 -35771 48396 80669 28391 -53117 -77976 -20088 57529
198 57529 73031 12885 -59894 -69613 -5478 63576 63944 -2062 -64066 -58944 7549 65900 54095
211E4095o8741n1848J8869O7711M5710k3278o7862m0359K9664O6593L3134l3361
223C0327o4580k8313L7994O3223K1379m1579o0024j5672M4591N7083R624m6831
235G222n3870m308M9226N0095j457n0187m5997O075N1528M2014j1557n1812l7270
248e0298J5764N1557L3052j9745n1246k8591K3855N0264K3493k7017m8565j9318
260d6795K9976M7367J4329l2782m4626j0116L4361M2976N840l6953l9727j355
272c7505L7608L7142k369l9104l3864O513L9128L0948r827l9817k7330J3302L9258
285A4083K4157j6179l9327k0290J9199L7773J7201k1346l7309j3506K3970L5446
297B3872J0125k5527l4170o686K7233L2092L621k8513l0252r2K9318K7752k537
$$ plain form
211 54095 -14646 -66494 -47625 20086 65796 42518 -25344 -65703 -36039 30554 63688 30327
223 30327 -34253 -62566 -24572 38651 60030 18451 -41573 -57245 -12654 44429 54053 7222
235 7222 -46648 -50956 -1730 48365 46908 -3279 -49276 -43201 8327 50341 38784 -13028 -50298
248 -50298 -34534 17023 50075 30330 -20916 -49507 -25652 24612 48105 21088 -27477 -46795
260 -46795 -16819 30548 44877 12095 -32531 -42647 -8286 34690 40530 3577 -36150 -37505
272 -37505 103 37245 34876 -4228 -38092 -31579 7549 38497 28670 -11147 -38477 -25175 14083
285 14083 38240 22061 -17266 -37556 -18357 19416 36617 15271 -22038 -35544 -11574 23872
297 23872 33997 8470 -25700 -32386 -5153 26939 30560 2047 -28205 -28297 1021 28773 26236
310B6236l0062k5803N826L0519K2860q164l0457k0776J0983L0482J7687j3029
322A6302k9913j5362J5292K9510J2311j7226k8278r939J8905K7393O975k0202
334E768k5923m607K1448K4636J808k2309k2827M50K3034K1184k919k3456j9336
347b3049N028K3876J7311p205k3677j5332Q948K3705J3269j1049k3053j1014J2250
360i992K2723R096j3954k1954o779J4959K0943M971j6161k0053k589J6972J8633
373A6815Q20j7676j7402J147J8136J6024l000j8412j4418M544J8571J2938o238
386A1849j8595j1251P792J8294R609r017j8022p972J0277J7443O262j1183j6842
399a1356m660J2131J6100L003j2879j5175j517J3502J4264n6j3980j3143J419
$$ plain form
310 26236 -3826 -29629 -23803 6716 29576 21412 -9045 -29821 -18838 11644 29331 16302
322 16302 -13611 -28973 -13681 15829 28140 10914 -17364 -27303 -8398 18995 25970 5768
334 5768 -20155 -24762 -3314 21322 23130 821 -22006 -21556 1478 22662 19743 -3713 -23049
347 -23049 -18021 5855 23166 15961 -7716 -23048 -14100 9605 22874 11825 -11228 -22242 -9992
360 -9992 12731 21827 7873 -14081 -20860 -5901 15042 20013 3852 -16201 -18790 -1818 16815
373 16815 17635 -41 -17443 -16296 1840 17864 14864 -3548 -17966 -13422 5149 18087 11849
386 11849 -6746 -17997 -10205 8089 17698 8681 -9341 -17313 -7036 10407 16669 5486 -11356
399 -11356 -16016 -3885 12215 15218 2339 -12836 -14353 -851 13413 13357 -623 -13766 -12347
412a2347J4402J2027k865j4481j0861M125J4490R664n321j4569q223O385J4143
425F569P182p406j3969n714Q263J3380M583r017j3025l171R739J2290J949j0231
439A422j1664p18J0690J0865l63j1128r966J543J1263R008k480j1410q180L693
453g425J1279P112m363j1244o281N321J1056N173o009j0674m302O752J0364L146
467I905p255r923k149P718R506J093q092q886k24Q434Q198o87q614p544J444Q940
483A864O750k372q754o130L007Q909N310l793q665m530M283Q608L807n030q272
498e008k901N368Q031K140n844p647j444O266P231O84o558o625l5O602O448q89
514E819o849n675J400O901N207k001p044m504K666O821L953l136o792l388L607
$$ plain form
412 -12347 2055 14082 11217 -3264 -14125 -10000 4490 14154 8833 -5736 -13959 -7574 6569
425 6569 13751 6345 -7624 -13338 -5075 8305 12888 3871 -9154 -12325 -2586 9704 11653 1422
439 1422 -10242 -10960 -270 10595 10232 -896 -10862 -9319 1944 10952 8472 -2938 -11118 -7425
453 -7425 3854 10966 6603 -4641 -10922 -5601 5455 10628 4619 -6055 -10357 -3605 6759 9905
467 9905 2650 -7273 -9422 -1704 7802 8895 803 -8083 -8307 127 8325 7638 -976 -8520 -7076 1864
483 1864 8614 6242 -2512 -8642 -5635 3274 8584 4791 -3874 -8404 -4121 4487 8294 3264 -5008
498 -5008 -7909 -2541 5490 7630 1786 -5861 -7305 -1039 6192 6876 318 -6307 -6342 260 6708 5819
514 5819 -1030 -6705 -5305 1596 6803 4802 -2242 -6746 -4080 2741 6694 3558 -3234 -6622 -3015
529c015O734K661l991o538k000M347O267J408m609n991q61M985N476M30n266n149
545e112K14N348M835q40n450m293J271N454L951j732n529l432K228N373L070k657
561B699n420k433K947N252J968l251n072j519L541M828J069l815m620n05L954
576c77M299K44m327m024M22M303L693p82m353l428J241M412K938j494m463k629
592d325J959M300K283k142m366j773K505M090J451k764m049j073L060L873N28
607C557l132l525l01L251L360l5l369l175M22L527K779p18l541k565J134L595
623A264K104j345l442k006J653L536J549j936l336j215K076L246R51k304l123
638b328o76K458K994K79k578k669r6K665K588k94k727k254M98K690K159p57k817
$$ plain form
529 -3015 3719 6380 2389 -4149 -6149 -1802 4465 5873 1264 -4727 -5588 -603 4873 5303 37 -5112
545 -5112 -4898 450 5285 4445 -1005 -5298 -4027 1427 5378 3646 -1883 -5315 -3087 2286 5356 2699
561 2699 -2721 -5154 -2207 3045 5013 1762 -3310 -4829 -1288 3540 4609 794 -3826 -4331 -377
576 -377 3922 4166 -161 -4185 -3763 540 4233 3451 -902 -4330 -3089 1323 4261 2767 -1696 -4325
592 -4325 -2366 1934 4217 2075 -2291 -4064 -1559 2531 3982 1218 -2831 -3904 -844 3029 3557
607 3557 425 -3100 -3401 -150 3210 3175 -194 -3369 -2947 580 3359 2641 -900 -3465 -2331 1264
623 1264 3368 2023 -1419 -3425 -1772 1764 3313 1377 -1959 -3174 -1098 2148 3099 795 -2328
638 -2328 -3004 -546 2448 2727 149 -2520 -2616 49 2637 2343 -384 -2638 -2140 550 2709 1952 -865
655h65j850J067K742J578j232k725j301J341K697J105j637k552p97J702K489O82
671B444j983k360k91J951K190J19k064k007K14K027J821l58k077j711N42K207
687F64J387p02k162j219R92J996J069j050k026r38J300J896O75j278j897n07J425
704c75J760K89j435j668j37J488J510J9j549j426K50J590J201l91j560j044N13
721i65J522R36o77j479q72P67J505O78q62j393n32R22J373L02r84j168l29J152
739a04J134J17j149j045N7J054R79j89j109p54K00J023Q18l09j125n88M68R47
757D25N99n25j077k85M69J013K73o27q74k09O15P58J90o25q00mP15O29o1o35o11
778f47O5P17N43j85o76n01K61O48M18l02o35k81K51O75K36l59n72j65L67N81P6
$$ plain form
655 -865 -2715 -1648 1094 2672 1440 -1285 -2586 -1245 1452 2557 920 -1632 -2429 -727 1762 2444
671 2444 461 -1899 -2190 -239 1951 2070 6 -2001 -1787 240 2061 1703 -374 -2085 -1543 664
687 664 2051 1349 -813 -2032 -1040 956 2025 975 -1051 -1989 -689 1207 1882 604 -1293 -1800 -375
704 -375 1385 1674 239 -1429 -1566 -78 1432 1451 -98 -1524 -1274 316 1517 1126 -434 -1478 -965
721 -965 557 1493 816 -663 -1535 -768 737 1415 553 -840 -1372 -450 923 1225 241 -927 -1256 -104
739 -104 1030 1147 -2 -1047 -990 64 1043 854 -255 -1009 -809 214 1032 723 -402 -990 -522 425
757 425 1024 499 -578 -863 -394 619 892 265 -609 -818 -203 555 745 120 -680 -684 31 660 599 -36 -647
778 -647 -582 135 678 493 -183 -684 -423 225 643 341 -294 -575 -324 351 587 228 -344 -509 -142 439 515
799E15m22m46r2L84M68M1m00m98O2M27K94Mm08k69N7M27J79p4l31k61J84K59K25
822C25j34l23j97J23L92O0j26l05q9K19K91Q7k62k08p8J65K55o2j08k20OJ57J91
845A59lk20l7m3K05O4l1j21q1k4K18L7k8r6j21L4R6R4n8q6nk6P3M3L2p5r9N4P4
874B9K1L3l2j42jQ0R1j4q0j3j5J7O0Qnj02J2MJ23Qr3q4lJ03P2l8j17L3q9J29J29
905A24p1j7q8j3N1J38k4q2p0q5J61J36j20q3o4%J24J39o0j79n4L5J31J48j58o6
931d7j37J02J66P7j99o0jJ32Q9j2j17j22m4J69J30l4j37r2K5J49J12l9j62j00
955a52N2J52J20p4k45k6P4J77J40j37j32j60J81R2J05j30j52l5J02J66L6j78j16
978a40k7J44K15p4j54j23J07P1Q4L2k11j21J32J61rK1k24m7J53J40J3p9j76p1
$$ plain form
799 515 93 -353 -445 -61 407 448 48 -450 -388 39 333 337 -71 -340 -283 144 323 249 -82 -343 -159 100 325
822 325 191 -132 -329 -206 186 246 120 -185 -274 -55 236 323 61 -147 -225 -60 195 133 25 -195 -189 -32 159
845 159 156 -64 -101 -144 61 125 94 -27 -108 -132 86 123 95 -1 -122 -88 8 102 44 -42 -47 -73 0 43 75 0 -99 -45 29
874 29 50 83 51 -91 -92 -12 79 65 -15 -28 -43 -26 34 42 37 -65 -53 -49 74 82 -11 -95 -98 5 77 39 -78 -45 -134 -5 124
905 124 53 36 -52 -65 -14 124 100 18 -52 -137 24 160 40 -43 -107 -107 17 156 96 -83 -137 -102 29 177 19 -47
931 -47 -184 -82 84 161 -38 -98 -99 33 122 110 -7 -129 -173 -4 126 92 -45 -137 -112 37 149 110 -52 -152
955 -152 -100 52 172 98 -147 -173 -99 78 218 81 -51 -211 -30 62 167 37 -115 -150 -48 118 154 -24 -140
978 -140 -167 -23 192 118 -36 -159 -52 19 103 135 -76 -197 -65 96 87 108 -116 -163 -10 130 143 64 -112 -183
1002a83J29J66J7j63r7K5J09J02N7k19l2k7J69J28k8j91j58J23J77Q6j35r1j14
1025a50O0J90M1p4j22l0N1J93L8j60j16n2N0J95J1j39j10L3J07J14o5o3j13k9
1049a40J63J23j01j49n1Q0J30O9p6k16L1N8J79k6q2j54OJ54J22l1q9p0l9R9R7
1074H7pr5K2l7O4P0n7j29M1m6J22L8l3j18oO2J47%r2p7J5PP9jo2m4k5J22Q1j00
1104B8k9qq3Q2Q9m0l9o8M6Q4K4q6l1nj2Q7L8j20nj2J8M6K8m6MNM8j4N1l3p4OO6
1137D5Rk2n5j7J3N3P9p4l4L8o0J03q4J7k5kl4N0N9k4k6K3MJn1j7mRKM1j5L4m9
1170a3J2%LK8m9K7n0RK3M8m1Nm2P5p7K7M7n0q6Q1j6O9Qk2j3j1k3J4N0K4n9m5M7
1203@PL3K1k3n8M1J0OJ0n0n3P2%J5P4j68N7n9L1M7J7k5o0N8N2j9q5lN9p4J29P
$$ plain form
1002 -183 -54 112 129 -34 -131 -106 3 105 162 -57 -89 -116 53 181 153 -38 -196 -73 104 190 55 -36 -150
1025 -150 -90 100 141 67 -55 -85 -34 159 197 37 -79 -131 -81 114 125 -14 -124 -91 16 130 65 2 -111 -140
1049 -140 23 146 45 -104 -155 -75 55 124 48 -168 -137 -79 100 74 -8 -162 -156 -2 120 89 0 -70 -109 -10 87
1074 87 80 -15 7 -30 34 104 47 -82 -41 -87 35 73 40 -78 -84 -22 125 125 33 -44 -29 -22 57 56 -6 -50 -75 47 128 28
1104 28 -1 -9 -92 -10 79 39 0 -68 -22 62 86 0 -31 -36 -48 39 77 -43 -48 -60 -42 4 32 -14 -10 -5 43 29 80 47 -27 -21 45
1137 45 54 32 -23 -40 -27 26 105 31 -3 35 -25 78 -6 11 -14 -16 -50 0 59 35 9 32 36 37 -14 -31 -35 -26 -24 17 2 36 -13
1170 -13 -1 -1 2 30 -19 8 -42 -33 -10 38 -3 2 -40 35 -42 -15 32 -18 -104 -23 -39 30 38 16 3 -8 -31 -17 33 57 -2 -47 0
1203 0 7 40 61 38 -20 21 31 37 47 -3 -56 16 16 31 105 -63 -6 -65 -34 13 30 5 -55 3 55 36 -49 -52 7 -67 62 69
1235F9k8j24M9L7O4l8Kn6NP5l8O3j33l9N8L1Q0n6o3o0Q2P2n6J3m3j1Q5M7m3l1
1265A3p0o0J53M4n7o3Lk5J8Q2m1n8M5P2J4K3j32Lk2M8M6L4n5l5k6Q3rJ9q1j6n9
1296a09Q0Q8j1q4j1pJ07k4J5j11LN3L1K6l2r4pP4L9L8q2l2%L1J23k2n7j78O0J39
1326D6L8k3j10Rj6N0M4Pj09m1M6J54M5j00q0l2P1R6mj59m1M1K2J40Qj48k8k8R7
1355eJ14o5j38k2Q3N5P6r5p4j0O8N7Q3j23o7k7Q5J05l1Rj39J1L9J74n5j21p8k0
1383a11J09J18j3j42r0Q9N1O8K1j23j00N0N2Q0j8j33l0J22J51j35N8r7l6K8R1
1408F0N4p0q8NJ10m2O6j21q2J7R7R3q3p8o8J26J8O6p7qjlL4N3n9q8%P7L2K8k9
1439C9j22J6Q9PK8j49L7RM5M6J4q7q8R5R3nq5M4m7PO5rj2j15j9K9J05L7o0j1p9
$$ plain form
1235 69 41 -83 -34 3 67 29 31 -25 -20 55 17 80 -53 -92 -34 -3 77 21 -42 -102 -20 52 -4 9 -34 -45 40 87 44 13
1265 13 -57 -117 36 80 23 -40 -37 -62 -44 38 -3 -61 -16 56 70 93 -39 -36 -58 -10 36 70 15 -20 -46 37 28 47 -34 -50 -109
1296 -109 -29 59 48 -36 -47 -54 53 29 44 -67 -64 -11 20 46 14 -80 -87 -13 26 64 -18 -50 -50 -19 104 82 25 -153 -93 46
1326 46 84 61 -49 -40 -56 -6 38 45 -64 -105 -59 95 140 40 -40 -72 -1 95 91 -68 -109 -68 -46 94 102 -46 -74 -102 -5
1355 -5 109 44 -94 -116 -33 22 98 3 -71 -81 -13 44 127 4 -63 -90 -5 100 69 78 -61 -50 -11 163 108 -13 -91 -111
1383 -111 -2 116 103 -39 -129 -40 11 79 100 -23 -123 -73 -21 59 41 -92 -122 0 151 16 74 -23 -59 -31 60
1408 60 114 44 -44 -39 71 29 95 -26 -108 -91 6 99 16 -62 -130 -4 14 80 3 -5 -6 -9 25 78 19 -69 -69 8 40 68 39
1439 39 -83 -67 22 29 57 -92 -55 -46 -1 45 59 -28 -116 -21 72 67 -18 26 -21 -14 51 42 30 -85 -104 -75 30 67 7 -4 -83
1470h3P7J4N0n9m7k9Q0P3k6p3o3j5M9Q1O2j54lj5J05O3n9m2o4QP6J4M2j25k0P1
1500a2O8K7j14L6q0LQ5N7r8j9jNR8m0j0n2j0O6J9P1j69j2P5J5R0j4q3m1m2J51
1530F9M5q5m4m1l7J15L5m2j27M9L3KP9m1j1j7j2N1km9Jk5N1K7J8p6j5lJ07j5J1
1561E1j22M0n4J22j6l4k1o0L6N3J9pom9n0J15J1Pn5j10Q5Q4n6M2r3kO8Q7m2n4
1591a1oJ5n9Q4Oj4k8l1N7O5K6o3r4O5O1o0M1j07RL5J4L0m5m1L7L9k8J1J1r6N4
1622b3K3L5o7m0KJJ44p4O3q4l6L4N2QK4j06%N9M3K5l3k9r8P5M8j0p6L6l9j4J27
1653G0L1j08l0oN3PPNo1J0oP1jq8O0j3J4k4L3on4KM7k9J2k8k2K0P6m7J4k9Jk2
1687d1Q5M1j06k0N5Mj7N3l8nl4P1Mk9n3l4ON0N2n9M9q8pM9N2J5r7j5J5R8k3M0
$$ plain form
1470 -83 -6 8 58 -1 -48 -77 3 76 50 -23 -86 -101 -52 29 91 -63 -66 -81 24 87 28 -14 -78 -70 6 20 62 -63 -83 -12
1500 -12 56 83 -31 5 -75 -72 13 70 -28 -47 -48 -43 55 15 5 -47 -57 9 28 99 -70 -82 -7 8 98 84 1 -40 -82 69
1530 69 114 29 -15 -56 -93 22 57 15 -112 -63 -30 -28 51 10 -1 -18 -30 21 19 -30 -29 -54 -3 24 42 -34 -49 -52 55 40 51
1561 51 -71 -31 -85 37 21 -13 -34 -94 -58 -5 14 7 1 -48 -98 17 28 35 -20 -130 -45 39 -17 25 -68 -70 -2 85 43 -11
1591 -11 -17 -2 -61 23 29 15 -13 -44 13 78 104 41 -53 12 73 13 54 -53 -44 -9 5 35 -10 -51 -14 25 -3 8 19 -77 -23
1622 -23 0 35 -32 -72 -70 -69 75 1 64 -20 -56 -22 30 38 62 -44 -44 15 58 83 50 21 -77 -2 46 36 -40 -4 -43 -57 70
1653 70 101 -7 -37 -43 10 17 24 29 -32 -22 -28 43 42 -46 14 1 15 -9 24 18 -36 -34 13 -16 -4 -32 -54 -34 42 -5 9 -20 -19 -41
1687 -41 44 85 -21 -41 14 18 1 54 16 11 -23 48 52 23 -30 -64 -58 -8 44 -15 34 -54 -61 -12 40 55 -42 -57 -42 56 33 73
1719G3p8p7J17l6L0p1L2o4N2P0kl6m0k6N1J03k8j26L6M7l4J24n1r0jN0l7L3j5
1748Fj6n0j0J10l7L7r8k5J27j7jM4q9k1J4N3K0j24N9o5P6L4l0k4k6KP2m0J3K3
1778A7k9j4m7J00M4r7K5j5J2K8K2n6j8N7j6J6j3n5K3k6R0o5n0O4j6J2P8n7k2l9
1808d7nM2L7o6%O5n2QR4m6j7n4Q1j1m9L6j3k1M2JPL1j02J0J9N0RNj14K7K3M9O
1841D5n4k2J8RP7o4o3l5J0J17%qj9Jm4M4N3n0q2N0m0J24J7o9n9J1rP7qj7r3P6
1873glN9L3j26L7m8O1P5r4j7M5p6R0K6l3o4j8M5O8k9on6j9mJ06m2rm6N2Nl2O5
1905C8j6m9J9Qk6Q0m9n8n3J33L5L7j07m8O7Lj4L6j01N0J0J8P7j05l6j9R9M8j7
1934F0q3J5m5J46j04M2j1k3Kj9K7pn3k7Q1J4M8J3o3o8ML0O7k1q2J3N2j7J17j10
$$ plain form
1719 73 -5 -82 35 -1 29 -42 -10 -74 -22 48 46 10 -30 -56 -5 98 70 -56 -20 27 -7 117 66 -24 -25 25 -12 21 6
1748 6 -10 -60 -70 40 3 40 -58 -83 44 27 26 70 -19 -40 -26 27 47 -77 -18 -83 -7 27 -3 -27 -53 -51 21 -19 -6 17
1778 17 -12 -26 -73 27 71 -26 -1 -16 -4 24 46 -10 -28 29 13 29 16 -39 -16 -42 48 -17 -67 -3 -19 -7 71 14 -8 -47
1808 -47 -52 -10 27 -39 -39 26 -26 -18 76 30 13 -41 40 29 -20 16 3 -18 24 25 32 63 -39 -29 -10 40 49 54 -60 -33 -10 39 45
1841 45 -9 -31 -13 -4 73 9 -54 -89 -79 38 38 30 11 12 -32 12 65 15 -67 -17 -57 67 84 15 -44 -33 -42 35 27 10 -83 -7
1873 -7 -10 49 82 -44 -7 -55 6 81 -13 -30 15 -61 29 55 22 -42 -60 -15 53 24 18 -38 -57 -61 45 3 -6 -52 0 5 -27 38
1905 38 22 -27 -8 0 -26 54 5 -53 -106 27 62 99 -8 -56 11 14 0 36 -65 -15 -5 13 90 -15 -51 -70 29 77 60
1934 60 -23 -8 -53 93 -11 31 20 -3 -1 -20 7 0 -53 -80 1 15 63 76 13 -55 -51 -21 46 25 -57 -44 8 -9 108 -2
1964bj0k0M3pK6j2j09K7L2L3N6n0l8%O8K0o4l5J1O1k3L7l6k1L1jM4m4Jk8j5O2
1996C7m1O2r1olR3l3pKk0m2P3K1n1qk3l2J02Mrl6l8OM0K4k3l5JN2J2j8l1K8l4
2030b4k6Q2n1M2n7rj9P8J5n0J8k4N9k2N1o6r9J07k6K0L8n1J6lO8m0J6q1JK5L1
2061A9oJ3no7O7J0K8p0JnL7NLmkm2Pj1M5m1m0J21j2n0LqK4m8N5n4J0J0l6M4K5
2096B6k5O1p1l2O3m2L9j3j3J2K4j3N7j17N3l1kJnJ5Pk0K1L7m4M6m8jM4n6J5Oo1
2129f7RJ07l2n3K3L0J3ln4O3m8nK9l2L1K5o4J7M1j6mnK3l7R6k6p7j6J1N4j0L1
2161E4p6l8NP3k5M0N2j05L5j1L1K0r4M6Mlj8m0jRjQ7J1j09N6k4l1P6n6K9J7Jk3
2194iL6K2p3J0m9J08p7k0J02j24Q5OnL0j0n7M6l3LK5r1J00l9K5J2j41J12p2J22
$$ plain form
1964 -2 -12 -32 11 4 30 18 -91 -64 -32 1 57 7 -31 -31 37 57 -7 -42 -31 30 7 44 8 -13 18 17 61 17 18 -10 -25 37
1996 37 -4 58 -33 -39 -42 51 18 11 13 -7 -49 24 45 -6 -14 -37 -69 33 37 28 -8 -46 -40 0 24 1 -34 -33 19 31 13 -18 10 -24
2030 -24 -50 32 -19 23 -34 -43 -62 16 31 -19 -1 -25 34 12 63 -3 -102 5 -21 -1 37 -14 2 -1 67 27 43 -38 -37 -12 19
2061 19 13 26 21 -46 21 31 59 -11 -10 -15 22 27 30 26 24 -18 -11 -22 23 -18 -58 63 51 1 4 -4 20 -28 27 -27 -17 -7 -43 1 26
2096 26 1 62 -9 -41 22 -20 19 6 -7 5 29 16 73 -44 9 -22 -24 -23 -28 -13 -6 -26 -5 32 -12 34 -14 -15 29 -27 -12 -6 -67
2129 -67 -58 49 17 -36 -13 17 30 27 -27 36 -12 -17 12 -20 11 36 -28 -11 30 14 10 5 28 -9 87 61 -16 -32 -21 33 23 54
2161 54 -22 -60 -55 18 -7 33 85 -20 15 4 35 55 -39 7 11 8 -10 -50 -51 -42 -43 44 55 -54 2 -22 -53 23 -33 -4 13 14 -9
2194 -9 27 49 -24 -14 -63 45 -32 -52 50 -74 11 17 12 42 32 -25 21 -12 -9 16 -75 25 -14 11 23 -118 -6 -78 44
2223D4o6M3L9m8q2P3K4m1l6N6J5q3R1j9j6l5K7J7j3j8l1R1n2m5J10k6m3J8J6O5
2253G5n0j4j5N6o7M8m1O4j04j2K5J6l1L3M7l9k4K0oQK5o7Q2l6J6qN0o8J9Mpk9
2285c0k4L8KQL3k9K7q7R9m8K0k0j7K9L6o5nN5nMl9Q0j2k0pj2J8K9m3p6K0Q6L0
2318G5op0O1n8klL0j00O8O5o3nM5j0o6J2K1k3K5KL0l8L9m2lK0n6J9N1%n8K8L2
2351B0M1p3MO9j10RM5kN5p8LO1r7L6j1J2rN2lpNq2L9L9jkM3j23L7K8N2r2P0Qn6
2386a8L6N3j4j44L7J00J0j08M0M9p3K4j2K4k1L8J8p7L8J9Lm5jQ3o4L3q6N0k1n
2416c4O0pl2k6jN3j2L1n0m4Q6m0L4n3J1lQ4p0N1Nj02MJ24j9n1Oj5j6L5mj9kJ7
2449Aj1PM7m5nN7n4l7O0K5n2n5Q0k0M4q9P0p2O7lK2n7m0Q6m4N0j5j0k0J1j5K4
$$ plain form
2223 44 -22 21 60 12 -70 3 27 -14 -50 6 21 -62 29 10 -6 -41 -14 3 -10 -28 -59 32 -20 -65 45 19 -24 -6 10 75
2253 75 25 11 -4 52 -15 33 -8 56 -48 -60 -35 -19 -50 -17 30 -9 -33 -13 -19 -11 14 -53 29 -7 9 1 51 -17 2 6 -1 -30
2285 -30 -54 -16 -14 -6 27 -2 25 -62 37 -11 9 -11 -28 1 37 -28 -33 22 17 21 -18 62 50 30 23 11 29 58 15 -61 -41 45 75
2318 75 69 -1 60 2 0 -3 27 -73 -5 60 -3 -8 37 27 -39 -27 -6 -29 -4 -2 28 -10 29 -13 -16 4 -52 -33 18 18 -40 -12 20
2351 20 61 -12 -8 61 -49 -40 5 3 58 -20 -17 44 -53 -17 -28 -16 -25 27 24 17 22 -60 -21 18 17 15 58 -65 -28 0 52 -40 30 38 -18
2386 -18 18 71 57 -87 -50 50 60 -48 -8 41 -32 -8 -20 4 -17 21 39 -38 0 19 22 -23 -24 59 -5 28 -58 -8 -29 -34
2416 -34 26 19 -13 -39 -40 13 1 32 -18 -62 24 -16 18 -35 -24 -27 57 -13 38 43 -59 -55 69 50 -1 5 -10 -26 9 5 -14 -16 1
2449 1 -10 -3 44 -1 -6 51 -3 -40 20 45 -7 -62 18 -2 42 -47 23 -49 18 15 37 -20 -60 26 -18 32 17 7 -13 -2 -17 7
2481Gj6M4j3p1P8L5j32O6l4j4N1K9j3m1jM9j1K3q7L1J3RL1l6k8J2j6P8k9m0M4
2512A8l6lQ1q2K1J8m4MM4L2r3j3R0o3NN5L4o9jM8j1m0j6K5k5%M5k0Lj2j5J7pO1
2546E1m4nj0J8n1P7m3l2P5Pp4L0J5j7J1j6M4o7L8m1L4L7p4J3j8J2ML9l4L0Mm3
2578c0K8Kl2K4m4J6P3j8ko4KO4O2q4nQk9K0M9j2l3JJ2K2k8o2O7j6m2K9J9K4n2
2611c1P6n0K2l8O4r9M5j4L1N3p2n5J15o1pL6l2l0O7J8J4k2o9Q4r4N8K4j6o5O9
2641B1k1m2L1K3j3OK5l6R7n3Jo2L1K7l8j5J5%k8N0Pl3k9k1R3l9J7k9N5o0j5L0
2673eJ5L2m2QJ6NJp7P7Rp8L4L2Km8L5k3M8m1j1k1OJ7Nk7JR5o5N0p7O1o0lN2k6
2708cJ8k8Qq2O7J7K1k0M5Rn9j8j8O3QnJ8n4MK0l%m6K9P3p6lk2L4J2m5K7k6J8m
$$ plain form
2481 7 -9 35 22 -49 29 64 -68 -2 -36 -50 1 30 17 -24 -25 24 13 36 -51 -20 -7 2 33 -3 -31 -19 -35 43 14 -26 18
2512 18 -18 -21 60 -22 -1 17 -27 -23 21 53 -40 -53 37 -26 -21 34 68 -1 -2 46 35 -5 -21 4 -21 -21 24 4 7 -5 -20 -3 -10 51
2546 51 7 2 -8 10 -41 36 -7 -39 36 43 -31 -1 14 -3 8 -8 36 -31 7 -34 0 37 -37 -24 -42 -30 -26 13 -21 9 13 -30
2578 -30 -2 0 -32 -8 -52 -36 37 19 17 -47 -45 19 81 -3 -8 0 -29 -9 40 28 -5 -4 8 30 2 -60 7 -9 -51 -22 -3 21 -31
2611 -31 45 -5 17 -21 43 -56 -11 -25 6 59 -13 -68 47 -14 -21 15 -17 -47 20 38 52 30 -39 45 -49 9 33 17 -48 21
2641 21 0 -42 -11 12 -1 5 30 -6 91 38 39 -23 8 35 -3 -18 -3 -3 -31 19 26 -7 -36 -57 36 -3 14 -15 40 -20 -35 -5
2673 -5 10 42 0 8 24 29 30 -47 30 39 -39 -5 27 29 -19 16 -7 41 0 -11 -32 -26 -9 -4 -31 -30 65 0 50 -27 34 -26 -29 23 -3
2708 -3 15 -13 -5 -87 -20 -3 18 -2 43 52 -7 -25 -43 20 28 23 41 -13 -9 11 8 8 -38 -9 64 -12 -15 -37 -3 9 -36 -9 -35 -17 -21
2743b1l7P4J2l3mj01J39k0Ro1M8M7m7J3Pnk5K0K9Qo7K0J1m1J5JK3j9M9j0l1l4
2775c1k8K1L9O6r7P4j00Q8Nm1J4p2Q5L4o1M1m5Np3L4O0p6K8N4l4j8K4l0J6L2M5
2806E9n5kL7l7N2q1oK4K7rO4q8m6R9l4J5o4M5K4n0Mj4O7p6M8L6j2j8l0O7o6J0
2838a0l0R6l4k8mK8l3j1N1k0o9R5K9l6ol3L6l2K3p5P9o5O1j7k5K2K1Jj1K5Mj01
2870f9O5l1K5K4k7nN3j9nk3L9j1J6k9o4L8L0Lo0L6j4J8l8P4l4LJKmJ5j7N5j17
2903g0O4J3qM0o9K4m0N3K9l6JM8j9j3Qj5k9P6r2J0nkJ6Pj0L6J6J1p2L1K4J0l4
2936CJ4N2q8N8o0L0oM2r2L2N0l1N2j02N0J4kk1l3R1n9K1L3q5K1R0l7n1O4p2j9
2967d1mL6j5J5P7m8k3M1J4j12M2mkk0K2oN1Pn1R0p8M4j3n7P2n2P5m6k1l7M3m9
$$ plain form
2743 -21 -58 16 28 -5 -9 -110 29 9 18 -43 5 52 5 18 25 20 -5 15 44 52 -15 5 16 -25 -10 -9 14 -5 44 34 3 -31
2775 -31 -59 -38 1 67 -30 44 -56 32 37 -4 10 -62 23 57 -4 37 -8 -3 -76 -42 18 -58 -30 24 -10 -28 -4 -34 -18 14 59
2806 59 4 2 39 2 54 -27 -33 -9 18 9 73 -15 -61 38 4 19 -45 0 24 -26 -22 -36 31 -45 3 39 27 9 -21 46 -20 -10
2838 -10 -40 56 22 -6 -10 18 -15 -26 25 5 -64 31 60 24 18 -15 21 -11 12 -63 16 -49 12 -5 -30 -8 13 14 3 28 32 -69
2870 -69 -4 -35 -10 14 -13 -18 35 16 11 -12 27 16 32 3 -61 -23 7 10 -50 -14 -28 -10 -48 26 -8 -5 -4 -2 -6 9 -8 47 -70
2903 -70 -6 7 -1 39 -30 -6 -46 7 36 0 1 49 30 17 25 10 -19 57 -35 -25 -30 -32 -16 -9 -19 17 33 44 -28 3 27 37 3
2936 3 17 69 -19 39 -21 9 3 45 -47 -15 35 4 56 -46 4 18 16 -5 -38 53 -6 15 48 -37 -16 74 37 -14 50 -22 -41
2967 -41 -45 -9 -24 -9 68 20 -3 38 52 -60 -18 -22 -24 -44 -22 -28 23 30 -21 69 -9 35 22 -35 37 -15 60 14 -7 -44 -1 -50
2999e0R5o7k1K8oO4p7OLM6qk9M5qL2o0qK4M2m1ll2lO2m4L3m8K8j5M2o8R7j2Nq5
3034c3L3k0M6k6K2P0j22M0J4j1ljj4m3M4l0L9oJ1j0p0M9Q5o8PJ8k7N8l2o7P4l8
3066a1M2J4n9J7j2Ok9O6nj1oJ3n2L4k9K8J7k1N2l8k4L9m0O6j16M5L1k7N1r0N5
3097FJ9pk7j0J4M5n9M9m0lK2n7Q4N2j05oK5k4J7m0N0J6L4n1J5nl4j3J7O0l6m1
3129c3M6m0l7R9o6L2l0L6j9N1j2J3pn5k4jO9p3P4o6m1M3L1K1m4K0L0p6N2k9J6
3160b0J2O4j22L0O8o8P8o4j2MM8j1MjK9m1MqM8m8K3K2k2l2Ol5P4j5l5M5n3l8R
3193e7Q5n8K5L2j7j2N3j23J04Kol9PRL2q0O1k9N7q8K9O7l1nk7N4k3J9o5NL3k9
3225a5N3l9km1M1L8nl3n2N3j0lK5o3O0K4n7J3N6m5j5N3m1jkk1OP1q2L6Jk0j4M4
$$ plain form
2999 -50 45 -22 -43 -15 -21 43 -34 -28 -25 21 13 -16 29 21 53 -7 -15 9 51 10 7 -25 -28 34 -10 23 -25 3 -12 30 -38 59 47 52 -33
3034 -33 0 -20 26 0 22 92 -30 10 24 13 10 9 -5 -48 -4 -34 5 -1 10 0 -70 -21 64 -4 3 21 -6 52 20 -47 27 -11
3066 -11 31 45 -14 3 -9 -3 -32 34 29 18 12 25 -27 7 -22 6 23 2 54 16 -8 31 -9 57 -59 -14 17 -10 41 -49 6
3097 6 25 18 -9 -19 -5 40 -19 30 -10 -13 9 -48 36 88 -17 -23 2 -22 -5 -45 5 21 55 4 19 14 -20 -33 -16 44 8 -33
3129 -33 13 -27 -64 35 -31 1 -29 7 -12 39 27 40 33 -22 -46 -47 22 -51 23 -43 -84 -41 -10 11 -33 -13 17 -59 -7 -36 -20
3160 -20 -8 56 -66 -36 32 -36 42 -22 -34 -30 18 7 11 10 39 -2 2 -6 42 -6 17 39 17 -15 -9 -44 30 15 -20 25 -28 -66 -57
3193 -57 28 -30 -5 27 10 -2 51 -72 32 34 28 -11 -4 5 37 -43 18 -11 46 -42 -13 54 23 18 -9 45 22 41 -24 -19 14 -15
3225 -15 38 -1 -3 -44 -3 35 30 -3 -55 -2 -12 -15 10 -53 7 31 -26 -13 43 -2 -17 36 -5 -6 -8 -29 -23 48 -34 2 3 -17 -31 13
3259A3j7K1n2J3KL0L9r6J5N0J9n4L2jj9M2j1o1P7n9oO5m8kL5l8K0ql6O1j6k0K3
3292A3j2K7q8O5KN2l7l3L5k8jK3m2J6j3j4J11o8l5m4J22j8k1OK3jr2J10n0K0O
3323C4K7m8qm1J5K4O0o9mK2j2J6n8N9k2j2kK7J3K2jk8q9J18o7O3ljJo4QL1j1m
3357dpN6k6k0m3j7J6P3p3P9op4N4M0m9PL2j8m4k6N4o4N2l6kJ4M3k5kL8p4M4k6
3390c4M8m0K1k9QqN9n%p3O1n9K4Q0jo6L9k6QPk7J0j9N3lj5j3l2K0j8M4k0k1N9
3424C2n4Oj6K8L1J3n4L3j1N2l3K0l1ok8M2k7k0NKjj7L7J5m0O8q0J3LJ6olj7L2
3458DJ4pj3Mom6L2J6K0K9J4p3QM7p4N8l4k3KJ0O7m6k6L3o3Q1Jm7K6O2o3k5L1k0
3492gJ0j6L1n2L9K8o9J7lJ9m2M4JL0n3J0M9o3P9o3P4m3K1j05O0J4L3k6mo0P6n8
$$ plain form
3259 13 -4 17 -35 -22 -20 10 49 -47 -32 18 37 -17 15 14 -5 37 26 -35 42 -17 -23 42 -6 -8 27 -11 9 1 -35 26 10 -10 13
3292 13 1 28 -60 5 7 59 22 -11 24 -4 -5 18 -24 -8 -21 -35 76 8 -27 -71 51 33 12 18 41 40 -52 58 8 28 34
3323 34 61 13 5 -36 -21 3 63 -6 -10 12 0 16 -42 17 -5 -17 -19 8 21 43 42 14 -75 43 -24 39 36 35 36 -28 -20 11 0 -4
3357 -4 -11 45 19 -1 -44 -61 -45 28 -45 34 28 -46 8 48 -1 6 38 20 -24 -50 4 -60 -8 -44 -46 -32 11 -14 -16 22 -52 -8 -34
3390 -34 14 -26 -5 -34 -26 -34 25 20 20 -53 8 -51 -27 53 52 -14 25 -1 7 14 -13 -3 -22 31 28 13 0 -32 -12 -30 14 -6 -27 32
3424 32 -22 -16 -32 -4 27 40 -14 19 8 60 27 47 16 10 -18 24 -3 -23 -18 -16 -17 -34 3 18 -22 46 -34 -21 -18 -2 -8 -11 -28 4
3458 4 18 11 -2 2 -4 -50 -18 -2 18 47 61 -12 -4 43 -31 27 -7 -30 -28 -18 49 3 -23 10 -53 28 29 -18 8 70 7 -18 13 -7
3492 -7 3 -13 18 -34 5 33 -36 -19 -22 -3 -45 -1 0 30 -23 -13 36 -27 52 -11 63 20 41 -64 -4 10 43 17 13 -47 29 -29
3524b9jJ4J5k3j3J3j1L1nnP0m9n2P7J0n0M2Mj7Po7J3J1k9M4k8N6j9K9l4k9K8J9
3557B2k9k4j4Q5J5l6k3oM3J3n6Rn1kP6lm0k4N3ll5J06q0qJ0p1R2o8J0M9n6J3L9
3590FPK3ko9R4n4J5m5QM1J9o5o5J19J%j9oo8O0K9k7J7m9QN4ppl2M7Rn6R4j28J2
3625c6K7K2op2M0L4QpL7l6M9q4N2n1n1J01p6J8N2j6n0M5l9RJM2lK8o3J7j1j1l
3658c3M7n6M3L9l5Q3o1l6L8l1j9m4O9Lk0mj7R5q4J8N3p0N1n3K0J7j7pm3J05l5
3689A6M0r2R6l6l6K7m5P8j02K7QR1jKq4n0P4OmKn2J8j1M1l8k2oN0m0Q5n6j7L9
3722HL3m6MK5k3J9o7j1N0J8J5n4J3O7o9Rj6N3j4Q6j40L1K3K2l6J7k9M9l0j9Qo
3754a0RKl4k0Q3k4l7K4o9N7O1m1k9K8J0Pkm3LQj7N3NL0r5j6P9k3M5q5L0M9L6p1
$$ plain form
3524 -29 -30 -16 -1 -24 -37 -24 -35 -4 -9 -14 56 7 -45 32 42 -8 34 38 21 28 -39 -26 -15 -44 0 -28 28 9 38 4 -25 3 22
3557 22 -7 -31 -45 40 55 19 -4 -10 33 46 -10 -1 -52 -54 22 19 -21 -45 8 5 -30 76 -4 -12 -2 -73 19 -49 -39 10 -46 -33 6
3590 6 13 36 34 -35 59 5 20 -25 -17 24 43 -22 -87 32 33 33 14 8 -60 0 29 2 19 -30 -22 32 25 18 -14 33 42 -14 80 -48 -36
3625 -36 -9 13 7 -65 -25 9 17 10 47 11 60 -24 28 -23 -74 27 -49 -31 21 5 -45 0 -39 -30 -29 13 10 38 -25 -8 -19 -30 -33
3658 -33 14 -42 1 40 5 88 27 -9 29 -2 -21 -65 4 7 -13 -17 -34 61 -23 -5 48 -22 29 -24 -4 13 -4 -11 -54 51 16
3689 16 56 -36 60 24 -12 15 -30 48 -54 -27 -19 72 71 73 -11 -61 13 19 15 17 -35 -17 -28 13 -25 -47 -53 -3 -43 42 -14 -31 8
3722 8 41 -5 -1 24 1 20 -47 -58 -8 10 25 -29 -16 51 -18 -9 -25 28 14 100 -40 -9 14 36 0 17 -12 37 7 -12 -4 -10
3754 -10 -1 1 -33 -53 30 6 -31 -7 -76 -19 42 1 -28 0 10 17 15 -28 -25 -17 -34 19 24 54 -41 -57 22 -1 44 -41 -11 38 74 3
3788Cj0P9q2PM6J3q0O7j02Q2J6j13J6J14j5m5J7lJ9Ql1k5OL5l9L6J9m2Mk3N5n2
3820b0LK4m5K1J4l0K1M4p3J7K9l8P9k0k9l3N0m7L1OMM4k4j6K1o5K0K4lN5p3OO8
3853F5m7k7K9rL5J2k8m6M7k8o6L6k6P1n6Q9o8M1j7K2lol9J2k5j5J5K6l2M3J9%
3885B4j8m1L1j7J5M4mm2k9L7N8o8J6o1P7p5R5k9l1m0QP4l7L2q5N4J2n4O6l9k8
3916e5R3p2O2l2MK7jj8N5o5%N2n1mK6j2p3L2K9P4n7kJ2n8M5k8j3K6k0N1lo3R7
3949E8p7L3n0J12p7j6NNpl4O9l4n7Q2n9M9k3K1o8M3L4n8L1n5N8Rnj6N7j8l9J2
3981a5J5n7L9L0p0N7J4Nn2M1Nj6K4o9N4mqL4k7M8lJ6j8J4j32Q0Rm6M3Pj2m2m5
4014h1J05l6m7L6L4lQnl9JL4O9n7l3o8J47n4L0o4l4P8J2k9Rj7Mo3J8L6j0L2n3
$$ plain form
3788 3 -7 72 -10 -3 43 56 -24 43 -59 23 39 -74 -58 56 41 -4 13 10 29 37 6 -19 -13 22 -17 19 38 -4 0 -23 32 -20
3820 -20 -17 7 -38 -17 -3 -33 -12 32 -41 -24 5 -33 46 26 -3 -36 14 -33 -2 4 8 52 28 12 33 -32 -12 12 9 64 -9 -3 65
3853 65 18 -9 20 11 46 58 30 -16 31 3 -63 -27 -53 18 -38 51 -17 24 7 29 26 20 -19 -7 -32 -47 -32 -6 -38 5 24 24
3885 24 6 -35 -4 -21 -6 38 34 -8 -37 0 58 -10 6 -55 22 -53 42 13 -18 -58 -50 24 -13 19 -66 -12 0 -54 12 -27 -55
3916 -55 38 -34 28 -4 0 27 26 8 63 -2 -2 50 -1 -5 21 9 -64 -32 -3 71 14 12 24 -34 11 -17 -30 -4 -24 27 24 -39 58
3949 58 -19 14 -36 76 -1 -17 -12 -7 -14 -48 21 -13 -70 12 -47 2 -21 0 -68 -25 9 -49 -18 -73 -15 -6 -11 -27 30 12 -27 -15
3981 -15 0 -57 -18 12 -58 -1 13 18 -34 7 12 -4 20 -49 5 1 -7 27 0 48 45 61 43 57 -75 5 14 -32 11 18 6 -36 -81
4014 -81 24 -12 -59 -23 11 8 16 11 -28 -27 7 76 19 -14 -82 65 11 41 -23 -57 21 33 4 13 -4 0 -63 -45 -9 -19 13 -40
4046d0K1K5qj3Q2r3J19j07K0oj6J7j4N4m7j2j7lM8L7k2lj3m7j2L0J3Ro3O3Mm6
4078d0L9l1Q4n2JJ2j4K5k5J1j5%nM4J9n2qK0Qk1JL5k6p9R5k8J5Rn7J8L2nJ2m6
4112b4N0K6o3O0nm1Nk5m0N7K6j9N8p4j3j9R8r1N0l6N1m2nm0K2K9l2Q2j2m7kL3
4144A7k1J2O6q7L2j7j9L6n6L3M0ln0n1N4L2M7n7l3M4j2j8J3Jm7M7M8m4k4L3Pm1
4176a8l4J0k1O0nJ0k7kN3JK0k6j8j5L9m3K9j8J6K4K5m0o9L4P6p0NqK1m6K8Kl0
4209c7N6j3Rk6K9q8P2n3lM3J3N2n5J8J4j7Kj6QL9n4L6K9l2k3K1J4o0M6K3o2J9
4241Dk2L8l6o%L0k1qP7n8JJkj9Q7k8o7J0N1n6PO0p2K1Lj8l1L5pL1l5N6k8l0J4
4276a8P2l9l3Qm6N6L0Kk4L5J9o9J8K4n2N1%K0l4m0J6NP1q2J1Kj7K8k1K3n1P5P
$$ plain form
4046 -40 -19 6 -2 -15 67 -26 93 -14 6 0 -16 1 -13 41 -6 -18 -35 -38 10 47 25 22 9 -38 -50 -20 -7 2 -61 2 6 -40
4078 -40 -1 -32 52 0 1 13 -1 24 -1 10 -5 -5 -10 34 53 1 -7 13 21 0 1 36 10 -69 26 -2 13 22 -35 -17 15 10 22 -24
4112 -24 26 52 -11 49 44 3 8 -17 -57 0 26 7 65 -9 -22 -41 57 -34 16 -20 31 -11 -16 -56 -34 -5 -37 45 33 -14 -16 17
4144 17 -4 8 74 -13 19 2 -17 19 -37 -4 36 33 -17 -68 -14 18 65 8 -25 19 7 -11 2 3 -44 3 51 7 -17 16 23 -18
4176 -18 -52 -42 -63 -3 -8 2 -25 -27 26 27 47 21 3 -12 27 -16 13 -5 11 35 60 20 -49 -15 61 -9 -4 -12 9 -37 -9 -7 -37
4209 -37 19 6 15 -11 18 -70 2 -51 -54 -11 2 54 -1 17 31 14 16 0 8 47 -7 29 58 26 3 24 38 -22 24 47 -15 4
4241 4 -18 20 -16 -22 -22 8 -13 -21 56 -2 -1 0 -2 -21 66 38 -29 -19 32 -24 -17 43 -29 -8 -5 -23 -54 -19 -26 5 -30 26 -2 -32 -18
4276 -18 54 15 -18 -10 -56 0 30 32 8 43 62 -7 11 35 -17 34 34 54 20 -20 -4 1 72 -10 1 3 -14 14 -7 16 -35 40 47
4309D7j15R0j0k1k1L0k9k4N3K2j4l0KN5j18P1nO1J2m9j1PM2k2O9j21j2Q0m8n1
4339f0L9lJ9J8l5M6K7o1jk1K7K6j9Lk0J4k1J0QK9l3K5oj8L1l2M5j0K7o0K7K4k1
4372B4L6p3M7j3j6l7J5j8K3L6P8j21k2K8nK5k5L4m1KM1pl4M7l7K3mm6j6L6J5K
4404ckPN4o0L6mn4M2Mm1l5N2l1K6k3K5O7M1j12K6n2l2N2M2kl6m2R5j26J05j4j0
4436el7M4m0Q2qn0J3k5M9o5K5L2K2l0J0m3m6J9L3L8n5J03o2j1M3k7m1O5k4rJ1
4467A1l6QM3j4%oN8n5K8L1p3j0N9r4N4kJ1o6O4l7M6n2jJ3L7J0l3NKL3j03M8M9
4500B8l4J9J3m2L8q6P5n8L8M8J3o6M9L7n6P3j24M1P1n0%j2k5Pj0J8k5M8o0J0M0
4531A8k0o2j1P0K2j0j5Jk6j4K7L2l0oL3N3p0LnkkK7jk9M9n8l4O9K9K5k9kMl8M5
$$ plain form
4309 47 -68 22 12 -9 -30 0 -29 -53 0 22 8 -22 -20 35 -83 -12 -17 44 56 7 -4 3 45 23 92 -29 -41 39 -9 -60
4339 -60 -21 -24 -5 13 -22 24 51 -10 -11 -32 -5 21 2 5 -15 -1 -22 -12 -4 25 -8 17 11 -7 24 -8 37 27 54 -6 21 45 24
4372 24 60 -13 34 21 5 -32 -17 -35 -12 24 102 -19 -41 -13 -18 7 -18 16 -25 -23 18 11 -23 24 -13 10 6 -40 -56 -20 -5 -3
4404 -3 -5 2 56 -4 32 28 -26 16 20 -21 -56 -4 -35 -9 -32 -7 60 101 -11 15 -37 -69 -17 25 23 -13 -55 40 -86 19 5 -5
4436 -5 -42 2 -38 44 36 -14 -1 -26 23 -42 -17 15 37 7 17 -26 -72 -53 -20 18 -37 66 4 -7 36 9 -32 33 9 0 11
4467 11 -25 -17 26 12 12 6 64 9 37 68 -5 -15 44 -50 4 2 13 -53 11 -26 20 -32 -33 -20 17 27 -6 -1 1 34 -69 -21 28
4500 28 -6 13 26 -16 22 -64 11 -47 -9 39 52 -14 35 72 16 89 -35 6 77 27 27 15 -10 -3 -13 5 -20 28 -32 -22 18
4531 18 -2 -64 -75 -5 17 7 -8 -7 -33 -47 -20 12 -18 -24 9 62 -8 -5 -10 -12 -14 13 12 -17 32 -26 -60 9 38 63 34 32 36 -2 43
4566D3m6p6J06m4N5n0j6P5m6%K2rP9r7l5J21p6pk5K2L7%l7j9K1o9P5m6P0k8J1
4597A1n2K4PK7j1j4l7O2n6O9p3j8O9m6M9pj5kO0n9l9J16n6k5O0k2M0rl3j03R8
4628A5kJ0r6M3N2m5O5k5K4n2N0j13J37o4k7L8m0P0k9l2J5J0M6l9nr7P7l1L3O7
4658E5m5KJ4qj3rJ5qm0N8nNk8K5j5m0O6j1o0O8n4L0QJ2mK3m3pM1n8L2K5l5Oo1
4693e9N1Rj0J0Lk3O9p1L3j6j8O8l4J4r6O2K5Pk7m5QL8Jk7N1k1k6j3Q6k5K7o3L4
4726B2L9p6l4Q8q1M1J3l0lQ4K1j11K7j7L7P9j58Q8n2M4J1q5N6K2j7M8K0l7l4M8
4756E3lq6O3n2N3j9NL1nq2M1L0o5K3pJ6m3J5M7M6n0j9M5l7m2R6n7k1J1J3p0J7
4788e3R0k5k9k2L1O2m6L6pj1n1m0J6LN3qL4k3l3L2o4J02Qn0O8n5n2j6P6l9L7K
$$ plain form
4566 43 -3 -79 27 -17 38 -12 -28 47 1 1 23 14 93 -4 -39 82 6 -1 -26 -4 33 33 -4 -23 -2 -71 4 -42 28 0 11
4597 11 -41 -17 -10 17 6 -8 -45 17 -39 30 -43 -61 8 -38 11 4 -11 -13 47 -12 -51 65 9 -16 44 22 62 53 20 -83 15
4628 15 13 23 -73 -30 22 -23 42 17 41 -11 39 -74 63 -1 -28 10 -30 40 11 -21 -6 4 50 11 6 -91 -14 -45 -12 55
4658 55 10 12 26 18 5 -4 11 3 -37 21 16 21 -7 18 3 -37 29 18 -42 26 -28 2 10 22 18 41 -2 -9 32 -26 6 31 -4 2 -59
4693 -59 -8 1 -9 1 4 -19 50 -21 12 -4 -22 46 12 26 -70 -8 17 24 -3 -48 -40 -2 -1 -28 23 2 -24 -37 49 24 51 -12 22
4726 22 61 -15 -49 39 -42 -1 12 -18 -21 63 84 -27 0 -17 20 99 -59 29 -23 21 32 -53 3 25 8 56 76 39 5 53
4756 53 50 -36 27 -25 28 9 14 45 40 -42 -1 29 -36 -13 -20 -4 -47 -32 15 61 11 -8 37 0 -42 54 -3 -24 -13 0 -70 -53
4788 -53 37 12 -17 -39 -8 54 8 44 37 26 -25 -65 -49 -46 7 -1 33 10 -23 9 -55 47 55 5 73 18 -34 -50 26 -13 24 26
4820B6k5k9L1o5O7K3p9N0k7QJ5Oo3O7l8K4L1o3P4p3K8M6l8L6nk6Ok1q1P4kL1K7
4853C5j9J9k2j00Q6k5O2K4n5K1k3oj6O4l9m5Q7r0L1K8j3k1m3KJ0O8k1M2lj8m1
4884b1m5jM5K6k9O7p2N8l0k0L5j9L9l1N3l1p7J7N8k2O9j46N3K3nl4N6j1L5J0m2
4915HJ4k1k3J5P2m1p5J03k4o4M4n9J11o1J6n4M2m8P2n9qJ8Q3o5k0JN8m0L4J2j9
4946B2n0N0n6N2l9O0q6K1lM2p6kR1rQk9k2j3J3J5J2J2j8M8j5j9L3J2n4k9P5m8
4978bJ6Mjl3J9j2LK6K7l5L8m4Nm4P8n4oo0J45p8qM8m3ll8NQ1k0Nn4J2L0m2J4M2
5013B1k8l2P3l8jN3j34M9J3k8P2J8j9mm6K4J6j2J2K8km2J5rL4l9J3L5l8o8J13
5044D9m1K1q0K7JN9ko9k3P1j0J4L7p3l7K8L9j5Kk0j1J6j5N0Qk0l3J2J3JL5p0L4
$$ plain form
4820 26 1 -28 3 -62 5 28 -51 -1 -28 -20 -5 1 -62 5 -33 -9 22 -41 33 -40 -12 34 -4 32 27 1 7 -14 -95 -21 -23 8 35
4853 35 16 35 13 -87 -1 -26 36 60 5 26 3 -3 -19 45 6 -39 48 -42 -11 17 4 -17 -60 -58 -48 20 -1 41 38 20 -21
4884 -21 -66 -67 -22 4 -25 42 -30 28 -2 -22 13 -6 33 2 55 24 -53 -36 22 0 69 -77 -24 -1 -6 -40 16 5 40 50 8
4915 8 22 1 -22 -7 65 24 -51 52 28 -36 8 -51 60 -1 15 -39 3 -45 27 -32 -40 -22 61 -4 -24 -23 35 -5 29 41 22
4946 22 -28 22 -34 18 -21 39 -47 -26 -29 13 -63 -65 26 17 25 -4 -26 -39 -26 -11 1 13 -5 43 28 9 42 54 0 -29 46 -2
4978 -2 14 18 17 -16 3 -9 -6 20 47 12 50 6 11 -33 45 -9 -15 -75 70 -8 -16 32 -11 -14 -52 -47 34 14 19 -35 -23 7 -35 -21 21
5013 21 -7 -39 34 -4 -5 48 -86 -37 -24 -52 20 38 19 15 -31 -7 9 -3 9 37 35 -7 8 -1 33 -6 7 42 4 -64 49
5044 49 8 29 -51 -24 -23 36 34 -35 -58 13 3 17 54 -19 -56 -28 11 -4 -2 -22 -33 -17 -32 18 26 6 -27 -15 -2 -1 34 -36 -2
5077bo2J18r2L3Mk7P9o8J2K3k8ML5Nj8l6K2jj3L8o5N5q6K3mM0JoP1r7O2kO4m7
5111C5m1Ork2O2j3o7O1n7L7JK8m1pJ5K5ko6L2K5J2ln7P7qk7m2Q1k5K7q8M6l3J4
5145b4M6o5K4K8n7J33o8k5j6M1k9n8M9LL8Jjn1J6P2m6n8K8K9nk8l3N7J8p1O5j0
5177Cl2lR2q5m7L9M5l9PJ7j1j7N9Rn8l4N1j8L0j6j2L9L0o1K2m2L8K7J6m1n4R9
5209E3l9k5O4j16O1J6N6mq9J3m2P8k8k8N8M5p7j7m3K0L7m4L6N1j5m3K0L5o1J3
5239a5M9n6M5k7J8j0j0N1l6j0j5O2r7O0K6K0k9pj2j3M4n1K8M2n8J4J5l1M2n0L8
5270B7p3J3R2r5L6l4q3R2M2l2KM1o2K8q3M8P7Mp8N3k1o8Q5o8M6qL0mK3k4k7K5
5302Dk9k2KM4Mk6J6l2k2O3K2N0j06O4k4Jl7K7KK1r5P0M3l4kJ6o4K2M4Kl9l8P3
$$ plain form
5077 -2 -64 54 -38 -5 -1 -28 51 -17 -5 18 -10 -6 29 34 16 -20 2 1 -12 26 -39 16 -70 -47 -51 -11 -10 -16 55 -42 20 18 82 35
5111 35 -6 0 -9 -31 31 18 -49 12 -45 -8 -7 21 -20 -27 -12 13 11 -55 -23 2 14 11 -46 31 23 -4 -46 35 10 37 -51 -5 -38 -24
5145 -24 22 -43 -19 9 -48 85 17 -8 -24 17 -12 -70 -21 -18 20 21 20 -31 -15 57 11 -47 -19 10 5 -23 -56 1 19 -52 13 3
5177 3 -29 -32 60 -25 -72 -33 12 -27 -20 -3 -14 -31 28 37 -21 -55 -4 -22 8 -8 -20 19 49 -12 10 -32 6 33 49 8 -46 53
5209 53 14 -11 53 -63 -2 14 70 66 -23 -10 -52 26 -2 -30 28 73 -4 -21 -64 -44 -7 -51 -15 36 21 -22 -2 33 -28 -15
5239 -15 34 -22 23 -4 14 4 -6 45 9 -1 -16 46 -51 9 35 55 26 19 7 -6 38 -13 15 57 -1 13 28 -3 39 -11 27
5270 27 -46 -33 59 -36 0 -34 -117 -25 17 -15 -13 28 -34 -6 -89 -41 36 40 -38 15 -6 -74 11 -57 -11 -19 11 7 30 6 -21 4
5302 4 -25 -47 -45 -1 3 -23 -7 -39 -61 2 24 74 -32 32 8 9 -28 -1 1 22 -73 -3 40 6 4 20 -44 -22 22 24 -15 -53 20
5335B0O5q3m0L4k4L4oMl6k8P5j7MJ1J7l0RK6K5o0n2rQ2J9o3QK7k1N1r5N9J2p4
5368e6L9M5j9n8k8QJ03Qm9O0m2q9J19p9K3%nN3j6j7n5M1j1K0o1N8j4kj3J2N4l9
5400a0l3N6l4mO3j5J6q5L2Rk8O3p8R1l9j5kJ1lNq6J01jjk0L3Jn0P0r5O5L0o5j6
5434c4NN6q0N9m4J8R4l1j2o2M3m1n7J04k2l6k1O3K2m1L5O6m7o8O6n6M7l9Mk1J5
5465a5qJ3n0M4L4l0J9k2Q0j45L2J0pL4J4j0l3O9n8L9m2N4k5M6j7k6N4r6M4lj3
5496a4J0q3Q3qNJ7k3L3m1J13j04j2M0pk8L3qj4M0j9N4r0nRLN7j7l2jl0O3Jj3j5
5530ck5K8JN9j07J29p8qM1j7k7O6q0l8R4k1o5O4l4K8mJ8k8J4km4M5K4l6mL8l6
5562hM9j0k9JQk5Mp5J10k6Pq5R6n2k4P7j8P1l0l0p8R6j6J6o9P5m8j8L7j6N2Nl9
$$ plain form
5335 20 85 2 -38 -4 -28 6 0 4 -32 -60 15 -2 2 13 30 0 9 35 60 0 -52 -61 21 40 -23 -15 12 -9 42 -53 6 18 -56
5368 -56 -17 28 9 -49 -77 -69 34 42 -7 53 11 -78 41 -38 -15 -15 -20 33 17 0 -55 -14 -25 -5 -66 -8 -22 -24 -37 -25 29 -10
5400 -10 -43 13 -21 -25 38 23 39 -46 -14 -5 -33 30 -48 43 4 -11 -13 -2 -5 0 -86 15 14 13 -7 26 27 -23 47 -48 17 47 -18 -34
5434 -34 -29 27 -53 6 -38 -20 74 43 31 -31 12 -29 -86 18 -4 -40 -61 2 24 -17 18 84 37 -31 35 -21 26 -13 -9 -30 -15
5465 -15 -23 -10 -60 -16 18 -12 7 -15 65 -80 -48 -38 -45 -11 3 -7 -40 29 -29 10 -32 22 -3 43 26 0 54 -42 2 -1 -14
5496 -14 -4 -87 -4 -12 -7 10 -13 20 -21 92 -12 -24 16 9 -19 14 6 -8 32 13 67 -23 -28 -19 -16 41 24 -8 -9 -39 24 25 12 -3
5530 -3 -28 0 1 60 -47 82 4 -4 37 20 -7 59 -21 -59 35 14 -51 13 -21 7 3 21 -7 7 5 -39 6 30 -6 -10 28 -8
5562 -8 41 31 2 3 11 -14 -10 -85 25 -1 6 -79 17 -35 -59 18 0 71 41 11 -67 29 13 29 -40 35 -13 -31 6 -10 42 47 8
5595Hj6l5N7n2O9mp0L6L9j2n9L4k8L9mk1M0n8K0Lk0J4J8Q3n7Jl9kn8R6l4n9L0
5628d1O9o2kJO8Jkq1R7l6N1Jr6P8J3Rl6n0L7rl3J7J8K5m8M5pk5mJ3l2L6k7J0L4
5663C2o6O6k1j3m4m5J07mk6P7j19N4k5NJ6J9O%J6k2L2l6PJ2n3N9k4M1o9N2K0n5
5695am2R0o4N8J5p3J2j2M4n7jNL8l2N9l1L5k0k8j1N0M0j02K5Q4o8j4l7P4j1j1
5726A4k9M1k1N0q5RP5j25Q5On5k2N6o7P5m0K8K9Jm7K1mj3J6J4j5J2PL2p3l8mJ28
5759F1o6o1R4Jj1p1J9Mj1L5n7M7m4Q7p2O6j06K6J00j21J02Ln1N4l3k5j5O9n2j3
5789d1kO1l0n6R8r3N7L0m9k3J1qL6L1l1k3M8KK1J6l7j2K1J7o5l9J02nk2j8l5L7
5821akK3k6J7Rk0K9k4k4j9L5j4k4N1j1j2k0K5RPJJ6n7J54m3n8k3K6n2K1J8Pl4
$$ plain form
5595 8 -8 -43 14 -38 31 27 -43 -7 32 20 -39 -5 -33 6 2 -19 21 -37 -17 -14 -34 -20 -2 81 24 25 -14 -16 -74 22 -12 -71 -41
5628 -41 28 -34 -36 -35 33 34 32 -49 48 12 63 64 -32 46 59 68 32 -18 19 10 -23 -6 12 37 -11 34 27 2 -2 11 -21 15 -12 -2 32
5663 32 -34 32 11 -2 -46 -91 16 12 -14 63 -56 -2 -27 -22 -6 13 19 19 35 13 45 9 16 28 -25 34 10 51 -18 34 54 -1
5695 -1 -43 47 -17 41 56 -17 -5 -17 27 -30 -31 -26 12 -20 39 8 43 23 -5 -16 34 74 -28 -3 81 13 -1 -38 36 25 14
5726 14 -15 26 5 55 -30 -21 54 -71 14 20 -35 -57 -1 -68 7 -33 -5 24 25 -22 -1 -5 -18 -2 12 -3 9 16 48 -25 -63 -67 61
5759 61 -5 -66 28 29 18 -53 -34 -30 -41 -6 -63 -16 -60 27 -45 21 -85 -59 41 -80 22 25 -26 28 -5 -30 -45 24 -28 -41
5789 -41 -43 18 -12 -68 30 -63 -6 24 -25 -48 -37 -45 -9 22 -9 -32 16 18 39 55 18 6 27 44 -21 -60 42 37 15 -3 -38 -1
5821 -1 -3 20 -6 11 20 0 29 5 -19 -38 -3 -17 -41 10 -1 -13 -33 -8 1 8 9 25 -32 122 79 21 -2 24 -28 -7 11 18 -16
5854a6j1O4k9k5L7k5j3Jj9J0L2M0K5l3n9P0k1n9rL5J9n%k0O4q0pRoL0M2j19O9
5887iJ5M7l8rnl0JN4m8l5M2K1l4mK5n0L5N7k1j3K4K4j2k4O1r3jL2k5K5o0O9J3
5920C4k6Q8l3m8k2nK3J6j5n5K8Rl0N2kl0J6J4M1r9O0k5K2pJ2Pp0Q9l7r2L5oK2
5953c4%K4m2k1Q1rK6n2mn3P2oN4NJ3k5L4l2ppm6J4L2q1rM2M7M1o7j1N2l2qRm8
5988d8N2nJ4j2PL1l2L6k9QpO6j34L5J16q3n4k5R3J8n3K1k2J6m0L0Kk0Q0r6M3n9
6020e1O9m4RO3k1J3m6k8L5L6l%j7J5J6K4j32Q8qk5j6O3m9km4O2k8K2rJ4oL0K0
6053E0p9l7O1Kj0rL6j8M0j9pmk2l3K3L5k4L9m0J3M3k3K8n3m7K6KQ5m0l6L7k6Q
6086Aol1O8n8K9K7J8o6l6P6N4n9n0Q8m8L3j5l1OJ8l2m0M1N3k1m0M3j7L2r8R8p3
$$ plain form
5854 -16 -27 37 8 -17 20 -5 -18 -17 -36 -26 6 46 71 38 -21 49 28 -31 -40 -5 14 9 9 -11 53 -27 -34 -25 -31 -1 41 -78 -9
5887 -9 6 53 15 6 1 -29 -28 26 -22 -57 -15 6 -28 -32 -7 -57 -22 35 14 1 25 49 37 13 74 -19 -20 12 -13 12 -48 21 34
5920 34 8 96 63 15 -7 -12 11 27 12 -43 -15 -6 -36 16 14 -16 0 14 55 -44 16 -9 13 6 18 25 -45 44 7 -85 -50 -56 -34
5953 -34 -34 -10 -52 -73 8 -1 25 -27 -31 -84 -12 -18 36 41 54 29 63 31 24 17 -29 -15 17 -64 -73 -31 16 57 -10 -21 31 -1 -9 0 -48
5988 -48 4 -1 13 1 8 39 7 43 14 22 15 81 -53 -18 98 15 -39 -64 29 47 -6 15 -7 9 -31 -1 1 -19 61 -35 8 -51
6020 -51 18 -26 -17 46 25 38 -8 -36 -1 35 32 32 15 30 46 70 -62 26 18 -7 -23 40 -9 -11 -55 7 -21 1 -8 6 0 30 50
6053 50 -29 -66 -5 -3 -13 -22 14 -4 36 17 10 6 -16 -49 -26 9 -15 24 -16 -3 40 17 45 -8 -55 -29 -27 58 18 -18 19 -7 1
6086 1 -5 -36 32 -26 3 30 48 -18 -54 22 76 17 -33 55 7 40 25 -6 0 18 -14 -54 -13 40 19 -21 22 5 37 -61 37 -36
6118c6L6k6P8n6j2K1Jk9l6J05m0l3l5Q7K9m5K9L4n3J6m4r1R2Nj7JM5l5N4m0JJ3
6150A9j0J4l6N3l0rK7o2K2j5P3p7M1PjJ3Rp6N8jJ5M7r8J9N9k4l0QJ5J1k9n4L6
6183fJ5j2J6k5J2M6r5N5L1rn3O7j8m3K3j6Kj1K6qP8j14Q1o2Q8m9K6K5n1Km8L0
6215CqoM0J2j5%n8J2M0K4k0J4l4q6J11K0nn0n2Q8j2J8l1pK3n7O8j1j6k5j1N1m8
6248b8J1k4ML5kN5k9j9K6kl1jl7O7Mn5O0q6K4pJ1QJ6Oj4Pp1R5n1P1J0n4Mk7K5
6283ApN9m7K6J1j01O7Ml0M1k3K7j2l0oJlP6j27O7l5P6m3j1LJ1m2L2N7k9Pj3L8
6316D5m1Ok5M4OK0r7L0L4k5L2n9N4Qm6J18j06J5l4K9m5P9q5P9m5pJRk6L6M4j5
6348C3l3l1OJ02r2KlK1mk7j1O0l0rK9m8O4%Nm0Kj4K5m3Q5n2K3M6q8J3M4pm7n7
$$ plain form
6118 -36 0 -26 52 -4 -16 5 6 -23 -59 46 6 -27 -62 25 54 9 38 72 19 35 -9 -100 -8 -3 -20 -19 26 -9 45 5 6 19
6150 19 9 23 -13 40 10 1 28 -34 -12 -27 46 -31 10 17 16 29 38 -38 20 19 34 81 -17 2 61 37 7 15 30 41 12 -42 -6
6183 -6 9 -3 13 -12 0 46 -49 6 37 28 -25 42 24 -19 4 -12 -10 -21 5 -3 75 -39 42 -20 68 19 45 70 19 21 -27 3
6215 3 -5 -11 29 41 26 26 -32 -20 20 44 24 38 4 -82 29 49 44 -6 -58 30 18 36 5 -2 21 -36 32 21 5 -20 -31 20 -28
6248 -28 -17 -41 -37 -2 -4 51 22 3 29 27 -4 -5 -42 25 29 -26 34 -52 -28 -35 -24 -16 0 6 -8 -1 -72 23 -28 43 53 -1 3 -24 1
6283 1 -6 53 6 32 43 -58 9 13 -17 24 1 28 16 -14 -20 -19 -22 54 -73 -6 -41 35 -8 -19 -16 -5 -47 -15 42 13 20 7 45
6316 45 4 10 -15 29 35 55 -42 -12 22 -3 29 -30 24 32 -14 104 -2 13 -21 8 -37 42 -43 36 -9 -16 -15 -6 -32 4 48 33
6348 33 0 -31 -25 77 -15 -13 -16 5 1 -26 -37 23 -7 -16 13 -35 29 29 34 -6 -4 -18 7 -36 49 -3 20 66 -22 -9 35 28 -19 -76
6382g6M3LJ03N1j31QK0J0m6RpK8L0r6R6l5m4J8K8m9O3L8Mm3J3o8L8j28Q8O3J7
6413D8k6m8j0Q4n2L0n7P0k1k2Jj3PK8k8J2J6l7L5j5mM3n9OJ1ONj9j6J8K2j0l4
6446b9R6p6QJnj2Q1p1O1k9l4K2o0M4l4O3ql4l7M7lK3j5M8Om1n9P8l9N4K7n3j5
6479En7K2N9l8O0j25R8n2k0M7m3O8o5Q1K1r0K9J7oMl3L4j2l6JP0K1o4n3R8m5n4
6511e8R6m3J0Jq4N0O7Np9P4j16J18L5m0j7Ml9RP5n4o7lO9l2J3%K3J9L4j08K9j
6543a0j6L5l7N7n9K0K7k4mJRkj7k7Q6p1pP4r1Q0OL1o2q5R3m3KR9l4j6m3J4K9n3
6577c8O3%j4Qk8N5k6l5J9K4m8M0n1L8%m0J9qJ0M1Rl9J1J6k5Kmk1R3m5o4L5J3k1
6611a1L0qn1RK6k4qP0j0j7J6K5n5l4N8k7N5r3J6M8l5J8K1m4L3J8l0J2K2K0n6o
$$ plain form
6382 -76 -33 -30 73 124 -7 1 21 31 -15 -6 -13 15 45 -51 45 10 -34 -16 12 -37 26 64 68 25 38 -30 8 -120 -32 31 48
6413 48 22 -26 -36 48 -4 26 -31 39 18 -4 -3 -16 -9 19 -9 3 19 -18 17 2 -2 41 -18 -12 -1 5 10 -9 -25 -7 15 5 -29
6446 -29 67 -9 -1 0 -5 -17 64 -7 54 25 -9 13 -47 -3 -37 26 18 -16 -53 -6 -9 14 -1 47 53 12 -47 31 -8 46 73 20 5
6479 5 -52 -30 29 -9 51 -74 24 -28 -48 -1 -44 24 -41 40 61 -29 0 17 11 15 -18 16 4 -32 -31 39 60 -4 -57 41 -4 -58
6511 -58 38 -5 5 6 -78 -28 39 44 -35 39 -77 41 76 36 19 23 -16 -7 68 14 -53 -56 13 -19 -6 -6 17 36 70 -38 -9 -10
6543 -10 -26 9 -28 29 -30 -10 17 -7 -11 -10 -1 -3 -20 -47 39 -32 -39 35 -56 24 30 61 -1 -86 7 -36 -34 65 31 15 -28 -14 15 -38
6577 -38 25 25 11 19 -9 46 20 -15 4 28 -20 20 -31 7 7 -33 -14 -22 -12 29 38 -1 10 26 1 3 -1 -22 71 26 -38 -3 10 -11
6611 -11 19 11 -40 -31 -5 -29 -37 33 23 6 22 47 -8 -42 16 -11 44 -49 -33 15 -20 -2 19 -25 8 26 -4 8 30 50 -6 -12
6643a2J2j6k4O3n4JN8mpJ3o1PN7l7K6m7J3R5k0oo5O9l8Ok9j2j0K3J5k8k6L0L3
6676B5l4K0l8J2l3O4Ll3O6j3m3K5j8LlJ8m7L9Ml6J7J4KK8l4k5M7n3M0j3o3O2j8
6709a5P0j06O6Oq7M3mRJ4k1k6N8K3l9n6P9o2O6orRKo0L4M1l3mN3p3j9R1J8l3k6
6743Cm2Q0m6J3K4p4K4K1kQ%kj3k2M1K4K1l4n9R2p3kN4Qr3N5Nm6N9Rj5qnO7p5M2
6779C9k4j4m7N8qk8L7L2m0pJ9k8Nj2K9n6L7K1JJ6m6L3K0k7j7M0o6K1KM6l7n8O6
6812Gm7k0O4mj0l0M1OK0J1m3l2N0o5O2j7K6J3o4N8lj3L1o8N6K9q3L0Ql2O5n0m
6845hN0p6R2m4l3M2n0P8q7N7K8l1J2L8q8J3J3p7N5m7M0O6pj17Q8m9O9M0r6P0p4
6876c3P4j8rlM2%p0K0NL0p3K6Pj9N0m2P0pl5k9qM9l0K4k8L3rkN0o3o0J23p7j0
$$ plain form
6643 -12 0 -16 -40 23 -31 -30 28 24 17 30 -31 -24 33 -4 22 -25 -12 83 63 57 -8 61 23 29 0 -12 -22 1 16 -12 -38 -8 25
6676 25 -9 11 -27 -15 -48 16 19 -14 52 39 -4 21 3 6 3 21 -26 13 17 -19 -2 12 14 42 8 -17 30 -23 17 4 -59 3 -15
6709 -15 55 -51 15 21 -66 -23 -27 -18 -4 -25 -51 7 30 -9 -65 14 -48 18 12 3 12 14 -46 -12 29 -4 -8 45 -28 -47 44 62 29 3
6743 3 -39 41 -5 8 32 -42 -18 3 1 9 9 7 -6 -28 13 37 58 24 -35 57 -16 -18 36 44 -49 6 11 -35 24 33 18 10 5 72 -3 39
6779 39 15 1 -46 12 4 -24 13 45 5 -2 17 -11 -6 -18 11 -45 -8 13 14 30 -16 17 37 10 -7 33 -33 -12 -10 36 -1 -59 7
6812 7 -40 -60 4 0 -10 -40 1 7 27 38 -5 -37 13 -52 10 -7 19 32 -32 26 23 10 41 -27 29 58 -25 5 13 -19 46 -4 -8
6845 -8 42 -34 58 14 -19 23 -27 51 -36 21 49 18 30 68 -20 -7 6 -71 -16 -63 -23 43 36 -81 7 -42 27 67 -29 41 -33
6876 -33 41 23 14 11 53 53 -17 3 8 38 -35 -9 -2 -21 29 -13 57 50 15 -14 -22 27 -3 21 -7 26 17 15 65 2 -58 65 -12 -22
6910b2J17j11N6jj9q3M0n7J41n5p4J25j8n2J5k3PJ9m9L8m9O4m7L3K3L8K3j06m0
6939f7N8PpjJ7N4o7k1M3Nk1Kk1N9J4j03K6rQ9o5N6n0M9l2ql0j2J1j3pM1K8k5N4
6973E4p9L9om4LJ4M5q4J34q8OL3o0J7Qk6J3QL0m3J9L6L4l0j22J23k8J2M2K1m5
7004C6l7Q4K0j72Q3l8o8Q2qL1j9l8K1J2K9rK7n3Pk2J0O1l7lJ7K7m9jp8J10r6Q0
7036IK0k0k1MK1m5M1l8J7N7qk2L4k3qK1l2K7Kmq3P8j16Q9J3m5M6j1l2N8K0Nq2
7069b8K2k7jK5m2O4j4J7K1q7N6j2LM9j38J45l6J2rL0n0n6N3N8p2k8M6l6J9J4j7
7100a9L7Mj8L7n5J0M0q1M2M0m3L8J9k4J4L9n4K8n6L3l0K0j6M0o0M6%m7N5m8K1
7131A2m6L0N0J6l2m9k0%Q2r7j0P4MJ3l5j6J6jO7k4q4J07o6KQ3o4l2O9r5O3p9P5
$$ plain form
6910 -22 95 -16 40 39 20 -63 -23 -80 61 6 -68 57 39 -13 2 -21 -14 5 -44 -6 -55 9 -38 -5 18 56 79 -27 -67
6939 -67 -9 -2 -9 -10 7 61 -6 -27 16 21 0 2 -19 40 54 -49 -23 -32 57 -8 48 -2 47 15 7 -23 -35 -24 -37 -44 -3 25 0 54
6973 54 -25 14 8 -36 -33 -19 26 -58 76 -12 -6 27 -33 -16 -8 -34 -21 -13 17 -26 -7 29 63 33 -89 34 6 18 60 81 36
7004 36 -1 83 103 -69 14 -24 -92 -10 -18 13 -6 -44 -23 -11 18 9 36 -17 -10 -32 -22 39 2 -1 16 43 -6 -7 -85 25 -71 9
7036 9 29 9 -12 -8 13 -32 9 -29 -12 45 37 15 49 26 18 39 7 34 36 32 -51 27 -89 0 13 -32 14 3 -29 29 49 54 -28
7069 -28 -6 -33 -34 -9 -51 13 -1 16 37 -50 6 -6 -3 46 -92 53 17 29 20 50 0 -56 -3 55 -17 -45 1 -35 -16 -2 -19
7100 -19 18 22 4 41 -14 -4 36 -45 -3 37 -6 32 51 27 41 80 26 54 -2 31 1 21 5 45 -15 31 31 -16 39 -9 12
7131 12 -34 -4 46 62 30 -19 -39 -39 43 -54 -64 10 14 27 -8 -24 -8 -9 58 34 -50 57 -9 -7 76 12 -20 49 -46 17 -62 13
7163A3J1oK0l1l3K0JJ2K6Rlj7K3j31J27o6j2L9J2K2m5J8KJ2k7l2J11j35L7OM7
7194C0j06M1N4k8pL0m3P1j38P7P4l0m5K9K7k9j3kJ9J2J3o6P1Qk4l7K3o0PN5KP1
7226H6j15%K2M6n0j8j7R4k3j3M1p0J8K2J7j11J04o3J2j5L4K0K7l9k9njO6o2L3
7256A1pl9K3L1nj0n0J7N6o8J8n9O7p6J21l0J4N0m8n8N6k7Pj1m9P6L6k2%J6o8L6
7288HpK9j2l4J5k7M7o2L6K7j7KmJ4l3l8L5K1O7j26N5O2q4O0j3o2R5k4j5j5O2j25
7320f3N2N2m5K2J6m7j3L9k0%M9q4K5mJ5j9K8rl5P4j08J30p8K8M5n7j3rP0mm7j
7352a1j2L4m7j2Q9q6O0nj1o0P0k6K8K0l4lNK8n2K9l3O4Ok3K5n5Jk1J2M3o8K6O8
7385D9m2QK0kLp4N3k8J2j5K7Km0J7M9j2l7oJ5R6p2o9j8J51l9p7J7K3J3l9k3M3
$$ plain form
7163 13 24 18 38 7 -26 -6 -5 7 33 42 39 22 45 -86 41 -25 -37 2 14 36 -9 9 11 23 -4 -36 75 -60 -23 -17 30
7194 30 -76 -35 19 -9 -16 14 -29 42 -96 -19 55 25 -20 9 36 7 -6 -8 11 23 36 -30 41 49 25 -12 11 -49 -42 13 15 86
7226 86 -29 -29 -7 39 -11 -29 -46 48 25 12 53 -17 1 23 40 -71 33 -30 -18 -33 1 21 48 9 -20 -25 -26 40 -22 11
7256 11 4 -35 -12 19 14 4 -46 -29 27 -41 -23 -82 -15 -91 30 0 14 64 16 -42 14 -13 -6 -17 -66 10 46 24 24 40 -28 8
7288 8 1 30 18 -16 -1 -28 19 -43 -7 20 3 5 1 15 -18 -56 -21 0 67 -59 -4 58 -26 34 21 -41 54 30 15 0 62 -63
7320 -63 -11 41 -4 18 34 -13 -26 13 -7 -7 42 -42 -17 -21 -6 -25 3 -6 -41 33 -75 55 -23 5 50 -7 -20 -29 41 37 -10 -11
7352 -11 -23 11 -36 -48 41 -45 15 10 -1 -61 9 -17 11 31 -3 -6 -1 27 -25 4 -29 35 41 18 43 -12 -11 -32 -20 23 -45 -19 49
7385 49 7 15 35 33 36 -38 15 -13 -1 -16 11 13 -27 -10 39 27 -10 -16 -1 95 23 -46 -64 87 48 -29 -12 11 24 -15 -38 5
7417EN1k8j00L3L5J7J3m4M8j0j1K9j3J1k7m1L8Q0o9p2P2Mj3l5L2Ok6O6m7rK2l
7449A4K6m2Nj2n3Q4j5N3j08pQ3J3nn8m0N6Pl5O6l0k4J3lPL7k8pj0O4m4l5O3o2
7482b7m0J22n4j2k3J00j10M0PJ2l7l3J6P7Rk6m2O1%l4J9j1n5Q9n1L4qL7mj43J10
7513B3n1M7k4M4m0L2k4OJ5k4l1L3N2p7j0j8K8J6p4R9Pl8nLj9K3P1j02QL9j9PJ1
7546HJK8j4k9K2K4n5j2L1j4lJ3n3MN5n7L0K5M9n7m2N9o0M6K9o3M9k6P4r5M7j7
7578cM3n8mJ0L5l6P8j29L3L4p8N4j3P2p2O5n3J6l0M0Rk8k0L3JNo5P9J0j5K2k4
7610A1j4N6k6q6M9J8J7J8j3K5m5J2Nj3OJ2l0N9n0kkL8k9m9M1M3k2n1L4k3%L3j6
7643FM4l3r4P6om1O7j3p2Q3k7M7q3L9k4J2OM7L1o5j0l9Q6j5LJ%o3j7J20p7K8K1
$$ plain form
7417 5 56 28 -72 -39 -4 13 26 -18 30 20 9 38 25 36 9 -32 6 86 17 -55 17 21 8 -27 5 11 -15 51 4 -5 17 14
7449 14 40 -2 3 -9 -62 22 7 60 -48 -55 28 41 36 -22 -62 -6 1 -34 32 2 -22 -9 -12 -5 32 4 -3 -13 51 7 -28 35 -27
7482 -27 -67 55 1 -11 -34 66 -44 -4 3 15 -22 -55 -39 38 47 21 -21 40 40 6 25 14 -41 48 -3 31 23 60 56 -87 23
7513 23 -28 19 -5 39 -1 31 7 13 28 4 -27 6 58 -19 -29 -47 -19 -3 -77 22 29 -9 -14 -11 -30 -7 64 -38 -30 9 -10 -3 8
7546 8 9 37 23 -6 16 40 -15 -27 4 -10 -13 0 -53 -49 6 -51 -21 4 53 -4 -46 13 -47 -1 28 -35 14 -12 62 -33 14 -3
7578 -3 40 -18 -22 -12 23 -13 65 -64 -31 3 -75 -21 -34 38 -34 31 -22 -6 -36 4 13 -15 -35 -2 -1 4 -61 18 28 13 35 11
7610 11 -3 53 27 -59 -10 8 25 43 30 55 10 22 27 14 20 32 2 61 11 9 7 45 16 -33 8 51 29 -22 12 -11 -11 22 6
7643 6 50 17 -77 -1 -7 -48 19 6 -66 17 -10 37 -46 -7 -31 -19 -13 34 65 0 -10 -49 37 22 25 26 26 -37 -54 66 -11 17 38
$$ [...]
8191A3
##END NTUPLES=NMR FID
##END=
