##TITLE=1H_DE-30H_k
 D2O
 8 sc, 
 9.10.2024
##JCAMPDX= 6.0         $$ Bruker NMR JCAMP-DX V2.0
##DATA TYPE= NMR FID
##DATA CLASS= NTUPLES
##ORIGIN= UXNMR, Bruker Analytische Messtechnik GmbH
##OWNER= root
$$ XWIN-NMR		Version 3.5
$$ Wed Oct  9 14:42:51 2024 Russian Standard Time (UT+4h)  she@DPX200
##.OBSERVE FREQUENCY= 200.1318
##.OBSERVE NUCLEUS= ^1H
##.DELAY= (6, 6)
##.ACQUISITION MODE= SIMULTANEOUS
##.ACQUISITION SCHEME= undefined
##.AVERAGES= 8
##.DIGITISER RES= 18
##SPECTROMETER/DATA SYSTEM= spect
##.PULSE SEQUENCE= zg30
##.SOLVENT NAME= D2O
##.SHIFT REFERENCE= (INTERNAL, D2O, 0, 15.7039)
##AUDIT TRAIL= $$ (NUMBER, WHEN, WHO, WHERE, WHAT)
$$ ##TITLE= Audit trail, XWIN-NMR		Version 3.5
$$ ##JCAMPDX= 5.01
$$ ##ORIGIN= Bruker BioSpin GmbH
$$ ##OWNER= she
$$ F:/spectra/data/she/nmr/H-F/1/audita.txt
$$ ##AUDIT TRAIL=  $$ (NUMBER, WHEN, WHO, WHERE, WHAT)
(   1,<2024-10-09 14:40:21.68 +0400>,<she>,<DPX200>,
      <created by zg, POWCHK disabled, PULCHK disabled
       configuration hash MD5:
       00 E9 B6 7A A2 85 ED C7 34 08 36 98 17 FE 4E 26
       data hash MD5: 16K
       3E 06 E5 9B 5E DF 77 19 5F EF E6 5C E6 C7 21 A5>)
$$ ##END=
$$ 
$$ hash MD5
$$ 88 95 2A B5 F8 8B 08 EE 1B 63 3B 7A 89 D9 CE EB
##$RELAX= 
##$RELAX= 
##$RELAX= 
##$RELAX= 
##$RELAX= 
##$RELAX= 
$$ Bruker specific parameters
$$ --------------------------
##$DU= <F:/spectra>
##$EXPNO= 1
##$NAME= <H-F>
##$PROCNO= 1
##$TYPE= <nmr>
##$USER= <she>
##$AMP= (0..31)
100 100 100 100 100 100 100 100 100 100 100 100 100 100 100 100 100 100 
100 100 100 100 100 100 100 100 100 100 100 100 100 100 
##$AQSEQ= 0
##$AQ_mod= 1
##$AUNM= <au_zg>
##$AUTOPOS= <>
##$BF1= 200.13
##$BF2= 200.13
##$BF3= 200.13
##$BF4= 200.13
##$BF5= 200.13
##$BF6= 200.13
##$BF7= 200.13
##$BF8= 200.13
##$BYTORDA= 1
##$CFDGTYP= 0
##$CFRGTYP= 5
##$CHEMSTR= <none>
##$CNST= (0..31)
1 1 145 1 1 1 1 1 1 1 1 1 1 1 1 1 1 1 1 1 1 1 1 1 1 1 1 1 1 1 1 1 
##$CPDPRG= <>
##$CPDPRG1= <>
##$CPDPRG2= <>
##$CPDPRG3= <>
##$CPDPRG4= <mlev>
##$CPDPRG5= <mlev>
##$CPDPRG6= <mlev>
##$CPDPRG7= <mlev>
##$CPDPRG8= <mlev>
##$CPDPRGB= <>
##$CPDPRGT= <>
##$D= (0..31)
0 1.2 0 0 0 0 0 0 0 0.06 0 0.03 0 0 0 0 0.0002 0 0 0 0 0 0 0 0 0 0 0 0 
0 0 0 
##$DATE= 1728470421
##$DBL= (0..7)
120 120 120 120 120 120 120 120 
##$DBP= (0..7)
150 150 150 150 150 150 150 150 
##$DBP07= 0
##$DBPNAM0= <>
##$DBPNAM1= <>
##$DBPNAM2= <>
##$DBPNAM3= <>
##$DBPNAM4= <>
##$DBPNAM5= <>
##$DBPNAM6= <>
##$DBPNAM7= <>
##$DBPOAL= (0..7)
0.5 0.5 0.5 0.5 0.5 0.5 0.5 0.5 
##$DBPOFFS= (0..7)
0 0 0 0 0 0 0 0 
##$DE= 6
##$DECBNUC= <off>
##$DECIM= 24
##$DECNUC= <off>
##$DECSTAT= 4
##$DIGMOD= 1
##$DIGTYP= 9
##$DL= (0..7)
0 120 120 120 120 120 120 120 
##$DP= (0..7)
150 150 150 150 150 150 150 150 
##$DP07= 0
##$DPNAME0= <>
##$DPNAME1= <>
##$DPNAME2= <>
##$DPNAME3= <>
##$DPNAME4= <>
##$DPNAME5= <>
##$DPNAME6= <>
##$DPNAME7= <>
##$DPOAL= (0..7)
0.5 0.5 0.5 0.5 0.5 0.5 0.5 0.5 
##$DPOFFS= (0..7)
0 0 0 0 0 0 0 0 
##$DQDMODE= 0
##$DR= 18
##$DS= 0
##$DSLIST= <SSSSSSSSSSSSSSS>
##$DSPFIRM= 0
$$ [...]
##$SUBNAM2= <"">
##$SUBNAM3= <"">
##$SUBNAM4= <"">
##$SUBNAM5= <"">
##$SUBNAM6= <"">
##$SUBNAM7= <"">
##$SUBNAM8= <"">
##$SUBNAM9= <"">
##$SW= 24.0689170037331
##$SWIBOX= (0..15)
0 0 2 0 0 0 0 0 0 0 0 0 0 0 0 0 
##$SW_h= 4816.95568400771
##$TD= 16384
##$TD0= 1
##$TE= 0
##$TE2= 300
##$TE3= 300
##$TEG= 300
##$TL= (0..7)
0 120 120 120 120 120 120 120 
##$TP= (0..7)
150 150 150 150 150 150 150 150 
##$TP07= 0
##$TPNAME0= <>
##$TPNAME1= <>
##$TPNAME2= <>
##$TPNAME3= <>
##$TPNAME4= <>
##$TPNAME5= <>
##$TPNAME6= <>
##$TPNAME7= <>
##$TPOAL= (0..7)
0.5 0.5 0.5 0.5 0.5 0.5 0.5 0.5 
##$TPOFFS= (0..7)
0 0 0 0 0 0 0 0 
##$TUNHIN= 0
##$TUNHOUT= 0
##$TUNXOUT= 0
##$USERA1= <user>
##$USERA2= <user>
##$USERA3= <user>
##$USERA4= <user>
##$USERA5= <user>
##$V9= 5
##$VALIST= <valist>
##$VCLIST= <CCCCCCCCCCCCCCC>
##$VD= 0
##$VDLIST= <DDDDDDDDDDDDDDD>
##$VPLIST= <PPPPPPPPPPPPPPP>
##$VTLIST= <TTTTTTTTTTTTTTT>
##$WBST= 1024
##$WBSW= 4
##$XGAIN= (0..3)
0 0 0 0 
##$XL= 0
##$YL= 0
##$YMAX_a= 186412
##$YMIN_a= -145846
##$ZGOPTNS= <>
##$ZL1= 120
##$ZL2= 120
##$ZL3= 120
##$ZL4= 120
##$ABSF1= 10
##$ABSF2= 0
##$ABSG= 5
##$ABSL= 3
##$ALPHA= 0
##$AQORDER= 0
##$ASSFAC= 0
##$ASSFACI= 0
##$ASSFACX= 0
##$ASSWID= 0
##$AUNMP= <proc_1d>
##$AZFE= 0.1
##$AZFW= 0.1
##$BCFW= 1
##$BC_mod= 2
##$BYTORDP= 1
##$COROFFS= 0
##$CY= 11.3945322036743
##$DATMOD= 1
##$DC= 2
##$DFILT= <>
##$DTYPP= 0
##$F1P= 15.6554695791079
##$F2P= 12.8336369535428
##$FCOR= 0.5
##$FTSIZE= 0
##$FT_mod= 4
##$GAMMA= 1
##$GB= 0.15
##$INTBC= 1
##$INTSCL= 1
##$ISEN= 128
##$LB= 0.24
##$LEV0= 0
##$LPBIN= 0
##$MAXI= 10000
##$MC2= 0
##$MEAN= 0
##$ME_mod= 0
##$MI= 1.114404
##$NCOEF= 0
##$NC_proc= 0
##$NLEV= 6
##$NOISF1= 3.799351
##$NOISF2= 2.8
##$NSP= 1
##$NTH_PI= 0
##$NZP= 0
##$OFFSET= 15.70392
##$PC= 1
##$PHC0= -26370.4
##$PHC1= 42.98743
##$PH_mod= 1
##$PKNL= yes
##$PPARMOD= 0
##$PSCAL= 0
##$PSIGN= 0
##$REVERSE= no
##$SF= 200.130013532006
##$SI= 16384
##$SIGF1= 3
##$SIGF2= 2
##$SINO= 400
##$SIOLD= 16384
##$SREGLST= <1H.CDCl3>
##$SSB= 0
##$STSI= 0
##$STSR= 0
##$SW_p= 3612.71676300578
##$SYMM= 0
##$S_DEV= 0
##$TDeff= 0
##$TDoff= 0
##$TI= <>
##$TILT= no
##$TM1= 0
##$TM2= 0
##$TOPLEV= 0
##$USERP1= <user>
##$USERP2= <user>
##$USERP3= <user>
##$USERP4= <user>
##$USERP5= <user>
##$WDW= 1
##$XDIM= 8192
##$YMAX_p= 0
##$YMIN_p= 0
$$ End of Bruker specific parameters
$$ ---------------------------------
##NTUPLES= NMR FID
##VAR_NAME=  TIME,          FID/REAL,        FID/IMAG
##SYMBOL=    X,             R,               I
##VAR_TYPE=  INDEPENDENT,   DEPENDENT,       DEPENDENT
##VAR_FORM=  AFFN,          ASDF,            ASDF
##VAR_DIM=   8192,          8192,            8192
##UNITS=     SECONDS,       ARBITRARY UNITS, ARBITRARY UNITS
##FACTOR=    0.0002076,     1,               1
##FIRST=     0,             0,               0
##LAST=      1.7004516,     0,               0
##MIN=       0,             -145846,         0
##MAX=       1.7004516,     186412,          0
$$ Real data points
##PAGE= N=1
##DATA TABLE= (X++(R..R)), XYDATA
0 0 0 0 0 0 0 0 0 0 -8 8 -8 8 -8 16 -16 24 -24 32 -39 45 -54 62 -72 83 -94 109 -125 142 -161 184 -207 233
32 233 -262 293 -326 366 -407 452 -502 557 -617 684 -757 837 -929 1028 -1142 1269 -1414
49 -1414 1581 -1777 2010 -2289 2635 -3075 3654 -4458 5655 -7640 11702 -39754 156566 154577
63 154577 -67109 -30698 -56711 -83925 81681 156321 -29555 -117604 -58103 17977 88842
74 88842 81634 -48571 -108666 -38936 60408 97039 27663 -84263 -82250 7539 72044 67850
86 67850 -7068 -88630 -60371 35165 82032 47255 -45842 -97559 -14521 78120 53819 -4222
98 -4222 -42294 -68573 -5924 89054 50775 -46522 -55768 -25656 16412 74292 38442 -67348
110 -67348 -67529 16589 48849 35169 3260 -49772 -51908 16771 63154 34537 -32174 -63501 -14718
123 -14718 48028 41769 765 -30623 -47140 -7809 58187 41898 -28949 -45238 -16714 15192
135 15192 44139 26320 -34343 -49230 -2668 38075 36784 -4129 -41813 -27180 14132 31675
147 31675 24560 -8688 -46088 -22812 35576 38715 -2245 -26246 -28185 -4577 32671 31060 -11232
160 -11232 -34850 -18910 13904 33388 15044 -21115 -30978 -7594 23449 31055 -117 -31659
172 -31659 -21024 9455 23728 18311 -6642 -31265 -16221 20668 27537 3910 -18898 -23533 -2826
185 -2826 23877 21156 -5949 -23727 -16147 8464 24910 11308 -15193 -20939 -5806 14439 22383
198 22383 3958 -22408 -19156 7051 19849 11449 -5799 -18786 -11770 10906 21182 6514 -15185
211 -15185 -18633 -464 16738 14169 -1949 -16083 -13820 5296 19171 8734 -11303 -15690 -4885
224 -4885 10226 15987 3193 -14763 -14109 2732 14874 10767 -4892 -14792 -7810 7487 14131 5572
238 5572 -9650 -14375 -1960 12126 11507 -1228 -12143 -9963 3420 13113 7557 -6310 -12733 -4749
252 -4749 8511 11169 1918 -9127 -10497 -120 11309 9169 -3490 -11377 -5849 4807 10197 4937
266 4937 -6857 -10788 -2276 8546 9365 -387 -9067 -7315 2516 9218 6180 -3779 -10098 -3716 6408
281 6408 8454 1498 -6504 -8163 -113 8072 6983 -2148 -8149 -5340 3028 8594 3502 -5063 -7439
296 -7439 -2215 5592 7036 312 -7139 -5943 1626 6882 4568 -2613 -7067 -3573 4431 6726 1562
311 1562 -4937 -5867 -641 5878 5362 -953 -5835 -4205 2466 6392 3027 -3914 -5734 -1631 4281 5711
327 5711 192 -5119 -4836 1186 5355 3976 -2029 -5613 -2906 2959 5250 1647 -3599 -4970 -483
342 -483 4619 4375 -784 -4577 -3322 1651 4713 2163 -2667 -4444 -1228 2979 4356 623 -3833 -3363
358 -3363 414 3796 2972 -1455 -4272 -2415 2323 4103 1329 -2871 -3612 -717 3603 3249 -604 -3733
374 -3733 -2814 977 3794 1882 -2278 -3619 -1093 2503 3085 600 -2811 -2583 253 2959 2030 -941
390 -941 -3105 -1870 1782 3095 1085 -2328 -2791 -433 2463 2772 -159 -2897 -2092 1006 2813 1621
406 1621 -1443 -2892 -1165 1757 2312 296 -1913 -2328 205 2397 1609 -843 -2527 -1404 1247 2631
422 2631 909 -1839 -2359 -407 2343 2005 159 -2098 -1412 689 2218 1200 -1033 -2137 -672 1514
438 1514 1897 298 -1668 -1467 8 1779 1402 -368 -2038 -1297 899 1784 518 -1242 -1826 -271 1388
455 1388 1681 -41 -1658 -1355 612 1670 1208 -900 -1623 -539 1012 1357 343 -1104 -1685 212 1447
472 1447 1183 -429 -1040 -1083 505 1252 823 -952 -1282 -167 1066 1033 -351 -1208 -1134 289 878 1078 -635
491 -635 -1235 -345 806 1208 78 -1061 -1409 -87 1436 874 -444 -912 -701 269 1234 399 -730 -974
509 -974 -540 934 1071 -163 -972 -576 69 970 478 -313 -750 -90 427 1023 276 -956 -709 197 940
528 940 783 -243 -1085 -391 358 683 407 -457 -952 -10 662 742 205 -381 -407 -16 461 349 -402 -839 -456
549 -456 418 784 103 -524 -687 209 561 568 -81 -753 -381 406 802 79 -461 -346 -233 226 931 9 -650
570 -650 -426 88 663 -140 -219 -661 -336 577 591 134 -436 -290 -199 261 706 -74 -449 -213 12 865 392
591 392 -546 -656 51 475 362 78 -356 -545 250 321 437 -285 -716 -330 421 445 185 -579 -281 -39 396
612 396 316 161 -511 -158 191 505 41 -467 -318 -102 434 471 -90 -495 -449 54 346 -57 -352 -423 -330 260
634 260 392 241 -502 -369 -152 413 636 -71 -175 -402 406 232 455 -165 -363 -192 566 136 182 -387 -129
655 -129 55 156 151 -356 -205 -177 396 414 264 -356 -156 -312 331 234 -138 -459 -408 -29 126 185 -223 -535 -287
678 -287 284 362 49 -190 -217 -24 546 231 143 -96 -60 445 -8 140 -316 -114 -200 -17 149 133 -281 -102
700 -102 155 261 327 -84 -37 120 -46 71 220 -234 -431 -7 273 226 -75 -198 -237 296 54 125 -88 -471
722 -471 84 232 340 -65 10 -43 -56 147 65 -155 -159 -305 488 289 -60 -62 -18 -136 -127 239 56 -344 -8 -168
746 -168 287 -248 132 -212 329 -7 -100 -72 -110 -83 65 26 -14 -167 -143 -225 169 272 -111 42 -114 18 163
769 163 -31 244 -295 -335 -10 394 153 -171 -6 25 76 -88 -8 -145 -199 224 462 -39 103 -205 -165 -81 164
792 164 274 -504 -396 -150 -28 -65 236 85 188 142 322 -49 -213 -222 -24 43 163 -191 -346 -78 52 53 157
815 157 -38 -254 20 7 -104 -86 137 -278 -30 -154 78 237 -210 -141 87 18 -67 -246 88 390 -149 -25
837 -25 -184 -189 4 91 241 344 -135 -187 58 276 -50 -180 221 -35 173 -35 128 -81 -44 -77 -12 -24 291
860 291 -306 13 -83 19 236 -97 23 -277 -56 -119 -114 -178 17 76 124 -303 39 162 27 105 270 33 -69
883 -69 74 -94 339 309 -69 98 -52 121 -171 207 -105 109 -281 -264 -182 -181 -61 -143 17 -49 -72 158 -17
906 -17 76 138 -97 126 237 171 -102 35 -115 -110 -48 -245 -66 255 -87 189 216 -130 -45 -159 -168 190 -72 4
930 4 -163 159 -281 -172 -10 -233 -233 -147 221 47 164 -263 141 -236 62 -90 54 -130 -148 165 -139 52
952 52 158 96 31 -443 68 80 -133 129 -97 162 -101 -263 79 -273 264 201 239 -165 -56 -338 69 59 -87
975 -87 -35 23 148 -289 4 -48 -302 -292 348 -10 -131 -83 41 -179 57 -6 362 -86 311 237 -193 -41 -43 91
999 91 -359 -183 115 -24 17 -100 71 224 65 18 -321 -110 -470 -1 -56 -54 -217 198 -24 -243 -73 48
1021 48 34 38 -21 40 -45 26 -27 -56 222 -3 -76 143 166 -228 81 -135 -144 -285 223 -10 54 232 -94 60 256
1046 256 -52 -72 184 -107 124 50 -160 -162 287 154 -134 -6 177 118 37 49 -132 -110 -93 -42 -183 -92 196 64
1070 64 -131 10 -154 -210 101 -58 -28 -293 18 114 194 -56 285 145 26 -196 -239 -222 105 155 -121 -13 85
1093 85 -174 0 -83 95 65 -270 -302 -64 -295 -27 177 -7 294 82 132 216 223 -3 -98 -18 471 2 246
1116 246 127 -64 -82 351 -206 -75 3 35 38 197 -49 -150 49 92 49 197 -85 227 -164 153 150 -230 -149
1139 -149 234 9 -110 88 -58 106 -241 -189 -119 -314 110 115 -230 181 -90 -88 -6 -149 -435 -70 -254 254
1161 254 41 79 -282 -8 -46 120 -13 -235 128 -53 -76 12 11 -217 -28 -66 329 177 -29 -278 -60 118
1183 118 151 50 -96 172 -356 45 -126 -198 -147 42 -210 -8 -176 -111 -229 13 -108 -83 97 260 -114 -90
1205 -90 -78 -95 106 104 -183 29 -119 8 117 -323 -196 -83 137 -21 48 286 34 170 -30 226 90 109
1227 109 42 -38 75 -142 311 -29 -188 50 578 -8 370 -178 125 -117 -135 128 191 33 -18 -86 164 -23
1249 -23 -5 -18 -301 -28 -43 141 -109 150 259 210 409 -159 -19 -218 60 -45 -9 86 -90 -11 27 72 -12 88
1273 88 261 167 -42 -222 122 176 -30 69 103 -44 84 210 290 -84 297 139 -147 -202 -157 -123 -127 242 -64 240
1297 240 -15 -112 -164 -61 167 -46 -152 16 -359 54 -7 -141 -221 -203 31 -26 -101 239 -221 71 40 -199 -196
1320 -196 -200 -45 -193 -176 -38 -403 -143 -15 -98 -254 25 70 -2 -106 -284 -157 0 19 230 139 -152 224 186
1343 186 24 66 147 129 -45 -61 115 -191 -218 -148 222 -255 77 -268 275 16 -76 -52 205 78 -83 -82 -60 -211
1367 -211 62 79 -130 55 103 -82 -194 84 189 249 -10 -33 -57 -51 -13 -47 -177 -11 -185 307 109 85 202
1390 202 45 -226 -260 -89 -56 -86 -173 -195 -209 87 -87 12 -216 272 -74 -339 -63 -59 288 -1 47 0 119 168
1414 168 129 126 -134 -114 -84 -132 157 107 -189 44 273 113 -179 -22 -171 -77 3 -272 7 -240 -20 -39 73
1437 73 119 -16 -76 26 -122 -127 151 42 174 -54 83 109 16 47 47 -287 33 213 88 -343 312 43 115 214
1461 214 190 32 82 287 -3 -105 -84 -70 165 52 77 69 -134 336 84 -78 -53 -244 -240 26 -133 33 -147
1484 -147 24 -161 -389 224 -585 -249 -49 -258 293 -132 -8 123 44 41 22 -22 82 81 62 32 144 33 -95
1507 -95 -32 164 182 -304 -246 -282 -8 143 105 54 -359 -35 22 228 0 -304 -63 410 -67 -164 78 -24 -275
1530 -275 83 89 18 302 -305 -179 -141 -103 46 -87 -107 -162 133 -402 149 -199 -242 44 -135 219 -87 -54 -143
1553 -143 -43 -61 185 -140 35 -284 128 -46 -71 19 -144 184 29 75 -78 -107 122 92 -255 112 187 55
1575 55 93 -19 97 -64 -418 -124 -223 -50 33 -54 128 221 15 122 -164 202 185 -20 -240 -172 115 -26 -5
1598 -5 77 207 -90 -315 -116 -230 -158 -110 38 -24 -53 -33 3 -162 -78 -56 213 26 349 -32 208 -252 55 304
1622 304 -241 -101 -256 129 -213 -53 -25 139 -188 214 -231 244 -332 -187 -115 -230 187 -184 -64 -61 -41 -24
1644 -24 -21 -4 -164 -186 234 -24 -20 9 -165 -168 -44 131 8 9 -367 100 7 -72 92 -270 -51 -430 72 109 -161
1669 -161 180 165 118 268 -87 -146 -92 141 -148 148 119 97 190 321 -44 -10 -268 105 -159 -104 179 -58 -282
1692 -282 -118 -311 175 238 -157 66 -242 210 -59 -195 -93 -61 -83 47 -159 144 -29 -118 142 84 14 53
1714 53 183 -157 149 -177 -181 33 78 45 -5 -218 -88 -80 -93 -36 -98 111 -185 141 115 76 95 -135 31 238 69
1739 69 8 414 -146 27 214 56 7 91 73 -47 -158 -54 -107 68 -304 -175 -43 20 329 -147 -29 142
1761 142 167 -37 130 -480 -161 85 223 -113 198 -15 -84 -261 232 -274 57 -189 -225 150 -28 -142 142
1782 142 -25 -71 234 75 -55 -213 16 313 -128 166 107 120 57 -255 -3 369 236 79 -144 38 -94
1803 -94 79 -13 -140 -213 267 -9 40 44 47 111 -348 -219 81 67 -68 -142 24 102 -277 -17 -101 213 -128 -245
1827 -245 -216 291 -143 -349 196 61 -46 51 158 -218 120 111 106 -22 0 -29 -137 -87 -65 -163 145 -78 -202 -97
1851 -97 106 84 -13 -146 -173 375 -34 27 180 8 -179 28 191 46 241 88 102 -99 43 2 -97 292 88
1874 88 305 48 -64 32 -226 103 5 -53 -53 36 -130 319 27 -158 219 17 -57 -45 -12 -156 196 99 -11 252
1898 252 -106 -296 -131 186 -15 273 -205 255 -158 219 210 249 112 134 423 131 -239 267 138 307 -73
1919 -73 276 -21 114 -26 132 -142 -36 171 302 56 -278 -89 27 217 -124 132 211 198 118 -109 200
1940 200 247 53 -73 -219 342 10 -48 -6 128 -76 236 96 143 -146 -76 105 -125 -161 -36 24 217 215 -164
1963 -164 -137 -276 310 154 -110 127 309 201 3 244 -193 130 115 -36 89 292 149 23 -124 176 288
1984 288 230 -210 -137 -105 -172 -307 -114 58 -120 7 -189 -130 311 14 -131 -252 -45 14 -160 -19 -37 -52 -12
2007 -12 135 137 86 -211 111 -271 -89 222 281 -237 95 16 -23 66 35 75 -154 7 -146 -60 -186 16 -156 -123
2031 -123 246 110 -32 -64 -184 63 -30 -17 -70 -136 -31 -18 151 -140 -136 14 -248 160 214 205 15 -189 -34 73
2055 73 -113 -79 -81 30 -197 170 -7 -256 4 -90 136 107 -32 211 -22 205 230 68 -134 -115 -6 -118 -80
2078 -80 -121 299 125 32 1 -17 -126 209 -23 23 542 -183 -96 110 -151 -351 -172 -66 -49 -166 -218 -266 -206 -113
2102 -113 -85 -120 84 -103 41 -250 -219 47 150 -36 236 -59 -216 120 -216 -19 -80 54 -77 -182 -253 111
2124 111 238 131 378 304 -7 -252 345 287 159 -174 -315 -55 -1 193 -94 -305 42 15 -40 -168 228 402
2146 402 -83 47 -16 177 28 84 115 -288 -172 -86 -110 -199 30 47 348 -148 50 152 191 144 -288 176 -106
2169 -106 -91 -33 69 -89 256 -117 60 183 -186 -55 -260 68 -9 -102 -13 -50 66 -61 -109 163 -192 -151 -139
2192 -139 -219 31 104 72 -105 90 -121 -123 -122 103 472 -288 -108 -35 -32 -42 37 44 -49 20 -236 -136 9 297 -6
2217 -6 -110 -14 188 60 -69 456 174 -53 -368 -5 -151 69 -37 134 104 -16 -59 -52 111 -72 -111 -110 251
2240 251 -25 215 56 -5 81 -4 -65 -62 -23 -205 127 29 22 -19 24 281 -68 -204 33 120 140 -12 116 -35 -34
2265 -34 -82 49 63 -88 -254 -14 95 111 13 -63 -98 -93 48 121 13 116 -122 -94 -267 -124 132 -84 50 113
2289 113 220 0 136 101 189 -97 360 340 -20 -74 23 32 294 542 152 151 -149 -86 111 -103 -54 59 -17 96
2313 96 188 -17 217 -93 -149 -10 114 -115 331 55 131 -59 -1 125 -10 -176 -389 -6 -131 -60 -62 -45 -133
2336 -133 117 119 -148 261 -228 115 163 90 -162 -79 471 -2 0 181 -61 -317 -203 -25 105 -329 406 -87
2358 -87 55 50 126 188 -199 110 125 -33 -92 281 -83 108 -57 -42 -157 -114 172 29 -56 50 -7 -192 11 76
2382 76 -64 120 -214 79 -303 74 0 159 -420 355 59 -33 73 -325 -213 123 304 56 24 -155 -32
2403 -32 -20 316 -196 -92 49 -383 -71 66 -217 -8 -174 -184 99 146 95 204 279 -24 -41 -18 -14 277 99
2426 99 -217 69 191 -56 -138 -22 97 58 31 -288 -63 465 -147 -7 -261 -45 -76 231 136 -87 -77 168
2448 168 102 -115 93 -53 119 18 -16 -63 158 52 27 -119 191 -129 200 -96 10 134 348 3 17 280
2470 280 -64 -252 173 192 -111 -202 -126 -12 94 -27 9 -151 130 -7 256 -28 -182 79 42 316 254 -4
2492 -4 134 231 87 -75 68 226 86 245 -226 80 109 -32 -103 -106 92 215 -69 -409 95 -127 -86 137 286
2515 286 -142 -171 120 -49 -87 -40 -191 -51 -268 27 -69 218 -58 -8 246 203 224 179 -246 -168 -29 83 249
2538 249 -49 -84 -165 -61 111 134 -121 253 14 -31 -112 84 -45 -236 86 -283 -349 150 262 -3 -75 72
2560 72 -77 28 -150 165 -169 143 23 190 121 95 70 -230 119 -148 -35 -456 -92 -14 154 226 223 227 199 35
2584 35 111 222 180 -105 -299 224 61 -61 42 8 -166 86 226 89 167 -197 -197 134 31 -39 95 135 -133
2607 -133 118 -230 -462 -333 -79 -12 -198 -403 -60 174 119 -302 45 111 91 -189 -44 -258 -101 195 -13
2628 -13 59 -33 31 76 300 -171 8 175 5 -24 -136 78 4 195 21 160 150 35 206 -2 39 -26 -65 -147
2652 -147 162 -169 35 181 -133 46 147 -69 121 108 -136 -309 234 301 1 -303 -125 -182 181 -38 145
2673 145 -336 33 -122 -11 16 -262 68 95 -84 -183 -38 30 69 -250 39 -62 -114 248 -176 -138 -12 -54 48
2696 48 29 201 -242 -134 255 407 281 96 -18 153 -296 92 -11 -32 236 -192 -184 118 -33 38 113 149 -168
2719 -168 170 269 -95 -27 43 344 -200 -176 -90 501 -11 171 -159 -125 101 -178 -73 -174 382 100 -134 -26
2741 -26 112 -82 -201 118 32 -233 -32 2 -116 126 182 -29 242 -74 53 -105 15 -201 193 227 -30 134
2763 134 -33 103 -77 139 8 63 291 -253 -96 31 280 -184 -201 197 73 -262 174 -165 51 -63 -98
2784 -98 94 -37 -76 -68 168 79 -248 -26 56 -362 59 159 301 -46 317 -63 -144 -216 -167 -117 130 161 277 -47
2808 -47 359 394 -205 -157 121 127 246 15 52 -75 194 -92 11 -102 -41 37 -116 14 2 150 -93 -120 -49 -162
2832 -162 44 11 -188 -11 129 -197 -3 -12 -90 -157 -235 39 -136 -65 171 172 -52 -77 -60 102 59 -280 24 8
2856 8 94 171 -75 -83 122 -331 -4 -16 -69 -129 -188 171 -38 76 -191 274 -34 84 -128 123 50 222 89 136
2880 136 117 -119 14 -132 76 67 182 -250 7 -337 -117 8 125 22 260 196 -104 -295 -125 -219 -97 -224
2902 -224 -27 -241 -248 48 184 -6 -19 120 -254 -346 144 65 34 105 273 42 22 -11 -72 451 25 168 -11
2925 -11 -246 -4 50 12 238 90 177 -12 -306 140 109 220 220 3 -31 -298 279 194 -131 -138 -79 -279 -105 244
2949 244 -262 -288 -35 -100 356 243 6 0 -309 -147 -110 95 -83 -165 -195 -1 -64 -331 -116 260 181 334 -78
2972 -78 268 25 35 133 -31 167 -30 220 97 125 -139 405 50 221 -46 -72 -74 -87 -146 -94 -120 204 42 296
2996 296 232 91 -7 -109 75 -125 -77 -92 -35 155 -51 149 -131 79 188 194 268 -51 -68 43 80 39 -258 -193
3020 -193 -317 -34 -350 -60 -200 -135 244 76 -36 445 -184 18 119 155 -164 17 271 -246 229 -87 311
3041 311 -74 -214 -90 71 68 33 -20 -128 -166 -48 45 -189 -82 126 -383 -57 42 12 124 -140 103 25 -82
3064 -82 -217 -106 233 -183 -163 -66 9 -97 -97 -96 -293 128 -60 -67 178 23 215 -197 161 42 -328 41 -69
3087 -69 221 236 90 -195 26 112 -74 105 98 -127 237 219 -300 -120 73 -396 114 2 82 -241 129 -21
3109 -21 6 44 178 -43 57 216 31 -125 -266 -337 -159 70 -310 166 -221 240 -162 -77 -133 84 4 -65 28
3132 28 26 28 161 -110 -200 70 90 118 31 57 20 -172 168 -156 -98 156 -56 -27 -243 32 99 -201 37 11 -244
3157 -244 -111 -174 -21 -144 -36 85 69 -107 -91 159 -225 98 33 -32 32 -82 -150 -184 -57 -215 176 -149 43
3180 43 18 -15 32 -33 290 64 80 -86 -94 15 51 22 -13 -100 -140 265 -88 -148 -84 149 424 59 -206 -190 363
3205 363 23 -138 -40 -69 198 -286 -92 106 3 -157 71 -146 -190 79 -57 284 42 114 192 296 -132 -130
3227 -130 33 -130 -169 40 176 -3 -38 -225 233 36 140 204 152 8 99 186 279 74 236 -186 -102 -87 -77
3250 -77 135 -164 -32 -88 -332 90 157 84 69 124 -135 369 25 256 -44 -98 -71 332 71 393 -119 -42 -14
3273 -14 5 -234 201 -103 204 197 131 -5 -208 -177 196 127 264 -108 108 -90 -512 -47 172 -84 59 -27 -75
3296 -75 -277 -130 -127 184 -67 -295 -73 -155 62 -246 -90 -180 183 -44 185 238 141 -184 199 -49 -119 -368 235
3319 235 138 100 -7 -76 115 167 110 180 101 145 89 186 -6 61 77 129 -64 -234 92 294 -72 -7 -323 32 166
3344 166 234 95 90 -201 37 99 39 116 -67 103 -216 -36 -33 54 -127 -186 106 -219 -12 -64 4 -69 139 252
3368 252 -169 -2 76 328 184 -173 -68 4 169 15 21 -62 -271 -21 119 -15 -156 -131 18 -112 251 105
3390 105 101 -40 -299 -78 -16 -29 67 -5 -19 94 -41 123 225 -117 196 -2 -80 98 -304 -194 377 363 165
3413 165 -20 213 41 -179 193 -99 -241 76 -25 99 -164 -104 23 -88 31 -106 80 31 27 -266 -297 293
3435 293 91 -63 -133 -167 41 -110 99 -45 305 -30 -214 -158 -223 -84 -191 88 -63 -107 -146 -62 147 -13
3457 -13 -171 50 -70 -139 15 -45 108 120 -175 250 -46 52 -348 -54 -30 -187 127 -212 -38 29 142 353
3479 353 82 43 -129 -58 -196 102 3 67 165 -194 -250 -128 367 -212 48 -72 131 -329 4 39 -87 -48 -295
3502 -295 -16 252 -35 278 -6 -39 82 -28 -55 -56 -19 -251 247 -92 50 87 274 -54 -234 -189 -234 -59 -26
3525 -26 -16 -61 137 -80 -82 -113 42 108 105 62 -105 87 135 -187 136 17 -22 -15 121 47 117 168 -66 -39 162 -365
3551 -365 -188 -23 -34 79 113 -49 -2 -63 130 69 31 96 92 136 226 -5 -109 224 -36 -34 49 -14 35 -233 -81
3576 -81 -71 -55 248 -67 195 153 201 17 -330 249 -109 -15 77 -258 185 -294 144 -120 -421 176 110 -77 364
3599 364 50 -61 206 -78 113 36 -123 62 -85 241 305 12 73 -54 -54 -66 122 -55 -52 -284 -194 -105 -258
3622 -258 77 82 318 74 8 169 -304 -132 -168 -27 -144 64 -118 -145 -76 455 -12 461 56 167 162 411 -299
3645 -299 6 -286 -43 459 -16 -199 -34 235 -17 -7 -95 59 47 -92 -10 -67 24 20 75 185 301 -20 245
3668 245 -94 -313 -93 -34 21 -136 138 -201 115 -62 104 -149 69 -67 -247 89 -60 154 -49 -123 -103
3689 -103 -26 -91 378 310 -233 -124 -162 116 -371 -10 31 83 -95 -87 139 -37 -24 -152 -190 -18 -24 -71 -225 -239 174
3714 174 92 -60 148 127 -11 116 312 -222 -208 -228 -278 -154 49 48 -398 104 207 41 167 -15 42 -201 -118
3737 -118 63 -17 -329 120 50 142 142 85 111 56 128 60 -57 -108 42 148 184 144 -74 65 -88 -24 130 -32 78
3762 78 -102 14 34 -233 -6 10 36 -177 216 -115 8 237 -71 -124 -81 -4 -418 29 324 -222 -61 67
3784 67 162 89 -152 78 -249 364 123 80 -76 34 -98 42 6 -86 270 131 -83 1 177 -143 50 66 89
3807 89 -192 -55 -16 -136 -136 -41 2 85 56 26 14 192 95 -166 121 19 -151 -12 77 -342 -220 -37 1 -11 52
3832 52 -118 164 183 -64 -140 385 5 -209 73 -86 202 173 441 41 -196 -22 194 -300 -70 336 26
3853 26 -269 150 -195 191 -165 -108 -4 -77 -20 98 -20 24 -175 310 50 89 21 5 117 1 -32 43 30 23
3877 23 -268 104 16 -211 79 -83 -120 -33 233 374 207 -152 135 -42 147 -271 -49 -381 57 -145 -351
3898 -351 -18 -219 -239 -311 -6 -111 -211 -13 -99 -263 -182 -253 87 -278 25 57 272 95 118 70 126 382 -93
3921 -93 -57 -95 113 -103 37 -138 -42 170 53 -168 -49 -91 -208 42 156 -97 395 138 136 42 347 -54 -134
3944 -134 -96 149 -32 350 246 -65 -11 -68 253 -101 279 340 59 -124 36 -152 140 -167 -124 162 -28 146
3966 146 -110 -157 28 34 114 -33 23 54 45 -153 14 -54 -283 258 119 102 128 239 -185 -98 -129 53 50 231 -21
3991 -21 74 -66 251 -124 86 -104 -232 35 185 212 -205 398 234 -76 205 4 176 173 -322 78 -9 13
4013 13 31 155 338 7 -183 273 104 170 247 92 -16 49 20 -158 -152 -245 -103 -434 -155 -73 249 10 -34 315
4037 315 -75 -82 -125 -102 118 281 266 170 -369 -81 200 -89 -47 -175 -65 3 -24 93 -138 22 127 -147 -107
4060 -107 -193 110 99 -31 40 -126 244 14 126 26 -223 80 152 76 -152 -292 -79 59 100 90 312 3
4082 3 266 226 -99 -36 -164 -48 92 -18 -20 6 -272 -143 157 -73 236 64 -71 -1 -106 176 -154 -126 -258
4105 -258 -146 0 48 222 -110 138 -192 151 295 -123 86 -180 -173 -66 -40 -27 36 -50 -145 -165 15 143 56
4128 56 -317 -69 -170 39 -194 -117 -30 314 -110 1 301 15 163 -60 -236 -48 69 -239 49 -169 58
4149 58 -24 134 -30 -90 -292 -91 -15 451 -115 126 68 449 -69 -98 95 -204 -10 -36 114 -304 77 -349
4171 -349 -37 74 79 -9 -197 -281 -259 -203 -6 -8 141 125 -65 -7 186 -182 215 -2 76 -108 137 -114 94 -192
4195 -192 -291 -44 -52 39 -133 228 -686 12 -233 122 -22 224 202 294 199 -30 -184 -264 -236 -132 28 42 -257
4218 -257 -126 -113 37 -40 85 73 -159 -43 -186 249 -83 -44 -164 98 38 135 -388 68 -249 -179 19 203
4240 203 156 -337 -28 378 124 132 69 157 10 60 288 -166 0 81 -192 10 298 -45 140 92 242 -166 141
4263 141 -103 91 -87 -220 95 207 225 171 183 -200 -47 -320 -13 223 184 286 201 270 -154 279 -13 106
4285 106 -8 44 52 -205 46 -178 86 -26 -97 47 182 48 -149 -27 -196 236 -1 32 23 190 -361 -101
4307 -101 117 -48 -175 92 90 -284 2 -45 105 -260 -253 195 65 -59 233 221 148 97 -161 -123 294 127 -155
4330 -155 377 -42 353 193 -12 131 117 -143 196 328 102 259 24 62 -189 218 179 53 182 66 -10
4351 -10 288 -171 -92 -44 -259 -41 -36 67 115 -202 -89 239 -242 50 5 -244 150 -106 -244 -69 45 -178
4373 -178 57 -102 -156 -252 -49 -179 204 205 -99 -213 -332 37 -58 -186 11 -294 -41 214 -181 -66 110 74
4395 74 39 -58 -70 88 7 98 -238 168 165 -251 -64 -124 -375 -89 -62 -263 -79 -292 -122 391 -85 -42 67 -166
4419 -166 -7 -141 -78 95 -201 -208 -95 31 61 41 129 -4 324 22 -80 -179 -219 -79 21 176 147 145 13 4
4443 4 90 73 -16 -8 -86 80 -213 139 -171 114 146 104 160 8 112 -127 -306 -93 397 -80 64 -120 111 -156
4467 -156 35 309 -196 264 230 -192 49 30 -343 176 49 -53 328 209 140 -71 -230 -44 53 230 89
4488 89 -30 -124 155 -4 -75 -175 -135 -28 33 -58 -3 -70 26 -59 43 42 69 -161 48 125 131 78 97 -146 -22 -338
4514 -338 -313 114 265 64 -515 -155 -200 -291 0 -58 -451 -215 212 -200 5 -312 -43 84 18 -195 -188 -136 263
4537 263 312 -36 -283 -160 124 -309 -89 -36 -79 78 -162 60 122 -246 149 -207 90 -57 228 84 225
4558 225 163 21 -86 77 -127 -216 61 -233 -151 154 -127 138 61 -154 -20 -27 -228 -71 -2 33 81 -126 95
4581 95 -229 251 -90 -12 8 -169 40 -103 -230 -291 315 78 240 -283 226 223 -365 301 -199 189 -217 -114
4603 -114 124 -87 -493 51 -298 98 7 -101 167 -128 -17 -291 64 208 47 186 117 -57 204 50 55
4624 55 58 -62 94 57 244 285 358 198 -195 -136 22 -253 152 39 -56 189 -52 215 20 252 283 -74 45
4647 45 169 135 167 87 -119 -162 -69 -342 -124 44 -109 -28 135 70 60 29 45 -297 -126 104 -125 -385 -61 -419
4671 -419 196 -18 206 30 121 -92 -169 -110 -15 185 71 136 -22 -17 60 -237 233 477 -87 72 48 205 -4
4694 -4 76 102 413 -63 30 -240 -126 48 -57 -197 -185 205 -226 -74 -35 -401 50 21 224 126 -287 -104 -74
4717 -74 188 74 268 -124 70 -120 5 -182 -315 222 39 -138 -185 -86 -136 -165 -38 -293 322 9 67 85
4739 85 13 -166 13 84 -87 -260 -155 59 -55 5 210 71 -433 -34 -9 81 -58 -103 -1 -227 102 28 -109
4762 -109 184 315 -42 -110 81 -21 39 308 -26 -89 27 -82 -39 -168 25 -249 -79 -122 46 4 -192 234
4784 234 14 79 147 -184 -54 256 62 -95 255 40 -54 -69 74 35 118 182 -325 -68 4 31 -204 156 218
4807 218 95 100 -98 -75 -142 -267 351 -13 317 128 -186 -222 137 200 8 -201 -148 17 -203 -45 -136 -128 -17
4830 -17 -270 61 37 -95 -151 -15 263 -133 -230 289 -292 74 -53 21 184 228 246 -33 45 -583 56 109 -31
4853 -31 -386 -178 275 89 166 -48 -48 -256 72 54 92 -129 -30 239 85 146 27 -63 -55 -245 -180 10 4 13 -78 115
4879 115 -93 -36 114 -68 -64 -444 32 -90 88 -58 -199 170 26 174 -155 19 -43 -108 -137 -90 388 -177
4901 -177 -235 207 -221 -74 61 193 125 -173 97 185 -110 -163 -104 23 -250 -553 68 -24 331 -40 180 167
4923 167 -243 13 -296 68 59 -75 146 134 -35 -63 -128 5 -226 0 283 -168 -125 -58 4 -213 62 -238 131
4946 131 223 -126 9 -133 101 77 29 17 -29 -123 32 -166 -75 18 41 -243 -15 68 145 -396 -215 137 21 275
4970 275 33 0 167 80 141 240 133 218 126 -97 -16 -73 64 172 -24 -80 82 38 -241 -182 313 182 104 125
4994 125 -120 81 110 0 -21 -138 -332 163 303 9 131 -100 144 -15 -27 -230 -280 71 -34 288 159
5015 159 46 76 146 -34 214 -203 210 92 267 34 -174 177 -56 84 -77 37 287 302 -162 -91 101
5036 101 -191 171 -131 62 -59 241 46 37 60 -135 -123 -82 -60 225 178 37 34 189 -126 -25 -74 -139 144 71
5060 71 63 -273 -137 -56 -106 -109 -91 45 189 -1 -72 -268 -126 132 37 -184 154 42 19 143 117 -69 -90 -112 1
5085 1 186 -87 -67 111 121 -32 -3 -46 59 -193 -185 -159 -79 -121 15 48 -200 76 -60 -183 -42 -265 -183 -119 -47
5110 -47 -260 -154 -34 144 139 135 249 -15 -127 -96 -8 -44 -117 124 48 129 106 -154 295 -44 57 -107 -341 -215
5134 -215 187 357 -204 1 102 -64 143 -19 -63 -27 217 36 77 40 -265 24 -25 126 67 144 -35 172
5156 172 8 140 40 -110 -135 -109 -118 264 -206 162 -68 -65 65 -183 164 -137 -108 51 167 75 158 -125 407
5179 407 -216 -104 -52 -24 -26 45 125 -193 -173 -101 200 -78 -107 -239 -89 -8 -128 197 38 339 -87 -331 35
5202 35 177 113 -61 -48 -90 -53 239 181 -262 -100 -101 -127 251 263 -318 137 -16 266 -99 134 -210 -164 6 169
5226 169 -133 121 179 -67 10 -125 126 70 -280 71 22 116 278 -73 210 -232 70 52 -131 31 -91 -161
5248 -161 390 28 176 153 -63 -34 -202 444 197 122 166 -108 -34 208 -276 -152 -124 -17 247 6 -248 272
5270 272 52 -247 -124 21 8 -191 -280 126 140 -27 -183 34 -73 -34 60 -259 112 114 -78 268 -97 356
5292 356 115 50 46 -15 -264 128 165 142 -54 -52 -187 279 -251 51 -165 67 -218 150 158 -33 286 200 15 -101
5316 -101 318 71 -67 98 -29 -275 -19 270 19 -248 191 -212 80 57 217 -407 58 23 122 271 213
5337 213 -218 -444 -228 145 -96 124 -169 163 277 -191 187 -256 -181 251 -189 -391 -307 198 110 52 -67
5358 -67 -205 67 -230 0 464 68 -203 -81 51 -299 105 -81 107 -10 -82 -209 -228 -27 -96 -251 21
5379 21 -114 291 37 -196 -108 240 -59 7 77 237 24 -9 -123 -76 -269 -30 -120 -139 -142 245 -268 -124 -38 158
5403 158 -21 210 -143 83 -218 -247 213 -18 7 18 -134 271 145 -173 -82 11 -16 -30 201 147 39 -75 79
5426 79 33 119 -142 -335 181 -144 131 81 -228 130 -7 185 -79 -82 -51 -37 176 -202 -213 -60 234 -81 -470
5449 -470 93 -58 70 319 55 -318 95 -193 -3 -5 86 241 75 -33 -2 -53 -33 -151 44 -58 -173 50
5471 50 206 83 -125 171 156 217 -20 283 -69 170 -58 6 -71 110 162 -77 -30 -32 109 -247 170 368 -183
5494 -183 338 165 25 77 -56 -31 223 127 -22 -109 178 78 -167 97 107 -322 43 44 -23 52 -211 117 248
5517 248 33 -6 16 94 -9 -201 -38 73 299 189 59 -178 -124 69 77 -18 -184 54 222 418 121 -25
5539 -25 -66 -152 -135 3 -196 -4 -36 79 -165 -212 -147 13 55 -135 -43 -126 59 184 -220 108 186 -259 54 197
5563 197 90 44 -61 -248 83 16 40 227 483 -6 -32 177 204 -99 -171 31 24 77 -70 194 80 -165 127
5586 127 -211 381 53 -150 150 156 -1 -269 131 3 -47 36 -60 -53 364 241 -29 -88 0 -5 10 113 -111 -298
5610 -298 -7 -122 -182 -241 151 52 -182 155 -86 -51 32 -40 157 234 -205 -144 111 -212 -68 -84 -176 137 -7
5633 -7 11 162 160 128 -173 133 126 29 3 81 41 -85 195 92 -35 -51 -221 -71 -66 -229 -205 -90 -95 18 19 79 499
5660 499 156 11 5 60 -33 48 223 14 -57 -43 10 -14 23 -334 -106 -199 -227 132 9 -254 -138 -124 -10 -196
5684 -196 -139 -318 -223 104 -232 -117 171 -175 94 69 -109 81 -59 220 -172 -39 -171 -50 -40 30 -39 228
5706 228 -5 -235 74 -47 74 -9 -71 -64 162 198 147 164 -131 -14 -282 -72 -12 -16 109 222 -158 203 -367
5729 -367 105 -42 195 -4 1 -211 -99 -153 -58 -385 73 -48 143 -191 -39 -67 291 110 -163 187 79 60
5751 60 116 -2 85 -46 241 -128 -17 224 -127 119 -141 190 465 317 9 14 -92 -142 -265 47 -58 -102
5773 -102 -61 312 -78 201 438 -168 124 158 124 -62 -36 -202 -272 187 171 346 -42 -36 188 19 39 -392 -208
5796 -208 126 120 -76 128 -141 216 204 -66 -306 22 -323 -189 -270 -32 -36 -410 -103 173 70 -166 5 -49
5818 -49 -79 75 73 76 187 124 207 236 3 -196 145 122 -8 26 -156 136 17 16 109 -267 48 -73 46 -21 158
5843 158 46 -17 152 -22 -80 51 -98 -478 -87 39 4 -55 121 -11 58 -186 -6 136 267 -45 259 146
5865 146 -93 121 -304 -192 -130 81 204 52 225 37 -210 86 135 -48 227 86 1 101 -43 108 -204
5886 -204 -246 -151 -129 18 169 -7 85 -113 52 -31 -54 -410 -69 26 -244 -170 58 -177 65 73 -26 43 -352 -64
5910 -64 67 118 239 155 169 -74 266 -220 36 -42 -118 -212 174 -126 -82 -74 7 33 392 -106 -206 203 25 407
5934 407 139 -38 -83 13 103 24 -139 -317 94 323 -57 -145 -33 305 -24 -23 135 -180 370 187 -96 -83 161
5957 161 185 202 -140 153 -20 -110 476 -57 183 -2 100 64 -21 155 -69 -144 -252 127 -9 -51 -356 -83
5979 -83 -63 11 117 -190 218 230 113 -33 -8 232 -50 -63 157 -204 -242 -14 134 -300 13 -162 -17 -40 -298
6002 -298 -166 47 58 218 -102 142 15 26 56 77 18 -34 -194 92 264 14 141 -254 -121 218 4 364
6024 364 -139 -157 82 230 20 156 70 8 15 9 -19 -247 -121 -181 66 -27 -328 111 205 104 -323 21 -155 -178
6048 -178 -42 198 -231 -57 -171 98 -149 -71 28 -308 -123 26 -124 7 -22 -62 -135 -123 -158 -52 -148 258 -155
6071 -155 118 146 -35 -16 11 -134 -9 160 -53 181 -240 -97 -31 138 -65 -159 164 -262 52 -158 41 24
6093 24 69 205 -50 -12 -321 -160 -61 -56 -53 -50 19 30 -35 -242 -42 -164 -28 -112 13 43 77 -30 -82 -216 -179 0
6119 0 34 78 15 78 -186 205 74 0 -299 -268 112 -338 110 143 -181 -92 84 0 16 -82 -145 -61 -144 -37 -178
6144 -178 180 -20 53 447 220 -149 120 -73 246 -49 2 -91 155 73 221 -130 -81 -179 2 29 -51 -203 -60
6167 -60 -212 -151 285 -163 -170 -54 16 75 123 -4 301 216 -39 -265 -101 -10 -217 34 -508 145 -250 115 -28
6190 -28 -197 -95 23 206 47 50 118 23 80 47 -210 189 146 86 -204 -82 -160 31 370 -76 -100 171 -47 488
6214 488 -60 193 -257 34 -37 41 -49 194 -144 -4 -300 -27 110 13 5 -216 -323 -192 -381 96 -4 -269
6236 -269 73 -241 -177 225 233 -13 -187 -170 -95 284 160 -51 -237 -43 167 -383 -77 240 11 -243 25 33
6258 33 51 -34 176 -190 220 -3 -384 185 41 -216 105 -263 68 187 30 10 -194 -133 198 188 -178 203
6280 203 -208 -135 -367 -134 60 75 41 222 -73 -352 69 295 138 70 170 126 -147 -5 121 59 223 -211
6302 -211 81 -138 -22 268 7 200 110 57 -56 -126 94 10 -217 305 173 207 -125 85 230 -221 -163 -350
6324 -350 42 -136 -45 24 211 -247 -13 -138 259 -258 272 100 -248 18 -117 21 80 -55 87 102 211
6345 211 309 -97 -118 -237 116 0 -293 105 87 -150 109 -248 156 100 -198 -158 -30 -6 -214 -65 218 -143
6367 -143 -43 -200 194 96 -287 -91 93 52 -144 129 161 -186 -114 -75 44 17 -276 -216 77 80 -109 -164 -62
6390 -62 30 97 91 78 0 64 145 71 -121 216 10 -90 -73 -172 47 -26 -122 -37 -100 117 123 -166 69 69 -3 -106 13
6417 13 18 -94 23 113 195 -143 120 88 -140 -91 272 -54 15 104 75 120 202 -173 -161 25 -31 -74 220 104 -103
6442 -103 -143 -197 37 38 168 165 136 136 -53 -19 142 80 -34 -188 -52 -119 294 17 -268 -22 -4 312 -295 -19
6466 -19 -33 40 156 55 -251 -20 -62 -42 109 -108 163 139 164 80 63 49 -31 97 -31 -5 32 19 193 -228 -204
6491 -204 -235 -179 -242 -187 -126 -154 24 -207 -202 33 79 -20 -22 24 90 -82 108 -273 197 193 126 65 -264 -76 291 -70
6517 -70 234 -106 -164 24 -86 244 -93 162 -30 196 -62 312 55 -10 59 -26 -11 -15 -10 -40 148 67 -57 144
6541 144 94 209 90 -23 227 238 -135 -43 -51 189 100 -213 207 56 -41 -118 76 -174 -174 116 -47 -340 3
6564 3 -27 46 188 -118 173 5 22 27 -92 -363 350 113 -163 -142 207 289 -23 146 40 214 126 125 -78 -79 9
6589 9 168 -16 361 54 158 274 124 -51 -391 57 -265 9 21 -177 -49 -146 -218 133 32 -48 192 201 -237
6612 -237 -162 171 -76 25 303 149 7 -242 26 7 -198 -193 273 6 207 -221 -108 17 80 123 108 170 260
6635 260 -37 56 -63 -91 -191 -77 -132 203 -286 54 8 -93 145 -209 -7 63 -61 -113 -49 234 36 173
6657 173 -43 -119 -94 -131 -267 -144 -151 -2 82 -97 153 192 -88 42 -37 -187 41 -52 142 166 95 -22 150 71
6681 71 -233 199 -61 -15 160 124 -380 -108 -8 132 -115 16 -156 -48 152 -151 225 21 107 2 20 18
6703 18 133 204 146 44 103 67 14 113 217 -214 -413 -107 -4 -200 -64 -238 -101 227 271 74 -130 70 8
6726 8 298 99 -130 -54 -46 -12 -142 -96 -124 -134 -230 121 -187 -101 21 -193 -2 -58 322 351 20 55 -58 -305 131
6751 131 190 37 -43 -81 -353 270 220 -108 293 8 -212 -144 -111 -20 -49 -53 106 157 104 101 -43 -62 188 195 -215 -149
6777 -149 173 224 -182 -181 115 -3 -200 -333 -114 -307 -263 54 235 27 -112 -176 -50 177 210 376 -30 -243
6799 -243 -107 -175 -57 30 46 184 -41 190 -233 -196 -249 -37 -277 128 -380 -241 -220 149 -58 18 62 -170 96
6822 96 -113 -95 -103 62 -75 -231 76 -25 -168 -202 180 104 -108 49 178 -125 301 -216 118 -128 80 163
6844 163 -164 -181 155 80 -304 109 -130 205 -149 39 -302 140 -366 -30 223 -102 -196 34 150 26 -225
6865 -225 -163 -20 -158 4 203 49 1 2 -155 100 -80 -48 174 50 78 245 178 -43 -407 -75 101 174 114
6888 114 139 308 -135 177 16 140 -128 162 -42 -35 37 78 192 269 46 256 -173 -199 0 -246 227 337
6910 337 -76 -106 -198 288 -127 -53 -140 -133 26 187 120 -155 -146 -7 -25 -191 107 -6 211 -53 -89 36 -77 44
6934 44 72 158 285 -152 76 239 88 172 -24 -66 1 -64 21 17 1 153 -35 48 -16 -126 124 -19 7 -21 212
6959 212 41 -151 -199 -163 -216 248 -82 180 58 56 87 -243 208 -271 178 135 292 145 -6 -40 -40 140 -177
6982 -177 -8 -18 296 -359 -259 26 53 139 -1 40 -3 225 -145 85 -250 -96 -292 -260 264 112 -110 98
7004 98 -57 -247 -226 135 93 79 -21 -216 -382 -255 -220 99 -238 -122 109 -62 26 106 -153 -172 236 -48 28
7027 28 66 159 -165 -281 71 -256 27 -187 152 -83 -93 156 -118 -62 -174 -228 249 488 -59 96 -110 96
7049 96 193 115 -100 26 284 49 -10 121 56 -208 -31 -142 161 -147 -151 -170 -251 -56 -240 231 -166 -160 66 13
7073 13 94 -378 -107 17 236 82 -156 232 74 -160 143 330 175 13 128 -123 123 -324 358 206 -50
7094 -50 44 -58 79 74 -74 -112 40 112 259 38 36 -101 121 133 228 192 125 385 -110 -182 28 157 -4 151
7118 151 -125 46 23 -227 7 -144 44 -328 42 -274 -19 74 8 138 175 49 0 138 140 -336 198 -233
7140 -233 134 215 8 -109 -11 11 -127 -78 20 17 6 162 -112 -52 45 -45 187 118 -110 100 -84 3 -180 -158 -39
7165 -39 -95 128 299 -143 -8 -26 122 -215 -92 68 297 79 -276 173 52 -74 -7 32 -198 -62 136 -119
7187 -119 54 -23 -127 21 121 290 324 -56 -115 166 301 -70 -13 224 -177 -200 41 -101 -53 -209 -180 317
7209 317 143 -199 -132 -161 -207 201 102 -30 -118 172 273 -160 -7 -101 -78 -36 337 -208 -45 -155 -38 -144 -312
7232 -312 260 -248 75 32 -53 -3 152 145 144 -259 -251 -304 -136 252 109 168 18 -199 8 -156 -143 -2 102 88
7256 88 -64 12 -181 30 68 354 119 325 279 31 15 77 23 1 97 -146 -128 -30 -265 64 50 -312 -284 -40
7280 -40 -165 -13 151 344 -44 -27 185 31 229 12 -200 -158 -124 -85 -4 147 97 288 109 323 -104 -35 121
7303 121 -75 186 -22 197 -9 204 251 -16 235 -327 134 -27 -32 -82 -89 48 165 32 255 -89 84 219
7325 219 -37 -130 -413 172 -263 151 110 398 152 -187 182 180 253 -275 92 -17 111 -134 -378 -133 -40 -36 105
7348 105 -14 -33 53 -116 116 -21 131 196 -45 -87 20 3 173 130 141 178 133 -19 104 42 -303 -86 43
7371 43 -45 -167 -166 89 152 -145 19 74 311 193 21 -331 -198 -45 256 -36 147 -40 167 143 191 116 226
7394 226 261 116 -41 -22 288 -183 108 -92 -18 289 60 -224 -247 -192 -434 -28 90 -190 -102 -444 -84 -562
7416 -562 -324 -90 49 272 -142 35 119 61 -310 -64 -101 -230 -213 64 171 58 41 161 -309 -265 -224 -109
7438 -109 98 28 -88 -70 -10 -108 -151 68 96 56 176 64 94 -157 -16 185 69 -249 -157 -267 -72 -29 -23 54
7462 54 35 -175 52 150 145 -83 -9 -18 21 -54 68 -236 324 218 -153 -160 143 -64 -9 -109 189 26 -36 160 -135
7487 -135 92 -59 -284 262 -28 169 -87 131 77 161 120 -330 -208 101 27 136 210 247 -181 93 431 -12
7509 -12 3 187 296 -143 -16 125 140 -249 -47 -95 -72 -144 -152 29 180 -222 44 7 -521 -237 -155 -170 -94 -209
7533 -209 394 26 114 203 100 35 -179 -17 -105 185 -157 -214 -34 -117 1 240 -2 -125 -59 126 -122 88
7555 88 -9 160 -180 36 228 -39 268 -18 -19 145 85 169 98 261 108 186 36 -220 23 125 104 -173 36
7578 36 82 -145 239 -201 76 153 -183 -22 -5 -81 -95 104 174 -210 89 77 -103 38 -18 99 75 89 -288 -114
7602 -114 93 -96 -108 -163 -505 -78 -33 -148 -150 320 100 224 17 55 137 2 -110 -70 412 -77 129 108 -58
7625 -58 -175 15 -204 45 -232 25 151 -121 74 -302 -197 -206 -57 -94 74 -20 209 -59 -127 -7 108 -163
7647 -163 55 -165 -210 5 -207 168 62 32 422 71 48 220 -227 -251 -24 -94 -4 -169 -14 214 -273 -268 -46
7670 -46 -119 -50 237 35 134 -1 234 180 -16 237 85 213 -51 -214 14 36 70 215 -9 -45 -66 33 -1 -190
7694 -190 -71 -79 62 116 151 105 28 264 240 -137 134 -31 -12 44 27 19 190 93 200 116 -36 -309 -281 -121 -105
7719 -105 114 61 501 -155 -305 3 -126 -173 -75 365 213 -55 53 -107 224 -347 114 -71 -40 -58 -165 -50
7741 -50 -49 -148 71 65 99 -162 -68 436 -111 112 26 -3 -62 171 28 188 237 169 41 122 96 206 -285 213 64
7766 64 -228 240 86 135 -92 -40 -3 43 70 250 -79 25 -174 47 69 -2 -167 -95 -55 -37 237 -42 229 328
7790 328 -76 95 -17 195 179 127 -196 54 -233 97 154 -22 -51 -446 232 -213 28 -15 -185 -157 71 127
7812 127 -57 -206 -232 174 138 -185 -103 -292 87 91 -127 -77 252 -57 -184 -12 17 -78 -194 -22 246 247 -101
7835 -101 -103 -167 184 26 18 164 -143 -211 -35 247 -116 -206 33 -464 -241 -139 -134 228 355 281 -105 179 -45
7858 -45 -34 97 135 19 3 -92 -193 -269 184 -11 83 246 306 212 255 52 -147 24 286 -234 69 84 352 48
7882 48 269 337 137 -62 163 -23 305 6 -357 224 -51 93 -60 313 -35 1 -301 506 -97 57 -117
7903 -117 178 112 -219 157 -46 -286 -224 -34 -231 -18 27 -42 14 52 163 251 14 202 93 -123 -292 -1
7925 -1 -58 0 111 11 -82 -198 -113 81 210 49 -184 119 149 -19 -109 -73 86 -356 101 158 9 -28 -10 -173
7949 -173 -69 -73 161 3 -389 -90 25 -73 234 -175 40 -68 -22 50 18 -129 -75 -16 -205 -29 -281 117 28
7972 28 166 211 -164 135 -141 331 -59 -126 118 264 108 271 -100 -193 241 -58 112 -24 -108 -69 43 45 24
7995 24 -44 -114 -12 46 -58 -30 172 -104 127 -52 -67 -338 -413 -26 275 34 117 373 142 -141 -130 -32 -184
8018 -184 224 -366 101 62 125 7 -69 2 57 -70 248 -38 83 -224 -138 -100 -11 267 -101 14 -148 347 181
8041 181 144 247 -243 152 302 -226 -131 65 123 68 220 34 252 -91 18 -116 108 148 63 232 -7 17
8063 17 -276 154 -180 95 -143 20 116 101 25 304 136 -137 -69 85 -52 140 -110 -75 196 225 98 -115
8085 -115 -38 43 72 -132 -132 106 -10 72 145 263 -148 -12 -166 292 130 -76 217 -88 104 -21 -1 -112 -75
8108 -75 105 -123 -320 -77 -69 -4 128 -167 -129 -3 -1 -84 -63 -246 -15 -9 -100 -56 176 -190 -106 -108 -65 -30 -328 -116
8134 -116 -138 -259 -132 -49 -6 -55 28 90 105 171 98 110 -112 268 -164 -260 -250 344 33 -10 -83 -287 -142 -205 -63
8159 -63 176 199 46 -25 32 -24 -256 148 126 208 -167 -21 -300 -116 -7 271 137 -59 261 -146 -467 -56
8181 -56 212 -18 146 253 -192 -250 -148 68 2 43
8191D3
$$ Imaginary data points
##PAGE= N=2
##DATA TABLE= (X++(I..I)), XYDATA
0 0 0 0 0 0 0 0 8 -8 8 -8 16 -16 17 -24 32 -35 42 -48 60 -72 82 -96 112 -129 148 -170 193 -219 250 -282
30 -282 316 -355 397 -445 497 -554 615 -682 759 -839 929 -1029 1137 -1261 1398 -1550 1722
47 1722 -1921 2147 -2412 2725 -3102 3568 -4158 4934 -6002 7577 -10127 14949 -27208 119011
61 119011 186412 -136034 -88309 -9594 -22866 76316 135723 -67915 -145846 -19029 74477
72 74477 80445 39463 -78788 -104130 4381 94099 74515 -15636 -101567 -61631 49783 86268
84 86268 33577 -43020 -88358 -29448 69025 79164 6246 -69356 -80314 15861 96986 39576
96 39576 -45073 -54293 -35993 20627 87286 31605 -74364 -59519 10531 40628 55721 11795
108 11795 -78109 -58567 45088 63838 12410 -24643 -48933 -30897 38008 63352 9177 -51597
120 -51597 -54308 8562 61333 32186 -25957 -40799 -26945 12935 58139 27488 -47856 -48195 6265
133 6265 33517 34483 6166 -43822 -41712 17780 47388 22018 -22246 -44027 -13408 31473 33475
146 33475 5930 -23007 -39074 -7584 44556 34150 -20415 -35669 -14987 12093 34279 19591
158 19591 -24424 -36558 -4043 26860 29571 915 -30624 -25689 7544 29925 21261 -12810 -34828
171 -34828 -11851 22943 25049 4750 -16884 -27101 -5049 28796 23984 -9356 -25941 -15528
183 -15528 8979 26400 13583 -16564 -24743 -5629 17746 23038 1793 -22554 -18304 5218 19871
196 19871 15649 -5984 -25111 -12874 16027 21904 3147 -14447 -17141 -3419 16709 18593 -2499
209 -2499 -19815 -14012 7723 19558 8675 -10503 -16859 -6485 11825 18500 2333 -16587 -13788
222 -13788 3359 14260 11325 -4152 -17116 -9924 9468 15991 4665 -10916 -13879 -1960 12220
235 12220 12605 -1331 -13232 -10895 4005 14634 7412 -6835 -12952 -4918 8910 12951 2182
248 2182 -10780 -11329 604 11802 9115 -3456 -11478 -6791 4871 12136 5293 -8322 -11482 -1306
262 -1306 8717 8985 -42 -9591 -8570 2715 10283 6017 -4569 -10257 -4004 6247 9366 2005
276 2005 -7544 -8845 -202 8783 6807 -2635 -8613 -5447 3599 9236 4135 -6112 -8287 -1583 6023
291 6023 7505 190 -7419 -6190 1578 7356 5117 -3101 -8006 -3586 5084 6970 1734 -5074 -6600
306 -6600 -437 6460 6004 -1390 -6488 -4337 2302 6864 3154 -3776 -6137 -1511 4744 5693 120 -5359
322 -5359 -4794 1155 5612 4072 -1694 -5985 -3036 3362 5280 1532 -3996 -5068 -548 4871 4278 -606
338 -606 -4875 -3797 1671 4963 2568 -2997 -5019 -1483 3141 4786 435 -4330 -3807 544 4273 2998
354 2998 -1431 -4785 -2433 2651 4467 1328 -2793 -4160 -430 3934 3591 -349 -3729 -2973 1185 3727
370 3727 2094 -2161 -3963 -1182 2422 3459 276 -3274 -2929 381 3290 2179 -1416 -3468 -2062
385 -2062 1681 3450 1068 -2147 -3015 -396 2597 2615 -65 -3203 -2283 926 2999 1536 -1527 -3030
401 -3030 -1135 2144 2491 392 -2271 -2368 507 2686 1894 -695 -2602 -1846 1444 2399 461 -1749 -2577
418 -2577 -370 2023 2110 37 -2292 -1478 715 2802 1073 -1176 -2380 -1003 1664 2034 475 -1747
434 -1747 -1770 101 2201 1474 -533 -2128 -1271 889 2015 480 -1629 -1987 -240 1492 1683 90 -1899
451 -1899 -1250 645 1609 976 -930 -1810 -577 1305 1663 188 -1080 -1320 147 1579 1342 -506 -1245
468 -1245 -1021 688 1689 441 -1169 -1275 -511 1230 1253 -41 -1439 -1044 416 1410 809 -691 -1409
485 -1409 -875 947 1310 136 -1055 -1156 -119 1203 945 -263 -1220 -683 40 1292 481 -899 -897 -357
503 -357 788 1005 54 -960 -822 80 1215 407 -259 -1264 -603 623 961 170 -529 -1149 100 1083
521 1083 764 -27 -1169 -759 249 1147 385 -517 -976 -233 802 795 92 -702 -568 52 740 560 -429 -781
541 -781 -450 519 656 250 -638 -871 -54 648 870 58 -484 -847 355 507 242 -572 -639 -159 501 643
561 643 -59 -548 -303 269 840 702 42 -603 -204 343 777 346 -162 -682 -43 672 614 -5 -366 -527 147
582 147 601 566 -237 -684 -218 179 717 208 -815 -730 28 585 522 -275 -631 -529 327 388 365 -409 -461 5
604 5 296 562 -285 -409 -386 429 504 217 -119 -447 -367 656 566 245 -809 -283 37 372 284 -353 -407 -200
626 -200 386 355 320 -555 -635 -253 126 103 128 -71 -555 43 441 277 -246 -465 -88 473 469 -31 -662 -381 220
649 220 355 348 92 -182 -262 416 441 45 -252 -628 -129 461 481 -88 -105 -97 -116 191 183 -132 -131 111 233 331 214
674 214 -199 -417 288 495 269 218 -438 82 206 235 -25 -124 -228 3 29 477 -17 -198 -300 -31 431 509
696 509 -101 -284 118 209 -39 41 -425 -397 264 82 461 26 -314 -437 197 315 -40 -76 -41 -3 110 -47
718 -47 -198 -328 -178 673 270 44 -80 -213 204 93 218 107 -91 -406 164 427 84 -270 -277 112 39 291
740 291 126 -377 90 6 -134 252 124 -182 -51 185 220 128 -63 -8 -86 213 150 277 -306 -132 -72 335 -13
763 -13 -51 -184 -113 54 -233 16 -171 -114 12 443 312 -122 -30 -89 -274 322 -189 -41 -73 -160 354 -31 -87
786 -87 141 -241 167 -220 262 5 -343 -72 -96 56 -174 -102 83 20 -35 62 -273 -16 189 216 79 174 -244
809 -244 -61 -197 140 -24 -50 -141 -304 -67 -138 125 63 101 -98 205 230 -72 49 -270 -64 -49 105 98 -23
832 -23 -231 74 297 188 -159 -119 241 -56 271 -94 -14 -149 276 265 54 -79 -204 -38 2 -111 -36 24 -56
855 -56 -101 46 -26 -127 -53 63 -99 -29 -92 -1 42 -241 -38 29 -50 -59 137 -19 55 116 170 198 137 -102 146 -147
881 -147 -85 -270 389 17 -98 -128 -35 135 31 129 -167 -283 6 251 215 57 -231 55 -298 -99 180 46
903 46 -118 -195 -95 143 -17 -11 -331 75 -238 83 186 40 386 -172 -424 -107 394 50 -378 -108 -174 24
925 24 -60 -81 97 -162 -199 -6 184 125 -13 -322 -21 44 79 134 -24 -226 -53 13 252 -261 214 39 -121
948 -121 197 311 -37 -185 30 103 280 121 -19 -53 235 -55 36 27 27 -76 197 415 -4 -65 166 -103 22
971 22 85 -155 88 -137 84 -35 76 84 -126 38 639 -28 -45 -48 6 -74 -393 66 398 83 -35 347 157
994 157 -53 -197 126 23 -11 101 -55 189 -42 240 49 -42 -217 -45 -99 -94 -40 -5 -25 -145 87 -75 -50
1017 -50 -182 -204 -125 -85 36 -271 -120 -150 -26 249 31 -99 78 10 -70 303 198 -45 -145 -77 198 -6 286
1040 286 53 -107 -53 -133 -136 82 -116 -207 251 -210 32 99 -42 -88 368 -8 -155 -231 -37 -127 -118 65 158 257
1064 257 -86 97 -63 276 -199 -216 13 -206 234 -185 34 153 -82 203 -417 -28 -149 139 -365 103
1084 103 139 52 1 -6 -324 -265 -23 104 -86 108 -79 -242 -223 210 249 -87 -1 158 223 132 -47 -64 106 -285
1108 -285 -48 90 71 24 123 -44 -57 112 376 115 14 -117 10 46 -106 48 -113 -142 -130 -395 44 -99
1130 -99 -50 -155 -97 350 -7 56 136 171 70 135 -58 137 -260 -60 317 -88 112 -100 -248 102 -209 -394
1152 -394 -63 -151 62 -181 145 226 23 83 -18 -68 112 -169 -159 -36 197 -333 239 161 -194 307 82 -91
1174 -91 297 -117 167 -131 33 309 -97 282 184 -26 207 164 -197 -139 -440 18 -15 31 -225 -413 -100 123
1196 123 193 -84 -193 252 154 247 -371 -118 24 -186 5 -53 139 -114 -170 122 18 -180 101 406 -20 162
1218 162 -89 78 72 108 110 159 51 -80 21 90 13 194 36 41 142 -85 -16 20 -9 -339 -295 103 52 -90 -128
1243 -128 -373 31 156 -38 -82 63 -3 24 181 1 8 -59 -24 35 -9 134 -58 -4 -2 -121 -159 52 92 10 84
1268 84 239 179 164 27 103 6 -115 189 52 -90 -55 -377 184 129 149 -143 -35 121 284 -163 90 -52 56
1291 56 152 204 -42 59 -148 268 138 -140 117 -353 284 -238 -127 -94 -136 43 -105 71 -153 20 118 -118
1313 -118 38 -15 -213 -34 -104 120 99 -50 -27 77 -40 110 -181 -177 79 -113 -232 207 -52 -32 -247 -126
1335 -126 86 86 0 -65 188 90 139 121 -11 -34 -88 -72 -208 -212 -243 122 -152 86 113 261 -103 317 216 -89 60
1360 60 -19 163 124 -319 60 22 95 -24 -23 88 106 161 -221 -241 -87 44 -72 53 7 164 -133 243 239 51
1384 51 -10 -11 -96 76 -161 -176 -124 100 -312 -101 170 172 133 26 219 232 -51 59 -420 -355 125 -115 -25 205
1408 205 -43 247 249 -51 -410 33 -365 -279 -163 -58 -67 59 20 -17 122 -35 -68 -176 232 -33 -57 -152 150
1431 150 -406 -111 -62 -18 -192 -71 -123 205 8 138 12 -20 240 -34 53 -72 -147 -170 -75 30 -94 53 37
1454 37 20 0 34 28 -21 73 10 -80 47 -76 0 -323 3 70 -64 -50 85 -12 -325 238 -68 -26 -149 -84 376
1479 376 39 -7 135 156 114 156 -330 377 -241 129 86 -110 69 -51 116 92 -73 -83 -302 -95 -129 -271 -146
1502 -146 -116 -63 -93 177 -269 75 -138 81 -174 -204 -16 -194 196 215 191 -43 -23 -311 -85 -138 104 121 108
1525 108 92 -83 143 -96 -226 -161 221 -555 53 -251 -122 -40 76 120 -137 67 -68 15 -59 105 270 -167
1547 -167 -13 72 87 131 -105 -83 79 -22 -6 20 253 23 -6 -123 -11 -87 -118 -141 -234 -47 -303 -106 123 -155
1571 -155 46 -65 -116 27 286 202 -8 -25 -240 -188 212 177 155 -34 7 117 -258 148 -80 5 0 -41 -55 -55 230
1596 230 -90 93 -49 100 -47 -17 218 -6 -55 -260 65 240 -186 -2 233 -105 241 -209 50 124 -141
1617 -141 -45 -157 17 185 71 359 -238 76 -17 -356 -23 10 48 32 -125 -129 -85 106 -59 -90 -21 123 -35
1640 -35 -62 197 -65 -56 -68 24 35 41 47 213 217 -92 170 77 -51 276 -126 -171 -309 -145 128 -252 -103 26 -130
1665 -130 -25 187 -16 104 -358 301 65 -265 16 538 86 25 -308 114 203 134 -30 -6 209 -133 39
1686 39 53 -64 -6 76 109 197 4 -92 -44 211 -95 32 -180 212 -66 -322 151 165 -24 -303 110 8 196
1709 196 -137 155 140 287 10 2 73 5 159 251 42 124 -103 -75 14 -125 -124 65 296 -104 -120 144 191 3
1733 3 -18 -225 52 -86 -315 331 63 51 -239 179 -156 -108 39 -112 -204 -380 211 41 135 127 164 84 107 240
1757 240 25 -49 39 36 -247 -18 -412 -35 97 -203 4 -93 -174 -3 -29 61 -116 232 -130 28 260 34 -109
1780 -109 -12 165 108 -163 90 -302 59 -67 -127 -337 -162 268 8 -138 -58 -88 -166 -67 83 -307 -364 -41 -228
1803 -228 -256 -94 -105 -21 -84 -179 -270 123 -173 16 -416 -266 56 12 -306 -23 -408 242 6 -159 42 -116
1825 -116 -35 -173 195 108 -446 -38 127 -213 35 313 -291 -112 -23 -179 -184 72 141 -139 -30 -219 -192 23
1847 23 194 34 38 -64 -24 -58 131 -120 26 -141 -209 -119 253 46 275 -190 224 137 104 -97 48 184 -69
1870 -69 -50 -72 117 113 -76 120 -155 192 -109 292 36 219 142 40 -41 68 160 -323 -98 -115 168 -193 -59
1893 -59 226 -240 146 137 -131 -260 41 -56 -192 100 129 -22 -128 270 -126 170 223 216 -433 220 70 129 201
1916 201 17 242 134 -17 -222 195 34 2 268 -205 -41 -42 -168 205 162 62 -215 -217 -52 -132 -84 144 -147
1939 -147 129 -3 100 95 -84 -129 311 195 -343 -183 76 89 -40 85 36 -88 -53 -106 -176 41 107 14 -345
1962 -345 86 -98 -136 -71 -171 54 76 155 -87 92 -5 -143 88 -9 -5 321 19 -61 -62 -18 288 -58 149 -73
1986 -73 211 31 36 93 -324 -168 -69 509 188 94 -26 -25 71 -98 -38 -72 -3 -127 -258 307 275 398 206 -43
2010 -43 -39 50 58 74 215 416 59 -337 16 64 -148 7 136 13 85 77 -183 298 73 64 -73 205 117 -97 208
2035 208 147 -88 -223 -201 -348 -96 243 229 221 134 -142 99 165 8 5 -170 189 262 -177 59 45 -199 -236 118
2059 118 35 -251 177 146 -56 100 -298 104 169 159 -144 102 244 -172 -11 -221 66 -80 -54 -146 180 209
2081 209 -237 -167 -25 -255 91 75 292 -15 -25 34 -132 19 -257 -55 -8 61 -44 142 275 -26 -209 1
2103 1 121 61 140 -47 51 -124 64 4 2 300 43 42 4 192 -1 -490 -14 87 -310 -51 -67 -25 15 2 -136
2128 -136 -110 -117 -301 -199 -177 -3 -48 44 161 -127 -50 34 -268 -74 218 -67 65 -150 -76 161 446 131 -33
2151 -33 -175 99 243 -231 -184 95 27 -72 -138 99 52 147 -126 121 180 115 -234 -227 -99 209 -4 51 8 183
2175 183 -56 1 -115 85 196 23 -14 -68 135 -217 101 -100 -55 -89 -129 33 110 103 191 -31 155 165 138 -135
2199 -135 -152 -125 -284 -288 -364 7 -329 -192 -11 168 52 204 -24 125 -207 5 -49 -75 -20 85 272 -78 281
2222 281 -72 -83 64 140 -199 42 -70 133 96 -181 -141 32 -75 -82 138 -73 7 -26 136 -204 129 -2 -89
2245 -89 -197 -2 -75 -43 71 213 -194 -149 265 31 83 54 -76 77 28 -41 -168 -160 147 133 9 44 28 54 281
2270 281 132 204 124 -197 1 -140 110 146 169 133 18 -320 7 -199 81 113 169 293 199 9 100 14 -111
2293 -111 366 -83 203 -322 205 -326 23 346 -72 -201 324 -70 -166 39 142 -16 -70 213 -104 175 -106
2314 -106 -332 -35 -198 69 421 116 7 -291 92 169 118 84 -22 -14 4 234 -7 -212 96 0 -132 27
2336 27 -166 -332 -141 9 80 -77 155 -14 241 58 5 -34 -380 183 50 -7 167 -165 416 -253 64 -68
2358 -68 -378 -113 -89 -150 299 -217 -48 163 297 -82 -289 358 -103 44 -215 -237 -6 -382 64 297 27
2379 27 -105 -133 -278 61 239 203 217 -194 203 193 -123 199 54 17 257 -206 -18 177 24 -147 -70 7 141
2402 141 43 74 -23 108 -137 243 -27 -151 -125 207 -119 -151 -380 217 -110 162 23 -204 -60 92 -160 109
2424 109 25 -66 2 -140 -123 -19 101 -40 70 -103 -42 101 -105 136 294 -175 176 184 -84 80 69 115 318
2447 318 -75 198 -252 319 107 -99 -40 43 110 -291 137 185 -86 32 -12 18 31 -54 -90 -22 -98 79 105 -213
2471 -213 -48 -241 -66 -265 17 -305 -184 -147 129 -116 37 -22 -27 -54 20 80 -131 209 -29 -149 -101 164 -269
2494 -269 -311 82 185 -104 -294 37 -2 -152 53 77 -360 -118 42 134 63 142 -281 -88 10 219 130 -238 236
2517 236 -123 44 -226 -325 -3 115 386 -58 -18 -106 -13 76 160 207 -330 229 -86 54 321 5 10 57 44 -139
2541 -139 36 30 185 -174 37 -62 -282 -161 57 66 -57 -105 308 -368 116 188 418 9 259 312 7 -112 -76
2564 -76 176 -146 -38 212 170 198 -121 -177 109 -168 -107 -66 -48 -180 16 -318 -28 -13 -24 -118 -196 19 -114 -133
2588 -133 216 20 17 -21 229 -114 -109 -167 283 71 -158 -190 99 -56 21 123 137 -51 -213 -251 66 -44 -68 -3
2612 -3 157 12 84 -193 232 39 -225 51 -11 -37 19 55 -171 -50 14 -56 -205 31 -186 -296 90 200 92
2635 92 -27 -127 91 195 -154 43 191 -189 30 -168 -40 -144 299 -124 6 80 -78 98 139 38 33 -152
2657 -152 107 128 -70 33 3 -31 -228 301 -56 -38 142 76 -64 173 265 52 -130 -36 238 133 -70 193
2679 193 124 -80 -137 -63 -152 -60 -101 -108 19 -203 75 54 -171 -53 -62 67 -79 141 284 422 39 -89 8 -32
2703 -32 24 33 102 -231 414 -135 12 -85 -44 230 24 175 -86 -78 -296 151 -17 -187 -82 90 36 -84 -56 88
2727 88 271 94 308 218 -448 -76 -71 455 -89 160 -79 -240 419 113 23 -191 4 -56 -247 -371 -67 -19
2749 -19 94 -40 -144 -94 238 28 -67 55 105 -87 -433 -115 77 -42 -80 58 -253 -88 15 -29 231 -85
2771 -85 -34 -116 199 -165 -66 21 -362 -63 -196 -56 -6 269 -316 -390 -96 -197 -44 360 -24 326 -250 -117
2793 -117 -111 31 44 -223 120 191 104 285 -102 -122 136 161 -52 103 -44 -194 143 -98 -133 222 -190 237 104
2816 104 -217 213 -49 159 -6 -44 38 310 5 192 71 42 26 35 -78 -14 -156 -105 286 -18 19 81 139 -270
2840 -270 -136 75 85 -177 -40 -207 52 -114 -186 339 64 -1 -108 -187 113 37 -61 241 -73 197 -37 -65
2862 -65 -76 -155 101 -48 -123 121 -132 281 366 112 -43 64 -53 6 -131 60 -19 -218 -201 -9 23 -177 -92
2885 -92 -39 -80 -91 55 78 162 -85 239 -176 -128 58 24 89 -153 -224 100 2 48 127 -163 -197 123 62 34 237
2910 237 334 -351 272 78 -4 10 -215 -42 82 99 92 -102 275 -160 -296 -18 -91 -105 -298 -174 -245 -54 -38
2933 -38 -206 8 -109 -31 -178 -52 6 -216 -77 -92 152 -57 20 25 -138 109 81 -133 -261 -116 -156 149 148 84
2957 84 -98 -331 522 120 -4 -243 96 -5 -279 -209 21 28 111 -62 124 191 258 -76 175 -193 -52 -14 -24
2980 -24 -166 147 283 -290 77 38 -105 -68 179 139 37 412 164 216 53 3 -95 352 392 -45 -6 26 -206
3003 -206 12 42 -21 -69 182 -272 75 -108 -69 36 0 -67 354 177 43 248 4 -105 -379 -146 67 -133
3025 -133 -89 -172 274 -273 212 -602 -222 265 -168 207 -209 260 -29 -123 -85 129 -153 -85 -206 157 14 -95
3047 -95 -149 245 114 103 114 -259 -25 52 23 -146 15 378 64 103 308 115 -144 378 -171 244 55 91 83
3070 83 138 -62 -130 277 34 50 27 284 97 1 -236 7 -39 14 111 -120 23 -26 -127 -261 -37 128 78 -124
3094 -124 -237 -197 12 -59 197 -38 -269 -222 -106 14 6 -114 140 135 -3 194 70 -213 47 50 -122 -2 13
3117 13 -207 -75 -68 -149 -155 -180 -118 -118 -279 348 101 284 214 -460 115 -37 118 -338 154 -108 -188 -174 -207 -121 -46
3142 -46 -213 72 -349 55 -113 130 -132 -83 -232 79 223 185 226 -32 146 22 -67 -276 83 35 87 -212
3164 -212 69 -262 -267 -153 -382 -262 88 -198 248 -118 64 -26 -223 3 -20 124 119 -278 -192 189 -199 206
3186 206 64 103 -279 86 216 354 39 -145 126 -182 58 67 108 -30 -75 329 -62 -26 -94 122 420 -157
3208 -157 -45 -52 -22 61 -6 -93 372 -22 106 71 23 -197 251 -70 -164 10 86 4 -161 -72 47 155 287 348
3232 348 82 -49 12 14 191 -41 64 -148 185 380 61 5 -126 -68 -72 334 -41 -27 67 98 -23 -80 -101 -78
3256 -78 -85 76 31 265 111 -70 -98 -80 122 -2 -63 94 -6 -58 136 -62 194 -69 22 2 -199 -97 84
3279 84 54 48 88 174 370 -23 68 -230 -133 111 -10 -33 -114 73 74 175 117 182 168 -279 -313 84 92 4 284 -8
3305 -8 200 282 218 -128 -345 -76 112 -57 188 33 -408 0 -285 192 82 -135 39 -251 -89 285 30
3326 30 -245 10 -6 -274 268 86 192 164 -321 43 8 155 -35 58 -91 155 11 2 -142 -56 -159 -233 363
3349 363 -25 222 1 -173 47 -84 12 -65 -174 -56 -341 -132 101 -53 8 -321 87 200 -58 -108 -57 8
3371 8 -38 -16 54 -67 213 -265 159 -103 -118 -113 -16 -60 261 -143 65 146 74 -170 111 126 -59 -17 78 -107 -272
3396 -272 128 -1 41 -147 -225 316 -39 22 155 -53 202 224 -167 19 195 99 70 -234 91 -186 -129 74
3418 74 -281 -150 100 -89 -147 -343 -229 -266 -53 55 55 -26 -95 137 51 146 292 290 -21 -253 -98 -63 -158 -36
3442 -36 33 -45 -81 -139 -175 287 3 -19 -109 -56 19 -135 -113 -172 110 -101 299 223 199 -338 97 123 17 -59 -130 -232
3468 -232 -89 -1 -37 72 263 289 37 14 13 79 172 297 197 268 -125 -131 -85 199 56 54 -136 175 -123 -145 65
3493 65 113 211 72 -5 6 153 19 118 29 170 115 -18 -103 -129 154 -168 -62 92 200 15 6 -28 150 13
3517 13 -107 -37 -191 -40 -281 -57 212 -339 142 -69 -182 -32 -142 343 43 -6 9 328 10 64 -246 -212
3539 -212 -269 3 -109 -15 -220 5 -230 254 32 -1 117 -67 -206 80 6 200 13 -156 278 -40 293
3560 293 -59 -16 -220 218 -64 86 -43 -12 -333 -243 151 -85 246 26 198 -102 107 109 4 102 -12 -105
3582 -105 -137 -26 -122 -155 -234 -204 -262 9 -185 -176 30 -62 36 -2 -32 -55 145 -232 132 83 -274 246 50 -303 194
3607 194 55 -164 -151 -102 83 333 -1 195 -61 267 -257 99 -5 -230 -108 20 109 243 71 155 214 163
3629 163 -30 -82 146 153 -81 236 -232 48 0 132 -110 -168 -19 -84 218 -83 277 36 -33 -293 439 -181
3651 -181 -67 -193 281 -133 -122 -6 -57 102 -3 -4 -135 -64 -69 179 -143 -22 -534 -131 -172 238 4 147 -122
3674 -122 216 -312 -317 145 -259 65 228 -131 27 -31 46 -80 -44 98 193 160 147 -42 -77 264 39 -47 109
3697 109 141 -38 -32 95 299 57 202 -36 -116 -231 78 169 -136 -44 281 262 -32 -115 -77 -27 -168 189 83
3720 83 215 -191 70 -229 40 -245 -11 119 49 51 -39 149 264 132 -370 91 212 80 -120 90 -150 48
3742 48 -90 -4 95 -99 -69 44 2 -182 -75 -101 -101 -162 234 -153 -435 128 -53 234 44 151 -277 -130 7
3765 7 -5 33 -100 27 -254 258 -75 60 128 174 37 -234 -256 -17 205 -68 264 -36 -52 -131 10 18 216 -71
3789 -71 144 104 -124 -112 -114 96 -60 113 30 220 316 43 -147 -17 74 -36 7 -6 156 6 -40 129 165 183
3813 183 73 -322 21 273 -87 60 -7 -128 -204 -72 241 -364 71 121 -200 0 -295 30 202 -108 -259
3834 -259 209 -179 -312 -49 -21 233 -7 -161 -283 270 23 -164 -21 -97 -189 -125 -124 143 -300 13 -80 -148 -104
3857 -104 93 -198 231 -20 131 -68 262 33 -76 18 -27 104 -250 -327 299 -119 145 -52 102 -69 -113
3878 -113 -23 -181 143 -86 282 -221 173 -275 316 60 -63 -303 -28 196 -24 158 -117 -55 -40 121 -20
3899 -20 170 29 -84 23 -32 18 134 350 -36 240 -68 23 -121 -78 139 -22 -142 -9 145 -94 1 47
3921 47 88 -176 96 -87 -87 10 -14 167 -231 231 119 96 11 -169 15 -308 117 -243 -116 -162 -122 -169 234 -60
3945 -60 154 -109 -126 -167 48 20 -47 64 -114 377 307 32 -55 -59 -167 151 -285 -86 -172 -235 33 7 298 15
3969 15 147 270 -81 64 -104 243 -29 -4 63 242 -81 285 154 -219 306 -388 199 -458 102 -44 -7
3990 -7 -39 70 -222 241 -5 -320 -88 64 261 -212 50 128 -46 -129 97 -173 -186 -240 138 -234 -64 -124 85
4013 85 -58 50 -173 -230 -12 -34 103 158 179 -102 -38 252 49 -32 146 65 13 -154 42 -114 -224 19 186
4036 186 -21 -73 -22 -134 40 7 23 36 88 -118 -221 -326 238 -7 51 -52 299 140 -117 3 55 126 193
4059 193 67 -292 233 103 337 8 -181 31 166 -124 -4 -260 -161 -399 -257 261 -168 177 208 547 -86
4080 -86 -148 -197 -78 46 213 178 -126 176 264 127 -108 -75 -86 -269 -216 145 -335 -136 -110 -131 -157 -201 -9 95
4104 95 59 -91 123 124 -5 69 12 -67 71 -343 -64 -2 -429 0 19 275 206 -112 -237 -222 202 45 304 -267
4128 -267 -96 270 -17 -227 -9 -70 76 224 -49 -26 126 -154 -74 -10 -293 -126 242 168 51 72 105 80 -69
4151 -69 268 -90 -223 114 189 -322 -327 -78 270 546 35 54 140 207 99 150 -181 58 16 215 -117 -66 247
4174 247 -150 -64 185 268 -29 -359 -86 -134 -226 -169 222 -65 208 8 -143 -322 -402 -98 -23 -158 -38 198
4196 198 -135 227 11 86 125 -115 -83 -52 202 287 56 -278 -57 55 137 198 149 155 -107 -126 -300 123 -33 121
4220 121 -24 29 10 311 151 -12 138 -36 -178 283 73 -174 -31 92 327 -258 -145 -6 -6 64 49 30
4242 30 -165 207 175 134 157 87 96 89 271 61 -126 45 -36 57 -206 80 7 -356 116 -76 74 -76 -247 147
4266 147 -28 28 -87 101 59 -25 40 142 -96 -206 139 -200 120 -24 199 -76 -95 96 37 -55 -134 58 -434
4289 -434 109 242 -241 239 -213 4 -102 51 30 -119 65 -21 -150 -72 125 -53 -59 117 -66 42 126 -473
4311 -473 0 209 79 124 136 -75 41 50 -125 -30 -159 -19 313 -214 -77 249 53 -213 177 183 95 170 54
4334 54 -36 317 -130 74 -108 298 -284 -203 9 -123 -141 259 223 141 120 6 404 -185 -189 41 60 12 28 285
4358 285 249 -55 -87 -66 -221 315 236 -150 -7 207 29 152 132 -240 -16 28 -31 190 -69 -2 -57 -72 179
4381 179 -138 267 130 316 123 366 -209 24 154 -87 114 -172 -375 272 -80 -5 35 -185 -101 -140 267
4402 267 -16 -232 -87 11 -186 -36 -33 -87 -115 -112 -221 -76 0 200 113 -31 3 -187 305 -175 40 -231 -84
4425 -84 183 -326 200 -107 3 224 -72 136 151 -88 -50 -140 131 328 265 -458 -128 101 89 -17 -214 -199
4447 -199 -61 -210 -29 38 122 123 -37 -73 48 -147 -51 61 187 -87 -2 -267 91 150 136 301 -243 -112 -242
4470 -242 103 141 19 129 151 -171 -102 -278 109 203 118 -73 -66 -168 69 8 10 145 -223 210 -94 -2 85 -29
4494 -29 -206 -38 -229 105 296 73 -114 -10 -85 -137 -258 -85 -104 -25 62 -238 41 -106 -138 98 -92 290
4516 290 69 71 137 37 -116 -39 -80 208 3 73 -28 363 124 -99 -19 -58 -298 4 46 -116 -32 -124 -375 357
4540 357 259 224 345 -38 -92 -211 56 -91 -206 -176 86 -8 167 -130 -36 -188 -35 -74 -239 121 7 -38 -100
4563 -100 -30 -186 -35 -63 -23 -2 -91 -224 143 104 -40 254 -175 7 -74 46 48 -230 -497 366 -173 49 3
4586 3 154 38 -295 -37 205 12 135 -98 24 87 156 58 -78 -253 -164 -198 122 42 288 -95 64 59 -40 310
4610 310 46 190 -82 14 43 204 -403 -196 76 -9 -9 129 4 -257 358 142 223 -66 210 249 -26 -2 -291
4633 -291 63 -105 -130 -261 -38 -342 103 78 41 -94 -257 -20 -120 86 116 -49 82 183 -210 16 -103
4654 -103 -130 -134 269 27 51 91 -1 245 -121 165 230 142 3 -12 -245 -96 -48 102 131 165 78 -29 -287 3
4678 3 -380 -41 99 -281 139 36 12 -122 23 195 -126 147 122 102 245 18 -163 46 204 141 -83 34
4700 34 262 60 211 242 -97 162 220 -56 -305 108 397 232 -186 -88 24 -327 -180 221 -103 -359 -70
4721 -70 -85 -168 -97 -97 182 -57 213 -125 -315 -58 150 -17 213 219 262 -42 46 -62 -235 57 -73 -359 -50
4744 -50 -24 -360 28 52 -297 210 7 -191 -147 382 -265 -170 -98 59 -371 -34 -68 -81 -171 70 -151 285 38
4767 38 359 -4 148 -130 -330 196 -255 -6 -319 -46 128 -98 -126 123 117 153 41 -21 -78 101 -82 25
4789 25 -148 11 -184 232 -262 -63 126 -170 -241 -164 59 -168 86 -276 -82 -102 -62 56 -149 130 -209 -341
4811 -341 82 329 -68 285 -240 -97 -49 -92 69 5 167 70 -49 182 99 105 -81 22 -206 -369 -125 44
4833 44 199 43 -67 -71 -30 115 406 70 110 -116 -309 -40 165 183 253 55 -25 -34 -57 -28 -24 155 -94 -201 154
4858 154 18 -16 -16 -210 -56 106 123 109 -58 42 240 -128 135 -193 42 -52 -23 -158 40 -333 83 18 -207
4881 -207 47 189 -1 -30 2 58 -86 433 143 123 82 -127 -58 -136 -98 -113 517 -31 76 18 302 -52 212
4904 212 -105 231 2 21 -303 -176 206 -113 128 208 210 187 20 96 1 -148 -129 129 301 -91 -71 59 200
4927 200 -78 -171 17 34 150 361 203 111 161 12 -131 -273 -118 236 363 -33 14 308 -241 165 -321 163
4949 163 58 -51 -154 43 -380 18 -86 186 -16 -105 94 -50 -159 194 122 -80 -221 -132 -399 92 -219
4970 -219 0 -168 -317 -367 35 -116 -72 3 76 -29 202 436 165 181 -108 98 -34 3 62 158 -232 -22 -285
4993 -285 -176 154 333 -217 -113 -9 432 -78 48 106 -3 -122 -284 61 65 5 94 -168 51 247 41 41
5015 41 -176 -279 171 -177 341 277 -28 -11 149 199 -20 -43 -126 6 -54 5 21 307 170 11 -217 -123 -54 -327
5039 -327 65 183 47 18 188 -268 -61 22 -154 -181 83 -64 -111 211 -73 114 -96 76 54 -83 -113 195
5061 195 -43 -364 155 132 -183 -20 287 155 37 214 -16 -294 -122 -271 -148 -202 68 -316 101 212 -188
5082 -188 -38 -98 -121 -77 75 346 -17 109 -84 -45 53 304 177 88 71 289 -44 153 -133 13 78 -65 -145
5105 -145 60 137 -10 -274 24 58 -209 -9 50 53 134 131 11 -89 91 68 49 250 -350 -139 6 155 -198
5128 -198 -53 72 119 -190 156 -99 86 43 -66 -188 -118 -13 -235 181 175 204 -52 155 57 138 -262 -234 -60
5151 -60 -121 -30 -178 133 65 0 -11 27 -10 23 11 247 -78 -206 174 212 -83 407 -136 -92 178 -46 74 209
5175 209 -131 22 -222 -5 429 -219 75 28 -185 84 -34 195 306 -49 297 4 -27 55 -33 150 -81
5196 -81 -157 110 11 41 -77 100 -190 65 -228 -133 68 -174 215 -206 -30 132 99 103 -131 101 164 289 -19
5219 -19 73 70 -183 335 -105 -268 237 -253 -138 -79 -15 8 -185 -254 242 56 50 44 6 33 -102 90 -66 130 -175
5244 -175 3 377 8 -137 134 124 -232 230 -61 -127 -124 197 393 -152 28 -271 33 -85 257 68 -64
5265 -64 99 -63 -137 -110 189 99 69 -297 48 -175 22 -67 205 266 86 -43 201 -113 -146 -250 145 -38 -92
5288 -92 43 -217 -226 354 303 -244 -81 65 87 172 -84 -5 -20 39 120 80 195 71 -115 -43 306 -301 -137 106
5312 106 -26 205 -22 126 260 201 54 -8 206 -19 31 -224 -81 -140 28 -124 13 125 -300 -258 -1 70
5334 70 82 -46 -104 70 -58 -77 180 112 -27 337 -60 127 -62 116 -6 -129 284 239 251 -25 202 168 -43
5357 -43 -34 -113 -85 -79 -238 117 -170 -218 -96 135 -165 -120 -157 -140 208 -36 80 -173 -201 -369 340 -220 202 -196
5381 -196 -142 -21 -48 37 65 142 -108 -112 -127 26 92 -3 -53 317 295 231 26 173 20 93 190 10 148 121 -309
5406 -309 -76 190 -94 185 -157 189 44 75 30 -91 -84 -47 8 -47 66 -235 -370 27 198 -130 329 100
5428 100 -148 -77 77 80 73 -86 232 -41 41 196 109 -46 -3 95 -220 -35 -62 266 -132 26 -109 158 143 -78
5452 -78 180 -363 203 173 -239 -39 88 -163 -28 149 -181 -123 -81 33 19 -144 55 35 -224 171 287 -92
5474 -92 206 -122 -169 88 -216 290 208 -86 -256 180 -185 -165 -83 -240 297 46 -13 18 -130 -97 -72 -109 -116 -262
5498 -262 -162 199 -92 179 38 -217 -146 32 214 243 137 -23 6 -70 38 213 -4 -164 -181 109 38 -364
5520 -364 232 60 242 -19 70 56 -162 -17 -167 -2 -101 -172 140 85 -19 142 -137 48 137 -116 -58 -93 120
5543 120 -10 -19 18 81 -125 141 -18 -71 78 -63 6 53 175 -242 20 186 32 -330 101 -274 134 -28
5565 -28 -227 -302 16 -140 178 -166 -20 -314 46 -159 251 116 105 108 -30 116 -145 224 -145 71 -21 13
5587 13 155 -94 -72 35 -194 3 -259 -169 -199 -361 104 152 60 -40 237 -303 -239 -64 -61 -29 62 -276 41 215
5611 215 -102 -105 -74 -183 161 -143 260 43 -190 -178 -96 -50 72 -18 -16 -214 112 -169 -34 -1 -258 132 -169
5634 -169 -56 -135 189 -277 -74 293 343 -36 73 356 50 209 -19 37 -63 108 133 -377 -108 -86 -352 -377
5656 -377 -276 47 70 123 137 -78 -4 86 56 -56 -308 -2 179 -128 -90 292 -190 10 -286 -278 -46 -244 33
5679 33 12 298 -3 106 -301 23 -63 -220 78 168 -108 51 31 -73 133 202 -191 -137 31 310 21 -165
5701 -165 -68 47 -173 -299 -87 -75 116 -91 94 112 -56 37 -193 281 27 24 -62 -414 -186 -60 -27 -17 -54
5724 -54 227 -108 -488 143 -118 -147 38 -175 97 -82 10 352 32 -75 -223 222 154 98 77 -127 -75 42
5746 42 -2 71 65 -127 -117 11 119 319 246 258 132 400 -162 -76 -138 -324 73 69 -134 246 177 37 -124 -22
5770 -22 108 -6 99 -338 -81 -155 -121 -86 255 -91 181 -112 -97 107 77 -112 82 158 -75 -73 167 62 -172
5793 -172 -230 56 196 -114 28 -319 230 -74 -77 -105 137 -5 -49 365 113 16 -221 -63 31 -200 185 132 -22
5816 -22 -166 88 67 17 -151 -222 82 -226 -97 -236 250 24 -2 40 3 83 275 -86 182 249 -100 -281 6
5839 6 -239 -204 -78 -110 -71 -79 -11 93 -2 -77 472 -27 -30 50 204 24 -243 -50 -306 97 -114 -112 182 181 181 -63
5865 -63 70 73 174 -71 -34 -129 5 125 -120 121 199 37 -162 198 -226 149 27 -276 -42 135 -108 -166
5887 -166 90 -59 129 -189 -219 33 66 181 -84 168 184 129 292 62 9 -91 142 -158 -75 -296 -57 73
5909 73 193 -84 113 36 -214 -202 -134 315 51 61 251 5 117 -25 -277 184 -2 209 23 70 -202 198
5931 198 -18 -47 185 88 173 32 -9 -204 -367 -102 -462 -214 137 239 89 -15 -238 136 -24 182 -90
5952 -90 -49 -16 31 169 111 -36 -150 -111 85 180 -134 52 -240 313 125 340 38 -206 187 -218 -95 93
5974 93 -36 39 80 -91 188 -18 -46 -133 331 179 -85 58 -5 -46 73 31 -39 42 205 -136 142 -70 -411
5997 -411 209 1 45 90 242 383 10 -58 120 -24 -60 -7 31 -114 153 22 -258 96 201 96 -27 5
6019 5 -176 142 191 237 -90 219 -45 -218 4 401 -18 -150 -175 -66 -132 -254 -67 53 75 -85 -385 -248
6041 -248 -138 -23 -40 142 101 -63 104 89 12 -74 -19 22 89 -2 56 -128 78 19 188 -72 -28 118 56 -200
6065 -200 21 -62 -435 101 -1 -169 180 224 -433 -173 317 92 -76 264 -8 -320 -165 16 -253 14 36
6086 36 -41 115 55 223 275 21 9 157 174 14 -41 142 194 -34 -116 210 -252 28 -56 59 116 -109 -71 -313
6110 -313 21 13 -94 -52 54 140 33 -215 -109 -1 -123 123 -14 251 41 -44 -278 -160 49 38 55 -79
6132 -79 -64 12 77 -696 75 -43 -96 205 84 114 10 176 -88 -15 -153 0 -46 210 156 135 -40 44 -179 126
6156 126 25 108 -117 163 -222 179 208 55 287 -173 109 -118 83 -64 89 97 -61 -409 23 -337 63
6177 63 -3 2 -81 177 -87 -189 -123 -233 -162 -170 -108 92 338 -88 35 97 157 -144 -291 -2 40 238 26 -51 -83
6202 -83 -218 41 -286 154 14 -243 -98 -86 129 -356 -301 -25 168 167 78 344 155 36 75 -164 65 -136
6224 -136 95 49 302 22 57 178 -35 140 -27 37 32 25 -70 6 -153 -61 435 -19 -35 265 -67 -349 -43 96
6248 96 -100 252 32 -9 188 -96 -85 200 251 84 21 38 75 97 -6 244 -106 50 -66 118 178 43 80
6271 80 301 -206 -99 22 -69 276 50 118 258 -92 -95 -41 272 328 -142 107 -197 6 93 149 38 -174 169
6294 169 171 110 236 -128 206 -150 25 101 -202 -101 -156 -159 -442 92 21 91 65 -12 -103 -30 89 -88 -61 -166 -8
6319 -8 -144 -28 -194 -14 -72 78 0 -14 101 -83 212 224 -31 95 -108 15 47 90 306 163 -23 179 -143
6342 -143 -91 125 -121 151 -9 -105 13 39 45 83 21 73 127 -95 -35 12 47 -242 63 -11 205 -118 282 228 91
6367 91 -38 -58 256 35 -202 -14 -92 129 398 205 -41 -64 -37 -236 43 -68 262 -82 -16 -50 -198 6
6389 6 183 25 -24 -74 316 4 -197 3 96 -3 -427 281 27 -67 -229 -69 -45 -57 23 148 193 109 -151 -4
6413 -4 -137 73 183 -14 -405 -19 -237 -136 -71 -262 -233 -111 271 -205 -268 136 -162 111 -204 99 7 84
6435 84 72 -76 21 -170 156 119 170 90 90 133 95 14 -185 47 -220 -22 -162 22 -177 48 48 77 35 -189 -203
6460 -203 72 201 -354 -109 -67 -242 -100 125 -19 20 -314 -17 229 -163 188 -31 168 217 78 -334 -95
6481 -95 -57 35 -334 -14 31 -201 63 120 83 -328 -143 -287 -327 294 12 103 40 83 -59 -84 56 26 11 49 -198
6506 -198 -143 -6 62 -121 -305 123 -4 57 -226 -302 -67 -233 222 22 121 85 -105 257 19 -309 -128 76
6528 76 -44 92 432 -87 61 -51 -12 214 117 29 -96 -130 90 -127 -10 -184 -214 77 41 127 170 -219 -103
6551 -103 -150 222 -11 -31 -302 -118 -303 32 -48 59 67 250 -37 -83 -386 141 22 -120 147 19 201 -16
6573 -16 -202 -94 43 -406 128 -205 -358 -140 -157 28 -147 -106 88 -127 -64 189 46 63 -369 -199 19 212
6595 212 44 20 -220 -141 4 211 56 -36 -3 -55 -50 16 -3 -63 243 127 145 -131 -33 283 -80 -115 55 237
6619 237 -156 74 3 68 131 -105 -235 158 218 132 -128 -49 298 -65 33 83 78 -15 160 149 299 -122 -95 97
6643 97 32 103 129 280 -92 103 201 -60 58 -74 -118 -127 162 71 -171 -253 56 195 -100 128 10 368 -104
6666 -104 -214 -9 67 -2 -3 -191 -300 194 -137 -277 -261 -41 -132 31 -141 312 -176 259 94 135 -168 -40
6688 -40 62 21 -157 -149 31 116 -281 -66 272 -105 -247 -25 25 -201 16 33 120 201 -57 -332 92 80 15 173
6712 173 51 -21 115 211 -190 -140 -155 29 205 -46 134 199 92 -94 -39 302 49 0 209 -62 38 301
6734 301 146 167 -139 173 -40 -55 -225 -52 122 -168 -278 -142 56 193 189 54 -165 -82 40 -149 187 -61
6756 -61 -289 7 240 125 -101 -184 8 -183 -68 -177 139 -162 -31 -114 13 -15 -197 169 -297 -342 68 -153
6778 -153 -69 127 74 231 -104 -233 89 85 229 160 91 -115 220 139 -268 14 201 57 258 84 84 -167 72
6801 72 282 238 -115 83 33 -106 -228 45 137 -169 -206 13 65 -5 45 258 -51 -65 -87 203 95 -129 -66 68
6825 68 -27 -201 -143 9 -242 107 -153 -45 -102 -23 -106 79 49 311 -168 -130 271 -224 189 134 108 139 58 193
6849 193 191 30 78 -272 342 -3 -108 236 -126 238 187 72 8 111 -107 42 166 -203 -213 -46 -116 -140 113
6872 113 279 13 42 138 65 -237 186 98 -3 -77 9 -66 30 -17 92 -346 -353 38 -193 -22 62 -17 83 -147
6896 -147 379 -112 -187 -32 -73 -116 -1 173 -282 53 126 -42 -112 82 -289 -25 -94 152 -15 -152 72 27
6918 27 63 -105 -131 -61 -152 -159 55 132 194 -134 -7 -115 269 32 4 252 -81 -106 -123 301 -44 -155 48 217
6942 217 13 -8 -125 118 -162 225 126 -61 20 -101 33 -49 326 -178 -132 222 -129 -27 303 40 48 -108
6964 -108 -220 -121 -153 80 8 132 47 -259 62 2 226 163 189 -54 157 -59 195 -83 -176 191 -2 -238 -139
6987 -139 -287 -42 80 -44 280 -131 241 -172 36 -48 285 -252 112 287 -139 132 -97 86 -301 -253 133
7008 133 -148 168 -30 -174 -24 9 -75 323 -109 52 -72 -95 -183 -303 87 -234 73 56 76 11 -120 38
7030 38 109 195 -207 -21 64 107 21 27 352 -158 108 -178 -103 -5 35 -214 159 -5 109 12 -179 17 -102 -113
7054 -113 194 130 -120 103 -69 -159 99 -134 173 324 -173 28 84 73 49 -39 -89 -41 -170 125 46 -211 -68
7077 -68 435 216 -13 -159 -471 139 -57 -218 120 -64 -65 -200 155 -40 240 -102 -103 172 115 40 -378 -13
7099 -13 -278 -16 -93 87 197 101 -92 -104 -241 -20 207 255 28 -91 -364 69 -147 76 -260 -201 -54 -211
7121 -211 19 113 -173 356 -206 -118 124 51 108 74 -392 14 -4 -195 69 35 130 -126 -42 -69 -148 -234 -137 -308
7145 -308 -76 35 30 263 417 -90 121 128 -57 -63 100 -81 -71 231 7 224 11 40 -46 -291 -96 -26 100
7168 100 83 73 136 -20 -147 24 -247 -48 -80 -32 -212 11 -72 -120 -322 63 -44 -109 58 298 -16 -41 -40 152
7192 152 -29 -188 84 337 255 52 -151 -209 130 79 -72 201 184 140 -126 20 -34 175 -317 -153 138 -150
7214 -150 146 7 -284 -315 284 -2 36 12 102 78 36 -26 204 -65 221 232 29 211 9 -131 20 166 31
7237 31 -43 441 34 -166 -75 135 -60 -46 118 -25 251 -179 -115 55 26 67 12 -152 77 27 356 58 252
7260 252 -196 -140 -184 -152 202 -159 -50 21 42 -165 291 -134 -316 84 -92 109 -18 99 -165 319 -18 -266
7282 -266 26 106 -58 120 56 -311 -157 -28 187 53 -208 33 131 -14 -159 412 30 63 73 -170 101 20
7304 20 167 9 54 98 6 128 50 298 217 77 238 -263 171 49 209 -139 -281 21 -82 60 13 55 21
7327 21 20 -146 80 78 -31 -92 275 199 76 26 -35 -264 -48 -53 320 -252 30 -168 23 -38 271 -30 97 115
7351 115 28 1 290 151 84 -272 65 -104 278 -150 128 74 172 49 83 136 22 -21 -52 -78 -150 -121 -53 115
7375 115 -32 99 252 86 -145 38 21 169 23 158 -127 -15 16 -207 269 278 -154 6 -120 59 -170
7396 -170 -105 74 -163 -329 119 31 19 20 -23 128 107 -99 -83 72 -141 -69 59 69 247 2 -124 246 164 -82
7420 -82 -112 60 211 -14 -16 328 70 -146 61 152 167 303 296 127 -180 -1 -116 -196 -34 -259 216 89 -109
7443 -109 -82 265 85 -20 83 94 -63 99 175 -188 30 70 187 191 -157 58 -139 13 151 136 -78 19 52
7466 52 -106 117 -21 56 17 98 -104 57 -212 191 -4 56 -140 131 125 -289 -305 -51 367 -171 41 7 -197
7489 -197 178 107 -83 -229 272 -272 -311 10 290 350 -17 -96 -379 -12 -85 -122 -300 -309 -70 351 295 -144 -1
7512 -1 107 72 249 209 -271 256 387 290 138 205 -114 111 -175 -49 -127 190 167 174 -34 93 14 -104 222 217
7536 217 -74 140 -34 60 80 -115 439 -9 0 -17 -16 -33 -72 7 83 -281 219 149 213 -133 157 -157 -125 162 -78
7561 -78 -74 112 -87 -197 36 -292 437 69 48 -165 433 -121 -156 -100 107 -96 -76 -331 -28 -273 -22 -229
7583 -229 44 -235 -24 -97 104 -162 55 -403 71 -71 -208 61 39 51 -272 -23 -173 115 -60 -17 79 99
7605 99 3 189 130 241 -87 19 -23 47 261 -42 180 263 -255 37 33 66 -59 97 94 45 49 158 141 -204 -69
7630 -69 191 -57 175 278 -12 90 -104 13 -38 77 -127 194 -340 -145 25 -54 89 105 -142 36 -11 -173
7652 -173 3 -153 -69 58 67 80 -7 -279 -40 105 201 -310 19 70 -229 -77 -140 -90 60 -28 49 88 -216 193
7676 193 126 -57 46 -73 -181 -131 106 68 111 283 -108 108 -26 -30 -325 -155 -153 -115 -177 -73 78 -287 -92
7699 -92 109 -20 -90 -39 -169 -66 -17 -133 108 -182 47 277 110 -212 340 -103 -181 -279 100 -3 26 37 163
7722 163 147 311 5 -191 142 -42 -71 -159 38 -65 76 48 112 334 26 -10 343 198 -199 149 -3 40
7744 40 -153 79 -22 176 103 306 69 232 6 115 -107 -48 19 215 -226 231 87 -148 291 -93 79
7765 79 92 -16 -173 286 -144 63 -18 187 -218 74 9 -36 -26 210 -263 -213 108 65 -166 71 84 -105 -140
7788 -140 -275 -146 83 -401 -44 -314 -40 93 -322 92 158 71 -207 -107 115 -72 40 -29 29 -176 -166 -43
7810 -43 110 221 -67 -244 114 -66 92 196 -5 -4 96 -243 259 26 103 31 156 -229 -68 -90 -117 -50 323
7833 323 -38 -37 137 -10 90 23 -172 -136 -307 -31 55 204 -390 -13 22 -266 -22 184 74 -204 103 -145
7855 -145 -23 1 56 14 -269 23 125 -285 -2 -28 49 -216 -155 296 0 230 163 -65 -267 114 8 -157
7877 -157 -90 -97 77 57 41 146 -341 128 -213 -16 68 -58 1 135 -110 249 312 -394 -18 -164 153 -173 -119
7900 -119 97 68 73 -205 -187 254 32 7 -388 -235 -25 -208 -123 239 128 -34 -169 39 75 121 167 -135 187
7923 187 228 84 -145 78 275 -209 -116 302 113 120 -114 162 -172 -397 -292 -183 -100 -143 244 -180 -41 -107
7945 -107 -47 -59 171 -338 -238 -65 9 187 -78 259 44 84 117 61 -48 -32 -135 -23 116 -162 -51 -100 -157
7968 -157 -66 -307 -214 -120 -55 -157 -151 91 185 227 -143 114 238 111 205 -31 17 345 -98 154 -69 111 172 -82
7992 -82 227 -80 -199 106 59 92 -81 -184 -74 37 145 -316 -19 -358 67 -154 -188 24 -21 88 42 458
8014 458 3 105 -19 -124 250 -256 113 48 329 197 211 -15 -90 206 21 -103 90 136 -189 -303 71
8035 71 74 34 -23 -84 125 -47 -177 -143 -185 -88 -131 20 -108 23 -117 227 -84 106 -31 -27 -95 -17 -199 -204 2
8060 2 141 165 92 104 50 -150 -145 297 -216 -194 -64 141 -92 400 151 94 363 43 35 53 137 14 60 -136 60
8085 60 338 -7 -331 87 -82 248 -99 120 -27 -12 327 -213 70 97 -129 403 -42 215 -162 -157 -17 -214
8107 -214 -284 -334 315 -347 224 -5 -145 116 21 19 -20 -109 -350 -83 -57 9 417 -148 75 14 2 -103 -109 70
8131 70 -137 107 143 -171 -423 -60 108 -68 -62 -207 -68 224 151 319 3 -80 116 129 -84 -140 77 31 192
8154 192 335 -12 -164 -292 109 -37 -8 110 98 40 166 242 38 -154 81 167 60 134 282 83 -136 17
8176 17 -88 -218 31 256 -31 129 -25 45 78 487 -113 -54 389 57 217
8191B17
##END NTUPLES=NMR FID
##END=
