##TITLE=1H_DE-30H_D2O
 D2O
 8 sc, 
 6.8.2024
##JCAMPDX= 6.0         $$ Bruker NMR JCAMP-DX V2.0
##DATA TYPE= NMR FID
##DATA CLASS= NTUPLES
##ORIGIN= UXNMR, Bruker Analytische Messtechnik GmbH
##OWNER= root
$$ XWIN-NMR		Version 3.5
$$ Tue Aug  6 14:48:17 2024 Russian Standard Time (UT+4h)  she@DPX200
##.OBSERVE FREQUENCY= 200.1313
##.OBSERVE NUCLEUS= ^1H
##.DELAY= (6, 6)
##.ACQUISITION MODE= SIMULTANEOUS
##.ACQUISITION SCHEME= undefined
##.AVERAGES= 8
##.DIGITISER RES= 18
##SPECTROMETER/DATA SYSTEM= spect
##.PULSE SEQUENCE= zg30
##.SOLVENT NAME= Acetone
##.SHIFT REFERENCE= (INTERNAL, Acetone, 0, 15.7039)
##AUDIT TRAIL= $$ (NUMBER, WHEN, WHO, WHERE, WHAT)
$$ ##TITLE= Audit trail, XWIN-NMR		Version 3.5
$$ ##JCAMPDX= 5.01
$$ ##ORIGIN= Bruker BioSpin GmbH
$$ ##OWNER= she
$$ F:/spectra/data/she/nmr/H-F/1/audita.txt
$$ ##AUDIT TRAIL=  $$ (NUMBER, WHEN, WHO, WHERE, WHAT)
(   1,<2024-08-06 14:47:18.20 +0400>,<she>,<DPX200>,
      <created by zg, POWCHK disabled, PULCHK disabled
       configuration hash MD5:
       00 E9 B6 7A A2 85 ED C7 34 08 36 98 17 FE 4E 26
       data hash MD5: 16K
       B3 9C C2 26 DC AC D6 BD 4C 69 FF 7A 78 64 3D 9C>)
$$ ##END=
$$ 
$$ hash MD5
$$ 74 CF 29 88 AB 52 F4 7C A8 AF 4F B7 FC DD A1 4A
##$RELAX= 
##$RELAX= 
##$RELAX= 
##$RELAX= 
##$RELAX= 
##$RELAX= 
$$ Bruker specific parameters
$$ --------------------------
##$DU= <F:/spectra>
##$EXPNO= 1
##$NAME= <H-F>
##$PROCNO= 1
##$TYPE= <nmr>
##$USER= <she>
##$AMP= (0..31)
100 100 100 100 100 100 100 100 100 100 100 100 100 100 100 100 100 100 
100 100 100 100 100 100 100 100 100 100 100 100 100 100 
##$AQSEQ= 0
##$AQ_mod= 1
##$AUNM= <au_zg>
##$AUTOPOS= <>
##$BF1= 200.13
##$BF2= 200.13
##$BF3= 200.13
##$BF4= 200.13
##$BF5= 200.13
##$BF6= 200.13
##$BF7= 200.13
##$BF8= 200.13
##$BYTORDA= 1
##$CFDGTYP= 0
##$CFRGTYP= 5
##$CHEMSTR= <none>
##$CNST= (0..31)
1 1 145 1 1 1 1 1 1 1 1 1 1 1 1 1 1 1 1 1 1 1 1 1 1 1 1 1 1 1 1 1 
##$CPDPRG= <>
##$CPDPRG1= <>
##$CPDPRG2= <>
##$CPDPRG3= <>
##$CPDPRG4= <mlev>
##$CPDPRG5= <mlev>
##$CPDPRG6= <mlev>
##$CPDPRG7= <mlev>
##$CPDPRG8= <mlev>
##$CPDPRGB= <>
##$CPDPRGT= <>
##$D= (0..31)
0 1.2 0 0 0 0 0 0 0 0.06 0 0.03 0 0 0 0 0.0002 0 0 0 0 0 0 0 0 0 0 0 0 
0 0 0 
##$DATE= 1722941237
##$DBL= (0..7)
120 120 120 120 120 120 120 120 
##$DBP= (0..7)
150 150 150 150 150 150 150 150 
##$DBP07= 0
##$DBPNAM0= <>
##$DBPNAM1= <>
##$DBPNAM2= <>
##$DBPNAM3= <>
##$DBPNAM4= <>
##$DBPNAM5= <>
##$DBPNAM6= <>
##$DBPNAM7= <>
##$DBPOAL= (0..7)
0.5 0.5 0.5 0.5 0.5 0.5 0.5 0.5 
##$DBPOFFS= (0..7)
0 0 0 0 0 0 0 0 
##$DE= 6
##$DECBNUC= <off>
##$DECIM= 24
##$DECNUC= <off>
##$DECSTAT= 4
##$DIGMOD= 1
##$DIGTYP= 9
##$DL= (0..7)
0 120 120 120 120 120 120 120 
##$DP= (0..7)
150 150 150 150 150 150 150 150 
##$DP07= 0
##$DPNAME0= <>
##$DPNAME1= <>
##$DPNAME2= <>
##$DPNAME3= <>
##$DPNAME4= <>
##$DPNAME5= <>
##$DPNAME6= <>
##$DPNAME7= <>
##$DPOAL= (0..7)
0.5 0.5 0.5 0.5 0.5 0.5 0.5 0.5 
##$DPOFFS= (0..7)
0 0 0 0 0 0 0 0 
##$DQDMODE= 0
##$DR= 18
##$DS= 0
##$DSLIST= <SSSSSSSSSSSSSSS>
$$ [...]
##$SUBNAM2= <"">
##$SUBNAM3= <"">
##$SUBNAM4= <"">
##$SUBNAM5= <"">
##$SUBNAM6= <"">
##$SUBNAM7= <"">
##$SUBNAM8= <"">
##$SUBNAM9= <"">
##$SW= 24.0689771365484
##$SWIBOX= (0..15)
0 0 2 0 0 0 0 0 0 0 0 0 0 0 0 0 
##$SW_h= 4816.95568400771
##$TD= 16384
##$TD0= 1
##$TE= 0
##$TE2= 300
##$TE3= 300
##$TEG= 300
##$TL= (0..7)
0 120 120 120 120 120 120 120 
##$TP= (0..7)
150 150 150 150 150 150 150 150 
##$TP07= 0
##$TPNAME0= <>
##$TPNAME1= <>
##$TPNAME2= <>
##$TPNAME3= <>
##$TPNAME4= <>
##$TPNAME5= <>
##$TPNAME6= <>
##$TPNAME7= <>
##$TPOAL= (0..7)
0.5 0.5 0.5 0.5 0.5 0.5 0.5 0.5 
##$TPOFFS= (0..7)
0 0 0 0 0 0 0 0 
##$TUNHIN= 0
##$TUNHOUT= 0
##$TUNXOUT= 0
##$USERA1= <user>
##$USERA2= <user>
##$USERA3= <user>
##$USERA4= <user>
##$USERA5= <user>
##$V9= 5
##$VALIST= <valist>
##$VCLIST= <CCCCCCCCCCCCCCC>
##$VD= 0
##$VDLIST= <DDDDDDDDDDDDDDD>
##$VPLIST= <PPPPPPPPPPPPPPP>
##$VTLIST= <TTTTTTTTTTTTTTT>
##$WBST= 1024
##$WBSW= 4
##$XGAIN= (0..3)
0 0 0 0 
##$XL= 0
##$YL= 0
##$YMAX_a= 221650
##$YMIN_a= -201578
##$ZGOPTNS= <>
##$ZL1= 120
##$ZL2= 120
##$ZL3= 120
##$ZL4= 120
##$ABSF1= 10
##$ABSF2= 0
##$ABSG= 5
##$ABSL= 3
##$ALPHA= 0
##$AQORDER= 0
##$ASSFAC= 0
##$ASSFACI= 0
##$ASSFACX= 0
##$ASSWID= 0
##$AUNMP= <proc_1d>
##$AZFE= 0.1
##$AZFW= 0.1
##$BCFW= 1
##$BC_mod= 2
##$BYTORDP= 1
##$COROFFS= 0
##$CY= 11.3945322036743
##$DATMOD= 1
##$DC= 2
##$DFILT= <>
##$DTYPP= 0
##$F1P= 15.6554695791079
##$F2P= 12.8336369535428
##$FCOR= 0.5
##$FTSIZE= 0
##$FT_mod= 4
##$GAMMA= 1
##$GB= 0.15
##$INTBC= 1
##$INTSCL= 1
##$ISEN= 128
##$LB= 0.24
##$LEV0= 0
##$LPBIN= 0
##$MAXI= 10000
##$MC2= 0
##$MEAN= 0
##$ME_mod= 0
##$MI= 1.114404
##$NCOEF= 0
##$NC_proc= 0
##$NLEV= 6
##$NOISF1= 3.799351
##$NOISF2= 2.8
##$NSP= 1
##$NTH_PI= 0
##$NZP= 0
##$OFFSET= 15.70392
##$PC= 1
##$PHC0= -25626.31
##$PHC1= -8.012508
##$PH_mod= 1
##$PKNL= yes
##$PPARMOD= 0
##$PSCAL= 0
##$PSIGN= 0
##$REVERSE= no
##$SF= 200.130013532006
##$SI= 16384
##$SIGF1= 3
##$SIGF2= 2
##$SINO= 400
##$SIOLD= 16384
##$SREGLST= <1H.CDCl3>
##$SSB= 0
##$STSI= 0
##$STSR= 0
##$SW_p= 3612.71676300578
##$SYMM= 0
##$S_DEV= 0
##$TDeff= 0
##$TDoff= 0
##$TI= <>
##$TILT= no
##$TM1= 0
##$TM2= 0
##$TOPLEV= 0
##$USERP1= <user>
##$USERP2= <user>
##$USERP3= <user>
##$USERP4= <user>
##$USERP5= <user>
##$WDW= 1
##$XDIM= 8192
##$YMAX_p= 0
##$YMIN_p= 0
$$ End of Bruker specific parameters
$$ ---------------------------------
##NTUPLES= NMR FID
##VAR_NAME=  TIME,          FID/REAL,        FID/IMAG
##SYMBOL=    X,             R,               I
##VAR_TYPE=  INDEPENDENT,   DEPENDENT,       DEPENDENT
##VAR_FORM=  AFFN,          ASDF,            ASDF
##VAR_DIM=   8192,          8192,            8192
##UNITS=     SECONDS,       ARBITRARY UNITS, ARBITRARY UNITS
##FACTOR=    0.0002076,     1,               1
##FIRST=     0,             0,               0
##LAST=      1.7004516,     0,               0
##MIN=       0,             -201578,         0
##MAX=       1.7004516,     221650,          0
$$ Real data points
##PAGE= N=1
##DATA TABLE= (X++(R..R)), XYDATA
0@%%%%%%%%%%qJ6j6J6k4L2l2M0m8N6o8P8r0J04j24J44j60J84k12K38k71L08l45
33a82L88m35M85n40O01o67P40q22R10j008J117j237J368j517J683j868K083k331
51a232K616k954L365l866M498n322O432p986J0119j6165K32145p7630k43234K0135
65g9079j0356R3450J86138j04496k56043L6128J76417R0273l8684j58162r9090
76a63504J25635J68725K560j65048j29766Q4318J78958K9555j16973j31257k595
87a19392J58458J11027r0616j46334m5740J07195J67909k3939k00628n6226J15341
98b2945J03378L7864j02801j62975N6357J83113J7745q8783q7998o0571J17848
109i768J72752q3872j87679M35J06763Q4947J6922j16499j14751O7384J43887
$$ y = [0, 0, 0, 0, 0, 0, 0, 0, 0, 0, 0, -8, 8, -8, 8, -16, 16, -16, 24, -24, 32, -36, 42, -48, 56, -68, 76, -84, 100, -112, 126, -145, 163, -182, 206, -229, 256, -284, 317, -350, 390, -432, 478, -530, 587, -650, 718, -799, 884, -984, 1099, -1232, 1384, -1570, 1795, -2071, 2427, -2895, 3537, -4449, 5670, -10495, 221650, 144020, -99214, -79079, -89435, 4015, 190153, 85657, -170386, -134258, 42159, 132432, 93748, -64414, -163504, -37869, 130856, 133416, -31632, -161398, -77080, 101878, 131433, 14460, -116797, -119392, 39066, 150093, 59477, -86857, -132597, -25402, 142507, 118568, -82060, -138286, -22945, 80433, 118297, 15496, -147479, -91122, 91991, 109736, 20953, -67045, -127616, -9768, 162984, 79112, -108567, -108132, -1369, 83578, 100500, -15999, -130750, -63366, 80521]
120H0521L5441j01718j26604J9155J43915O4050p3805j09612m4962J02348J37118
131A25847m4162j51775l6002Q3568R6124K1974r7634j04864L2431J27026O5167
142A17700q7045j36780J4482J32286N4312n0175q7539o2079P4496J37413k1335
153H5736j32981m6147N3545R2584N0132q8591j20115L1793J23774M7726o6801
164C0655j01849j5744R3077Q2428k5560j02720o1130P1193J13895n105r9399o3300
176h3559K8781R8418N6234q1839j07049K0743R7189N2246l7346r3668l8588P8923
188i515R0487j4228r5033o2730N3366J04704J2095q7496o5996K0192Q2729N7112
200H5687n3415j00887o582Q9268O3766l1403q5440l9749N8064Q6576M531q7068
$$ y = [80521, 115962, 14244, -112360, -93205, 50710, 114760, 40955, -68657, -113619, -11271, 125847, 81685, -70090, -106092, -22524, 73600, 95574, -2060, -106924, -74493, 52533, 117700, 30655, -106125, -91643, 40643, 94955, 44780, -42759, -104838, -30342, 107071, 85736, -47245, -93392, -39847, 52737, 102869, 14278, -105837, -74044, 49730, 97456, 30655, -71194, -86938, 6139, 88567, 63007, -39713, -100843, -29650, 84245, 79140, -20259, -83559, -54778, 43640, 99874, 18035, -89014, -68271, 28918, 81164, 43818, -49850, -88438, -9515, 80972, 66744, -28289, -91019, -37653, 67051, 79146, -8350, -74346, -54154, 28575, 85687, 32272, -68615, -75197, 14071, 77837, 46434, -39006, -78755, -20691, 65885, 70416, -16652]
212a6652o5761M3594Q9672J9212o1717o9188j946Q0603O3497m6357r0603j2947
224f8593O9161O4940j2175p9942m8890M8492Q2424R851p1466o1524K3738P7112
236C3128L5944m8546p6041p249P4464N7821l1991p6768k6612N5010O8508m495
248E3173o9918m8144L1322P5187K3558o1777o4384J5656O7699L9172l3788p2237
260d4481j7015O4962N7687k1958o6635l2321M0090O7008P229o2268n1391K2303
272c6790O8883K8028m9363o1249L782N8672M4659k4563o8092k1868N4146N5132
284E1377j0048n8437l8463L0321O4511J3535n3394n0573J3075O0577L3237l8467
296A7251n9091m501N0665M6040j5147o2576k7169M4686N2895j460n0290m1570
$$ y = [-16652, -82413, -38819, 50853, 70065, 8348, -60840, -62786, 17817, 81314, 34957, -55646, -68593, 568, 65508, 53333, -26609, -75499, -27007, 55417, 65268, -6198, -67722, -43984, 33128, 69072, 20526, -55515, -62764, 11700, 69521, 37530, -39238, -65850, -10840, 57668, 53173, -16745, -64889, -33567, 41620, 65178, 3401, -60983, -45327, 22372, 61544, 27756, -44481, -61496, 3466, 61153, 39195, -27440, -59761, -19671, 47337, 54566, -7702, -59093, -36790, 32093, 60121, 10758, -50491, -46709, 11963, 56622, 32059, -36033, -57901, -3755, 51377, 41329, -17108, -55571, -25250, 39261, 52796, -598, -51171, -38096, 22481, 55718, 17251, -41840, -46341, 4324, 50364, 35217, -27359, -54528, -9842, 43053, 41593, -8697, -50267]
308e0267K0150O1716J9454m6716m7742M816N1714L7941k7710n8398j0723M5391
320c74M3808q031n2807l3094L3748N3783M186m4353m1055J2627N4038K5488l6684
333A1280m9357p19M6457L7003j8868n1739j8250L6491M6400j430n0037l2608K5831
346a9546M7814J2376l5941m4410N966N1087K5983k8684m4343q910L8885M0869
358D1146j2452m9608k0520L0472M2267M877m0862l6638J7289M7182J5994l1584
370G563m0550j34M2448L1139k1067m4494j1941L3416L8189m623m2734k6695K4035
383a5448M2749P983l6140l4198R344M1862K1912k6482m0841l446L7408L0505j3435
396B1773m0281j7856K8307L8788r29l8133k7005J6938L9643J3338l0553l5536
$$ y = [-50267, -30117, 31599, 51053, 4337, -43405, -38589, 13125, 51066, 23356, -35042, -45765, -374, 43434, 35403, -17404, -50498, -16750, 37033, 41219, -3134, -44189, -31562, 22476, 47964, 11280, -38077, -38796, 7661, 44664, 25796, -25943, -44193, -7702, 38698, 37268, -12769, -45377, -19546, 28268, 40644, 4703, -39707, -33741, 17346, 43329, 14645, -29698, -38608, 277, 41146, 28694, -20914, -41434, -10962, 31305, 36182, -4680, -41318, -24029, 23153, 39147, 7563, -32987, -33121, 9327, 40466, 19399, -25095, -37036, -3620, 34569, 29946, -12788, -39483, -15448, 27301, 35284, -856, -35054, -25710, 16152, 38064, 11582, -29259, -32705, 4703, 35208, 21773, -18508, -36364, -8057, 30731, 29802, -8331, -35336, -18398, 21245, 34583, 4030, -31506]
408c1506M818L8236K3090k0052l8279q615L1760L2395p618l8577j9861K3584L5906
421B5281M269l2366k9211J0934L8331J5905k6264l3028j202L3179K6693j4417
433A8104l7854j1806K7706L1602k893l4620k1621J7362L4759Q401k7367l0916
445b9143O593L5804J7085k0446l1428n797K8102K9592j0626l5930j2830K2267
457f757K9554K924l0065k6043J4125L3909J0180k3296k9022R20L1228K1366j5977
470A3046l1410q651K4641K8513n413l1749j6692J7275K9832O466k7007k6141R995
483a7295L0021J3590j7483l0056l447K9967K1552j2598k8265j1506J9215K9679
495B3374o83l1007j7482J4377K6595R810k1853k7402M527K9471J5662j5409k7827
$$ y = [-31506, -26688, 11548, 34638, 14586, -23693, -32308, -548, 31847, 24229, -14348, -34209, -10625, 25281, 29550, -2816, -32027, -21093, 17238, 33143, 6879, -26149, -27351, 5828, 32521, 18104, -19750, -31556, -3850, 27752, 24859, -9761, -31382, -14020, 20739, 29140, 1773, -29143, -22550, 13254, 30339, 9893, -21535, -27332, 770, 30362, 19736, -16194, -29024, -6757, 22797, 25721, -4344, -30387, -16262, 17647, 27827, 4531, -24491, -23571, 7657, 29023, 13046, -18364, -27015, -2374, 26139, 20726, -11023, -27715, -10440, 19392, 25858, -1149, -27290, -17295, 12726, 26316, 8833, -21223, -24670, 5297, 26849, 14251, -14014, -25520, -6305, 23374, 22691, -8316, -25798, -11421, 15174, 24984, 3131, -24271, -19744, 9727, 25389, 9980, -17847]
508a7847n776K4222K3048p121k7066j4570J6830K8171K069k5861j9460R004K5878
521A1521J3346j8922k7594J979K5825J6747j0683k6191r527K1013K3793l604k5187
534g484j5732J2528K6929N841k2529k0675N630K3841J4455j3936k6645l081K3851
547B993J8503q384k3676j1264J5698K4389R49k3359j8058J0523K5182P246j8149
560B593k0329N50K2012J7718j2249k5644m442K0118J8087l512k1740j4416J2831
573h423K4441L020k0720j8127O870K2604J0267j4148k1718j973K1051J6916r046
586A1014k2661p571J5905J9808p97k0463j4239Q967K2129P206j7979j9604M294
599a3991K0722J1461r999k0875n931J8735J8887o955k0647r052J1815J9113L644
$$ y = [-17847, -23623, 599, 23647, 16526, -10540, -25110, -8280, 19891, 21960, -3901, -23361, -14357, 11521, 24867, 5945, -21649, -19670, 6155, 22902, 12219, -13972, -23499, -2486, 21307, 17703, -7484, -23216, -10688, 16241, 22082, -447, -21122, -15492, 8349, 22804, 8868, -17777, -20858, 2993, 21496, 13112, -10564, -21828, -6130, 18259, 19208, -4151, -22209, -11686, 13496, 20742, 2593, -17736, -17186, 4826, 22544, 10295, -15349, -19791, 327, 18414, 14902, -6838, -21254, -8423, 16018, 19038, -1682, -19809, -12939, 9665, 19932, 5784, -15934, -17907, 3144, 20060, 11014, -11647, -19218, -3313, 16495, 15698, -4765, -19004, -10037, 12092, 19298, 1319, -18285, -13991, 6731, 18192, 8193, -12682, -18613, 122, 19009, 12054, -8593, -17645, -5830, 13283, 16927]
612A6927j8496j6624O911K1325Q273j4910j8716J115J7193J3838o249k1053p806
625a8272J7070J7526m032j6992j1717Q003K0169N453j7488j5769L930J8331J1211
638A7423j1390j9343j147J5760J3598l352j8864j0562J4071J8613j787j5885j2052
651a4917N523J8108Q423j4516j7105K087J7206J0892q607j6929m324J2326J5249
664A3416m72j8751j1338J2778J6027j4j1539j2740N43J8701J0575j4300j5473
677a2587J321J2663J2589m163j8317o374J3096J3419N9j4452j2544Q439J6522
690I671K673j0876j2685p12J6054J1502j0532j5607j647J1800J2581k097j6196
703f071p493R455J3878K486j3374j3015P123J4509M218q039j3217l207J5672J1957
$$ y = [16927, -1569, -18193, -11282, 10043, 18316, 3406, -15310, -14195, 2998, 16836, 10587, -10466, -18272, -1202, 16324, 12292, -4700, -16417, -8414, 11755, 17208, -280, -16049, -12119, 6212, 17423, 6033, -13310, -14457, 1303, 14901, 11549, -7315, -17877, -3806, 14807, 13020, -2865, -14917, -9394, 8714, 17137, 2621, -14484, -12397, 4809, 15701, 7094, -9835, -14159, -1833, 13416, 12944, -5807, -17145, -4367, 11660, 11646, 107, -12633, -12090, 6611, 17186, 2886, -12587, -11266, 1397, 13986, 9823, -8494, -14868, -1772, 11647, 11706, -2746, -15290, -6851, 9671, 12344, 1468, -11217, -11929, 4125, 15627, 5095, -10512, -12159, -359, 12222, 10125, -6071, -13564, -4109, 9769, 12255, -1119, -14134, -7011, 7498, 11716, 3677, -9540, -12747, 2925, 14882]
717A4882r974j3364j901P732J2798J622j6030r445R381J2672K593r968j2537K465
731i074J4607O490p738j2550l815J2711J2447o402j3003m466O816J3032K284j3922
745b583r589O771J1857M399q514j3167J705J3106O853n719j1553n376J1258J2222
759A1670m812j1296m954M081J2839M639j3511j0486N911J0707N606o427j2760
772h793j262J2417P887m394j1020n743R045J1691k386j0373o482L353J2464M502
786A0906j1107r667L583R453O421m283j2746k599J0813Q356l096j0228n596O665
800c125J1055K82r660p451K790J1006M866q124j0206J618R202O517l657j0680
814e567l986Q935R179k050r518o313N254J0577J961q441q059J269J0290O162p408
$$ y = [14882, 4908, -8456, -10357, -2625, 10173, 11795, -4235, -13680, -4299, 8373, 10966, 998, -11539, -9074, 5533, 12023, 4285, -8265, -12080, 631, 13078, 6676, -6327, -10793, -3977, 9055, 11339, -2583, -12172, -5401, 6456, 10855, 2341, -10826, -9121, 3985, 10838, 5119, -6434, -11810, -552, 11670, 6858, -4438, -9392, -5311, 7528, 12167, -1344, -11830, -5919, 4788, 10394, 3967, -8793, -10055, 2362, 10249, 5855, -5165, -10908, -1863, 9828, 7442, -2931, -9413, -6060, 6404, 10906, -201, -9868, -6285, 3168, 9589, 5306, -7440, -10039, 774, 9130, 6034, -4194, -9790, -3125, 7930, 8212, -1448, -8899, -6109, 4897, 9763, 1639, -8567, -6949, 2253, 8770, 5113, -5567, -9553, -618, 8561, 6511, -3007, -9320, -4066, 6511, 8472, 31, -8028, -6759, 3531, 9693, 2285]
829B285r876N44P674P361j736j0548n445Q445Q902j110q015o578L010J0398L047
844H358p694p841P48Q533O511n070r525j395P037P630r55j0021m797O306Q376
859F201Q65p435p392K469R569L570o275p684o75P960O743l883q732k363O131P439
875F508o7q876n476M885P960J879o677o970J395Q278N038n448q061q14P156O473
891G183k526q379l767N693P827K74p709n382L021P682K892n487p420K03Q065M923
907G093l881p759j906O240O619j238p843m387M477P325J321o533o008K044P613
922C177L584m855p246l28O849N313k703p649k563N241P272q41o981m761L235P216
938C960K403n903o139R91P088L839l719p179j016O179N379j615o986l426M195
$$ y = [2285, -7591, -7047, 627, 7988, 6252, -4296, -9741, -1296, 7606, 6496, -1519, -8097, -5087, 5311, 8358, 664, -7177, -6429, 2104, 8615, 3545, -5980, -7375, -338, 7292, 6337, -3684, -8481, -2175, 6201, 7066, -369, -7761, -5292, 4277, 7847, 1572, -6112, -6787, 1173, 7916, 4033, -4699, -7062, -931, 6508, 6441, -2435, -7911, -3026, 4934, 6813, 136, -6834, -5439, 2839, 7877, 2429, -5632, -6446, 710, 7183, 4657, -3722, -7489, -1796, 6031, 6305, -1404, -6786, -3765, 3917, 6809, 1322, -6098, -5895, 2170, 7093, 3212, -4547, -6453, -213, 6406, 5168, -2675, -7062, -2585, 4740, 6061, -472, -6480, -4436, 3177, 6761, 1906, -5340, -5668, 1181, 6494, 3791, -3858, -6421, -1180, 6092, 5251, -1730, -6491, -3256, 3960, 6363, 460, -5679, -4688, 2400, 6239, 2520, -4659, -5675, 504, 5883, 4268, -2718, -6144, -1949]
953a949O706P70o161n484K387P088K662m998n970M8O382M680l508o278k138N158
969f05O028n01o920m230L921O435J189n424n165J274O424L390l719o374n99N241
985C65N435k330o373k779M270O123O9n747m806L007O074K123m720n668P81N923
1001A747L796l127o018j396N121N335j711n976l145L287N771J255n617m354J638
1016c394N997K602l623n872L5N288M266k853n527j963M189N069l5n607l544K436
1032b536N722J661m656m741P28N618L189k974n887p58M804M584j737n352k440
1047d775L716N115Q1n011m113K352N224K329m081m687R7N065L541k525n283j447
1063d402M093M590r47m884l288K961N303J087m426m487J152N264K642l446m696
$$ y = [-1949, 4757, 5527, -634, -6118, -3731, 3357, 6019, 1021, -4949, -4901, 1481, 6161, 2653, -3625, -5763, -605, 5423, 4922, -1998, -6228, -2307, 4128, 5317, -107, -5272, -3998, 2426, 5816, 2097, -4277, -4876, 365, 5800, 3470, -2903, -5682, -1412, 4711, 4780, -967, -5773, -2766, 3308, 5431, 711, -4957, -4176, 1747, 5543, 2416, -3602, -4998, 123, 5458, 3747, -2229, -5374, -2087, 3684, 4939, -678, -5032, -3394, 2603, 5205, 1582, -4290, -4255, 1033, 5299, 2446, -3081, -5044, -855, 4214, 4179, -1428, -4972, -2536, 3186, 4847, 191, -4550, -3822, 1796, 4985, 2011, -3876, -4634, 170, 4754, 3017, -2335, -4775, -1059, 4056, 4137, -874, -4987, -2635, 2589, 4918, 837, -3850, -3753, 1312, 4853, 2328, -2955, -4402, -309, 4281, 3334, -1550, -4838, -1877, 3426, 4513, 87, -4400, -3248, 2016, 4658, 1212, -3484]
1078c484n61M405M213j914m853k075L505M388J81m579l802K197N150J484l699
1093E56m506M44M633L096k334m684j477M099M398j479m289k506K587M299J049
1108C886m099l508J077M796J851k661m784k53M688L153j980m586j357K969M489
1123C681j92n043k609K363M298J131l412l603M28M623K330k434m612o34L949L396
1139C660j293l984k134K633M201L49m196k837J172M370J952l431m080M84M280
1154A146K349j446l988j860L467L619p71l946k083K180L963O81l454l162J053
1169b252L831J939k319l887k61K892L115p27m204j421K634L200P0l062k571J306
1185a717L878J199l210l092M56L243K642j916l721o92L058K866m20l591k561K466
$$ y = [-3484, -4045, 360, 4573, 2659, -2194, -4269, -764, 3624, 3805, -774, -4576, -2379, 2771, 4255, 556, -3950, -3506, 1127, 4223, 1889, -2795, -4272, -173, 4225, 2746, -1543, -4049, -1462, 2837, 3886, -213, -3721, -2644, 2152, 4003, 1342, -3442, -3695, 993, 4146, 2166, -2420, -3777, -808, 3681, 3489, -1554, -4163, -1800, 2498, 3629, 217, -3386, -2958, 1665, 3995, 1561, -3051, -3685, 264, 3660, 2367, -1617, -3751, -1118, 3083, 3432, -764, -3601, -2429, 1941, 3893, 462, -3618, -3134, 1146, 3495, 2049, -1939, -3799, -332, 3287, 2516, -1430, -3513, -1333, 2630, 3311, -143, -3305, -2252, 1579, 3518, 1199, -2688, -2949, -57, 3058, 2331, -1873, -3294, -660, 2540, 2610, -452, -3023, -1717, 2161, 3360, 150, -2942, -2486, 757, 3399, 1483, -2238, -2930, 128, 2994, 2574, -1017, -3578, -1112]
1201a112L774J34l063k749Q49L680J506j937l672r8L144K651j360l616q02K282
1217c89K885L32l586k310J728L367N57k117k944J71L168K070j757l459l60K560
1233h4K803p39l201j965K334L382j33k717k773J607L314J025k314k889J15K871
1249F36J982j453k887p57K253K697l69l292j403J450K673R83k415k814J028K476
1265G88J759j401l191k32K654K135p15l251q66J758K317K13k232k213J240L045
1281A808O27j949k816M30K624J880j492k832p05K188K408m87k564j408J621K449
1297A782N47k694j775M30K955J309k138k234J20K267J696r06k686j129J929K475
1313A948o8k466j364R08K754L26j564k558K72K922R80j213k372l06J700K372n14
$$ y = [-1112, 2662, 2796, -267, -3016, -2167, 1513, 3019, 1082, -2590, -2688, 456, 3107, 1747, -1869, -2671, -389, 2496, 2828, -758, -3068, -1340, 2027, 2584, 467, -2477, -2306, 862, 2932, 1175, -2284, -2644, -84, 2719, 1980, -1221, -3186, -852, 2530, 2397, -320, -3093, -1486, 1828, 2853, 539, -2350, -2235, 636, 2618, 1165, -1722, -2479, -226, 2471, 2102, -1190, -2593, -1143, 1530, 2513, 98, -2716, -1688, 788, 2547, 1146, -2045, -2277, 377, 2512, 1797, -1454, -2320, -562, 1755, 1968, -264, -2477, -1237, 1808, 2435, 486, -2330, -1900, 724, 2604, 1112, -1720, -2425, -237, 2171, 1684, -880, -2288, -667, 1782, 2329, -365, -2140, -1710, 1245, 2554, 416, -1818, -1698, 569, 2265, 1359, -1327, -2456, -527, 1948, 1880, -586, -1950, -1042, 1712, 2038, 474, -2084, -1812, 1110, 2090, 877, -1495, -1801, -101, 2271, 1757]
1330A757k656j076J630J892K29j907k434J312K372J154j943k153M35K002J589
1345B203j185k408n98J548K359k42k372j383J393K254J53j701k122Q17K375P85
1361A876r85k297m48K117J875j185j831q31Q43K791k58k329j260J097J941Q14
1377A930j502k149J33K634R58j010k320n47J803J827n80k191r15J193K232L17
1393A813k075j582Q68J702R87j013k134j80J954J809j062k080q07J422J956j71
1409A407j900j013P16J866Q55k072j308K40J726J292j024k349j5J692J321l97
1425A037j831j072J214K136k80j386j280M65J847Q98j741j702M93J538J525j068
1441G93j786n48J474J533n12j055j769J401K094k42j569j305K82J887R82j383
$$ y = [1757, -899, -1975, -345, 1547, 1776, -131, -2565, -1253, 1119, 2273, 330, -1823, -1388, 614, 2203, 1018, -1390, -1988, -440, 1919, 1677, -695, -2078, -685, 1569, 1722, 21, -2101, -1284, 1091, 1876, 891, -1406, -1854, 263, 2138, 953, -878, -1709, -866, 1925, 1667, -662, -1922, -825, 1116, 1930, 428, -1721, -1588, 1046, 2004, 994, -1326, -1873, -70, 1757, 1177, -1014, -1929, -736, 1496, 1813, -262, -1844, -976, 726, 1713, 700, -1434, -1614, 340, 2149, 1087, -993, -1800, -378, 1578, 1407, -493, -1506, -790, 1076, 1931, -141, -1449, -1209, 517, 1809, 785, -1564, -1579, 113, 1434, 1037, -794, -1866, -652, 1484, 1204, -182, -1462, -997, 850, 1748, 7, -1695, -1202, 336, 1861, 793, -993, -1541, -67, 1466, 954, -101, -1870, -469, 1625, 1383, -186, -1491, -1209, 678, 1660, 277]
1457B77j542K09J243J265l07j645r81J464J263oj456j519Q99J966L27j447j233
1474a223J99J669Q00j117j510m69J490J622k57j847q47J123J368K04j060j595
1490a450O83J600P29j313j262j1J263J419p73j714n82R74J559J77j610j196Q81
1507f26J390M01j014j349J84J603R45r61j648k49J390J534p43j527o59J165J093
1524I29M37j368j368P84J358L70n97j601j18J446R62p13j203m42J212J111j08
1541A091j118j519R11J476M37j258j074J96J560O10o92j358j34J100J201r53j154
1558f78n07P58J196K50j380r75P34J448L65r14j245j58J694M93n03j351p49J307
1576b15J137k11j315n18Q94J365O8j014j270J31J571P09o84j472m7P05J324m84
$$ y = [277, -1265, -1056, 187, 1452, 1145, -500, -1481, -17, 1246, 1240, -216, -1735, -836, 1130, 1457, 10, -1223, -1024, 645, 1445, 328, -1182, -1651, -161, 1461, 1204, -643, -1490, -367, 1001, 1205, 145, -1450, -767, 833, 1562, 249, -1013, -1024, 239, 1658, 885, -829, -1411, -437, 1122, 1299, -311, -1507, -626, 764, 1165, 151, -1198, -1014, 589, 1534, 573, -1075, -1324, 66, 1600, 857, -670, -1329, -164, 929, 1366, -2, -1370, -586, 772, 1142, 545, -1056, -1174, 272, 1234, 521, -682, -1124, 88, 1199, 1091, -27, -1546, -635, 841, 1278, 20, -1054, -858, 702, 1312, 620, -738, -872, 228, 1429, 476, -678, -1185, -427, 769, 1019, -361, -1336, -602, 846, 1211, 297, -948, -1106, 588, 1081, 578, -773, -1522, -215, 922, 711, -604, -1122, -228, 1137, 1205, 191, -1079, -948, 623, 1332, 648, -824, -871, -166, 1158, 674]
1594F74j420k21Q43J018j31j181o60P60J086L68j105j092L77Q96R50o92j221l32
1612a083J265Q18m09j275m87Q16J164L34j018j046L25J028N05m82j263n7R63Q82
1630I80m69r56l92P74J238l94j243n18L34J362J20j029o12L43R28O04k99j608
1648h37j34J028J025n37j107m62O32J123J27j092r24N79J094N13p22q95j78R49
1666A82O22l09j059n07J057R50o00m92o23L69R64K73r93p57L89P51O66o18q36
1685e71p1N16O73r9j217P3L16P78L12r58n37M26R01M86j086o41j57J208L90m27
1705C15q32m31J005Q35k30q50l04K92Q07K44p21r06M93P24K88m20q35k06Q51N46
1725F65l44q86j24M51O68M06r59l84K72N94M94o99p97J30P83N76o20p12l0O09
$$ y = [674, -746, -967, -124, 894, 763, -418, -1078, -318, 768, 1136, 31, -1061, -684, 212, 1162, 470, -751, -1083, 182, 1000, 591, -684, -1171, -355, 809, 1143, 125, -921, -596, 432, 937, 455, -808, -865, 98, 980, 511, -445, -837, -63, 1175, 781, -462, -980, -646, 716, 836, -193, -805, -462, 466, 1070, 771, -837, -971, 57, 1082, 545, -562, -1024, -392, 731, 858, -234, -1158, -579, 515, 1028, 306, -589, -767, 182, 804, 495, -564, -1071, -14, 936, 336, -156, -779, -410, 554, 827, -166, -923, -534, 217, 883, 265, -571, -642, -126, 547, 448, -769, -696, -380, 398, 710, -248, -785, -359, 542, 1028, -58, -699, -856, 352, 742, 315, -517, -948, 57, 892, 662, -188, -492, -200, 607, 851, 130, -776, -283, 441, 729, 309, -526, -732, 119, 665, 321, -565, -689, -238, 430, 836, -123, -507, -235, 359, 853, 154, -643, -513, 270, 846, 226, -486, -516, 93]
1745I3O56l66q66p70Q78P79K02l87o77J24O98L94q95k91J45K49M51J52q16l64
1765f11M15J092k77r69m35M51Q76J46n32j002L60M23Q92p76q03J44O32O30k02
1784D54r85j3M37Q47j18q42o08O18M82J1k80m82k8P41M39o24j37l54L01O27m75
1805A1l15k34K52Q42M4p00m78N11R0N78m45n38j3O87L88p99k03m44N02Q29k95
1826B70k76p26K97P80J4k85n61k27Q21N38q18p6j49L40Q08n03p02k14N30K16M85
1847E62o09m26Q8Q75O5k87o82J26M85L46l21n18l20M12N55k93k19m86J96P85J86
1868E20m34o05J63N75M33m21o50J01L08K17j00l74l15J16N79L15n91o54L67P09
1888B59J59n22q8o5K51O87m43o16k3O75N9n7m26k92K81N0P18j035J68o6M93K40
$$ y = [93, 749, 383, -483, -1253, -375, 404, 606, 219, -458, -334, 364, 758, -137, -428, -283, -34, 417, 569, -247, -611, -196, 896, 619, -350, -785, -334, 542, 688, 156, -846, -486, -63, 829, 53, -750, -606, 26, 656, 454, -531, -544, -107, 740, 622, -220, -828, -210, 272, 283, 3, -479, -507, 234, 673, 49, -88, -442, -141, 486, 11, -304, -538, -286, 556, 600, -100, -578, -67, 23, 601, 156, -382, -395, 292, 680, -119, -322, -766, -264, 565, 270, -6, -732, -435, 345, 359, 74, -487, -714, 107, 645, -173, -249, -398, -58, 750, 247, -455, -669, -139, 77, 562, -47, -473, -385, 490, 555, 268, -414, -288, 197, 543, 222, -296, -616, -204, 351, 58, -161, -647, -451, 334, 520, 86, -519, -356, 219, 652, 231, -419, -318, -10, 207, 107, -267, -582, -466, 113, 428, -163, -817, -450, 259, 418, -104, -192, -257, -6, 681, 238, -378, -401, 274, 333, 276, -150, -442, -161, -111, 607, -428, -260, -326, 167, 407]
1910D07k18n69o7L03M66K05q45l58O04M82K4q24J08k6N37J43j04p08K09K66M59
1931D94j76q55J42M18O11l65k97k76L42L96J92m68l60j78N60L05k23o00L4K89
1951a5L88k92j78k01L0N07R3j60o95K77M05J82k58p54J96M79L57l50k23p3K53
1972c2P00k75l50l89M05M23j29l67m76L67K88M56j96p80K04K88P7J32m25l88L94
1993g3L66J3l05n90O54L12r3k36n92J2O24L72l85k80n2L48M64p19j73l16P31M31
2015E13q2n20j38j39N18J87m52n3j91L40M65k67j81m81K05L68L59r43J13M20J31
2036A72L79o32k15J45nK20J57n50k16M07K08J32o73K06L14J56l4m5m52J15L58
2057A47K14m43k38K27L79k5n9l95K3q5M90P3l24j01L3O00k54k40k23K8K93J32
$$ y = [407, 189, -380, -447, -144, 322, 527, -318, -676, -72, 410, 434, -390, -282, -308, 229, 372, 268, -440, -231, 35, 494, 318, -537, -395, 23, 634, 269, -28, -304, 38, 434, 626, 158, -202, -380, 180, 485, 262, -338, -304, -15, 373, 81, -97, -298, -268, 239, 332, 172, -523, -246, 159, 341, 83, -671, -475, 4, 361, 11, -212, -285, -32, 668, 393, 43, -346, 59, 482, 353, -14, -490, -123, 165, 621, 425, -355, -151, 137, 214, 346, -79, -467, -73, 293, 306, 1, -589, 65, 377, 284, 48, -544, -532, 92, 464, 79, -201, -253, 95, 559, -160, -333, -649, 82, 513, 431, -89, -227, -366, 152, 339, -113, -166, -357, -17, 448, 181, 0, -481, -276, 92, 451, -492, -379, 41, 172, 551, -81, -296, -151, -156, 64, 221, -329, -545, -138, 70, 202, -471, -265, 49, 205, 171, 126, -326, -211, 147, 361, -82, -320, -93, 286, 261, 202, -193, -170, -255, 235, 308, -16, -117, -84, 516, 262, 22, -201, -173, 120, 252]
2079B52k77j65j31L08K60j44j20k98k4M85J18l71L1j78J18J75j29k96K36L86j12
2100A24J12m71l32Q67Rk32K1n79M20l6M30l69j85K46M4K5j90k40O9J76N40k28
2122B21m73J38J59J2M9jm94J83O85j95k12k89k13N41L9J94n27J49j01N42r1m46
2144a30k88K56K72n2k18l6n6J75k1R4k94K72N8M2j9j01j44K4M71j23k6l91K30
2167eK43N9m7l34p4L77k47P8k46k57L32J2L02m54J34l7L68k04p4j09J29J01Pj5
2191C9R0j80K81k54L0J94r9o9P5P0j54j78k90N02k4k73J36r1K41J37l29J34j65
2214a77J08L11ol53L1l20O81j02Ql98L7M78m73K09l1K55J2L7k00o7l14K06L35
2237B67p8j01n77N26J66M06r72K52q9J54J13K04m51J44q4M05m27k12R5N00J2j50
$$ y = [252, -25, -190, -321, -13, 247, 103, -17, -315, -339, 146, 264, -107, -76, -254, -136, 39, -90, -386, -150, 236, 124, 236, -235, -567, 300, 309, 77, 98, -481, -61, -97, 333, -36, -221, 25, 69, 94, -96, -336, -267, -91, 449, 221, -252, -114, 45, 57, 106, 105, -389, -206, 479, 284, 72, -217, -430, 111, 150, 344, -183, -34, -135, 407, 316, -130, -418, -162, 110, 58, -160, -196, -252, -77, -98, -4, -298, -26, 32, 74, 55, -46, -190, -166, 305, 182, 156, -235, -5, 238, 297, 250, -84, -158, 219, -28, 50, -196, -453, -121, -109, 193, -261, -127, -164, 204, 0, -74, -183, -54, 47, 54, 39, 129, -51, 230, -24, 6, 200, 101, 32, 107, 177, 23, -155, -445, 57, 33, -240, -104, -195, 46, 183, -146, -12, -177, -69, 242, 236, -117, -86, -406, 275, 173, 181, -217, -180, 298, -175, 34, 3, 258, 270, 307, 107, 40, -274, -68, 267, 189, 88, -489, 37, 203, 609, -363, -111, -200, -46, 67, 271, -180, -36, -120, 285, -142, -354, -259, 241, 253, 103]
2259A03j01j99N88l00R9l8k36K64L7p7j6l57K29J48p8p8l92N68k26K90J54l24
2281E8l52N82j92p9%j53K82J1Q6j79j13jJ99j44M5r9N2l70O50l72K35l6R2R3n7
2306B38J8m48M50m78L68j67K12k78K05k44L40M0k26R6k32J25L81l92k99K99K96
2327C04k02k49m23K80L54J70j44J74j73l1J65q1j46l25M93j78r3O5n9J76k13N7
2349g9L01k67J40k26N26k75k60L74n05L87m58M67j00N4K46l64K62j55J0m2l61
2370c25M48Nj24J85o4o7J1k88L73J40k97q5p0J41J03K2m95M2J54J99j03l7P3r3
2394a52L13K67k59j15J42J16l49J3P2j51J06K44j71j44k84O75j37k62O8o2L36
2415B66m19K46k17M11m52K73q6K61j30j65j2M6J50l7K5l07K51Q5j65j50K99k44
$$ y = [103, 2, -197, 391, 91, 190, 152, -84, 180, 217, 140, 124, -233, -4, 144, 66, -12, -404, 164, -62, 228, 382, 58, -294, 288, 96, 17, 17, -136, 146, 157, 243, 64, -49, -50, 149, 5, 50, -49, 3, -367, 283, -89, 146, 110, 202, 295, 238, 256, -192, 258, -220, 148, -19, 193, -85, 120, -124, 216, 256, 30, 126, -106, 19, 400, 8, -291, 8, 304, 102, -147, -570, -290, 64, 234, 90, 264, 91, 60, 225, 144, -2, -327, 166, -12, -105, -40, -99, 77, -136, -79, 222, -45, 95, -131, 395, 120, -140, 234, -271, 116, -342, 125, 25, 79, 325, -39, 223, 68, 78, 36, -325, 123, 128, 4, 189, 125, 58, 69, -219, 154, 294, -3, -88, -158, -17, 86, 108, -387, -345, -191, 8, -95, -132, -59, -152, 161, 428, 169, 54, 196, 312, -37, -24, 48, -103, 3, 247, 76, -68, -352, 323, 186, -76, -8, -70, 266, -153, 93, -124, 287, -165, 108, 22, 283, 153, -12, -24, 22, 172, 135, 160, -147, 104, 189, 24, -126, 173, -71]
2437g1J57k28Q1K75k75m7K87j29r1k49N03k97O6K4l3j32M87m55J28l62K69M02
2459C10n00K81j60j81K55m1l3jL33n54K55J40o6J40L0l27J11j35q3K04Lj55L59
2482A85k68k01K91K19k23j59J73k4J66l64N2K85o59Q32l51j15K36j8n1k05L02
2503A03O3j85J93k7o8N2j30r6J46pq3P1OK15j15N9J4l26P9j08O0P0L3J87k88J39
2529E7k56K83p6Q9k86K08l73O98O2k13j87L42j51R3j41J46n98M76r6j53j41K44
2551B7k40L97K7q9k24J92j85J94j10j04J75J5M4j93mKn6K93k03r4J72j0k28L11
2575A09m16L89k04RJ04p7J57n3J02l1k25J42L3k08K13%j34K88k75L38m88mM47
2598B16j40j22K13k39J65k7j70N36n49J90j44K73j53l71M86L47l94k28L53l98
$$ y = [-71, 86, -142, -61, 214, -61, -108, 179, 50, -41, -290, 213, -84, -18, 6, -27, -159, 328, -127, 1, -361, -92, 310, -190, 91, -69, -250, 5, -36, -69, -70, 263, -291, -36, 104, 38, 178, 208, -119, -8, -143, -226, -22, -19, -174, 185, -83, -284, 7, 226, 3, -156, 17, -7, 159, -205, -153, 132, -527, 305, -46, -161, 75, 57, 6, -199, 103, 166, -19, 174, 147, 79, 131, 1, -95, 51, 44, -39, 32, 38, 253, 138, 197, 211, -115, -36, -144, -84, -14, 19, 206, -82, 57, -199, 84, 8, 97, -189, 19, -354, 344, 406, 193, 6, 348, 197, 290, 149, 295, -303, 173, 77, -76, -217, 27, -213, 184, 211, 122, -102, 90, -95, 99, -11, -115, 60, 75, 119, -74, -78, -76, -132, 161, -42, -136, 36, 26, -202, 109, -307, 82, -122, -113, -9, -86, 71, 18, 120, 89, -136, 6, 39, -169, 44, 44, -90, 198, -77, 261, -227, -231, 216, 76, -46, 167, -72, 93, 66, -104, 432, -117, 73, -71, 202, 49, -322, 164, 511, 117, -111, 242, -156]
2618a56K27j70q8l0M34l91L6N26l29l75N62l8k40J16j02K26k27J26j23J99k03
2639b0k51L08l6k02J11K90K2j21r3J18k60J4J30L9k81M24m05J32pK07J0k63K5
2662a09O4l5J23j84K16o5Pj18j6K36j12j32K5Q5j18K78p0m83K91k41L83K74l16
2685a7J54q8J07m5p4j39J38l02K06J16K3m8N9n9k5J97k12J87l37K00n4N7P6k65
2709a45K56J95k64j36J20j60K44j46j25M6j07P4J66M4l5n4J74q4k7k60K06K86
2731B68j50l80K95j73K94j72J88j48k2M5n6r3p0L79l30p5M98k60R3J47j14J24
2753B88j24j18m4J38j1p5J15l9J3N2l36J13q9NQ6J4J5J01Qj29M98o30K58k71K13
2778E1o4O3Q4m10L53k99K08O0k23K62m59J93K79m15M86m56K39n5N1J52j72R3j24
$$ y = [-156, 71, -99, -187, -217, 217, -174, -138, 388, 59, -316, 246, 208, -32, 84, -18, 208, -19, 107, -16, 183, -20, -271, 37, 1, -201, -90, 200, 222, 101, 8, 126, -134, -120, 10, 49, -232, 192, -213, -81, -88, 119, 129, -134, -109, -45, -80, 43, -141, 75, 10, 17, -101, -117, 119, 7, -125, -100, -15, -133, 145, 75, -408, -117, -358, 25, 299, -17, 137, 49, 156, 111, 37, -102, 36, -266, -60, 56, 79, 31, 90, 31, 6, 203, -9, 178, -159, 41, -13, 44, 120, -145, 111, 306, 42, -94, 26, -134, 110, -36, -161, -115, -222, -148, 18, 62, 27, -27, 147, 63, 36, -224, -18, 268, 118, -262, 33, -140, 154, -18, 170, 22, 0, 45, -11, -104, -174, 205, -125, -200, 298, 38, 131, 278, 164, 288, 164, 46, 2, 140, 129, 54, 169, 130, 143, 195, -141, -28, -117, -112, -26, -12, 3, 104, 112, -17, 481, -149, 109, -162, 51, -13, 50, 134, -276, 77, -222, -14, 46, -177, 85, -374, -181, 98, -317, 169, -287, -48, -103, -52, 100, -72, 21, -103]
2801a03M65j68n25L22Q9k60L72L2k19k9L19n00l1M31j44k35L66n9l70L41N8n8
2823I4j68R5o7l8j90K94lk0J3K3j99L00j74L03k78k39L00m3j58M51l17K1j64K34
2847G0k12M69k12k33K44j28o4o5L62j07N6n0j84j54J68M7m1l3L5j56K51q1N22
2870E04l61j80j13L41n5p6j7J57l1j32k08L93l29M45l5l61P2P4k63K5J17j71r
2893b13J52j61M88p82L09K26j77J62R8o5j13K05k37J13K57l99j33L99J2l75n3
2914b87O79k25k27k01J21K70l45J09L3K98k62N2p1k2MK7j67J27n1J24q5J58q6
2937b7K96l86J51J11j24Q7j74K38k52P7K1K9q0K4m3M08m83JJ22j04J95m79R9M17
2961A24j31O9P4k76K40j93K44n4L29j89j78j79L08J02l22M72l47l18L24qj10J8
$$ y = [-103, 362, 194, -331, -9, 80, -180, 192, 224, 5, -24, 295, -205, -236, 195, 51, -184, 182, 123, -247, 94, 152, 94, -74, 21, -46, -84, -274, 20, 17, -3, 10, 33, -166, 134, -40, 263, -15, -254, 46, 3, -155, 296, -21, 0, -164, 70, -142, 327, 115, -118, 126, -2, -66, -131, 231, 124, 180, 130, -54, -208, -40, 7, -34, -67, -32, -188, 63, -18, 504, 143, -37, -150, 191, 136, 60, 43, 200, 169, 37, -171, 222, -107, 338, 303, -58, 14, 88, -175, -150, -33, -204, -213, -61, -222, 266, -516, -207, 19, -158, 4, 102, 37, -76, 129, -108, 5, 262, -137, -270, 129, 141, -234, -287, 392, 167, -60, -261, -140, 130, -215, -106, -73, 225, -37, 15, -56, -78, -74, -47, -214, -87, -138, -14, -99, 59, -27, 269, -117, 34, 145, 21, 108, -66, 172, -80, -3, 18, 47, -33, -9, -52, 356, -127, -126, -4, -108, 87, -392, -293, 124, -7, 62, 136, -140, 100, -93, 151, 97, 426, 237, 59, -120, 188, 290, -32, 440, 93, -225, 99, 91, -19, -1]
2983aj61N9j05K91J08j80Mj15J01j7q1K12Q5j36k80J78l9K52l03J40j02L41n5
3006A96l62M65k42p6k04K95j20J52j43K18m23L68k34N6K87k17J8j47jJ99j01j47
3028a63M54l04j30M50j85l50R0N19o35O5K53kJ39p6j85o4K66l93K86j22j00L25
3050A38o71N56j32K57K3n6j88J6rJ67j00q6K02l01N24n76J42K43k01J37j8j46
3072g9P3j36J97J16k35Q9r9l7J6q4J29L69m18N8R0j82K9r3N84m85K08l97J42K72
3096A27j74qk6K28j57p6L3j29M04m67K39j00K12j23MO5k14K08l2k76L52j32k1
3119f3K61J27l00r0R9m5j49K75j37R2j76K78k71L57j74k01K90l64J75l97L10L67
3141B64j78l47J6O42l16q1L5j21L19k98r8O04o18L40rl4J09m42L16k09L36j23
$$ y = [-1, -162, -103, -208, 83, 191, 11, 15, -100, 1, -16, -97, 115, 200, 64, -216, -38, -77, 175, -128, 12, -90, 251, 196, -166, 299, 57, -19, -223, 72, -48, 104, -39, 179, -244, 124, -110, -54, 233, 16, 34, -113, -114, 85, -16, -163, 291, -13, -143, 307, 122, -228, -138, 381, -254, -189, 64, 62, 201, 125, -60, -124, 142, -251, 35, -87, -187, 138, -533, 23, -109, 148, 171, 115, -73, -57, -66, 101, 1, -85, 117, -184, 340, -236, -94, 149, -52, 85, 67, -79, -6, -142, 55, 171, -64, 25, -74, -111, -95, -179, -50, 319, -99, -41, 49, -133, -104, -197, 387, -98, 110, -287, -145, 127, -47, -55, -81, 147, -10, -86, -53, -182, 222, -245, -6, -106, 106, -17, -13, 52, -162, 46, 14, -262, 90, -42, -63, 198, 325, 25, -65, 34, -11, -160, 115, -22, 70, -106, 172, -99, 258, 84, -117, 173, -191, -16, -413, -103, 264, 86, -261, -245, 397, 81, 0, 35, -86, 233, -65, -163, 441, -177, 163, 154, 120, 229, -213, 103, -106, 230, 107]
3163A07j08K93l22K90m77L60j87P7k13m6J69K19p4L5pk92J73J96j09j21j98L12
3185G7k7j05k39O16m2l82K79R2j51m60L80pJ31k45P7K02l37K72k96MK49l87L39
3208D0QJ06k61J76k73L61m29K93mrK28k89Lrj18J52L5j11J25q6N6J38o94M49K98
3233A85l21K11j93O8N9R2m9j60r5L27l7K34l82J93j28L49l99P2j64L5K80j68j70
3256a61n3K09k71M09j29K03l26J17j04k0J29J20j02j79K45m29M67l8r4j08J78
3277F3J8J2l71J18p8N4K86P2l18K62j82L2J20k06j02L96J89k47R0j98Or4K19L0
3301A71k39j27K25Km9L51n7n48K59N7j65L80k27r1j35K58k51K03o3M4L67k32L1
3324A64l31J98J58j18M9R8l85R4M99k34k7k45j56K88J95l19o2J98n1j79K72J18
$$ y = [107, -1, 292, -30, 260, -217, 143, -44, 33, -180, -226, -57, 162, 88, 123, 116, -176, -3, 193, 84, -37, -235, 77, 50, -55, -294, 322, 280, -102, 177, 269, 118, -342, 38, 31, 162, -83, -6, 196, -141, 131, -165, -161, 88, -299, 40, 48, 154, -107, 69, -204, 157, -272, 21, 17, 8, 236, -53, -50, -59, -177, -25, 10, -101, 24, -62, -6, 132, -562, -113, 185, -136, 75, -118, -50, 9, 101, 52, -108, -203, 124, 87, 321, -61, 132, 4, 353, -46, 26, -138, -103, 177, 9, -161, -214, -5, -276, 133, 4, 207, -119, -2, -106, -126, 3, 123, 21, -158, 87, -342, 125, 87, -7, -115, 63, 81, 93, -278, -160, -238, -184, 102, 174, -144, 118, -64, -32, 88, -118, -220, 176, 365, 118, 208, 10, 16, -78, 141, 171, -68, -195, 30, 32, -17, 334, 277, -271, -12, 45, -120, 260, 33, -58, -193, 65, -186, 17, -46, -2, 365, 133, 164, -167, 31, 189, 71, 120, 218, -167, -73, 426, 192, 165, -80, -236, 52, 247, -72, -134, 64, 13, -166, 106, 224]
3346B24l43K23k56K52j5K4l6p1J65l05R3j07K05j65J1K09j53j31J30L6j2J63j80
3369c9J16l1J01k52n7N7n6l27M55l7O9M3j27L10m07q1M22k02p3J9j73M23k83J70
3393D0r1Q3j91J96k64N6J82k45L62j27L7m0Q2k58o6q4J10L54j30j10J04j96K46
3416E0j77J97J8j55n7l7J00j2K23m50K92L7Q1L2l95J81k1r5L23j61j20Q8k4j98
3440b80M97j40R0k54L22n49J24K17K66k88n7J15r0p2J71q2k26L92m5J70m61nL0
3463a55K81n3m00L77k10K50O3k1k82m0J27j41J96J35k81K01J31k33n2R0L0j6L19
3486C16m93k0L03Jl02K3K04n4o0K21j23l0J08k36o2J95K30o4k11J71j77K16m1
3509A15k38p0J42J61j81M3J69k86M37l58J06k61L12J23j97j65j54M53k72k25L92
$$ y = [224, -119, 104, -152, 100, 85, 109, 73, 2, 167, -138, -45, -152, 53, -112, -101, 108, -45, -176, -46, -10, -22, 141, -39, 77, 46, 147, -105, -162, -105, -161, -488, -33, -70, -1, 42, -85, 225, -182, -263, 159, -43, -116, -97, -270, 153, -130, 40, -51, 32, -159, 37, -227, -171, 11, -234, 128, 1, 38, -2, 80, -178, -244, -328, -218, 136, 6, -104, 0, -196, 50, -127, 70, 88, -67, -124, -161, -61, -73, 150, -300, -8, 29, 110, 142, -253, -72, -93, -188, 135, -26, -146, -58, -82, -280, 217, 77, 167, -87, 235, -314, -190, 27, 293, 5, -52, 63, -27, -99, 72, -10, -236, 156, 111, 281, -180, -185, -155, 126, 73, -327, 50, -160, 90, 153, 132, -150, -190, -63, -204, -8, 127, -154, 47, 178, -55, -107, -17, 13, -3, 316, -177, -197, 106, 107, -195, -172, 32, -22, -82, 139, 16, -14, 94, -142, -204, -9, 221, 157, -54, 117, -60, 156, 115, -123, -193, -51, 110, -71, -28, 141, -145, 292, -66, 40, -221, 91, 214, 17, -148, -302, 151, -121, -346, 46]
3530D6l24J96L5J39j15L1M5p3l1J03K20l09j71J74P2k95J64K32j59Q9n7K16j64
3553F4k61O3J18K45k56l44M31lk03K13K16m95M59k26k43L38k07J05nj51P7R3L0
3576E8p8j58M25l24q6J99l69J59J13o4J63j17J58J04J3j68k01K18J75k75j53K84
3598G6j21K9j24J30m38N56J0p9J24q5M1j25L1P9n1j83L81j52L04l08l3k33R5j52
3622b28L37k70K19Q0l1J42n8j46j44J01l9M7j91k32O63l68K10o3k36N2j81K53
3644h3mm7L67j92M7P7j61j90P4L55j48j81L43j07k22J73l5q3l14N48J96m82k2
3667i1q1P4J78J26k72K94j80q0O9n1l32L89q6l0p8J63n7L0KO2PJ34l14K34k00
3692i0J09j21J12L15m18M8j54J77k60M91l1L1j13N5k86J56k06L9L3P0M7J00p8
$$ y = [46, -278, -82, -47, 92, -23, 8, 53, -20, -51, 52, 272, -37, -208, -34, 38, -257, -93, 139, -20, 69, 12, 228, 64, -197, -134, -16, 229, -27, -371, 60, 57, -146, 67, 283, -212, 247, 21, -222, 116, -91, 14, 9, -142, -65, 28, 58, -20, -178, 247, -77, -163, 36, -333, -174, -61, -125, 38, -79, 79, 183, 196, 28, -173, 45, 220, -55, -208, 76, -45, -16, -140, -10, -448, 108, 118, 39, 163, 78, 119, -6, 25, 104, 53, -130, 251, 99, 403, 95, 62, -171, -76, -228, 109, -161, 58, 138, 107, 249, 191, 45, -99, 2, -37, 10, -181, -413, 250, -118, 92, 29, -207, -155, -336, -83, -87, -134, 233, 41, 88, 165, 4, -186, -112, 243, 95, -86, 257, 150, -72, 101, 66, -17, -331, 217, 413, -69, -91, -172, -98, 80, 206, -66, 228, 48, -32, 37, -14, -346, 43, -43, -73, -151, 12, -45, -15, -13, 49, 56, 190, -124, 110, -90, 19, -102, 10, 325, -93, -45, -199, -22, -282, 209, 178, 209, 96, 151, -135, 21, -185, -146, -113, -43, 4, 104, 26]
3715B6m5L61o10J57%L28l08N17k01n4k73J65j92jJ28K59o02K92j8k98N07n30N53
3738A61l30n7Q8J02K65j55k09L88k61j25n9J4j65K82j33J63K18K50n27O3L3k36
3760b30M08n10j28L54m7K08j3p1L17l23K05O9m64L04M77n53l47L13R6j53LP4j80
3783a91K25k68K53j04k2P5j86N6K52j16J4K79J50m20J1o1J59k08K04j33L5J66
3805A70m25K47j16j19n7K43j0J16n2P6n7M5j88j60L32n2P5kk06L21q8k09L85l02
3829c3p3L15k80L34Q6m37j7M4P3j39j03J35M8j75N5O3n6j0J63k65L8K14J95k18
3853d3j2J29M9j50k0j87L84j73Om3K4o1K94j44K51j53p4K59l24l12K74j27J02
3876e1n4r8K4K16K4j15j71L11K76m91M46k38k03J52Qo3q7O2j88n4J15J95J01l97
$$ y = [26, -19, 342, -268, -111, -111, 217, -91, 426, 225, 171, -102, 63, -129, -130, -2, 257, -345, -53, -71, -369, 138, -392, 161, -169, -226, -138, -36, 229, 74, -135, 253, -8, -133, -192, -178, -343, -61, -194, -31, 187, 437, -90, -27, 6, -230, 178, -332, -460, -106, -153, 55, 42, -29, 288, -35, 170, 239, -225, 79, 556, 3, -344, -31, 65, -88, -85, -11, -191, 34, -234, 19, -85, -107, -32, -218, -162, 90, -26, -12, 267, 417, -3, 8, -53, 106, -102, 102, -31, 4, 170, -255, -8, -124, -243, -300, -57, -67, 49, -3, 73, 16, 61, -127, -287, 45, -7, 68, 66, -140, 181, 93, -116, 269, -33, -106, 209, -71, 263, 349, -88, -105, -61, 12, -127, -230, -95, -47, -222, -167, -104, -160, -170, -7, -272, -234, -20, 175, -43, -55, 74, 123, -27, -47, -234, 150, -23, -17, -60, -36, -97, 197, 53, 304, 151, 77, 336, 12, -300, -26, -153, -51, -105, -203, -179, 37, 61, -54, -225, 86, 362, -129, 317, 79, -124, 28, 36, -27, -114, -52, -240, -294, -179, 16, 117, -280]
3900b80J87J56j5J72l02k8Q7j24k1J84K12k39J14j47m4J32j86N63l52n5K4j8j60
3923a40m5K34k59J26j17J3r3L64k46K66P1L6k09J69l69M19l14l18L56N1L63l91
3945c3J17P1k07j27j00K85J03j76J29l27L16J8l98K50j3L19l77K9K68k47K46n01
3967c55K36j03L12J24l64K55mn6J31l75L9L26j27m11L27j03J50R4j7O5j94n7P3
3990c4P4r0j93J62K74j53q7P8J85k27ln9N6Q8q7J37j05j1J6N4k61J73Q6j51l40
4015d18J69M85k41j08l6J3p3K48j21K81k72r0K61n0J3%k20q4K73n9J84q9m6l13
4039b93L12n2M0r5J39j95PQ9K97m33J88k5m9J20J15j33K7K50l56k6L10J25o52
4062b90L40J40j30L4j97j67M4J50L7k03K73N3p8Lj62Q2K6n4K1J35n8r3J16q1O2
$$ y = [-280, -93, 63, 48, 220, -82, -110, -23, -147, -168, 16, 228, -11, 103, -44, -88, 44, -142, 421, 69, 14, 38, 20, -140, -185, 49, -210, -84, -201, -188, -281, 83, -163, 103, 174, 210, 1, 170, -199, 220, -94, -412, -56, -5, 358, -33, 84, 155, -52, -179, -279, 6, 109, -67, 62, -265, 51, 69, -329, -79, -92, 227, -150, -121, 147, -100, 146, -355, -119, -222, 90, 214, -150, 105, 101, 45, 176, -199, -160, 166, 39, -372, -45, -148, 2, 96, 79, 144, -50, -107, -34, 40, -50, -243, -81, 193, 40, -47, 31, 216, -11, -14, -73, -17, 71, -16, 121, 16, 5, 21, 75, -186, -13, 73, -78, -418, -249, 236, -5, -113, -149, -136, -209, 39, -82, 199, -73, -163, 98, 48, 61, 61, -159, -243, 30, -29, 155, 66, 20, -293, 19, -33, 7, -88, 51, -144, -137, -48, 249, -184, 4, -21, -70, 50, 165, 32, 59, 309, -47, -73, 237, 362, -290, 50, 190, 60, 94, -103, -270, -226, -76, -39, -242, 31, 84, 6, 9, -153, -71, -45, -99, -78, 57, -1, -94, 22, -59, 3]
4087Cjm8Q4J07j63p4M5l2j00K94J36l70M0j51M43q9j8K3l72L96j58r6P8l3J59
4112A03NL0P8l42l3L83p6j21k01M74m94M1K3J2J29n5M4J03K4O6m44J31J89o4j03
4137i8J79N6J40k72j28l4L39k70k46M66l79J37J61L0M0k13jj09K59Q3k28j67O55
4160D00n36K06J79n1j36J49l64K87r2j91J15J28l28k1M68K8J1l50J39n2K43l78
4182a46L43l81K81pj78J92n07J36K80lk80K58r1J01j38K31j43j06K22K5J31n19
4204b99K90j59O5J87K12l33R6r3o6L8L9L0K3K51n93K93K08Q3r3n24L29j04J20
4227@Q2k9k54K62j42j76M28mK65m90K25J8j13Q5K23n75J10L29m9k94j11J89M20
4250C99o42K97j74K90l67J29j35J89j1K99q7m17K95j16j59M89k84J15j54J2r9
$$ y = [3, 2, -46, 38, 145, -18, -92, -47, -79, -179, 115, 251, -119, -79, -230, 213, 124, 106, 129, -243, 153, -5, -101, -23, -56, 103, 108, 138, 216, -126, -159, 224, 148, 27, -174, 300, -194, -153, -130, -118, 11, -44, 0, 103, 127, 193, -251, -120, 69, 5, -98, 81, 137, 277, 5, -123, -157, 182, -88, -334, 132, -247, -110, 51, 81, 121, -92, -93, -202, 57, 140, -88, -255, 400, -136, 70, 249, 198, 62, 211, -153, 134, 42, -149, -34, 94, -234, -255, 213, 241, 252, -98, 41, -11, 232, -146, 197, -184, 97, 90, -88, 104, -403, -267, 13, 10, -270, -12, -103, -2, -140, 91, -52, -158, 64, 89, 220, -299, -9, -168, -103, 84, 296, -37, 59, -34, -100, -62, -23, 7, 30, 281, -312, -19, 189, 272, 179, -345, -16, -120, 0, 82, 53, -201, 61, -81, -257, 171, 167, 432, -58, 167, 185, 72, 157, 380, -195, -85, 244, 195, -99, -210, -21, 399, -243, 54, -120, 170, -197, -68, -203, -14, -25, 274, 187, -230, 65, -51, -210, 279, -5, 110, -44, -32, -131]
4271a31J40J99q0j03p6Q1l63O43j74n9O1j62q5K07j28m9J07J02m5k32k4J84m8
4294c5K08O4k26p5j0j78K75K68l82L5N8m2R6m4J57J11o06M60r8J9n1O5j24l51
4318d06N73k9j52P0J33j04J15l39J92j28J15J33k73P8j98K37k41J24l1lJ37j65
4340a62J08J5P6J93k09k19L00R1j22p8K71l72r2L21R4k21K04k88J8J14Q7J22l33
4363h2K08m27M29k00k1k07RK46Q5J28l27L7K39r5RO1j70P4K04j2l6j38M0k26j8
4388a90Q6J29J97j17o0J10k29K80J70k83j89j67M61J29l27R4j41J30r4J33j9J79
4410B82l21L16l35L9l9K21m48L02J02o2j46J08O8Q5l22J16j13p1o4M55j50jO5
4433H7k03L67m4j80P3j17l43M68j6Om55L80j13j07K75J61l97N16m77qJ97o3J23
$$ y = [-131, 9, 208, 128, 25, -51, 30, -333, 310, 136, 77, 138, -24, -109, 98, -30, -79, 28, 130, 85, -147, -171, 13, -35, 173, 237, 11, -64, -74, -252, 23, 291, -91, -56, 2, -40, 56, 12, 169, 280, -326, 134, 36, 55, 4, 69, -55, -406, 167, 138, -14, 56, 189, 85, 200, -139, 53, -75, 40, 173, -100, -22, -220, 17, -224, -100, -131, -134, 3, -162, -54, -39, 37, 230, 21, -198, 102, 193, 71, -7, 264, -108, -200, 121, 215, -6, 198, -90, -72, 42, 129, 251, -82, 126, -301, 128, -72, -93, -300, -291, -45, 40, 168, -159, -122, 117, 22, 31, 92, -78, -4, 200, 188, 152, 14, 54, -172, -190, -104, 25, 222, 105, 45, 155, -74, 206, 376, 93, -96, -263, 198, 327, 0, 94, -47, 83, -11, 122, 103, 282, -39, 277, -58, -19, -58, 163, -285, 17, 119, 57, -89, 19, 87, 172, -150, -34, -147, -218, -282, 173, 23, 22, 87, -116, 251, 207, 27, 100, -17, -360, 108, 92, 98, -357, 23, -90, -197, 78, 239, -158, 358, -119, -127, 70, 7, 130]
4456A30k02K09j50m0J09R5l51J11J95l2L5k49J62k05J05K4k6N5K7K93l43PK35
4479A94k64j4J42p8oQ4K74k36j25J74l09K04P7l71K42o8R0J26n2j78j12L35l03
4502a74L96k28J76j85L7Qm9M6J2J19K29l91J63l38L86%j59J64l26K5j80M22j94
4525d1r0q8r5J82L02l21j47L39m8o2k1J21j12J27n2N4J90j78J61o4j63K93j48
4548A39Q9m20M7J90j24J83j75J60j67j44L12J09l55J53L9q3K08j21l7j05J49J10
4570A57q8o2j09l5K90j87j42L4j91L97j42M46k19k69L60l12j62K17N56o23L19
4591B35l18n4j03K51J23K4k15j43K05J60l91J76J11kO8l04J52J76P9k92K40j82
4613dK88j8k66K02k15J79j88K11n02J06K08J62k9k07J34k94J37J30k94J42N9J90
$$ y = [130, -72, 137, -13, -53, 56, 151, -200, -89, 106, 74, 109, -140, 22, -183, -78, -54, -80, -25, 2, 295, -48, -41, 194, -70, -84, 58, -20, -26, 58, 332, 96, -29, 145, -164, 40, 117, -254, -12, -80, 10, 136, 84, -94, -206, 129, -174, 222, -6, 170, -15, 22, 30, -19, 27, 39, 158, 387, -4, 159, -179, 207, 207, 48, 212, -114, -89, -269, 153, -41, -131, -219, -314, -132, 170, -151, -298, 41, -7, -69, -90, 31, -81, 46, -6, 48, 238, 60, 221, 157, -6, 287, 139, 228, -192, -145, 45, -79, 104, -71, 89, -78, -222, 90, 199, -156, -3, 36, -47, 161, 40, 3, -102, 47, 157, 69, 7, -102, -137, 153, -34, -176, -142, -333, 64, -78, 368, 149, -120, 240, -72, -234, -17, 539, -84, 235, -83, -137, -240, 11, 134, 158, -57, -200, 5, 165, -226, -50, 61, 59, 127, -177, -25, 151, 230, -62, 178, -4, 284, 266, 0, 202, -13, 166, -22, 189, -313, -207, 1, 163, 134, -73, 61, -233, -96, 34, -260, -118, -59, 131]
4635A31j50m9p0J60j33R4o4J28m9j99J54P5j1j63L03J3r7l14M57j92l9K1M0O3
4659A09m06K93K8j33P9l2N1Ql6n4K83j40j49k36k9M69j69L44j36O3k25J2k71P64
4683D87o14J94K37l01O0j80N3J22j07K32j43J81l24J58r5M4J95m35L17J69n59
4704c09K37L76r9j43j02N8K9m2q2J03j5l42L05J0J05n8J81l15K53J46j91R8j62
4727D1O6k54L20j42J11p6K39l29k60K95J33N0j34j97MK62j00K9J0K14p7k98J25
4750C2K07l88j36N10j89l8p6K48j34n3K4k03K07k53M15k98jn2L61l99L41m3l13
4773b31K34J21j54k6J94M8j68q1M9r9Q6j57K35j92J23j47R7R0J72k43K00j16q4
4796d9q1L57j64M5M3l5j04k89Q6N7Q0M0o1K81k88J7J11P5m18O31k48k2ok05L70
$$ y = [131, -19, -68, -138, 22, -111, -17, -81, 47, -2, -201, -47, 28, 17, -146, 157, 170, 73, -241, 216, 24, -15, 6, 46, 109, -297, -4, 24, -109, -30, -62, -11, -3, -39, -93, 190, 50, -99, -335, -364, 105, -64, 280, 144, 207, -18, -6, -277, 487, -127, 67, 304, 3, 63, -117, -64, 58, -49, 183, 40, 221, -103, 55, -40, 4, 199, -236, 81, 250, -309, -72, 304, 205, 62, -40, 18, 47, 5, -77, 26, 11, -331, -26, -16, 89, 31, 212, -103, 150, 296, 105, 203, 41, 107, -147, 173, 31, 142, 66, 305, -24, -284, 11, 144, 194, 60, -137, -133, 129, 29, 58, 68, 282, 205, -93, 32, 239, -149, -285, 225, 36, -2, -78, 170, 36, -17, 7, -196, 11, -242, 173, -125, -126, -178, 183, -216, 125, 82, -231, 3, 124, -30, -56, 138, 186, 18, -63, -14, -113, -27, -184, 51, -141, -18, -165, -68, 22, 194, -49, 151, 35, -49, -130, 227, 63, 108, 151, 116, 12, -277, -191, -134, -54, -14, -75, 206, -82, -65, 46, 121, -297, 334, 86, 64, 58, -147, 223]
4821B23k94N5J39l62L07k9n7k32P4j06Q2j10L58K3k16L68m94N21j50j25M9k56
4843b32J05K12N8J97k61j83J24j54Q2J80q7j05L75m60q4O8K5p3P7L17l40K72K3
4866A36j43l55J82J01P8o4J64Ll95K85l4j28O1J01l0N9j20O6JJ12p7q3J31P0k53
4891a32M7L49k4l83L61n3k02Q7K40l20k15P4L10P2j77m67M40Q4j79J29j29P4j90
4914b04o2J38J64q4O7M12l98Q9n2m0J57k34J89j20p3rJ70r4l7J64j84k29K83k00
4938a87K13j89nJ4pm63O57M1J66j32l0p1q1k04J76K52j19p6L9J71l8J06k89k7
4962h3N32n88j63K65J72l21L8M3N6P9j3N9r7J14k56K21K2m1q8k41K72K1L4m5M2
4987C4k34K65q1j18J98J2J10l73M14m07O54n11J37M6k78J25j90J28m6R7O3K48
$$ y = [223, -71, -16, 123, -239, 68, 39, -18, -250, -176, -282, -200, -310, 48, 71, -145, 223, -271, 250, 100, -25, 24, -232, -127, 85, 143, 340, 79, -104, 20, -134, -52, 128, 41, -64, 311, -149, -233, -165, -140, -213, -136, 181, -159, 113, 136, -7, -362, -180, -79, -1, -65, 99, 102, -293, -8, -42, -170, -109, -8, -38, 21, -99, -33, -32, 80, 3, -80, 51, 121, -132, -85, 264, 240, -143, 218, 165, -37, 50, 290, -30, -245, -171, 139, 211, 34, -433, 7, 91, -88, 41, -88, -14, -204, -266, -128, 36, -48, 19, 431, 33, 122, 70, 30, 187, -47, 142, 22, -51, -60, 110, 16, -21, 143, -41, -270, 13, -187, 26, -163, -168, -154, -161, -624, 33, 74, 240, 108, 78, 7, -74, -278, -102, 150, 31, -45, -6, 165, 127, 233, -56, -83, 449, -139, -302, -37, 135, -186, -148, -105, -49, 30, 17, 76, -21, 93, -163, 58, 80, 39, -49, -290, -18, 3, 37, -8, 34, -200, 65, -16, -134, 64, 76, 186, -187, 227, -180, 474, -37, 100, 146, -132, -7, -197, -69, -115, -18, 45, 293]
5009B93m44J0J6j55J64J7J28K26m34J83l6K05k95K46m8k7j39L45k25m40K31J93
5031A4J30k00NLL42k46j60P7N6k9kL4L7J2N5k34L30m74L59J32l65J96o9Q0k55
5056a72K95k52J75j16K54pj47j85M28j81l71L12Jj92O9L02j65j7M1M4R9j64J68
5079B19j97j49J98l0q9oj17M32K9m03J24k96M6K39M2j60K53k58J92j20M6k12J2
5102b05N1K0J03O6k03K14m0K44n3P6l31J40k58J84L2J0K03O7k90l98M01J03j64
5125b8k56K91j25K44k49J74l29L17K0j4j64J10m7J18P8l7j11p3O5K01j5k63J81
5148H8j17q5L75k81K33m6l9j72R4Q2K1K70m81No2l5L68K8k60k39O67m64l20L15
5172e5P5k01O48m81j50M23l1k03kj89J83j59J6k52L59m2M14o26K58Rn9j88M60
$$ y = [293, -151, -141, -125, -280, -116, -99, 29, 255, -179, 4, -32, 173, -122, 124, 76, 49, -90, 255, 30, -410, -179, 14, 144, -56, -51, -48, 294, 48, -112, -35, 21, -8, -10, 24, 61, 73, 128, -106, 224, -250, 109, 241, -124, 72, 3, 83, -172, 123, -129, 46, -70, 184, 177, 30, -155, 273, 92, -279, 33, 34, -158, -89, 213, 48, 31, 72, 116, 215, 51, 219, 22, -127, 71, 41, -48, -54, -171, 261, 290, -113, 11, -285, -239, 0, 42, -118, 135, -123, 69, -51, -5, -217, -205, -154, -134, -31, 35, -168, 46, 6, 250, 197, 273, -58, 82, -176, 8, 40, 50, 253, 320, 30, -368, 33, 136, -28, -284, 7, -118, 126, -123, 51, -278, 39, 59, 45, -119, -9, -56, 62, 140, 103, -8, -81, -16, 185, 170, -93, 88, -29, -114, 261, -20, 213, 167, 128, -44, 50, 132, 153, 423, -58, -53, -115, -150, 218, 246, -14, -253, 414, -50, -370, -55, 20, -181, 467, -14, -164, 259, 228, 25, 23, -166, 17, -142, -126, -378, -19, -61, 353, -273, -15, -6, -65, -253, 207]
5195B07j49k79K91j94M80k76l06K38R1J67k45k82M01m9r6J24m2k6k63P0Q0NO5
5218A2P8m3J50k49K99k3k69K18l69O1R9N9p9l9J73p0N2K71m41J61j86L80p3n3
5242A19r0m47M40K81m81K57j36J37j37K08M49q51M40l75L18k30QM4q8L69n1k59
5264g5oJ83m0j55O4l85M24%P6l0o2n5L82j40j83J72j96qq0K55J11j42kJ29k54
5289a7l08K87J89j43J53k57m3L2K49p5k77J99K04k15R5O1k27L03j79J05K24l83
5311b3q1J50m2N2l69L11k32n6L16j0j0k9N3k93M17j27k22J11J97L6l50J26q7L62
5335B00l99J44K1L5j49j41M90l58L51l58k1J04K31J28k99j35K32r6J67l97L03
5356E3J20k53K05k57K24j41j35M95j89l00J98J46L5l88L13K6j34j71K05K48n85
$$ y = [207, 58, -221, 70, -124, 356, 80, -226, 12, 103, 270, 25, -257, 144, 95, -1, 123, 81, 55, -208, -138, -58, -53, 12, 90, 47, 197, -52, 247, 224, -45, 173, -196, -135, -36, 23, -56, -95, 78, 8, 60, 331, -110, 51, -135, 245, 172, 119, 29, -418, 22, 303, -178, 79, -57, 80, -57, 151, 600, -251, 189, -186, 132, -98, -90, -46, -134, 235, 184, -75, -81, 102, 62, -93, -29, -414, 10, 10, 86, 56, -6, -61, 321, 181, -2, 170, -26, -34, -114, 141, 252, 110, 108, 237, -17, -325, -38, 151, 8, 161, -96, -139, -107, 142, 67, -210, -11, 193, -22, 73, 134, -93, 210, 31, 136, 360, -23, -104, 46, 4, 56, -313, -2, -234, -290, 26, 16, 6, -23, 30, -263, 154, 27, -195, -84, 113, 149, -201, -75, -162, 200, -199, -55, -34, 1, -148, -289, 201, -157, 194, -164, -185, -81, 150, 278, -21, -156, 76, -20, 147, -250, 53, 173, -80, 125, -132, 92, -49, -184, 311, 122, -178, 20, 166, 201, -187, 126, 152, 18, -153, 52, 300, -285]
5377b85K00K10k92R0l8J89k08j28L35k42K12l01m1k3N13j79J79k30l2K16m16N03
5399B32j9l72O4J41j35K2L5R0j2K7j54L22j38p5J49j41O7K95l69k1j4K42j58K8
5423A06r6j55J33L59n00K37J94k38N3k71M9K25J21k19m0j12J55O7o3R3q7j13L94
5446B92L1l42K16l81J44K39r0j29j34j29J72J97l12K11j06j76J89J64Lk05ML77
5468B35l71j68J72O8R1J02N1m4n06K70p2n8k30K03J84j29K88J11K8k57N20m74
5490A4j36M16k28k39p7J2K70k81J17M11j30k05l4O9N9oN7j31J59m3k52J61j06
5513a23K10k53J25q2j42O35m73J84n7k54M52m05J4J07K52l34p6L61k09J86n5o6
5535cJ12j05p0m4j2L34k71p6p9J80J35k56L63l34J89K40m19K18l6J12m31J45j01
$$ y = [-285, -85, 125, -167, -77, -115, 74, -134, -262, 73, -169, 43, -258, -299, -322, 191, 12, 191, -39, -71, 145, -271, 232, 213, -159, -95, 46, -89, -67, -32, 58, 46, 73, -81, 241, 103, 28, 177, 36, 103, 398, 29, 8, -6, 236, 78, 106, 10, -145, -12, 347, -153, 84, 278, 40, 93, -178, -129, 96, 217, -2, -42, -154, 1, 68, 5, 98, 11, -102, 292, 323, -19, 197, -184, -40, 199, 109, -20, -154, -283, -111, 86, -226, -15, -121, -297, -108, 56, 59, -146, -142, 235, -136, -304, -132, -64, 27, 129, 180, 136, -370, -100, -172, -230, -460, -257, -73, -202, 86, 197, 225, -32, 488, 14, -122, 294, 66, -173, -250, -238, 32, -249, -132, 279, 149, -56, -90, -21, 38, 32, 89, -42, 117, 74, -178, -17, -123, 87, -166, -41, -123, -265, 370, -103, 81, 24, -230, 222, -183, -169, -62, 190, -144, -220, 141, -68, 118, 63, -3, 109, 4, -66, -110, -122, 212, -59, -135, -214, -34, 101, -155, 208, -126, 63, 303, -116, 102, 66, 178, -253, -108, -209]
5558b09J94j88L33l53Q32o00j41J61j05L91l76L34k68j03J27k6k13L21l23K44
5578C2l3j81K95J25m03J88j27J75M8l60L38m58L15J01k03j3L04n16L73J28k65
5599a37J42J64o43M13N0J74o0K33j80Pr8n4Q3J23j82k48J92R0Q3j54j9j84K66
5622F1k44O8n4J62o8K58q9l18J73rj14L71k59O4r1oJ94q4Kj6j35p1K05j86O2J06
5648a8o8J99q0Q8k70K11p9N2j9J57j19N0j19MR9k81K56j07J31m51Q3R1M86l06
5672a0K18k31J18k63K82q3Q0m8k88K64j43K59l35L29j4K5k25j04K72o1l4O9k97
5695b20K54K3k13J41P6j29M7O8P0m1N6m14K35j19NL92j33j8m47L35P1J87j30j9
5719G7q8J39j15M5l2o6k9J94o0k7j69PrK27l57L32j4R4L2j29J38J4j52n8L9J80
$$ y = [-209, -15, -203, 130, -223, 609, 9, -132, 29, -76, 315, -61, 273, 5, -98, 29, 3, -210, 111, -212, 32, -1, -182, 113, 238, -165, 23, -104, 71, 119, -241, 97, -361, -46, 55, -148, -161, 143, -373, 0, 128, -137, 5, 169, -474, -61, -11, 163, 103, 336, 156, 163, 65, 11, 94, 217, 35, -213, -21, 69, 152, -2, -21, -205, 61, -183, -115, -169, -7, -75, 183, 94, -224, -51, -60, -174, 197, -62, 2, -89, -95, 99, 15, 17, 1, -134, -205, 0, -186, -124, -18, -86, 113, 33, 121, -149, 62, -17, 35, 16, 173, 54, 104, -15, -11, 88, -193, 63, -44, 87, -364, -281, -190, 296, -10, 208, -23, 95, -168, 114, 31, 111, 63, -225, 39, -104, 155, -180, 149, 135, 160, -65, -169, 103, 42, 8, 77, -220, 34, 57, -156, -15, 61, -68, -21, 47, 117, 76, 132, -282, -47, -166, -161, 231, 98, 80, -367, -32, 39, 226, 96, 77, -11, 128, 13, 58, 26, -40, -69, 125, 65, 38, -131, -124, -133, 94, -263, 69, 55, 149, 181, 52, 190, 204, 52, -6, 33, 213]
5745B13j75j28Q6M2J92j57j38L25k04j61K43k15J39j57n3L81j42k10K04P8j03
5766F0M3l19j3J16m6M50n94J75K16k32K9j09L08r3N26l93k89K85q3j13j53J18
5788a11K17Q1k52k97L75k90M31l32K94j8j89o5R1J86k23L07j21N4J27m08l5p6
5810b54J32M36m25J58R7L0k58K89l54L28k77OP7J62q0q1j35J85K60j92Q0k7r4
5833F3J04k30j17L0J33J51j38k69J07M99l76j7J7n7r0K16J7k42k5L30k02J04Q1
5856H9k45K49J01l73K04Rj90Q3k19J35L86k72K08k62Q3k18K37j85L22k10k06M7
5878b27KQ7J78J95l15J59M5R7j51j2l14L60R0n6j61k3j17J39k85M01P4l57J12
5901g9O0m3j08J62M2L31k32j0l09J53J9Q3k80K01K08n12M47j34L9J49j00K69l62
$$ y = [213, 38, -90, -4, 38, 230, 73, -65, 260, 56, -105, 138, -77, 62, -95, -148, 233, 91, -119, 85, 163, 60, 103, -216, -229, -113, -159, 291, -303, -128, 88, -144, -115, -224, 84, -9, 517, 124, -165, 120, 37, -76, -229, -111, 106, 187, -65, -362, 13, -277, 154, -178, 116, 98, -91, -156, -65, 121, -102, 205, 84, 138, 265, -143, -178, -254, -122, 314, -111, 47, 144, 174, -84, 205, -149, 179, -98, -92, -15, 147, 67, -14, -149, 36, 296, 104, 184, 157, 63, 167, -63, -180, -150, -17, 134, -4, -273, -166, 333, -43, -60, -43, -100, -190, 26, 43, -199, -224, 106, -96, 8, 89, -156, 93, 194, -179, 25, 34, -156, -73, -292, -157, 229, -43, 165, -97, -14, -232, 5, -180, 142, -68, -274, -227, -225, -138, 40, 235, -80, 79, 124, 221, 70, 58, -256, 104, 194, 138, -23, -46, -163, -24, -309, 92, 166, -191, -79, -19, -62, -170, -8, 34, 365, 133, 123, -186, -33, -14, 69, -211, -10, 198, -314, 133, -1, 38, 187, 87, 356, -6]
5924fk51M43n48N28l02J39j74J71J10J22k35M0R0k66K07k40J86R0o9k07K69l46
5946b49K03M6O5m1L12k13j83j96L67M2J13L8k92K14Om60N75m56J11J85p3RN3m78
5970c02K92J66j52j75J13M8J04L7n8o5k03J26J99l01NK61Mk26K11J2j45L37j61
5993A27K0k16K82k85M56n06J69J46m9l40M80l03k92K71K75k70L04n90N08l53O4
6014a02J25L7O3k13j22j28N53m78K06J64k08J98l07J6M06P9l99k5K16m8J77l22
6036a12J19P7m02L83k92J69K45j37k28K72P1m7j48O1k57L4j81J54K42j06j59L6
6058b06Q3J43J39j95j20J41M7N0k17J71j8j03q4R1K7K25o4M8j97J4J55k10k1J35
6082C4M6j62N6J10J3j82kJ40j42l13M12K29k57R6J60l19k7K24l94L03K8L11o23
$$ y = [-6, -257, 186, -362, 166, -136, 3, -171, 0, 110, 232, -3, 37, 127, -139, 68, -172, 14, 104, 35, -172, 97, -249, -46, 0, 65, 24, 336, 123, -60, -256, 111, 153, 266, 304, 12, 226, 232, -228, 347, -109, 2, 187, 114, 123, 176, -302, -10, 156, 4, -171, -58, -10, 94, 131, 73, 8, -195, -69, 130, -171, -166, 95, 99, -127, 84, 96, -49, 288, 127, 147, -69, 213, -72, 384, -122, 47, 193, 144, -196, 284, -19, -311, -40, 235, -35, 269, -321, 187, -166, -102, 23, 60, 123, -90, -212, -340, 213, -265, -59, 105, -103, 95, -212, -196, 210, 289, -110, -135, 81, 33, 210, -112, 7, 84, -318, 65, -227, -58, 187, 50, -178, 94, 165, 118, -30, 31, -226, -192, -373, -219, 23, -83, -242, -206, -123, 20, 159, -36, -156, -15, 32, 82, -135, 36, 18, -85, -169, -78, -51, 174, 110, 158, -39, -25, 130, -80, -101, 34, 80, -82, -26, 84, 97, -85, -87, 53, -89, -402, 10, 239, -18, 78, 238, -81, -108, 116, -278, 25, 53, 364, -259]
6105b59J17K61j94P9j52J65j8kl8R5j42K24j28K69k56O2j75M7q0L58L4k88K46
6128B25k48L9J5L38l20J66k95J24J7r0J28j41M58k17j55l8rn3M3Q1k18J74k83
6151b59L41k1j1j99j59N70J09p71L11N3K87l80k5L93j76j27L03r1J67p02L51k6
6173f2J3l70L39j03K61J88m73n9M17N6m52J00k01L47L4k9q7j96Q9P7k02L58J06
6196A51k19K26k91j67O55l32J67r0k48P2N8j39K62J20k67L06k50J87q6l34J35
6217h4L4J6j01Rn5K92j73K69K3k95kK19o13L28K04j5p1j7J38j01O5K1jk71J28
6242e3K8N5j48J43qK82n61J70L85k73R8j9J0OMJ09l17M33m12J97j20k5P5K55o17
6267c03O36l50M37l27j66l2J16p0L17j02k78Nj04M68j92O9k8J3L54l13k5L8j32
$$ y = [-259, -142, 119, -75, 4, -148, 17, -1, -3, -41, 54, -88, 136, 8, 277, 21, 83, -92, -45, -125, 233, 267, -21, 225, -23, 16, 31, 369, 49, 215, -80, 44, 61, -29, 99, -42, 416, 199, 44, 6, -3, -56, -13, 68, -150, 24, -259, 82, 61, 50, -149, -308, 262, 371, -400, -89, -36, 251, -129, -154, 239, 63, -64, 239, 148, 315, -387, -36, -62, -49, -419, -80, -183, 78, 266, -207, -266, 151, 207, -245, -145, -346, 1, 35, 6, -81, -277, -188, -111, -313, 45, 151, -68, 158, -133, -300, 355, 23, 190, 100, -148, -76, -18, -157, 105, 225, -42, 264, 14, 201, 115, -219, -84, -50, -34, -135, -126, -181, 111, -62, 207, 230, -65, -67, 152, -461, -133, 71, 56, -15, -32, 106, 5, 70, 91, 90, -181, -53, -25, 30, -118, 25, 17, 299, -262, -92, 293, 20, 118, 99, 109, 115, 119, 228, -89, 344, -68, 129, 9, -16, 59, 314, -303, 333, -17, 420, 93, -73, -105, 11, -59, 258, 156, -122, -117, -221, 247, 55, 124, 96, 109, 463, 150, 125, 163, 31]
6290C1K15j60q2J22J3k72M16k85J62p4k24J6K75l01L95R0l99N2R4j57M31q2k76
6313@k12J42Q3m0J32m43Q5M08p3o0J3J01k7j11k68M47j38n9P1k81L89l6k18j4
6337a09OM2J59j43R9m0J49k06J06J99m80J95K11J0k16m8O6k32J82M53k8l23J72
6360B24m13j14J41k14M46o0j49M09l79l1K73L0k53L54j17m38K01J05p5j47O7P8
6382f2M0l1k7K82k17qj72R7L53m32J77J53j97k19K41j96J22K09l43K90M5l15q0
6405b90M16k7l00N23j15j05q2j07m9J12N1J44j46j14J92j23M0l5j21J51lk45J14
6428a19L9J53J10m72K90o6K36o3j98J4J52Pq1l8R6J30O0k94j14K09N9J3Q1l25
6452a21J78j25K31k90P0J19M1n0o0r9J01m0J03K18l86j77J16K71k72L71j19m10
$$ y = [31, 246, 86, 4, 126, 139, -133, 283, -2, 160, 86, -138, -122, 153, -148, 247, 337, -62, -10, 84, -73, 358, 276, 0, -212, -70, 13, -27, 105, -338, -253, 155, 82, 22, 35, 136, 109, -2, -270, 177, 39, -20, 51, -230, 159, 123, -95, -109, -103, -61, 98, -45, 54, 14, 163, -43, 63, 262, -218, -23, 188, 198, -18, -66, 0, -232, -50, 403, 375, 52, 224, -189, -303, -162, -376, 70, 10, -139, 270, -109, -140, 133, 163, -90, 264, 147, -291, -90, 15, -60, -207, -140, -62, -22, -53, -80, 202, -15, -23, -195, -98, 255, -177, 0, 153, -44, -263, -22, -218, -96, 113, -230, 60, 105, -210, -290, 126, 99, -201, 322, 207, 102, 20, -87, -136, -24, 27, 171, 25, -89, 103, -20, 20, -15, -136, 15, 12, -233, -119, -80, 73, 183, -289, 1, -65, 171, 108, -90, -76, 76, 83, 2, -36, 60, 190, 250, -44, -158, 51, 110, 123, 204, -121, 57, -68, 163, -127, -57, 62, 103, 53, -7, -106, -5, -45, 58, 276, -110, -287, -171, 100, -172, 199, 80, -330]
6474c30M26NJ01n52L81j57K18k9P2j36j4J62K81l71R8q3J22j30J88l35K10J5J57
6497B99k96L0j07l6n5Q6n3J63R1l16L10M7K52n01O4j78M5K5j08L40p7J60k5N4
6521B14Rm93L28k31J79R8Q5k30R5p3j47m2M47j40j5Ok68J32l1k3l4J72l6M6j97
6546a49N20n27J61k9n6j74N19k53j99K17j65K10k01K35K2q0k24L04j54k85L22
6567A4M7k02j16K38L04k77J24k02K09k42Q3O1N1J23Pl82R0L32k9J6n77M56K21
6590C49j64k60M7k03n3K81k39L12j94J7L69k0l72R8j21L90l32N0M7l2Op8J7J84
6614I9r4j0q8r4K49n4p9j04M1OJ88l68N46k45J20m37M51n7J15k79P0j70l5J40
6638h9K35k01k66L68k6r5J73l3l67Q9%J43j37K06J55j11k4l34L58q7J48O5n29
$$ y = [-330, 96, 101, 202, -350, 31, -126, 92, 63, 135, -1, -15, 147, 428, 57, 155, 72, 194, 64, 252, -83, 127, 142, 299, 3, 33, -74, -110, -165, -79, -132, 31, 122, -194, 116, 163, 415, -86, -22, -200, -155, -130, -238, 102, 25, 185, 160, 214, 223, -270, 58, -173, 6, 104, 189, -41, 54, -19, -166, -208, 239, 99, 84, 90, -178, -46, -77, -100, -134, 38, 2, 48, -149, 371, -156, 5, -24, -80, -254, 265, 12, -187, 30, -135, 75, -126, 109, 131, 51, -173, 131, -23, -308, 14, 61, -141, -257, -19, 285, 8, 132, -70, 139, -103, -20, 41, 92, 215, 222, -160, -70, 262, 233, 249, -328, 128, 349, 185, -75, -28, -231, -284, -3, -242, 70, -124, -107, 262, 242, -130, -32, -153, 237, -95, -45, 2, -30, -24, -102, -85, 99, 5, -5, -93, -187, 62, 8, -71, -175, -134, -128, 60, -308, 238, -7, 113, -324, 127, 70, 185, -94, -24, -194, -229, -89, 146, -55, -321, 47, 21, -74, 99, 66, -301, -212, -212, -69, -206, 0, 155, 44, 20, -314, 44, -43, 105, 170, -359]
6661c59L28r9P1P5J88j10k62Q8K26J01l05J32O3j42K26k40r8J87M7J39k02j12
6683e8R7nOr4M09k42j03l5R5j88J43J00k14m2RK76k46J09o4N9j29J24K22k58j39
6708a68k14K02K92k58J10J76l21J83m1j90K97j21K1l6R1J97m18L40k20n1L77k73
6730b5J97j84k47J33J10J96j70j54J77P6M3l18K38J87N7j82j91J31j57n6K57q6
6752C2JJ18j02O5m00O8l4K03l1l3k14J23J34q5J01j63M56p7k3j33j51K13L9j60
6776e3J14m3k45N6J84N8k20p6O1K13m6j64J33r8j59R0N15m3k71j63J08J22l26
6799b53L96j44M4l22L25r2o1r0J99k26K73J02k45P9K9M5Kj22J83j99M7J95Onj66
6824@k9J47J45l24P6j00J7L41k34j61O9O1K00l53J65m1r9K13j69J55j51J04Q0
$$ y = [-359, -31, -130, -59, 16, 204, 94, -168, -80, 146, 247, -58, 74, 137, -5, 221, -19, -117, 70, 117, 256, 54, -58, 39, 34, 40, -54, 355, 113, 10, -25, 70, -118, 25, 125, -89, -131, -122, 154, -92, 17, -47, 12, -117, 7, 229, -29, -168, -382, -180, 112, -146, -36, 140, -181, 2, -39, -229, 68, -53, -32, -68, 23, 220, -198, 142, -78, -129, 248, -25, 172, -12, -259, -126, -16, 180, 10, -144, 33, 109, 152, -166, 72, 259, 316, 134, -57, 74, -83, -139, 118, 32, 33, 151, 49, 114, -286, -218, -252, -49, -80, -113, -327, -204, -70, -155, -54, -217, 239, 162, 139, 6, -145, 68, 107, -53, 61, 18, -227, -171, 13, 71, -149, -225, -164, 49, 3, -161, -28, -126, -285, -195, 320, 277, 6, -157, -49, 73, -253, 143, -1, 43, -279, 46, -46, -107, -197, 2, -224, 49, 151, -94, -15, 14, 59, 61, -61, 122, -77, -30, 165, 171, 166, 0, -29, 118, 263, -61, 15, -85, -68, 273, 39, -122, -53, 8, 208, -145, 20, -21, -120, 93, -76, 79, -72, 32, 112]
6847A12l65K26p6kl5P3J24mN7L9j50J1k84J24o2N48m93R6O9Q1Q3m16K50j39K42
6872A09J78l79K29j19J7n7K68R3k09j74M7j22M37k90j03L11j76j56j49J80M8J68
6894A51l10K43k3K23j97J18k35jJ00m15M33n8k12J7L61k53R3j24K52J17k97J96
6916A79j5R3k22M7J11k37O0o1K39r8j23R2j88K4j13R9K97Q9m94J15m4k16L57J96
6940A87l67L10l34L16k27J60J73j61j35j47K75r8M2K89k31J92m07K25Kj62J78
6961H0J84j69R4k49J43Q0k77J28j37J58n6j27n0J14N2p9J85Q7l15L54k04J71m54
6984b87L98j29q9N7J12l7J71n24K78q2qJ51n3R8j43L47k16o8o9M2L49j99Nj07
7008cJ03j27L13l79k4m5J83J69k21O2OL3p5n0j49K78N0O8k71j71J57J56m5qo1
$$ y = [112, -253, -27, -103, -105, -140, -67, 57, 53, 110, 149, -1, 10, -274, -150, -212, 336, -157, -61, 8, 89, 172, -244, 6, -133, 109, 287, -92, 137, 18, 35, -22, 246, 339, 130, -44, 3, -119, 318, 28, -75, 236, 60, -96, -245, -65, -17, 151, -159, 84, 61, 284, 87, 205, -30, -31, 69, -346, 87, 29, -183, -166, 195, -58, 35, -89, 163, 280, -17, 179, 164, 257, 35, 82, 193, -44, 16, -45, 194, 96, -27, 65, -123, -99, -212, -113, 184, 273, -221, -106, -150, -366, -9, 187, -180, 130, -204, 112, -115, 45, 218, 57, -78, -225, 50, -48, -6, 283, 52, 244, -163, 62, 64, -98, 80, 264, 95, 189, -60, 83, 163, -114, 14, -123, 35, -21, -148, -198, -84, -32, -111, 74, 161, -154, 200, -4, 167, -287, 111, -18, -107, -50, 62, 25, 196, -328, -50, -132, -140, 11, -42, 56, -87, 260, 44, -24, -93, -51, 298, 99, 104, -3, 100, -27, 286, -93, -117, -162, 21, 190, -31, 31, 37, 70, -5, -55, -204, 74, 124, 192, -79, -250, -93, 63, 18, 10, -51]
7033e1K54k9j56M8k35R0p2K37l10L7J24L3j97K81j74J04L2k09K03j06m0K43o7
7056D0j72J74o7k8l6K3J1j19M05l04o7k02L1K15k71k5L23J38mK92j88j67j14L6
7080g6Mn0r6L31j09J24N2k32J46l8J65l50J33K95j24l70J32J43j15Q8J29j38J91
7103B35r9L4n37O79n68J53K64r9j50M15m07M7K47n7j13j00O1j61r5M39k81L7j04
7126a60J91p2LJ39j29j05o9r1L45J77k20p6J5N13m87N1k3j48M29k55k5L6O5m53
7150c49L11K39j92J96k76J70j87L50k26j6J08j12J54j87Qj51J72P8k98L20J5j72
7172d5R4j00r3l3J36j04J88P6l48K60k27J12n7J56k21K25l0p5J25Q1m0J33l81
7195a68M39l89K85j0N7P3m12J91n6j00k9J89k97N54n97L37o7k99K67q9L1O2P9
$$ y = [-51, 203, 174, 18, 66, -169, -79, -151, 86, -224, -187, -63, -30, -227, 54, -120, -16, 16, -193, 10, -96, -136, 107, 40, -132, 42, -25, -53, -89, -66, -55, -174, 231, -73, -140, -342, -311, -96, -367, -392, -69, 69, 65, 357, 169, 2, -112, -76, -72, -122, -218, 113, 4, 128, 180, -52, 94, 56, 221, -129, 4, 299, 175, -195, -63, 80, -35, 53, 182, 44, 235, 136, 170, -367, 312, -256, -103, 161, 62, -88, 327, -80, -33, 214, 157, 44, -56, 5, -156, -251, 188, -93, -56, -160, 31, -41, -38, 101, -28, -133, -202, -293, 52, 229, 9, -67, -52, 461, -26, 25, 2, -146, 283, 28, 3, 39, 104, -349, -38, 201, 9, 205, -71, 99, -88, 262, 36, 20, 128, 16, 170, -17, -9, -160, 12, 90, -208, 112, 127, -45, 49, -51, -144, -177, -41, -145, 43, 119, -229, 31, -196, -84, -141, 15, -206, 19, -11, -86, 39, 120, 80, 213, -168, 271, -118, 167, 157, 214, 287, -125, 66, 10, -90, -119, 70, -227, 327, -270, 67, 0, -299, -32, -121, -90, -28, 51]
7218E1j78J9l0j43K74J15O6k54K80k00K44m37K82J7k06K34j35J21Rj94L52l19
7240c2K1j26K43l01J96K31k34r7J2M4M8J92l17L03j67M14k50Pk50J8K01l9m7j53
7264h3P5j86M19j58k6j69M0L55l52K29L3j3r3k97L81l40J36M6N9k4k14M42j00
7287A60k31m5Q5j61M85k18l66J18L01j10J13J28k75J85m02J06J12K18l22J98j3
7308F6J85l86M3R6l3n4P2R1J61j95j06J5q5L48l76K42j59J18K83k49L9m19M36
7331A33J79k78n7L12l48k01J49J33k87J46J99k52M70l42L26j14l22K32K31m29
7351a20K1L28k01n8J60j50K2m7J71l64L58j16l45O29k37J48m44L08j03Q5N2k41
7373a44K94J59l17l1J00p6j74K9N4M54k45k27J73q9n4r1J43P4Q1n6j77j30J78
$$ y = [51, -127, -108, -138, -281, -7, 108, 174, -80, 200, 0, 244, -193, 89, 106, -100, 134, -1, 120, 129, -65, 287, -32, -11, -137, 106, -195, 1, 232, -2, -99, -87, -43, 5, 197, -120, 183, 16, 430, 180, 187, -63, -45, 156, 117, 70, -83, -8, -194, 225, 67, 41, -128, -88, 267, -85, 144, 177, 164, 71, -226, 155, -185, -49, -3, 56, 32, -182, 260, 160, -71, -116, -31, -192, 293, 75, -291, -173, 128, 18, 131, 259, -16, 169, -233, -127, -15, 203, -119, 79, 66, 251, -135, -92, 4, -29, -83, -11, 80, 241, 46, -60, -45, -130, 218, -158, 84, -75, 43, 326, 77, 116, -303, 133, 312, 34, -23, 289, -59, -260, -111, 22, -265, -119, 80, -172, 298, -44, 282, 168, -154, 78, 309, -120, -99, 229, 28, -30, 130, -20, 2, -45, 126, -238, 120, 4, -341, 288, 51, 199, -245, 63, -40, 45, 97, -144, 150, 309, -8, -39, 61, -15, -189, -160, -106, 348, 103, -124, 49, -40, -94, -185, -42, 32, 113, 57, -120, -250, -72]
7396g2M83k55k45MK7j33J70k01K00on5J75j81L6p3K8J14k44L02k03J45J1j21K52
7420A58k00J72M9n9k08j53K93o1K33k53J72k53P4PJ34J41l27K91k34J51j28j2
7442a3Q5M3o0l0J49qj12o3l7j3J31n31L07jJ31j42k1N7O0k46K41J12J54n5j58
7467b0M8P2l05K68K27j65J77k95M8m1J2j71J98j82K61J53k03l4j70J16K39m6q8
7490I9J3J60j62l7p7P0J74k83P9n03P65k72k03K15L3k5m0M5j32l9J97k28J12j29
7514a68L47j75k03K67j7J68j49J76n60N31j06K46j32m27L22l56L97k82k2J39l5
7535c9J57l29Q5QK51J8j42k9M4o6n1LL5k04M17j62JK36j39m41L17J73l29L39j73
7560b0K71l00mJ49k17J34j32J11m0P0J1r5Q4J08m6l56J29L74l43L24j22R6l48
$$ y = [-72, 411, 156, -89, -85, -58, -191, -21, -222, -22, -28, -83, 92, -89, -53, -126, -98, 16, -228, 74, -129, 16, 27, -94, 158, -42, 130, 179, 120, -88, -241, 52, -9, 224, -29, 143, -110, -36, -29, 105, 246, -81, 210, -24, 127, -1, -13, 72, 115, 55, 25, 174, 166, 54, -9, -46, -59, 72, -459, -152, -153, -22, -164, -185, -128, -68, -314, -73, 39, 193, 138, -20, 28, 100, -205, 63, 290, 125, 302, 7, 55, 14, 26, -145, 53, -129, 132, 285, 82, 48, -122, -6, 233, 187, 99, 112, 272, 110, 73, -4, 66, 240, -43, 36, -467, 298, 26, -177, 38, 71, 46, 6, 51, -81, -120, 77, -151, -39, -168, 179, 4, -199, 68, 51, 219, 70, 246, -314, 217, 111, 357, 225, -202, 120, -236, 161, -121, -143, -4, -39, 118, -211, -126, -118, 133, 151, 9, -20, 24, -42, -93, -90, -55, -259, 158, -4, -3, 233, 94, -347, -30, 143, -186, 153, -20, 251, -49, -53, 96, -121, 13, -119, -8, -48, 22, 33, -62, 22, 130, 84, -272, -143, 231, -112, 212, 90, 186, -162]
7583a62J59m79M67K32j58P1j05K53k48k3p9K7j8J69J7l06K81J81m48J90j58O4
7605g3l7M49k28q8q8m5L28J41k27l08K07j79J58J88l94j24K65j11k1j16M37j40
7627fj9k40L24N5j45J60j69o9J43k42K05m2Q9l75N50k19j2J59K90n38L79j31j75
7650b8L6kj45L40k3l62K37j05J76J35m18J85j44r6QL08j08MR5O5k89n5K86k58
7674a58K21l66J57N0K50k78K76m40M59l17J59m6j35K82p9N7j94J06K5k07J74K07
7696B03n73K86L70k00J1J8P1J5k81L29j57j26l3j46K07J05Jm3R0Pj55M6J19j50
7720A4J0j18Q0j55N2J98k57L10j73N3J11J59P9k96J6l16N26l06m1r1K36m24K31
7743a02P6R2Qj50M20l23O2O7j42J6J11j07l58K43j9n9k15K25K56j19j96K15n6
$$ y = [-162, -3, -482, -15, 217, 59, 130, 25, 278, 30, 7, -72, -45, -63, 106, 123, -183, 98, 279, -169, 21, -137, -73, -110, 339, 111, 23, -65, -110, 218, 359, 132, -176, 31, -148, 10, 198, -196, -320, -55, -166, -187, -303, 134, -6, -25, -265, 59, 114, -31, 129, -40, -109, 34, -208, -3, -45, 44, -331, 219, 0, -12, 147, 437, -101, 278, 147, -28, 8, 6, -139, 201, 178, -184, 53, -52, 124, 259, -159, 26, -118, -214, -206, 102, -6, -2, 93, 158, -131, -186, 100, -158, 63, -303, -146, -96, 154, -124, 152, -288, 171, -146, 13, -33, -168, 114, 35, 92, -102, 4, 29, -178, -4, 203, -370, -84, 286, 86, 97, 115, 186, 201, -80, 249, 92, -34, -67, -213, -6, 99, 100, 57, 147, 154, -1, 45, 164, 14, 24, -94, -14, -169, -117, 81, -176, 134, -39, 14, 125, 284, 363, 67, 83, -233, 293, -13, -54, -145, 91, -333, -102, -26, 66, 74, -76, 344, 21, 83, 150, 8, 24, 135, 28, -330, -87, -106, -165, -380, -155, 101, -18, -214, 1, -55]
7766e5j04K17k56j9L71L8k63L02l82J87r1n1J32j65K18j35J78k34K06k07M3J20
7788E0k61M11j2m66L23n2J08k43j09J70Ql9j88J32K61k34K52o10Q43k85l71J15
7810a97M34q3l43L39k17qj44L83j76Q2J1K50m43oK54k72J81R5J34j93n9J60j65
7833A7k45L62l78O8J33J32j32K57n7j08R0KL03n16Qj9J32k03K18J82j25k62j27
7856b68L86k89J8J26k85K76P6j67L88k53K08l36j80M51j01l07L70j91o6k3k0R1
7878i6o5J79L80j0k89m22P6L24J1k53p9K96J12j72k22J60j07pJ63K14k92PJ60
7901F8PJ66m03q0R5Q1J46k66K52pJ31l93L67qj70o6J04k28O88l90j67J71l1L8
7925A05Mk08J78OJ9j45J04M7j44J64j59M8l23N08l29J52p9K33k28J82j96J45j54
$$ y = [-55, -159, 58, -198, -217, 154, 192, -71, 231, -151, 36, -55, -106, 26, -139, 79, -56, 122, -112, 94, -113, -70, 50, -211, 200, 188, -278, 45, -7, 101, -142, -251, -81, -73, -112, -300, -168, 93, -141, 111, -499, 344, 59, -312, -197, 237, 154, -189, 150, -67, -75, -219, 164, -12, 70, 81, 331, -112, -118, 136, -136, 45, 140, 274, 81, 22, 182, 17, -228, 134, -244, -176, -43, 89, -43, 214, 157, 49, 139, 141, 444, -72, -64, -83, 49, -154, 64, 246, 121, -141, -268, 118, -171, -153, -27, -312, -36, 40, -127, 261, 8, 216, -120, -300, 151, 50, -257, 113, -78, -144, -167, -187, -96, -161, 18, 398, 388, 99, -323, -247, 77, 88, -165, -244, 52, 164, -8, -230, -70, -177, -184, -21, 193, -99, -92, 68, 75, 241, -162, -242, -147, -66, 80, -186, 66, 59, 190, -203, 164, 156, -14, -80, 24, -204, 484, 94, -73, 98, 67, 105, 109, -99, 79, 85, 104, -41, 63, 110, -34, 130, -29, 19, -304, 204, -125, 27, -52, 181, -47, 135, -61, 84, -70]
7948g0L53j90j43n4J21j27k5Q2J71j46L64k97r5qM1J89j32K12n45M63l25J61K46
7971B46k46q4K19j99k0pN2k08Q8L31j74J68k62N1k7N5J08k61K96O0q8J55k80J12
7995H5j32l23M37l5R8j37O2j46R2o0O3k17K50K93k62p3J10j68K80k18p2J3J65
8018A05l6o7K02k93O2J8J80m08R3j60K80JJ00j02J88j48k01N9J64J51m18L26k85
8041a89J78K38k64J28j16l2J25j04j38JK96k66j5J42j05k11M34q5k99L18O1P5
8063A72k91K28J82n21L15j95L6K53k53J1j99K81P5Q9J49k26k03J00l53L20J54
8084A24l17N20k82Q0m06L14j00L83m90K69J27m42n9K62R7l1m8p5J58J51k69J11
8106G7J9j72j23L00Rj11N6k4P2j4J72n91Q2J77L38k88O8l7L1%O4j4l10M24k24
$$ y = [-70, 283, 93, -50, -104, 17, -110, -135, -53, 118, -28, 336, 39, -56, -64, -23, 166, 34, 246, -299, 164, -161, 0, 246, 0, -84, 135, -64, -84, -91, -39, -247, -159, 172, -2, 166, -96, -45, -72, -17, 91, -170, 126, 186, 98, 253, -27, 85, -47, -370, 67, 32, 130, -7, 55, -91, 1, -59, 4, -213, 37, 330, 68, -5, 105, -63, 217, -1, -73, -60, 105, 69, 2, 204, -89, -27, -9, 171, -237, -144, -304, -24, -23, 77, -25, 163, 15, -186, -127, 37, 188, -230, 96, -189, -11, 227, -37, 91, -25, -57, 68, -36, -174, -173, 123, -143, -158, -16, -121, -332, 102, 17, -282, 36, 97, 172, -119, 109, 291, -230, 85, -110, -74, 179, -74, -63, -262, 19, 94, 183, 332, 106, -97, 3, -350, -30, 124, -193, 327, 45, 125, -281, 33, -67, 316, -174, 95, 222, -220, -279, -17, 80, 49, 1, -74, 84, 235, -34, 77, 96, -76, -199, 101, 110, -1, 55, 31, 103, 89, 261, -330, -248, -71, 267, -21, 47, 10, 41, 41, 105, 91, -219, 205, -19]
8131a9Q1O3j58J74j06j12l08N67k27j54K47j04J97M9l34j78K77o2K26n28P86l18
8153E9lm3mj74QP5r2J27N4P5L08p52M28j17Kk9J3J31j53L03r7p4n3j85K39m17
8179c71J85j26J3J62K19N8k54Kj01J5J8J56
$$ y = [-19, 62, 125, -33, 141, 35, -77, -385, 182, -45, -199, 48, -56, 141, 190, -144, -322, -45, -107, 119, -409, 377, 59, 56, 13, 9, -165, -157, -82, -174, -47, 7, 82, 390, -362, 66, -51, -49, -78, -65, 66, -87, 216, 119, 45, -8, -193, 46, -371, -186, -312, -299, -137, 82, 140, -114, -112, -213, -198, -180, -24]
8191b4
$$ Imaginary data points
##PAGE= N=2
##DATA TABLE= (X++(I..I)), XYDATA
0@%%%%QqQj6J6k4L2l2M0n6P2q8J04j20J36j60J92k24K63l07L48l99M59n23N91
29C12o67P55q48R51j065J188j325J476j639J818k017K234k473K738l031L357l722
46a958M134m600N135n754O479p344Q397r712J1407j3689J6941k1976L0886n1230
60c2884J78302J9394l58697R0452R5418N9602R6273r9872k49566Q9815K21978
71A10215L3998j16837j30129m0160J60241J39691o5215j79901o9156J29797J70200
82A42744l0777j57935q7905O1652J55424O4298j37584j37596K5375J35294J13261
93A46251o7058j99493j8620J70813Q5806m1938j08912j10319Q3972J89012k1085
104A08429j47672n5924J5058J10634J26261j08743j93856M6268J56158M5566m5588
$$ y = [0, 0, 0, 0, 0, 8, 0, 8, -8, 8, -16, 16, -16, 24, -32, 40, -48, 56, -64, 72, -88, 104, -120, 143, -164, 184, -215, 244, -279, 312, -355, 400, -448, 503, -562, 626, -699, 777, -862, 956, -1061, 1173, -1300, 1438, -1593, 1764, -1958, 2176, -2424, 2711, -3043, 3436, -3908, 4489, -5223, 6184, -7505, 9436, -12540, 18346, -32884, 145418, 164812, -193885, -103433, -8015, 51587, 147860, 47988, -201578, -111763, 110215, 144213, 27376, -102753, -142913, 17328, 157019, 91804, -88097, -157253, -27456, 142744, 111967, -45968, -133873, -72221, 83203, 147501, 9917, -127679, -102304, 32990, 146251, 79193, -120300, -138920, 31893, 117699, 75761, -33151, -143470, -59498, 129514, 108429, -39243, -95167, -80109, 30525, 156786, 48043, -145813, -99545, 56613, 102179, 56591]
115E6591j09999p3251J02103J39024j9001j30368q7028O3025J46934K4682j18491
126e779r3013J5680J13169R8722p8602j55680M397J26041P1290l1425j05443o9468
138a10111P2122J24046J6018j13156j08162N2387J45594K2548r8661p6436o972
149h0783Q6795J08254n1610j46354j2491J00203P4160r79r7566r2271O5244J30874
161H3476Q276j01366q0434K5687J05890N3660o5422r8674j8725R2512R4383m0253
173E9010j15389l1565O9504Q6321J5346r6963q7873N5171J09968J6979p1911p8981
185g0383j510R3774O9589n0942r9216k5763P8459R0670k1285j03687m2726N8632
197b4388Q0301J9708p3658q5079K5228J02311L7645o4399q0152n323P7639O8170
$$ y = [56591, -53408, -126659, -24556, 114468, 95467, -34901, -121929, -58904, 88030, 112712, -5779, -98792, -83112, 30057, 128779, 50177, -105503, -101106, 24935, 96225, 64800, -40643, -110111, -37989, 86057, 102075, -11081, -119243, -66856, 78738, 101286, 2625, -73811, -80783, 6012, 114266, 62656, -83698, -96189, 4014, 78174, 77195, -20371, -112642, -47398, 83476, 91752, -9614, -90048, -64361, 41529, 95189, 29767, -68907, -87632, 4880, 99263, 59010, -56379, -87944, -18440, 67881, 83227, -13736, -101609, -46438, 63530, 80509, 8598, -70383, -71893, 21881, 91470, 40528, -58688, -84451, -5992, 84678, 63393, -40294, -83020, -24388, 55913, 75621, 1963, -83116, -57888, 44423, 82068, 17669, -62483, -67806, 9833, 78003]
209G8003k9064r3241l7726O9954Q3448j2750q1616m7688L2375Q0645L5097o7974
221I463q3093J7903Q5619M2276m3674p7760k0497O9548P0885k0825q2782l8867
233g1804N1130P5106O622o7509o0380K2129Q0714L5064n7353p2161K635P0800
245A4993N1402l1632p4894k3662N4729O6036l559p3571m7819M1930P1111J2454
257E7518n4483o0055Q895P3929M0326m6772o6788o366N7523N3928j7387o9692
269b9424l1442M5527O4259L047o3258m8407K8713O4511K1831m4647o0634J449
281d8475O5742M1725l4603o1224j5322M7178N6048q893o3733l4377L6071N9117
293C9254J1453n3799m9287J8017N9173K7234l5636n7951o958N7650M3547k5075
$$ y = [78003, 48939, -44302, -82028, -12074, 71374, 58624, -22992, -70680, -38305, 42340, 77437, 9463, -73630, -55727, 29892, 72168, 28494, -49266, -69763, -215, 70670, 49845, -32937, -71804, -20674, 54432, 61054, -6455, -66835, -44706, 36008, 71072, 13719, -58442, -55807, 14993, 66395, 34763, -40131, -63793, -9064, 56972, 53413, -20158, -67977, -26047, 45064, 57518, 3035, -57020, -48125, 25804, 66130, 19358, -47430, -53796, 3727, 57655, 40268, -29424, -60866, -15339, 48920, 51967, -11291, -59698, -30985, 33526, 55357, 10710, -49924, -48475, 17267, 58992, 24389, -36835, -52157, -4979, 51069, 42176, -21557, -55934, -19863, 39254, 50707, -3092, -52379, -34362, 24811, 52045, 16409, -41542, -48500, 9150, 52697, 27622]
305B7622n5173k2052L8127N5697q75n8013l6003K7786N2933J7912m2359n1810
317d6208R085N5787K9097k8782n1884j3521M6992M6619j5824n2731k4599L0715
329a5254N1032P032m8358m0429J8640N1574K1275l5598m8068N69M7253L4774k0262
342B4180n1714j6763M0859M3025o977m5415l0234K2827N1016J0770m2966l7833
354c9225J0824M4455K6719k6998m8775m779M3154L3850j3746m4382k2631L1291
366a0243M4994n71m2776l0265J6830M4655J7227l4430m0552M684M2017K7061k0712
379A7919m3429j1718L5749L7383q735m2087k3018K4471M1258O671l6518l3900
391c5954J1912M2528J8280k7410l8347k808L7243L1013j6131m1713j3446K9311
$$ y = [27622, -27551, -49603, -11476, 44221, 43346, -14667, -50670, -22884, 30049, 47961, 5602, -46208, -37123, 18664, 47761, 18979, -32905, -46426, 566, 47185, 31361, -21370, -45969, -15254, 35778, 42810, -5548, -45977, -27337, 24237, 45512, 9914, -38154, -37585, 9668, 44442, 24180, -27534, -44297, -3438, 39587, 32610, -12805, -43039, -20212, 30804, 41574, -1392, -39225, -28401, 16054, 42773, 15775, -33000, -37779, 5375, 39225, 25479, -18903, -41534, -10243, 34751, 34180, -8596, -38861, -22031, 22624, 39851, 5421, -35131, -30447, 11570, 38631, 17919, -25510, -37228, -1479, 35904, 27169, -14918, -37936, -13465, 27793, 34464, -2054, -35954, -24042, 18486, 36766, 9356, -28991, -31799, 5444, 36457, 20326, -21387, -34833, -5522]
403e522L5831j775l7565k6724J8694M0362R998l1485l3145O001L7792K2296k1267
416A3491l8450o589L3391L0299j0751l6558j7956K2604L6957L186l5009k6673
428c2058J3671L5958J4439k5336l4561J461L4602K3599j6238l5359j0615K8338
440b099L0575n162l3447k1308J8364L6089O007l0830k5960P674L2038J9098k0951
453A0088l5057j442L1612K2459j0346l1600j5895K3537L2320j549l1383k0800
465b8056J2713L2545J1178k5396k8896M301K9895K0481j6378l2516n951K6205
477A25K4877n286l0396j8160K0031L0182K349k5833k3567P441L2333J3725k2658
490E163k6909N00K5149K2450j0610l2838r272K4208K3982k112k5946k0160J4042
$$ y = [-5522, 30309, 28534, -9031, -35755, -17061, 23301, 33299, 1814, -31331, -25330, 12462, 34758, 13491, -24959, -31548, 1843, 32142, 21391, -15167, -33123, -10519, 26438, 29624, -5385, -32058, -18387, 17571, 32010, 6674, -27887, -26426, 8176, 31775, 15537, -19822, -30437, -2099, 28476, 23314, -10133, -31441, -13077, 23012, 29019, -1811, -27771, -20097, 11941, 31039, 10088, -24969, -26411, 5201, 27660, 17314, -14286, -30181, -6644, 25676, 24127, -7256, -28056, -15343, 17202, 28380, 2984, -25912, -21611, 8284, 28765, 12387, -20129, -26080, 125, 25002, 19716, -10680, -28840, -8809, 21373, 23722, -2111, -25678, -18237, 14096, 27821, 5163, -21746, -21246, 3903, 26353, 15743, -17095, -26367, -2159, 21823, 19711, -6235, -26395, -12353]
503a2353L0909N815k4255k3292M734K8282J5629j6928k6900l966K3537K3074p791
516A6495k9195j1601J8609K4198K616k4105k1850J0639K9192P934j9296k3237
528a9601K09K5068J8502j2856k6768o528K0126K3003l772k6640j4504J5922K3746
541A5907M567k0393k2041O141K7003J1393j6626k3435j482K1590J9076p969k5633
554a1902j0503J8547K2758j346k3229j5085J0246K2664R386j8588k3256L927K4784
567H403J2181j2307k1745o237J8966K0840n246k4382j1391J4791K1565K309j9244
580a497j8024O376K2953J0885j5720k2111K95K1095J4761q807k1474p741J6153
593b856J9791q02k1722j4419J1714K1845L597j6277j7302J958K1209J3615j3899
$$ y = [-12353, 18556, 24371, 116, -23176, -18442, 9840, 25469, 8541, -18359, -22325, 1212, 24286, 16495, -12700, -24301, -5692, 18506, 21122, -2983, -24833, -14194, 14998, 22932, 3636, -19601, -19392, 5676, 24178, 11322, -15446, -21974, -1848, 21155, 17383, -9257, -23761, -7839, 15907, 20474, 81, -21960, -15819, 11184, 22577, 5951, -17484, -18966, 2624, 21700, 13731, -11902, -22405, -3858, 18900, 17554, -5675, -20760, -10514, 12150, 21536, 2948, -20308, -16381, 8403, 20584, 8277, -13468, -19705, -739, 20101, 14855, -9527, -20918, -6127, 15438, 17747, -1497, -19521, -13145, 9808, 20693, 4973, -17138, -16843, 4252, 19013, 10206, -11268, -19009, -2856, 16935, 16133, -5589, -20008, -8294, 13551, 17148, 871, -16431, -14473, 6736, 20351, 6452]
606F452k1243j433J7691J5514m611k0651j0565J3489K0222J538j9918j4488Q729
619i274J9113O520j2527j8794q96K1277J3084j1217j8481m300J3198J7612j368
632A3947k0586j1209J1458J8234M061j6192j6484N737J9064P834j0835j6840m098
645a5909J7631J5936q644j8566n233J1424J5985J808j7531j3779Q896J8336M853
658A5207j4217j4947K403J5936J0453o929j8190n929J7118J4985p172j4973p008
671a3263O825J7194M944j7936j3431Q037J4945O325r035j6617r65J6413J0665
684A4101o705j5221o803J2305J5737k903j5052q263N662J5537N950j4016j4511
697a4182N087J4605P387p524j5384k882J3977J1764l913j4878q452J1191J4877
$$ y = [6452, -14791, -16224, 1467, 16981, 12370, -8281, -18846, -5357, 14865, 16403, -3515, -18003, -9274, 9839, 16359, 3832, -14962, -15858, 5419, 18503, 7286, -11195, -15495, -2297, 15315, 13947, -6639, -17848, -6390, 11844, 15905, -287, -16771, -11034, 8030, 15864, 5029, -11811, -15909, 1722, 17658, 9014, -9552, -14785, -3361, 12624, 14432, -3099, -16878, -7982, 10354, 15207, 990, -13957, -11554, 4382, 14835, 7906, -10284, -16213, 905, 15890, 8718, -6255, -13263, -6438, 10756, 15700, -2236, -15667, -7630, 7315, 13640, 4605, -12012, -12977, 3436, 14101, 7396, -7825, -14628, -2323, 13414, 10511, -4541, -12804, -7142, 8395, 14345, 329, -14182, -9095, 5510, 12897, 5373, -10011, -12893, 1084, 12848, 8935, -5943, -14395, -3204, 11673]
710A1673j552j2561r052K249J5578Q734j4254j3428M212J1256Q190k978j5855
723g788o022J3929J1962l929j1635q720O622J4983J701j1579j0209K011J3569
736D895Q389r989j3766J269J0430R146k064j4767o483J1497J1265j016j1001r378
750a1573N529J3760K813r769r740k86J2168R858q614j2933rQ366R209K17j3411
765d415p899R450J2004p26q829r471K530J3166M933q709j0475n92J0992Q906n858
780E007j1845j998P230R918P50j2264q250Q035J0276J393p373r902R42J2553N800
795A0272p634r488j884R167R081l356j1351m165O720J0001J721j0567q651N820
809d314J0251K439o537r551p16J1122P010n916r870k416P955R035j724j0234n090
$$ y = [11673, 10121, -2440, -11492, -9243, 6335, 15069, 815, -12613, -8401, 2855, 11045, 8067, -7788, -13810, 119, 12081, 8152, -3483, -12203, -5581, 9402, 11103, -476, -10685, -8674, 4895, 13284, 3295, -10471, -9202, 1228, 10374, 8310, -6457, -12940, -1443, 9822, 8806, -2195, -11573, -6044, 7716, 10529, 760, -8980, -9266, 2902, 12760, 4146, -8787, -8796, -430, 8779, 8996, -4415, -12314, -2864, 9140, 8414, -415, -9886, -7356, 5810, 10743, 2034, -8441, -9033, 1959, 10865, 5007, -6838, -8836, -1606, 8312, 9062, -3202, -11452, -3417, 6859, 8252, 879, -9023, -8081, 4472, 10272, 2638, -6850, -8734, 433, 9514, 6158, -5193, -9358, -2638, 7363, 9084, -1483, -10134, -4314, 5937, 8376, 1839, -7712, -8428, 2694, 9704, 3788, -6082, -8498, -543, 8492, 6768, -3466, -8556]
824h556N214R481K626r450q319L831R464L848n147r607j952J0542P261n129q780
839d673l292O078R014p2r870n637M641R082K468p010q682K216Q943M776m508r436
855e962k135Q654P705l405q290m475N337Q935P86q515o234L207Q522L542o131
870A541q430P92P792N687l094r002l415P809P476j972p790m880M235Q606J759
885G114p721o700K477P781M451n172p871r10P399O339k754q243l506O142P185
900F011j20p487n401L128Q445K216o085o889R16P426M726l869p772j830O936O027
916F378j764p249m303M782P438O72o736n883K692P855K520m983o911j45O871N387
932F621l046p266k924N780O755q56p249m183L751O982J581n963n977J353P371
$$ y = [-8556, -3342, 6139, 8765, -685, -9004, -5173, 4291, 8139, 2992, -6615, -8567, 1975, 9236, 4107, -4673, -7965, -1887, 7127, 7055, -2815, -8452, -3811, 5271, 7739, 729, -7953, -5737, 3206, 7982, 3474, -5962, -8097, 557, 8262, 4857, -3433, -7908, -2571, 6364, 7150, -1365, -7599, -4392, 4130, 7672, 1541, -6889, -6097, 1695, 7382, 4288, -4714, -8129, -320, 7156, 5184, -2606, -7486, -3251, 5355, 7114, -607, -7307, -4830, 2951, 7402, 2230, -5641, -6551, 848, 7187, 4433, -3810, -7316, -1174, 6011, 5891, -1596, -6997, -3869, 4576, 6792, 707, -6182, -5266, 2160, 6886, 3017, -4755, -6585, 351, 6378, 4614, -2635, -6938, -2156, 5282, 5954, -782, -6665, -3973, 3882, 6402, 1419, -5492, -5637, 1234, 6621, 3575, -3691, -6615, -835, 5920, 5064, -2185, -6368, -2617, 4365, 5946, -17, -5994, -4641, 2730]
947B730L431l953o964q82O209N546k368o538l574M951O735j59o608m417K454O609
963C202K760m905o681J053O536M022l210o654j813N328N729j003o851l149L473
978b163O313J409o109n033J844O457L152m377o188Q6N355M614k224o175k676M992
994g23N882j013n725m113K937O353K098n350n244Q36O122L237l448n959q09N070
1010A51M687q99o276k648L421O172k00n034m593K221O073K159m558m900j66N556
1026A166L814k383n573k174M700N219r39n629l179K994N741R62m651m826J390
1041c368N524K846l569n087n73M652M247j897n460k524M155M748J64m574l993
1056d709K106N430J820m077m947M60N045L474k588n159p83L858M379q70n274k663
$$ y = [2730, 6161, 2208, -4756, -5638, 571, 6117, 3749, -2789, -6363, -1412, 5323, 5164, -1444, -5861, -3407, 3202, 5962, 1057, -5624, -4571, 1965, 5987, 2777, -3877, -5690, -362, 5367, 4364, -2487, -5636, -2163, 4150, 5559, -550, -5583, -3739, 2718, 5870, 1493, -4695, -4609, 746, 5360, 3136, -3039, -5715, -723, 5159, 4146, -1579, -5692, -2755, 3598, 5696, 346, -4898, -4062, 2060, 5297, 1849, -4110, -4919, 151, 4838, 3939, -2337, -4985, -1564, 4608, 4408, -626, -5219, -2998, 3075, 5234, 676, -4224, -4390, 1166, 4980, 2597, -2976, -5150, -450, 4769, 3830, -1799, -4978, -1984, 3757, 4719, 68, -4758, -3368, 2156, 5002, 1433, -3654, -4227, 425, 4672, 2775, -2685, -5209, -1054, 3694, 3858, -716, -4709, -2603, 2827, 4647, 570, -4377, -3917, 1128, 4602, 2014, -3145, -3928, -70, 4309, 3439, -1835, -4498]
1072d498K945N124N71m418m103J651M947K233l113n056j85M695L533j821n029
1087b524j661L401M353K56m679l465K246N019J325l916m101N48M598L021k797
1102A624m693p27L768M027j031m952k676L387M665L21m405l330J428M712J898
1117D016l198m298M58L685L369j858m785j401L485L810j31m358k802K338M442
1132B772R06l779l668P21M625K245k684l958p91L888L454j327m353j816K729M015
1148B979J92l939k850J892M136R62k734l672O1L952K783k103m022j325L485L627
1164C424p06m186j848K095L831O01l532l174J310L671J785k350l836j30L764K657
1180C376j540l733j413K518L612k8l742k300J513L720J101k705l411K98L969J802
$$ y = [-4498, -1553, 3571, 4142, -276, -4379, -2728, 2219, 4452, 1339, -3717, -3902, 793, 4326, 2505, -2524, -4185, -784, 3569, 3825, -854, -4319, -2073, 2946, 4271, 355, -3746, -3198, 1400, 4421, 1624, -3069, -3796, -28, 3999, 2968, -1984, -4660, -1273, 3392, 3713, -692, -4022, -2594, 2118, 4016, 818, -3480, -3022, 663, 4032, 2174, -2611, -4012, -527, 3283, 3152, -1206, -4008, -1670, 2772, 3678, -101, -3769, -3048, 1577, 3822, 1138, -2820, -3611, 277, 3731, 2404, -1949, -3765, -1036, 2979, 3171, -768, -3618, -1726, 2410, 3372, 638, -3034, -2973, 979, 3762, 1659, -2363, -3688, -203, 3424, 2718, -1468, -3316, -1221, 2610, 3211, -321, -3495, -2185, 1486, 3271, 921, -2915, -3045, 719, 3376, 1836, -1897, -3310, -792, 2820, 2792, -950, -3250, -1737, 1983, 3084, 379, -3032, -2734, 1235, 3037]
1196C037j684l453j056L090L180j138l679j308K013L298M33l130k670J076L723
1211A732J251k181l353j93L503K182r64m059q78K718K959m64l205k320J798L404
1227A930Q58k980k633Q65L005K081k045l228l24K902K434j309l032j542J773L514
1243B269n4k869k251J368L297J172k495k994K41L179J910j383l154r72K136K785
1259B185k30k897j981K120K637K40k055k559Q54L017J127j970k622k57K721J907
1275B237p41k745j369K440K665m50k731k158J666K827Q38k243k300j1K890J782
1291B597j698k603p17K108K350l55k806j346J617K498L80k417j920Q53K724Q02
1307B067j657k309m10K879J253n60k652q05K238J765L1k442j862J738J905P04
$$ y = [3037, 1353, -2100, -3156, -66, 3114, 1976, -1703, -3011, -998, 2300, 2733, -397, -3067, -1991, 1732, 2983, 802, -2551, -2744, 759, 2941, 1977, -2082, -2960, -242, 2717, 2253, -952, -3272, -1474, 1930, 2788, -192, -2825, -1960, 1045, 3126, 1081, -2147, -2471, 431, 2865, 1556, -1476, -3018, -1245, 2269, 2215, -654, -2905, -1537, 1760, 2932, 437, -2557, -2316, 863, 2773, 1390, -1764, -2736, -600, 2185, 1955, -942, -2923, -803, 1834, 2074, 19, -2540, -1686, 1331, 2458, 488, -2134, -2391, 330, 2237, 1496, -1249, -2618, -178, 2487, 2037, -694, -2852, -1186, 1641, 2479, 236, -2064, -2075, 815, 2597, 899, -1704, -2421, -313, 2037, 1682, -1124, -2470, -853, 1645, 2025, -392, -2312, -1459, 1265, 2067, 410, -1899, -2309, 570, 1823, 1263, -1389, -2194, 44, 1809, 1840, -602, -2464, -726, 1179, 1883]
1323A883j958k024O56K171J462j612k609K17J917J713l65k228j174J605K157p6
1339A735k577j176R12K131J281k541j419j69K101J981j320k499l90J784K159n46
1355A447k228j051J007J893P44j938j851P50K257R56j606k229K04J689J732l27
1371A449k572p25J614J828k14j829j443J121J843P30j684j994N03K110R50q47
1387H40k164j90J487J908r27j808q69J306J902K19j503k030P87K326K46j135j850
1404a455j9J987J388q69k170m68J326J635R9k138j202J007K025pj266j207J58
1421a176K015R23j465j197n18J689J387m60k362m58J328J506k8j751r01M45J810
1438G87Q03j421j351n39K362P83j090j777q4J288J632l04j734q20R60J773P3j259
$$ y = [1883, -75, -2099, -1443, 728, 2190, 578, -2031, -1814, 103, 1816, 1451, -777, -1951, -346, 1811, 1735, -842, -2018, -1106, 1025, 2306, -235, -1654, -1823, 278, 2259, 939, -1560, -1950, -166, 1993, 1447, -781, -1832, -825, 1068, 1812, -126, -1977, -1227, 1030, 1986, 380, -1849, -1645, 44, 1776, 1449, -1123, -1848, -234, 1594, 1380, -449, -1892, -771, 1072, 1802, 118, -1876, -1373, 737, 1687, 840, -1324, -1514, -27, 1881, 954, -854, -1723, -417, 1485, 1704, 201, -1829, -1042, 1284, 1530, 395, -1455, -1474, 513, 1901, 1032, -1138, -1606, -280, 1355, 1454, -684, -1886, -879, 1146, 1139, -127, -1334, -1176, 839, 1762, 297, -900, -1418, 271, 1658, 1198, -1164, -1622, -294, 1212, 1184, -567, -1468, -1023, 787, 1590, 169, -1182, -1721, 641, 1424, 334, -1443, -1527, -239, 1393, 1089, -645, -1465, -505, 1268, 1341, 82]
1456H2j687J006J588N45r75k082L74J809P42j017j479n01J194J723lj949p72M83
1474i19J553R95j655j389K70J656J164j293j817j66J659J337l56j499q54N97J672
1491I55M87j839r23O79J529P03j408j185k62J676Q74p42j325m39P83J394N9j242
1509b26j294P18J614M90j400j393O73J439J114j459j318o6R56J597n81j670l64
1526a170Q25J503q5j208j200R46J271M64j303r39N3J176Q34j093r20l30J294Q40
1544I58j14j318q92R56J224O6r93r18Q3J506Q10j126j327o9J323J115l98j588
1562g02m35R30J156K48j516j065P19J478j2n02j136k52J726M49m63j308k59J031
1580H7J214l20j494q31R51J279J12j352r19O83J025O78q75j206N7J210R06l41
$$ y = [82, -1605, -599, 989, 1534, 559, -1523, -1149, 660, 1402, 385, -1094, -1595, -401, 1322, 1319, -630, -1402, -919, 634, 1629, -26, -1415, -1145, 511, 1675, 382, -1435, -1601, 58, 1395, 1039, -460, -1314, -717, 955, 1442, -397, -1320, -641, 888, 1591, 183, -1002, -1264, 412, 1286, 544, -781, -1220, -437, 957, 1016, -226, -1520, -802, 812, 1302, -98, -1491, -818, 621, 1735, 276, -1042, -1108, -152, 1445, 864, -806, -1170, -345, 1158, 1073, -135, -1335, -389, 882, 1346, 43, -896, -843, 333, 1167, 74, -846, -1176, 118, 958, 844, -474, -1366, -410, 814, 880, -113, -1031, -948, 558, 1368, 242, -1085, -1154, 169, 1284, 886, -702, -1137, -207, 949, 1197, -319, -1384, -665, 813, 801, 299, -837, -1089, 637, 1086, 623, -685, -944, 87, 1301, 981, -513, -1344, -393, 886, 998, -354, -1273, -590, 435, 1113, 238, -968, -911, 299, 1205, 864]
1598H64j606m10R19J181N0j602m56N90J210J68p19r27lJ028O31o46r16j59Q02
1617aR62j13j548k27P95J072j13j098o26K83J196M22r68j068L62R12O34m06q49
1636c79n04N98J018nr15q93O79J190nq61q87L74R77O28n06j519M00Q33Q33m85
1656E71j131n36O98J356j69q57r73O72R96L02p29j066K03J000N09n32o36m67P54
1675c5P36Kj316k61Q43P66O8r71n08O5R21L13k98q57k75J060Q10m32j331j1L98
1696c13Q96J92j077p91O73R11L45o71r69L34P03M84n61q69j54J002N93j13q12
1715a97p59P20R07j54m42r99L96J351j72n14o69o0N13R13n34o91l55O12O51M99
1735A016j759o1P32O36O0o51m23k85J167N28q91q28K54P64O90m81o84p28Q50M83
$$ y = [864, -742, -1152, -233, 948, 998, -604, -1060, -470, 740, 908, 189, -738, -741, 287, 918, 272, -644, -803, -1, 961, 848, -700, -927, -132, 940, 827, -271, -897, -614, 582, 1004, 36, -1032, -670, 242, 876, 470, -379, -883, -285, 733, 728, -187, -1080, -401, 789, 784, -77, -964, -590, 387, 1015, 509, -1010, -610, 223, 1056, 571, -560, -1096, -398, 958, 789, -68, -1041, -369, 627, 929, 200, -866, -663, 337, 846, 314, -322, -789, -35, 701, 703, -613, -874, -31, 735, 803, -168, -676, -611, 310, 623, 325, -532, -807, 253, 1063, 631, -700, -711, -313, 583, 775, -302, -1093, -420, 491, 836, 165, -804, -470, 233, 717, 156, -713, -867, 135, 728, 615, -197, -956, -236, 671, 517, 75, -924, -528, 823, 651, 137, -532, -592, -79, 834, 300, -391, -746, -134, 517, 1016, -743, -804, -72, 564, 624, -27, -450, -735, 432, 960, 69, -759, -505, 259, 949, 468, -216, -944, -94, 389]
1755C89J75n70n55M5R63M2k30m22m14Q42N86p69j47q36N23J206k88q11l58N60
1775f9O77J33p15p73L09O48M12m52n53o2M06P56l73m82n35L42Q56j39p81N0J72
1796a73P77j62l93o13K16P56r5r0m64m00O87P03k28q75n0P5Q91l32n61j54k11
1817f96R68K06l99m46l5K37R37n27m97l67K00Q57J9o88m03L81N81L06n65n87J91
1838c27N18N23l67p05j73P34L30J01j006j07K99Q97m3o42l21j00Q01j82m63l31
1858e64o5P28J53K9m52m48P33L88j35n29n26O00L19L17o61o76M18L83O00m03l70
1879a61m06N14M77%o21m13N89O02j66p22k52L20L42K30k06m03nK50R06j153k27
1900e05K52J63O46k54n00n14M99N71j30j08m94k05Q77J8r7o28K95O0N38l33l33
$$ y = [389, 564, -6, -561, -516, 447, 489, 259, -163, -577, 265, 851, 82, -65, -901, -378, 828, 540, -271, -629, -69, 608, 741, 26, -747, -438, 210, 622, 170, -383, -445, -39, 717, 344, -138, -673, -331, 525, 386, -395, -345, -173, 604, 442, 49, -564, -348, 408, 313, 223, -241, -641, 46, 749, 521, -354, -404, -329, 562, 230, -331, -485, -696, 272, 478, 79, -367, -402, -165, 772, 245, -252, -619, -419, 438, 457, -231, -634, -253, 328, 634, 69, -518, -327, 191, 714, 347, -358, -531, 203, 533, 634, -372, -479, -180, 717, 674, 32, -289, -389, 412, 230, -233, -564, -629, 99, 252, 281, -171, -619, 114, 502, 367, -162, -688, -88, 231, 548, -113, -789, -371, 12, 612, 209, -161, -567, -53, 424, 424, -197, -610, -21, 581, 415, -307, -559, -239, 103, 333, 127, -276, -281, -31, 875, -278, -505, -253, -90, 556, 302, -198, -712, -213, 358, 228, 120, -374, -579, 298, 316, 219, -409, -114, -54, 484, 151, -182]
1921a82J13J94K64R8l31o81M19N85ql40l76o3O26L79m96p8l89p6J083o34n38J11
1943c20J00O01K56q02l14R2M73L51j85o02j20Q08K30k87m83j24O6N69l53r5k51
1964c90K31M74n1p1n14J10M40J93L6p28k55N47N64l19l85l86P59Q4m68N8j22p6
1986b69K89K66J1o81l6N03K61L0o44J76L59J09j90m31j19L21L17j64m2k67jK84
2008H2L14J0q64O29pl6K1j26m22N71Q1l20q8k33J20M78K55m80n67L22J20L97j52
2031A05n56J86O8N87K49o31o11M69K50Q6j59n33L04L16N47n25k84l68L73M39j94
2052A18J17o63O27L5q0k9k96k24N19M66p16K08k64J46M59k95j08n2j17L26K13
2073C90l35l71K0N97P6l58l66L71J21N5m2j43j32L85K6J37n72j2K15M16m22j87
$$ y = [-182, -69, 125, 389, 487, 156, -525, -106, 479, 471, 131, -245, -308, 318, 697, 201, 123, -266, -342, 741, 107, -431, -320, -220, 381, 637, -165, -479, -387, 86, 437, 252, -350, -470, 338, 568, 281, -202, -326, -260, 309, -44, -139, -390, -159, 315, 264, 193, -321, -211, 229, 422, 458, -270, -525, 22, 586, 267, -118, -504, 255, 339, -129, -71, -193, -269, 20, 286, 297, -384, -420, 83, 344, 374, -270, -94, 265, 374, 184, -247, -366, -45, 272, 108, 66, -201, -202, 82, 396, 406, -458, 171, 164, 128, 149, 23, -399, 172, 253, -67, -155, -388, -268, 210, 465, -15, -582, -260, -140, 257, 105, -451, -265, -197, 390, 639, 8, -603, -134, 116, 202, 43, -490, -186, 130, 677, 152, -132, -500, -127, 312, 118, 235, -428, 199, 234, 154, 125, -171, -395, 124, 590, -126, 82, -182, -36, 423, 128, 20, -32, -149, 177, 390, 55, -316, -296, 301, 377, 19, -347, 24, 145, 200, 158, 15, -117, 268, 294, 431, -141, -153, 62, 478, 56, -131]
2095a31l45L09N11O2k17l77K55L3p3J01l04n6j44O30p1n55O3K56K33j47Lm67K49
2118a82K44J15k77j44J58j05L09n2j86J91r0L12pm62l45K8O99K02o27j5O8M03
2140B37k55M0k39k32J84N64k48k92L27j01K57K26o00k50M57J36K51n52k39P0J67
2161i2L08L3m02l71M76N64k97m40j62Q3M91M9k59j35M53l61M2j30j12K93j68K39
2183A02K64o49r8K95M30l49j90K06j94K09L56l27j62o9OJ80M2j75p6K14Oj8j80
2206a77k11M18J04J17n08J24l5L03j99J26J58l19r8J23R9m30K87kJ7M24m24K5
2228g8J37p7J61j56j02q2K08L21o83M93k71J14J33j47r7J83kJ17k26N6j50R9K92
2251B43j44k57po7O48l12J57n39O2N37j86j72k04J84j61K66L32m03J01j52K86
$$ y = [-131, -476, -167, 344, 406, 189, -188, 67, 100, 27, 128, -176, -232, -376, 254, 183, -372, -309, -53, 180, 33, 36, -431, -182, 62, 177, -100, -244, -86, -191, 118, 66, -120, 71, -19, 293, 286, -176, -521, -493, 206, 408, -219, -234, -166, 237, -18, 22, -217, -449, -265, 299, 51, -241, 86, -15, 242, 468, -132, -382, 75, 211, 462, -90, -329, -259, -92, 216, 249, -153, -524, -48, 516, 219, -221, -383, -300, 191, 240, -19, -154, 299, -62, -20, -150, -262, 31, -137, 102, 366, -283, -381, -86, 344, -5, -195, 11, -183, 26, 382, 55, -107, -176, -170, 10, 52, -123, -199, 15, 21, 3, -177, -388, 30, 134, 251, -257, -133, -168, 135, -64, 62, 220, -99, -197, -74, 25, -405, -118, -120, -103, 321, -103, -78, 59, -18, 143, -13, -115, -197, 11, 332, -351, 142, -129, -15, 118, -29, -126, 57, 55, 172, -54, 2, -148, -49, 243, 99, -158, -165, -232, 416, 104, 261, -278, -216, 321, 135, -37, -241, -57, -218, 48, 380, -23, 78, -74, 212]
2272B12p5Q1j75j76K67J99j19k37j7m6K21m1J16m17L53k95L37n15L63l64N32o6
2294A38R8l96L97kj37K50j87J4o9p2K30l22o3J01O2K07j66k56K7j77L20J06q3
2317B0J15k38K72l26R8k76O03n15N50m82j0J80o9J8M2k00J42k26M63Nk50J46k47
2340a85M58J00j75l44P8p2L07j47J0K0j19K03J17j92k11K8J21J99j90l10J51J64
2362A1K18l99N1k4J10J86n5k45K95K5J1k14j9p7k27K46Kj2L21j95K4L43n40J63
2386aJ68l14K03J73q2j41k25R0L87m81K12q9J92m0K26m45K38j27k7l2Q0J03J09
2409A77k11M1J03k95O8L28j59p4m17N06K5k25K33k38K61j28O4Ll81L47L4L2q8
2432Fk75K19J03q8j56L62m3j60RJ13k21q4J02K74j46r7j23O3K7J39j39n0Q2p4
$$ y = [212, 137, 218, 43, -133, 134, 333, 214, -23, -40, -86, 135, 94, 210, -207, 146, -149, 188, -327, 36, -328, 204, 138, 236, -160, 237, 235, 98, 348, 161, 175, 106, 34, 264, -58, -121, -20, 42, 249, 83, -173, -146, -323, -3, 103, 20, 135, -103, 169, -157, -59, -335, 268, -247, 303, -179, -189, -9, -78, -60, -18, -218, -76, -302, 161, 166, -84, 62, -185, 273, 373, 198, -146, -68, -140, 167, 20, 30, 50, -69, 134, 251, 59, -152, -124, -3, 196, 6, -304, -153, 11, 229, -170, -119, -143, -33, 153, 98, -147, 148, 173, 184, -30, -49, -126, -353, -107, -105, -117, 204, 9, 33, 376, -164, -1, 167, -147, 56, 229, 147, 6, -219, -129, 258, -223, -11, -100, 92, 52, 278, -167, 71, -56, -83, -115, -35, 68, 177, -34, 7, 110, -185, -117, 211, 52, -22, -439, 67, 92, -133, 100, -138, 123, -5, 59, 62, -319, 28, 62, 94, 6, -269, -50, 53, -35, -191, 171, 128, -32, -23, 90, -131, -215, -113, 161, 15, -82, -205, -142, -115, 24, -115, -165, -83, -157]
2456a57L11L13o42Q9K92j97j25P4J58l49P2L87j86j85K78J76m66J5L69l56O9K35
2478A75K50q13L66R5k47N3O16n24k99K68O8P2l7R0P5l64j3kJ41p1J43j12j60r6
2502c26K67K43l08J22k4j00j98K25K72j63o8L3J32Jl60R2J12N6n9m9j69K6K82
2525C9N9J86m79j0k1K11l65L39l3K24j14l0K1j25K63k37N2J58j95J90j71j02j01
2548b41J10k5K17k29J50J40m03L84l1k05m8K00J48p3n7j73K14J52j85k18M78l19
2570a4N1k68K8K62r0Nl7N4K4J18j95j45M16p4j1p8k24J97p7LK6k3J9K72n7k53
2596g1j02K54j94K97k08k06J92o4M0j54J19J07k02J94k10K07J8K53j80n98M93
2617a5RL73m77N2M1Lr6K93J16j7l60o9J24O2j6L10l30K46o6l69L43q1o1l4R7O7
$$ y = [-157, 154, 467, -175, -86, 206, 9, -116, -42, 116, -233, -161, 226, 40, -145, 133, 309, -157, -142, 227, -129, -60, 175, 425, -388, -22, 73, -174, -121, 495, -29, -328, -60, 8, 80, 43, 133, 208, -156, -169, -171, -30, -101, 42, -70, -230, -326, -59, 184, -124, -2, -26, -126, -324, -99, 173, 10, -58, -25, 107, 108, -252, -160, -48, 8, -51, -100, -269, -243, 39, 98, 284, -195, -205, -226, -15, -380, -41, -74, 150, 36, 6, 27, -98, 165, -72, -20, 138, -57, 133, -38, -140, -241, -131, -156, 61, -168, -18, 122, -281, 103, 72, -133, -181, 19, 167, 94, 37, -136, 78, 230, 45, -173, 305, -14, 37, -231, -203, 59, -31, -26, -63, -9, 15, 133, -62, -207, 209, 135, 124, 46, -178, 19, -58, -55, -29, -52, -33, 239, 182, -71, -173, 81, -113, 184, -24, -230, -38, -102, -62, -216, -97, 10, -192, 2, -208, -1, 17, 270, 90, -508, -15, -6, 367, -110, -58, -17, -14, -110, 183, 299, 282, -78, -147, -23, 39, 23, 333, 3, 249, 183, -186, 157, 76, 15, -19, 78, 145]
2643A45j29L9l24L73m6n3O9j47J17N0k57K22l74M68j80j45k8L18j27L3k1K21k53
2666b9J1KJ63r5j76K07p7m9J08M9l76O23o31J75n8J14J94j07m67L83L3m5P6k9
2690aq8K03l01L0L31j93M8k8k7J68J54k07l10M77n67L17l1j9K7o5j40K09J82j05
2714F4k56K17J24jl14J61R5J35k81k27L23q1j23J62j67K82k33k9J79k45M02j09
2736G8o9J41J6k43J39j64M5J94Rn0R7j34J35j64J11N4k47m0Jq4O0L0j97K51%Q9
2762E8j03j41Q4J65k64J70J51j12M6j54J10J65l97M12k75r5j02J2L69lJ60r3p9
2785H4k58J67j17L26m61N98l78J0L33q5k69J69m9j78J91J4J00k73K84j62r4N2
2807DJ5o9K4kJ41l88K93R0j0r2r5k8M28r0r0j42Q2n0j87Q9%j52k4K09k93L41K68
$$ y = [145, 16, 55, -269, 104, 58, 5, 74, -73, 44, 94, -163, 59, -315, 153, -27, -172, -200, 118, -9, 24, 3, 224, -29, -18, -16, 147, 52, -124, 83, 6, -43, 65, 114, -262, 361, -270, -95, -153, -39, 155, 48, -419, -36, -3, -48, 28, -1, -89, 114, -187, -157, 174, -19, 29, 1, -26, 142, 296, 89, -221, 256, -311, 6, -25, -44, -17, -82, -222, -13, 169, 64, -192, 25, 149, 148, -166, -5, 90, 225, -56, -283, 40, -41, -164, -2, -169, 113, -120, -149, 30, -215, 187, 78, 9, 150, 166, -77, 62, -102, -57, 137, 146, 96, 193, 59, 194, 30, 141, 195, -52, -92, -91, -175, -115, -85, -282, -31, -31, 58, -45, -186, -102, 63, -201, -31, 120, 8, 54, -100, 10, 175, -222, 190, -85, -180, -282, -270, 99, 96, 256, 163, 84, -174, -7, -124, 202, -259, 339, -39, -29, 304, 219, -50, 119, 70, -108, 83, 97, 197, -76, 208, 46, -48, 4, 19, -50, -26, -28, 113, -275, 18, 108, 98, 6, -89, -117, 311, 221, 131, -11, 71, 21, -166, -77, -77, -229, -253, -44, -337, 4, 272]
$$ [...]
8191G9
##END NTUPLES=NMR FID
##END=
