##TITLE=1H_DE-3 oil
 CDCl3
 8 sc, 
 7.8.2023
##JCAMPDX= 6.0         $$ Bruker NMR JCAMP-DX V2.0
##DATA TYPE= NMR FID
##DATA CLASS= NTUPLES
##ORIGIN= UXNMR, Bruker Analytische Messtechnik GmbH
##OWNER= root
$$ XWIN-NMR		Version 3.5
$$ Mon Aug  7 13:55:00 2023 Russian Standard Time (UT+4h)  she@DPX200
##.OBSERVE FREQUENCY= 200.13135
##.OBSERVE NUCLEUS= ^1H
##.DELAY= (6, 6)
##.ACQUISITION MODE= SIMULTANEOUS
##.ACQUISITION SCHEME= undefined
##.AVERAGES= 8
##.DIGITISER RES= 18
##SPECTROMETER/DATA SYSTEM= spect
##.PULSE SEQUENCE= zg30
##.SOLVENT NAME= CDCl3
##.SHIFT REFERENCE= (INTERNAL, CDCl3, 0, 15.7039)
##AUDIT TRAIL= $$ (NUMBER, WHEN, WHO, WHERE, WHAT)
$$ ##TITLE= Audit trail, XWIN-NMR		Version 3.5
$$ ##JCAMPDX= 5.01
$$ ##ORIGIN= Bruker BioSpin GmbH
$$ ##OWNER= she
$$ F:/spectra/data/she/nmr/H-F/1/audita.txt
$$ ##AUDIT TRAIL=  $$ (NUMBER, WHEN, WHO, WHERE, WHAT)
(   1,<2023-08-07 13:54:06.29 +0400>,<she>,<DPX200>,
      <created by zg, POWCHK disabled, PULCHK disabled
       configuration hash MD5:
       00 E9 B6 7A A2 85 ED C7 34 08 36 98 17 FE 4E 26
       data hash MD5: 16K
       24 71 92 FD 83 44 B6 2E 89 9C E2 AD 1E 22 26 3F>)
$$ ##END=
$$ 
$$ hash MD5
$$ C1 7E 89 E2 1B CE 8A EC 95 BF 9D 66 3F 6A 7C 87
##$RELAX= 
##$RELAX= 
##$RELAX= 
##$RELAX= 
##$RELAX= 
##$RELAX= 
$$ Bruker specific parameters
$$ --------------------------
##$DU= <F:/spectra>
##$EXPNO= 1
##$NAME= <H-F>
##$PROCNO= 1
##$TYPE= <nmr>
##$USER= <she>
##$AMP= (0..31)
100 100 100 100 100 100 100 100 100 100 100 100 100 100 100 100 100 100 
100 100 100 100 100 100 100 100 100 100 100 100 100 100 
##$AQSEQ= 0
##$AQ_mod= 1
##$AUNM= <au_zg>
##$AUTOPOS= <>
##$BF1= 200.13
##$BF2= 200.13
##$BF3= 200.13
##$BF4= 200.13
##$BF5= 200.13
##$BF6= 200.13
##$BF7= 200.13
##$BF8= 200.13
##$BYTORDA= 1
##$CFDGTYP= 0
##$CFRGTYP= 5
##$CHEMSTR= <none>
##$CNST= (0..31)
1 1 145 1 1 1 1 1 1 1 1 1 1 1 1 1 1 1 1 1 1 1 1 1 1 1 1 1 1 1 1 1 
##$CPDPRG= <>
##$CPDPRG1= <>
##$CPDPRG2= <>
##$CPDPRG3= <>
##$CPDPRG4= <mlev>
##$CPDPRG5= <mlev>
##$CPDPRG6= <mlev>
##$CPDPRG7= <mlev>
##$CPDPRG8= <mlev>
##$CPDPRGB= <>
##$CPDPRGT= <>
##$D= (0..31)
0 1.2 0 0 0 0 0 0 0 0.06 0 0.03 0 0 0 0 0.0002 0 0 0 0 0 0 0 0 0 0 0 0 
0 0 0 
##$DATE= 1691402045
##$DBL= (0..7)
120 120 120 120 120 120 120 120 
##$DBP= (0..7)
150 150 150 150 150 150 150 150 
##$DBP07= 0
##$DBPNAM0= <>
##$DBPNAM1= <>
##$DBPNAM2= <>
##$DBPNAM3= <>
##$DBPNAM4= <>
##$DBPNAM5= <>
##$DBPNAM6= <>
##$DBPNAM7= <>
##$DBPOAL= (0..7)
0.5 0.5 0.5 0.5 0.5 0.5 0.5 0.5 
##$DBPOFFS= (0..7)
0 0 0 0 0 0 0 0 
##$DE= 6
##$DECBNUC= <off>
##$DECIM= 32
##$DECNUC= <off>
##$DECSTAT= 4
##$DIGMOD= 1
##$DIGTYP= 9
##$DL= (0..7)
0 120 120 120 120 120 120 120 
##$DP= (0..7)
150 150 150 150 150 150 150 150 
##$DP07= 0
##$DPNAME0= <>
##$DPNAME1= <>
##$DPNAME2= <>
##$DPNAME3= <>
##$DPNAME4= <>
##$DPNAME5= <>
##$DPNAME6= <>
##$DPNAME7= <>
##$DPOAL= (0..7)
0.5 0.5 0.5 0.5 0.5 0.5 0.5 0.5 
##$DPOFFS= (0..7)
0 0 0 0 0 0 0 0 
##$DQDMODE= 0
##$DR= 18
##$DS= 0
##$DSLIST= <SSSSSSSSSSSSSSS>
$$ [...]
##$SUBNAM2= <"">
##$SUBNAM3= <"">
##$SUBNAM4= <"">
##$SUBNAM5= <"">
##$SUBNAM6= <"">
##$SUBNAM7= <"">
##$SUBNAM8= <"">
##$SUBNAM9= <"">
##$SW= 18.05172834244
##$SWIBOX= (0..15)
0 0 2 0 0 0 0 0 0 0 0 0 0 0 0 0 
##$SW_h= 3612.71676300578
##$TD= 16384
##$TD0= 1
##$TE= 0
##$TE2= 300
##$TE3= 300
##$TEG= 300
##$TL= (0..7)
0 120 120 120 120 120 120 120 
##$TP= (0..7)
150 150 150 150 150 150 150 150 
##$TP07= 0
##$TPNAME0= <>
##$TPNAME1= <>
##$TPNAME2= <>
##$TPNAME3= <>
##$TPNAME4= <>
##$TPNAME5= <>
##$TPNAME6= <>
##$TPNAME7= <>
##$TPOAL= (0..7)
0.5 0.5 0.5 0.5 0.5 0.5 0.5 0.5 
##$TPOFFS= (0..7)
0 0 0 0 0 0 0 0 
##$TUNHIN= 0
##$TUNHOUT= 0
##$TUNXOUT= 0
##$USERA1= <user>
##$USERA2= <user>
##$USERA3= <user>
##$USERA4= <user>
##$USERA5= <user>
##$V9= 5
##$VALIST= <valist>
##$VCLIST= <CCCCCCCCCCCCCCC>
##$VD= 0
##$VDLIST= <DDDDDDDDDDDDDDD>
##$VPLIST= <PPPPPPPPPPPPPPP>
##$VTLIST= <TTTTTTTTTTTTTTT>
##$WBST= 1024
##$WBSW= 4
##$XGAIN= (0..3)
0 0 0 0 
##$XL= 0
##$YL= 0
##$YMAX_a= 52586
##$YMIN_a= -90244
##$ZGOPTNS= <>
##$ZL1= 120
##$ZL2= 120
##$ZL3= 120
##$ZL4= 120
##$ABSF1= 10
##$ABSF2= 0
##$ABSG= 5
##$ABSL= 3
##$ALPHA= 0
##$AQORDER= 0
##$ASSFAC= 0
##$ASSFACI= 0
##$ASSFACX= 0
##$ASSWID= 0
##$AUNMP= <proc_1d>
##$AZFE= 0.1
##$AZFW= 0.1
##$BCFW= 1
##$BC_mod= 2
##$BYTORDP= 1
##$COROFFS= 0
##$CY= 11.3945322036743
##$DATMOD= 1
##$DC= 2
##$DFILT= <>
##$DTYPP= 0
##$F1P= 15.7292609196834
##$F2P= 12.9074282941183
##$FCOR= 0.5
##$FTSIZE= 0
##$FT_mod= 4
##$GAMMA= 1
##$GB= 0.15
##$INTBC= 1
##$INTSCL= 1
##$ISEN= 128
##$LB= 0.24
##$LEV0= 0
##$LPBIN= 0
##$MAXI= 10000
##$MC2= 0
##$MEAN= 0
##$ME_mod= 0
##$MI= 1.114404
##$NCOEF= 0
##$NC_proc= 0
##$NLEV= 6
##$NOISF1= 3.799351
##$NOISF2= 2.8
##$NSP= 1
##$NTH_PI= 0
##$NZP= 0
##$OFFSET= 15.70392
##$PC= 1
##$PHC0= -21042.27
##$PHC1= 8.652719
##$PH_mod= 1
##$PKNL= yes
##$PPARMOD= 0
##$PSCAL= 0
##$PSIGN= 0
##$REVERSE= no
##$SF= 200.130013532006
##$SI= 16384
##$SIGF1= 3
##$SIGF2= 2
##$SINO= 400
##$SIOLD= 16384
##$SREGLST= <1H.CDCl3>
##$SSB= 0
##$STSI= 0
##$STSR= 0
##$SW_p= 3612.71676300578
##$SYMM= 0
##$S_DEV= 0
##$TDeff= 0
##$TDoff= 0
##$TI= <>
##$TILT= no
##$TM1= 0
##$TM2= 0
##$TOPLEV= 0
##$USERP1= <user>
##$USERP2= <user>
##$USERP3= <user>
##$USERP4= <user>
##$USERP5= <user>
##$WDW= 1
##$XDIM= 8192
##$YMAX_p= 0
##$YMIN_p= 0
$$ End of Bruker specific parameters
$$ ---------------------------------
##NTUPLES= NMR FID
##VAR_NAME=  TIME,          FID/REAL,        FID/IMAG
##SYMBOL=    X,             R,               I
##VAR_TYPE=  INDEPENDENT,   DEPENDENT,       DEPENDENT
##VAR_FORM=  AFFN,          ASDF,            ASDF
##VAR_DIM=   8192,          8192,            8192
##UNITS=     SECONDS,       ARBITRARY UNITS, ARBITRARY UNITS
##FACTOR=    0.0002768,     1,               1
##FIRST=     0,             0,               0
##LAST=      2.2672688,     0,               0
##MIN=       0,             -90244,          0
##MAX=       2.2672688,     52586,           0
$$ Real data points
##PAGE= N=1
##DATA TABLE= (X++(R..R)), XYDATA
0 0 0 0 0 0 0 0 0 0 0 0 0 0 0 0 0 -8 8 -8 8 -8 16 -16 16 -24 24 -31 32 -40 46 -49 57 -65 75 -87 97 -109 121
37 121 -136 152 -168 190 -210 232 -259 285 -315 347 -383 422 -466 513 -566 624 -688 760 -841
56 -841 935 -1042 1168 -1315 1491 -1710 1984 -2349 2847 -3578 4762 -6988 12682 -60529 -90244
71 -90244 17172 -2314 -11058 24383 24994 -17911 -900 16066 20580 45513 47602 54 6877
84 6877 37710 4378 -19234 30309 32859 -16933 -14794 5155 -22629 -24533 4743 -10900 -33089
97 -33089 -13436 -17673 -35270 -4210 19169 -9592 -15814 3314 -7237 -7441 25354 24749 5163
110 5163 20865 20417 -10700 2810 35496 16324 -3608 15977 10661 -16676 -9569 4177 -4312
123 -4312 -3042 -2148 -21671 -20666 -1870 -13161 -22261 2412 6653 -17551 -11783 9667 2527 -3527
137 -3527 9398 9179 3362 11424 10387 1696 12069 17270 584 -2772 9066 4076 -5589 444
151 444 799 -7405 -6635 -5877 -10770 -3277 3112 -9600 -14100 533 2405 -8204 -3181 7218 3701
166 3701 -1975 -105 4254 7871 5360 -2147 843 10266 3923 -6193 2272 11041 887 -7394 -1039
181 -1039 2926 -1784 -4354 -1883 1611 317 -5937 -6801 1598 4410 -2612 -3004 1903 580 -3109 -416
197 -416 2480 2143 1833 277 -1524 509 2161 510 -797 765 723 -897 -1602 -1156 1801 4024 -103
214 -103 -4683 15 3928 -1483 -3824 3624 5648 -918 -3952 1078 4717 764 -3692 -1598 4199
229 4199 998 -7514 -4653 4546 2072 -6281 -3279 3789 307 -5627 -2687 3343 2995 -2142 -3007 2672
245 2672 6396 1509 -2249 2918 5757 273 -2709 2009 4018 486 -1499 -241 1261 488 -2918
260 -2918 -4062 -1048 857 -2634 -4960 -2103 558 -1456 -2733 -1044 1120 533 -1369 -922 2686 4094
276 4094 491 -878 3676 6066 1840 -949 2584 4838 1313 -2176 -332 2204 158 -3356 -2392
291 -2392 1027 17 -4685 -4647 -1025 -528 -4034 -4139 -607 1133 -769 -1714 193 2343 1389 -92 1123
308 1123 3916 4116 1104 605 3173 4541 1539 -955 1128 3040 710 -3252 -2347 1106 -196 -4344
324 -4344 -3946 875 150 -5026 -5343 465 1441 -3813 -4481 1619 3683 -631 -2486 2500 5614 1259
340 1259 -1537 2709 6031 1978 -1981 1809 5653 2432 -2056 -513 2246 530 -3170 -3265 -141 -734
356 -734 -3156 -3239 -604 -705 -3161 -3627 -1462 -271 -787 -1334 -1060 1088 2043 1561 556 1926 3910 2731
374 2731 987 1934 3628 2025 -225 169 2544 2734 -1119 -2732 89 1042 -3052 -5290 -1596 472
390 472 -3122 -4737 -1376 580 -1993 -3845 -1075 2234 893 -2103 -704 3690 4077 441 588 4319
406 4319 3909 325 4 3068 3341 424 -1258 256 1516 -148 -3063 -2542 603 -5 -4507 -4738 -793
423 -793 -688 -3663 -2577 1109 1256 -1331 -2239 303 2573 1459 -946 1234 5320 3179 -1001 744
439 744 5114 3262 -829 419 2521 566 -2208 -1389 322 442 -1570 -3670 -2040 397 -1552 -4481
455 -4481 -2054 454 -1860 -2922 287 1027 335 1319 973 120 1638 2009 -283 1244 5132 3028 -1415
472 -1415 -11 2023 514 86 688 83 291 -478 -3987 -2719 2581 640 -4365 -891 2370 -2241
488 -2241 -5682 -301 2456 365 -331 -123 -226 1295 288 -1690 2419 5651 -701 -3794 2497 3778
504 3778 -1607 -817 3589 2202 -1103 -930 -887 -577 1891 -647 -3049 910 1626 -3952 -3480 3168 1280
521 1280 -3711 -1413 118 -1562 -707 1095 -464 1081 2583 -1783 -3155 3051 2914 -1819 532 3874
537 3874 285 -2199 716 1249 1250 2684 403 -2572 103 916 -2884 -1812 3413 336 -3939 -1480
553 -1480 25 -2320 -1557 106 -1251 -681 397 -2582 -2684 2616 2843 -1286 510 3272 84 -1681
569 -1681 1311 2975 2113 2181 366 -812 1769 1768 -2538 -996 3394 166 -4951 -1950 1140 -1561 -2640
586 -2640 -461 -138 -1345 -2616 -3078 -982 2509 739 -2375 647 3374 -407 -1597 3312 5077 1061
602 1061 -483 1286 1516 432 509 904 1746 1786 -1827 -3932 -1145 673 -1940 -2347 92 -1005 -3698
619 -3698 -2653 -585 -70 68 -94 -1263 -568 1340 364 -145 3037 4131 509 -697 1662 1787 981
636 981 1445 1473 607 189 -999 -2241 166 2228 -1051 -3502 -829 -582 -3616 -2716 464 406 -979 -1160
654 -1160 -1447 -352 1208 69 -632 2280 2469 -1139 -1092 3124 3350 511 910 2087 899 -348 -547
671 -547 53 1287 1159 -2223 -2468 768 59 -3488 -2144 1525 -534 -3072 -1989 24 28 -306 -335 260
689 260 1599 583 -1726 149 3692 1664 -1019 1161 2907 276 -561 1361 1761 825 -347 -823
705 -823 -527 527 -719 -1983 -269 929 -1596 -2496 -669 -252 -1213 -831 -215 -401 -14 223 -909 -209
723 -209 1574 853 -638 564 2096 753 -70 589 1631 1750 610 -478 704 1654 0 -2040 -244
740 -244 1530 -870 -2519 -403 1073 -1217 -2445 -1293 378 -385 -1947 -1387 927 1361 -963 -877 1672
757 1672 2026 -492 -379 2051 2151 140 -444 1149 1946 818 -538 73 1285 376 -1577 -1283 176
774 176 58 -2040 -1609 143 146 -1515 -1977 -629 231 -188 -1261 -549 1307 721 -681 175 1646 1491
792 1491 -95 308 1856 1629 282 -74 1495 2084 343 -1125 20 810 -926 -1485 -902 -124 -742
809 -742 -1554 -1139 -233 -560 -1429 -1105 68 224 -167 -731 175 1023 969 462 499 1376 1653 769 27 868 1690
830 1690 470 -814 447 1622 227 -1521 -540 609 -500 -2348 -1823 500 24 -2123 -1705 647
846 647 494 -1653 -1780 1301 1536 -647 -1039 1191 2125 61 -1080 1357 2269 461 -583 723 1993
863 1993 108 -1156 -229 1297 131 -1187 -584 513 33 -1746 -1151 -157 -191 -897 -939 -205 -143 -395 -527
882 -527 -560 306 600 23 -175 670 1346 590 53 730 1379 1197 16 -84 929 978 -636 -953 732 1121
902 1121 -1354 -1405 337 257 -1455 -1592 -421 521 -429 -1560 -709 696 -137 -1193 -210 1457 789 -892
920 -892 230 1476 1155 149 529 975 1401 346 -294 80 990 70 -1063 -138 1229 -45 -1350 -699
938 -699 155 -378 -1197 -1657 -1040 246 -314 -1475 -397 1493 -139 -1456 499 2071 191 -656 655
955 655 2042 809 22 469 1810 1609 -148 -905 576 645 -1411 -1284 883 436 -1756 -1835 -627 -782
973 -782 -1137 -913 -550 -286 -667 -870 -579 491 729 352 58 796 505 399 640 773 1069 1428 862 -298
993 -298 -65 1298 209 -991 -221 742 -850 -1680 -567 694 -347 -1492 -1146 -247 129 -1711 -1361
1010 -1361 1116 1578 -885 -998 1289 1471 -291 38 2335 1369 -457 -668 788 1155 423 68 189
1027 189 995 -403 -1805 -726 886 -208 -1377 -354 20 -1254 -1362 -7 70 -186 203 -751 -1212
1044 -1212 502 781 -193 333 1802 575 -465 487 996 467 704 519 -352 348 797 -708 -392 2015
1062 2015 530 -1994 -778 317 -1094 -1235 423 380 -525 -761 -1066 -1279 570 419 -757 204 1563
1079 1563 -715 -1459 1042 1706 251 824 876 -562 270 818 -273 -139 1817 104 -1672 -6 891
1096 891 -699 -789 637 -191 -1284 -660 -797 -908 970 189 -1704 -86 1461 -1174 -1742 1450 1715
1113 1715 -351 -609 1059 496 38 410 271 1264 1333 -806 -1375 1334 1177 -1406 -201 1537 -541
1130 -541 -2210 -600 366 -874 -284 -177 -1058 -484 -431 -1024 -307 1561 174 -1234 267 880 -105 430
1148 430 1371 497 219 1014 85 -529 1232 1126 -401 -560 671 -168 -1022 -438 -33 -209 -229 -1243 -1345
1167 -1345 -302 -122 -1216 -486 1382 -31 -1436 -3 1155 474 -307 703 1129 541 136 -297 979
1184 979 1543 483 -247 259 750 -500 -919 160 836 -734 -1252 -371 -387 -595 -830 -861 -137 171 -898
1203 -898 -1102 241 783 140 -417 488 542 165 44 437 853 902 87 -62 682 834 77 -496 494 830
1223 830 -869 -853 -79 -84 -705 -899 -68 152 -393 -928 -582 180 -15 -478 -331 283 269 14 29 608 514 340
1245 340 113 529 724 525 345 129 671 516 84 -496 -70 534 111 -732 -339 111 -147 -941 -574 171
1265 171 85 -723 -834 266 388 -565 -648 420 751 -348 -149 613 1251 84 -104 601 1474 201 -758
1284 -758 481 1329 267 -749 -91 555 -197 -1031 -515 187 -150 -750 -533 11 -29 -622 -698 -197 69 -271
1304 -271 -361 231 639 294 101 310 662 727 381 282 347 581 305 -189 183 501 -94 -252 -358 15 -120
1325 -120 -743 -714 -343 -15 -405 -637 -4 4 -467 -750 148 725 -97 -383 206 660 745 357 294 631 475 -80
1347 -80 231 549 408 -225 -515 98 390 29 -538 -676 95 -271 -649 -660 6 -6 -606 -553 408 470 -267 -505
1369 -505 312 933 -35 -468 377 1127 637 -303 325 1057 383 -634 183 925 126 -700 -249 565 -60 -936
1389 -936 -611 -56 -196 -773 -826 49 -86 -339 -613 152 616 -199 -254 164 484 277 230 473 278 429 244
1410 244 134 299 616 252 -153 -70 34 -202 -250 -321 -238 -22 -403 -899 -522 195 -276 -756 -241 374 -93
1431 -93 -715 -29 553 473 -251 48 451 796 -21 50 685 772 31 -236 450 606 -74 -468 294 395 -210
1452 -210 -660 -217 53 -226 -941 -621 186 -58 -663 -940 242 218 -465 -259 408 394 117 -111 349 810
1472 810 386 -36 116 516 440 -115 -114 730 516 -629 -461 321 128 -419 -300 -168 -468 -357 -867 -653 -106
1493 -106 -71 -739 -266 330 -121 -511 221 351 287 405 320 174 188 257 9 239 642 251 -322 -28 450 168
1515 168 -23 -347 -168 -269 45 -265 -503 39 434 -955 -819 48 -218 -677 62 563 113 -386 -122 221
1535 221 495 661 81 321 976 199 -833 454 1020 142 -223 506 156 -598 -588 -87 27 146 -379 -1032
1555 -1032 -534 23 -508 -577 757 114 -622 -707 427 427 244 553 402 108 666 166 -463 953 1126 15
1575 15 -359 261 131 -533 -23 327 -133 -212 -370 -842 -473 214 -169 -599 246 212 -566 -538 301 174 264 317
1597 317 90 -153 534 240 44 887 1056 13 -361 378 391 -463 61 369 44 -137 -172 -428 -305 326
1617 326 -541 -916 168 -218 -1017 -471 490 199 -365 -27 189 8 -4 -132 185 621 335 -114 -75 878
1637 878 160 -239 282 793 -136 -685 231 226 68 104 -57 -107 89 -366 -674 -65 498 -398 -697 162 253 -529
1659 -529 -215 269 221 135 193 -126 -152 635 266 -122 465 445 128 -53 123 420 -21 -41 -97 -170 -212 -136 -306
1682 -306 -414 259 -482 -948 -215 341 -499 -334 -89 49 -177 -426 66 398 269 132 -164 343 482 -192
1702 -192 -113 735 707 -347 -298 182 156 -137 -167 -103 30 -172 -612 -560 -185 30 -643 -271 194 -79 -377 -342
1724 -342 223 444 134 -16 70 208 182 17 32 449 312 -134 71 539 128 -12 -144 168 -29 -418 -434
1745 -434 38 7 -351 -625 -35 -20 -307 -447 -117 299 -119 -324 87 303 196 102 452 -45 397 434 178
1766 178 217 318 207 -8 93 209 93 -164 -454 -218 48 -163 -542 -346 8 -331 -327 -149 310 -95 -434
1787 -434 -219 452 209 -325 -124 483 318 -296 -98 569 348 -3 -183 475 524 47 -281 -58 330 -42
1807 -42 -490 -133 -84 -280 -430 -427 97 -89 -216 -317 96 126 -332 -375 187 106 -162 -87 -265 394 194 250 217
1830 217 322 458 -6 -58 99 128 129 10 155 344 -82 -299 -223 -15 -124 -593 -431 -53 -134 -378 -159 262
1852 262 215 -6 -318 343 359 49 -167 29 502 100 185 113 220 337 61 -44 179 76 -220 -150 136 177
1874 177 -297 -431 -74 -90 101 -364 -363 -114 71 -297 -110 -20 56 3 -250 134 542 88 166 329 632 132
1896 132 -12 341 498 71 -294 203 191 -113 -357 -144 69 -189 -384 -303 19 61 -677 -566 -285 116 -250
1917 -250 -142 190 158 -209 -141 291 211 84 -135 8 400 298 148 58 250 186 172 -31 -207 31 361 -218
1939 -218 -339 -173 138 -281 -575 -31 254 -58 -285 -91 -24 105 -343 28 169 452 161 -162 450 461 -157
1960 -157 151 480 335 -146 -108 -30 -175 104 -257 -160 446 -79 -538 -270 406 -369 -396 -349 -41 -121 -203 -200 58
1983 58 -32 44 -139 -33 556 105 -239 146 434 334 -22 337 167 -94 -140 223 -27 123 -387 -359 -80 278
2005 278 -197 -451 -104 66 -247 -599 252 0 -103 -222 -79 -81 381 170 11 399 294 40 65 112 137 68
2027 68 -37 348 -139 -134 188 -82 -29 279 -106 -252 79 44 -365 -505 -54 23 31 -223 -249 34 63 119 -32 61
2051 61 543 -180 -323 329 494 27 83 241 372 -206 -215 42 288 207 -148 -163 87 83 -329 -428 516 -150 -504
2074 -504 -435 105 117 -219 86 40 239 187 -220 294 184 348 -200 108 323 -29 -132 414 340 326 104 5
2096 5 -117 -60 48 31 -197 272 7 -502 -287 -134 129 -46 -61 -20 -143 136 -80 -138 321 268 -464 -23 489
2119 489 -59 -91 583 623 71 -210 -86 103 171 168 -192 -245 319 -186 -376 18 175 -68 -362 -100 -130 -161 -122
2142 -122 -93 178 234 -238 -365 226 350 167 7 371 261 -83 -86 7 172 -6 -127 -41 8 117 -208 -623
2164 -623 128 30 -241 -475 177 -92 -378 39 163 -56 -419 -24 -126 45 112 38 73 217 78 -123 99
2185 99 190 42 -84 73 69 -6 12 143 157 -83 -6 -430 -310 251 108 -225 -72 38 -193 -31 -342 -180 41
2208 41 188 -120 -211 46 48 -191 -130 120 196 -101 -115 256 96 115 135 211 258 163 -95 -259 234 -156 -447 19
2232 19 102 -251 -352 -172 87 14 -95 -199 -22 229 -29 -88 -3 104 149 -210 125 408 38 -84 175 282
2254 282 127 295 -217 97 21 -56 -137 12 226 -214 -115 -31 -141 -7 -472 28 228 -190 -63 88 137 116
2276 116 13 -122 38 241 -193 263 213 296 132 -156 31 352 148 -5 67 19 -15 -265 -64 59 -153 -250
2298 -250 -490 -170 119 -243 -165 66 -95 -9 -25 143 150 -74 73 -402 76 310 89 -147 65 641 -72 -212
2320 -212 -10 305 227 58 33 61 84 -232 -7 90 -333 -168 34 30 -182 -366 -329 -50 363 85 -100 139 -332
2343 -332 -193 -33 243 374 181 30 202 -21 394 107 120 -129 -166 213 -116 -179 64 49 -192 194 -222
2364 -222 -157 -271 -153 -283 -78 -281 -256 -72 458 142 -178 48 284 -1 25 6 183 104 -129 53 72 292
2386 292 24 -34 114 -307 -269 10 85 -230 -275 -194 -141 23 -152 -120 -284 28 93 -122 -75 53 109 -220 -19
2409 -19 42 384 142 366 382 95 161 126 239 249 -50 5 -246 201 148 -269 -77 44 -130 -31 -116 -97 -16 -386
2433 -386 -347 42 189 -193 41 -25 191 8 -312 56 174 6 -152 -160 125 254 -8 -2 101 -48 47 -312
2455 -312 210 -47 104 -62 -54 76 -120 -193 -90 -353 137 253 -117 48 96 124 -60 56 46 102 47 26 363
2478 363 389 225 -74 240 323 171 -209 -85 269 -71 -438 -25 117 -175 -455 -139 -39 -64 29 -418 44
2499 44 336 -378 -142 272 431 -55 -75 226 224 -116 341 218 27 47 97 -19 25 182 -58 5 48 -112 -196
2522 -196 -429 -131 177 25 -420 -262 -71 115 58 -346 -40 -70 -143 -214 199 143 -97 394 602 48 192 0
2544 0 65 -126 171 -176 -111 -224 253 -138 -62 315 -139 -19 15 154 40 164 33 -111 294 233 -270 -164
2566 -164 80 -13 -161 -21 145 -3 -30 -89 257 50 78 137 -68 226 -94 -179 -97 226 64 -356 -197 377
2588 377 -106 -282 -72 -144 -147 -209 -222 -142 -165 -264 265 387 -88 96 27 4 144 -9 204 163 313 -191 -40 -147
2612 -147 200 341 17 -223 -80 29 -196 -116 -18 -147 -361 -51 -237 -112 -189 147 -76 -130 -210 375 -162 373
2634 373 274 12 -69 253 35 181 423 111 134 41 190 -51 14 77 -238 39 -105 -60 -121 -162 -177 -59 60
2657 60 -97 -64 -256 71 -100 -129 396 178 -9 -6 16 270 55 -38 -14 313 -133 39 343 185 -32 -190 46
2680 46 408 102 -209 -232 97 -152 -639 -387 -22 41 -150 -168 26 287 -214 63 314 438 -173 19 154
2701 154 181 4 -46 441 44 353 238 -272 97 183 24 -126 -113 165 -216 88 -139 -183 17 148 -133 -99
2723 -99 84 140 -164 -130 -5 24 -283 100 97 155 144 335 -42 125 -14 -284 189 -20 -63 18 84 312 13 -10
2747 -10 -26 -175 -179 -125 -81 -83 98 -147 -220 -45 105 -30 -230 120 -183 -4 -106 252 180 275 -19 118 -144 -74
2771 -74 270 -61 111 35 234 24 43 158 -197 -105 100 -129 -193 -130 -72 -60 60 -128 103 -38 -166 -23 26
2794 26 109 132 -2 -46 110 5 -101 178 -51 78 -46 216 228 -26 37 -77 162 61 132 -81 29 -193
2816 -193 -102 -155 -156 70 19 -138 -113 -57 107 -30 -38 -225 326 126 63 24 204 64 -34 91 168 195 -13 -119 35
2841 35 73 -101 -351 120 -38 -263 19 -228 30 -251 -267 -167 103 -160 -5 -5 157 153 21 142 53 2 -384
2864 -384 52 337 22 41 -95 -33 -125 171 -173 -71 -59 8 104 -90 -181 -467 102 -294 102 -255 -320 165 -122
2887 -122 120 -103 36 202 -197 199 105 51 244 -83 -68 -99 42 117 -15 473 -250 53 -46 -19 -46 -37 55 -156
2911 -156 128 -43 37 -177 53 74 150 53 -311 -70 162 129 -156 131 176 149 -161 96 360 -75 -90 -31 201
2934 201 71 -10 -231 -16 191 70 77 -138 243 -143 -227 -35 -10 -146 -141 -249 76 -56 20 -326 -300 136 -121
2957 -121 -144 -415 -120 -37 247 53 186 257 26 241 119 -57 89 -107 82 138 -76 70 226 207 204 -75
2979 -75 -324 138 61 99 -296 48 245 31 -163 -49 194 129 221 198 -41 28 79 -124 385 40 -189 100 131
3002 131 -87 20 -120 145 86 -164 -36 87 -259 49 -226 24 169 -90 -224 162 65 162 -173 -132 253
3023 253 -47 58 1 -154 64 115 -172 121 -17 -256 -327 -50 186 15 -88 -287 1 -121 -66 23 28 5 -128
3046 -128 -95 47 306 -66 56 57 -44 -206 -224 292 -155 -108 -94 61 114 343 -82 53 269 48 114 175 159
3069 159 -155 -109 33 -179 -88 94 -305 -5 92 158 106 -164 23 -108 -191 117 -112 -51 184 -53 112 -71
3091 -71 124 -47 21 -39 371 -91 -109 -55 -314 -96 -19 -80 299 28 -35 77 -33 56 27 -231 112 -34 -40 -77
3115 -77 131 91 204 -42 -70 120 -30 -36 156 178 138 263 -219 337 52 57 -1 -43 -156 -99 121 -141 -29 165
3139 165 -116 -87 -166 38 -63 -100 230 -81 55 59 -189 -37 116 -134 104 233 30 -191 -20 167 205 -137
3161 -137 -210 113 189 -51 93 147 156 -66 -284 86 -189 -23 -74 238 136 -149 -174 162 -45 -74 -252 233 -31
3184 -31 -101 30 34 1 -5 -181 76 290 253 -154 -1 153 91 -19 -48 -13 -58 -32 -425 90 76 -31 8 -9 121
3209 121 78 -18 128 66 -35 -271 50 10 324 105 48 159 219 -53 -3 60 91 -112 -100 -71 136 168 158 -112
3233 -112 -97 232 135 -410 -80 17 -82 -317 5 -131 -96 93 -99 241 -52 -160 -18 -195 168 182 -55 94
3255 94 153 -89 -177 -68 -60 93 -94 -200 55 -34 -139 -182 -96 315 99 -230 -199 -52 -128 -12 219 134 29 176
3279 176 146 -83 87 -172 -79 190 70 24 33 -66 16 107 285 25 169 57 32 98 71 -29 -212 59 -159 68
3303 68 -9 94 96 -112 18 42 3 -1 90 101 183 294 216 205 152 160 245 160 -64 -194 297 -24 -56 34 138 -120 31
3330 31 122 215 -122 344 -142 -146 71 -152 -32 -15 178 -375 -23 105 214 70 -62 107 -41 266 169 -73
3352 -73 70 219 -58 348 64 -73 -317 61 161 -89 -234 -386 -92 9 162 -279 -142 106 42 -92 -280
3373 -280 -138 218 11 31 -25 -159 178 -126 -79 332 -210 13 249 78 20 -171 -120 99 -260 168 45 208
3395 208 174 -129 -248 -39 85 -41 -109 60 -126 -115 110 -65 -33 -17 156 271 -17 50 159 121 59 123 104
3418 104 109 -19 111 211 -101 -324 -49 133 83 -20 -93 -123 -352 195 -93 -50 -70 -169 -13 -2 -336 3 39
3441 39 -67 -41 150 119 102 -15 -25 207 352 358 -24 -175 6 -61 -114 90 91 46 -28 -226 -48 11 23 -23 -23 48
3467 48 -238 39 27 364 129 -159 -78 159 -96 109 94 1 359 -29 -28 -45 236 -152 300 188 77 -91 -34
3490 -34 68 -101 -35 -81 38 53 5 -200 -140 -87 -117 -118 -176 125 12 -234 -93 -214 -254 188 306 148 -295 51
3514 51 -229 -73 201 -78 289 5 -27 -49 107 93 -127 9 60 226 -288 -112 91 -224 118 -117 -143 -158
3536 -158 30 -151 64 161 77 194 109 88 -119 191 -89 203 159 -66 -173 203 76 100 91 40 -179 -274 -121
3559 -121 24 32 -194 -143 -208 -151 3 19 154 160 -58 -59 -117 83 -69 -184 81 162 61 -137 -127 165 178 -172 90
3584 90 155 -84 219 77 -35 -263 42 -185 -68 81 54 8 69 -157 31 -223 -107 -86 20 37 -152 -91 28
3607 28 147 -218 -5 228 131 90 -44 -78 312 50 137 -220 -54 -137 73 111 190 -106 -105 6 -51 -335 -37 -145
3631 -145 -224 37 -74 -110 -279 153 72 -135 -173 -65 -130 -28 336 -75 43 192 -38 -43 7 92 -51 -67 2 -192
3655 -192 -187 95 51 -232 -238 13 -120 -196 266 -51 -39 32 34 -27 -38 193 99 -269 -243 -19 250 115 45 142 30
3680 30 25 -16 -8 -218 179 -192 247 -107 15 -117 34 39 -199 151 51 46 167 -133 -198 119 -116 125 -145 -87
3704 -87 -118 -102 203 44 71 -27 63 98 -88 102 -3 -479 38 162 -22 247 184 -5 -117 174 64 -143 -33
3727 -33 -85 -42 80 -360 41 14 -152 124 131 64 25 -20 63 287 18 -369 -31 9 -55 -103 -184 219 118 88 109
3752 109 -116 -143 -35 117 8 -111 199 144 83 198 -107 -34 -25 238 -115 57 -7 -104 -101 -282 253 12 51 116
3776 116 289 184 -81 178 -45 -139 -34 -8 93 -8 6 -43 -156 58 79 -26 83 63 56 30 -277 -5 -154
3799 -154 81 61 -67 136 -166 280 2 -17 -272 -37 138 -65 109 233 62 120 -105 -148 -139 -1 -15 -81 46
3822 46 -201 -70 -40 -40 153 -144 -33 -17 316 -130 -127 -104 93 159 -246 162 -187 97 206 165 -104 199 -98
3845 -98 48 10 -40 -220 88 67 121 -337 7 13 365 332 -255 -206 55 161 -193 -50 -181 189 59 146 -48
3868 -48 67 40 -67 -172 -7 -67 -172 -72 -93 262 -49 69 -71 102 -190 -70 70 -427 -118 -50 -144 30
3890 30 65 2 -122 76 -33 204 116 -145 33 98 -39 -30 88 -12 51 7 167 54 43 -135 35 -129 18
3913 18 -19 273 -183 -114 -56 28 -12 -146 125 -85 45 -309 -86 -33 -20 228 -104 95 -149 210 41 -50 110
3936 110 -123 43 112 71 -38 -7 -257 -208 225 3 51 -12 -26 -310 -125 35 189 378 23 -91 186 -46
3958 -46 -7 -162 -25 114 -101 -100 27 94 160 -200 161 201 232 -34 17 118 -168 77 -43 -377 35 38 262 -185
3982 -185 -209 -133 171 154 47 -319 -196 251 282 144 -281 -46 -111 -15 170 8 52 -27 130 116 117 86 -100 -155
4006 -155 17 262 -129 104 20 9 -134 -153 -149 254 260 172 -57 -345 -254 220 31 -221 47 252 -93 122 58
4029 58 -126 -63 -323 241 232 109 -45 61 -20 211 -27 -154 -71 36 10 -143 19 -83 261 -226 -148 -140 -93 221
4053 221 42 143 -141 -233 3 -7 229 69 33 276 3 -17 -122 -86 -32 -106 49 -138 84 -23 1 -97 39
4076 39 71 -152 -106 -36 53 -34 -26 -53 42 -223 52 32 188 98 117 -165 69 50 86 -191 93 -80 -80 79 -3 50
4102 50 -79 44 58 -19 39 -47 2 57 -2 137 127 240 -76 80 -80 -194 -33 -19 -80 -126 -140 22 25 -75 -270
4127 -270 -223 28 -150 -236 136 150 -261 106 287 -152 -159 108 54 -187 52 -42 72 -4 63 -189 21 169 -207
4150 -207 -7 23 263 -122 -411 222 191 -15 -127 -133 -100 19 -298 -321 45 -117 -298 110 -351 53 -245 -169
4172 -169 31 -197 45 -36 -35 36 -43 162 -86 -3 13 264 -205 53 6 -19 75 -181 259 16 275 82 69 212
4196 212 -185 -202 -73 -125 174 -406 -87 -97 89 160 -106 -1 96 19 -235 201 -73 217 42 148 150 11 30
4219 30 217 39 -71 96 166 189 116 195 24 -74 -137 200 163 71 -104 69 10 95 -29 -224 -82 -7 -233 -112
4243 -112 -223 -113 -120 214 19 -53 14 -219 141 19 91 -37 -43 -266 274 -219 94 156 25 63 -161 56 -41
4266 -41 199 -74 -44 292 -164 -38 83 -216 32 -34 -50 7 -81 76 -291 269 -24 193 47 76 -124 -1
4288 -1 97 44 5 207 -99 113 64 -55 34 -83 -360 -76 194 -106 -213 -144 260 -157 -102 39 -82 6 -260
4311 -260 -77 142 26 58 67 -4 79 130 -134 -76 67 128 252 386 145 -279 -295 127 361 -288 60 -97 36
4334 36 -73 64 -32 -1 -121 17 -213 -90 -76 -93 -217 18 151 -225 26 -87 264 -9 -7 65 142 -124 -96
4357 -96 45 -86 -197 65 158 -179 -52 -58 -26 89 -79 109 54 128 -117 -123 -12 -185 -178 8 315 -141 -312 -35
4381 -35 307 -48 116 -51 290 -130 -63 36 178 266 -78 -105 219 -49 -3 196 -29 -111 177 -87 -138 -26 48
4404 48 -233 28 -93 25 -76 -70 130 -199 -69 1 -3 44 -47 48 -108 -135 73 -136 9 -39 -155 -18 163 -94
4428 -94 -47 117 -28 -57 91 -116 157 -154 -66 -108 -37 -21 -87 -23 208 227 -87 43 -17 167 133 -188 123 -56
4452 -56 81 -94 78 -88 42 174 -59 -213 22 50 162 -31 -79 176 -81 -245 39 -55 251 136 -88
4473 -88 -91 106 -48 170 -216 210 49 30 60 -264 -101 59 60 74 310 61 204 -63 -276 28 -183 32 -59
4496 -59 244 126 -242 -22 17 41 162 -20 -406 -106 177 149 -256 61 228 111 4 82 -32 86 -88 174
4518 174 35 95 182 -5 75 -39 219 76 -25 -148 -34 -6 -191 74 4 -14 -4 -124 107 146 -16 -11 -138
4541 -138 24 -192 3 150 81 -169 294 103 28 -252 44 78 -54 223 -47 122 91 -97 83 -151 -33
4562 -33 147 62 -137 52 -142 25 10 51 -40 75 194 -71 55 -307 -194 94 137 58 43 -282 -3 54 -1
4585 -1 -43 60 -21 -40 8 -92 -83 -248 -236 -249 46 35 -21 -68 203 -126 201 -58 -54 86 -89 201 87 45 219
4610 219 16 -175 203 121 149 12 12 166 -74 104 -221 72 -161 188 -195 -255 -85 -109 97 74 -35 -10 -157
4633 -157 -9 201 -94 -165 -201 94 144 148 -151 26 -185 84 134 -6 97 138 207 183 -52 -37 9 -36 7 -166
4657 -166 -56 -32 22 64 169 -142 -80 -11 -287 -32 101 251 -1 71 -137 -15 415 -77 -12 145 93 180 -61
4680 -61 -191 25 88 -134 -43 -108 283 22 111 59 -74 -48 30 124 304 -53 127 95 -166 36 -4 -153 -448 -50
4704 -50 -263 129 123 -39 44 -51 242 -153 17 -247 129 -173 -52 181 -88 344 -7 88 -79 -185 155 -36
4726 -36 -201 18 28 -194 98 212 103 9 -79 100 16 -81 -22 115 203 94 170 209 -216 164 -127 131 8
4749 8 53 55 -138 307 -240 -85 -33 -48 -116 160 -305 -174 136 133 63 105 -94 -85 -199 54 203 123 -2 -27 221
4774 221 -40 -136 -75 162 137 195 166 -291 -118 11 -201 -2 -43 -169 -67 -111 -199 -36 146 10 -95 51 67
4797 67 120 -78 154 -6 101 -10 -79 -68 168 50 88 -34 6 -62 -20 -102 -34 -43 41 -21 -104 -95 -366 -37 -83 -249
4823 -249 -259 37 106 238 14 112 119 128 -178 60 -148 128 121 13 -100 134 49 28 -59 71 156 51 -216 -31
4847 -31 25 21 -306 118 -66 70 8 -184 43 184 103 -9 2 -136 -20 28 -82 76 -131 36 201 84 -76
4870 -76 -87 55 -15 24 94 44 70 -8 46 31 5 -37 111 -177 44 119 -205 -174 -183 28 -33 132 159 270 -274 149
4896 149 292 223 -160 -69 -80 -130 130 65 81 -4 -210 -69 17 7 -73 -45 99 38 4 195 44 48 148 -96 -242
4921 -242 118 35 222 -6 16 -60 122 78 -64 -116 291 11 -23 -100 -52 133 23 172 191 115 123 -99 -44 79
4945 79 -189 -69 -170 -229 -3 -111 128 -6 -80 -18 125 177 -86 -20 147 115 -180 238 -277 110 -66 -78 5
4968 5 186 -104 -41 -90 151 -29 51 15 -108 -181 -68 -209 -124 -42 -124 -64 15 95 179 160 100 74 -23 74 -243 -87
4994 -87 142 171 -71 -107 -24 -212 56 -158 -8 -239 -82 -341 -47 -37 -95 -138 119 -26 77 89 -67 -136 -273
5017 -273 -154 415 -91 -96 -7 105 121 -34 -58 5 -47 70 -51 29 61 107 152 -29 82 -33 145 30 -74 -101
5041 -101 85 -79 -277 -16 -125 -202 280 -155 179 -135 -112 -143 -229 91 -69 -162 141 1 -178 164 111 99
5063 99 -261 -8 317 6 -6 -130 142 68 2 -133 179 102 -89 138 148 -19 86 -47 -192 112 263 206
5085 206 159 81 254 -30 -48 -249 -42 -110 220 244 -106 -38 67 68 -71 -71 -198 -299 28 -139 19 110 264 60
5109 60 -116 -229 -104 269 73 -131 -13 47 49 -154 95 80 51 105 -155 -14 -222 24 -47 -76 -198 -113 -47 -297
5133 -297 59 104 -47 112 -83 -331 162 -55 46 63 -19 -284 -219 11 79 -38 152 66 122 68 66 17 -149 3
5157 3 32 -56 -189 -72 93 78 41 -163 115 31 114 131 -91 334 41 190 161 -49 50 -134 -107 -64 -120 8 67
5182 67 204 99 -19 58 -78 -102 45 -29 257 48 -177 95 -23 27 5 -223 -83 -49 161 104 -62 -72 -192
5205 -192 169 -114 -40 157 -270 -29 -272 138 142 54 298 5 -123 -28 121 47 153 -231 162 -50 138 88
5227 88 25 -32 211 -105 -10 17 -122 58 -14 341 -20 -18 -177 11 -193 131 51 245 -72 101 109 -173 43 -7
5251 -7 -152 292 302 -273 -5 -223 -60 1 225 -10 -150 -42 315 -43 159 65 132 -37 -43 -241 -57 -101 73
5274 73 -9 171 39 77 -47 -155 2 153 36 -324 -55 53 299 164 -74 69 18 29 -4 -116 0 42
5296 42 -85 15 140 5 14 96 170 17 -169 98 240 -137 13 28 -72 -79 12 126 116 -152 198 -14 -29 168
5320 168 -184 -147 -106 -45 -70 176 -21 -371 -92 -47 72 -56 18 -75 141 360 261 59 -7 53 -12 217 229 57
5344 57 153 -197 -49 -212 150 -26 60 -233 -104 429 -40 -4 110 -88 5 81 47 3 280 120 -360 -179 -218
5367 -218 112 146 -175 74 -45 139 91 -135 289 -99 16 55 40 -164 161 134 112 193 223 206 -88 257 -222
5390 -222 37 71 -222 -265 92 -1 -103 -155 -133 175 142 -3 206 -124 -30 -167 37 3 -164 -82 56 10 -16 -6
5414 -6 89 -172 -116 43 39 45 350 136 243 -99 5 235 -14 -128 122 -64 -87 -262 -35 -211 16 39 95 -183
5438 -183 -18 -141 -89 163 144 -35 -177 -179 -47 -189 122 7 -53 -102 -164 4 141 -28 -72 -11 -57 47 -276
5461 -276 161 75 268 114 -58 208 -1 -221 -103 94 -62 -15 -119 62 -224 -66 -148 339 266 93 -208
5482 -208 185 -80 -173 -215 -40 -231 -162 172 176 52 -229 -108 196 -72 -147 -300 271 60 166 -3 -33 -159
5504 -159 253 84 85 -10 74 -55 -58 284 256 116 -213 155 107 27 46 -16 140 23 217 95 -71 -57 -144 -319
5528 -319 -78 15 70 -97 -337 292 -115 96 -33 -2 83 132 -75 -128 85 117 16 -157 209 -70 243 124
5550 124 -10 72 103 182 41 31 334 29 -113 -122 -136 37 -126 179 -13 -90 -18 115 -373 -165 -220 -116 -43 44
5574 44 208 -160 -84 29 208 76 22 -127 24 -102 -173 -258 -117 -175 -192 -67 111 155 -74 -214 37 -35 -188
5597 -188 38 -130 63 129 390 5 146 158 -60 -68 114 -164 -91 135 127 99 34 0 135 -278 -59 74 224
5620 224 104 -338 232 -221 109 -63 -11 131 -232 -208 133 -22 -10 3 -85 -14 -103 -144 -27 204 249 19 261
5643 261 174 30 -149 72 82 86 -182 9 -13 416 178 -134 56 73 25 -22 -86 -121 -7 97 -35 -3 151 98
5667 98 128 452 158 92 -42 163 -250 26 86 -274 238 95 257 -164 122 -5 -154 22 -257 56 -13 127
5689 127 46 -85 125 -37 343 -53 -48 64 99 112 -99 -90 263 -173 69 -176 95 67 162 30 112 -44 -126 -226
5713 -226 -108 34 -403 -92 28 77 90 87 -231 102 150 -290 100 27 24 31 -3 -18 -13 25 17 -203 -139 -76 180 75
5739 75 -43 -136 -213 -91 129 19 76 -59 -19 -13 60 -147 135 126 186 -187 191 41 -35 -128 83 109 -11 61 45
5764 45 95 -91 -9 -44 53 136 149 -34 225 141 85 92 21 -185 -96 32 -13 95 -119 -62 77 -9 -57 -60 23 -43 -158
5791 -158 7 -113 -52 140 18 14 -12 224 -308 14 29 128 98 -111 -244 128 -197 123 -107 -32 -7 -6 166 -194
5815 -194 -3 114 -70 -97 -52 277 -57 71 -356 -179 -315 -238 175 -72 -269 78 232 20 155 -18 277
5836 277 -5 114 298 -156 51 -110 66 -79 -237 71 -31 -246 -159 171 -43 102 -55 180 146 -202 4
5857 4 -65 -131 92 -88 -76 -39 -212 -86 -134 32 61 -160 -195 80 76 -2 -62 11 16 -34 -61 -107 18 -167 -123 -191 -125
5884 -125 2 -105 -69 121 -35 -222 -86 -128 9 49 -119 -3 -154 45 -55 29 -140 -65 406 203 202 132 -14
5907 -14 -37 174 129 319 -309 -94 -2 -93 15 191 13 -69 -205 -1 -140 -138 -55 -84 21 82 20 18 96 321 96
5932 96 -90 172 22 -181 -51 -66 -200 227 -22 157 116 -86 3 25 3 -1 -222 -3 180 6 31 -142 -103
5955 -103 -80 -173 -110 99 39 -13 -35 -60 22 -98 37 87 183 264 -419 -28 -4 11 -367 77 -75 -107 149 -262 13
5980 13 101 -215 -98 101 85 276 -94 -62 136 73 -147 69 181 -183 175 -7 71 -102 -88 -109 200 -41 114
6003 114 42 59 86 -194 89 -266 -10 -30 35 -92 -46 -142 177 -38 15 -52 -132 153 273 120 14 51 8 95
6027 95 -178 198 125 176 107 65 -139 -277 140 93 11 51 92 301 -39 38 14 -75 66 -112 -180 -56 -186 -115 -29
6052 -29 165 206 161 -133 -89 8 -15 2 68 -5 -132 252 -296 24 21 215 136 -122 -123 -9 263 29 90 306 116
6077 116 107 -63 118 141 33 78 144 -41 -117 41 -47 27 40 60 115 52 106 147 134 286 -121 -233 102 -134 -186
6102 -186 -91 58 135 -7 24 -57 -112 -135 -281 -27 154 9 122 77 55 -107 -195 -54 -200 313 -81 -8 -53 269
6126 269 -30 -230 -185 71 -297 47 -94 107 19 122 68 -13 -50 -75 -100 122 62 93 116 76 -136 -127 43 163
6150 163 -122 272 84 -173 143 -225 252 -225 -106 12 -92 79 166 -146 -104 -112 183 61 -116 281 150
6171 150 -19 194 -66 157 -98 -257 18 -103 -3 222 31 143 44 198 210 96 -101 195 181 -6 -73
6192 -73 -134 131 -125 27 0 131 -314 -34 -141 142 -115 38 -56 -109 -217 62 -69 58 -64 -36 -56 -47 101
6215 101 -44 130 -55 -45 49 111 -186 -112 210 -100 -98 -91 -211 81 135 -45 264 -175 -61 -83 -74 -121 120 70 150
6240 150 159 -35 -116 -48 97 -145 17 -107 124 -31 -280 -121 27 304 5 152 151 143 -323 30 45 -84 -35
6263 -35 -152 -57 -3 -182 61 -123 -34 -247 -103 -116 129 298 -103 39 77 131 85 -99 149 150 -9 -62 34 66
6287 66 -189 138 -19 116 -75 -5 83 218 -26 82 35 136 30 -120 -139 42 78 -1 -30 -155 13 -105 -193
6310 -193 -40 112 199 119 165 217 13 85 86 128 88 -95 120 65 80 -106 96 30 -44 -11 216 -9 -92 39 236
6335 236 -102 -88 43 -137 15 225 40 -68 -186 294 -8 -53 -246 -90 -22 65 32 -27 170 -119 -16 -310
6357 -310 96 -108 179 -14 92 -76 -14 97 11 -113 -81 170 36 -361 79 18 70 108 92 -70 100 77 -127
6380 -127 -138 242 -10 -199 17 -1 95 172 40 119 78 124 1 -75 -49 -48 -128 -5 129 -149 -259 185 2 26
6404 26 26 -107 -48 41 41 126 -63 225 143 95 182 19 -45 12 86 141 290 55 -135 -21 -142 172 -192 268 97
6429 97 -282 -120 30 237 -211 -107 -52 -4 115 -33 41 211 -53 5 30 97 31 51 99 -110 -134 -52 -85 -127 -130
6454 -130 55 -30 85 113 -7 364 153 5 -264 -17 74 -27 23 91 149 68 19 29 -133 122 150 149 -58 -92
6478 -92 4 79 149 316 -176 -1 -10 105 -30 114 -192 103 -36 -325 51 -87 -24 75 14 -149 12 -69 151
6501 151 93 124 13 15 -129 149 189 -297 57 -333 165 106 -31 103 -21 49 -165 155 89 -124 175 -56 26
6524 26 -27 78 146 218 107 77 -54 -73 -54 100 259 -50 167 321 27 -191 11 -1 -160 248 180 107 -223
6547 -223 -27 -246 -300 275 -38 -49 -243 72 -90 -65 -197 136 -255 122 -18 -233 -153 -80 153 55 226 108
6569 108 175 182 153 -124 151 23 59 -66 -137 -36 30 -96 -308 87 81 178 149 144 -106 135 91 -89 104 -28 -231
6594 -231 54 344 -31 18 -239 132 125 163 95 -92 159 -2 59 101 -162 -307 -187 -81 -5 63 0 142 122 134
6618 134 117 -59 -47 104 -23 -254 76 48 75 168 -43 -62 53 99 260 115 321 49 -6 -56 -170 3 -53
6641 -53 29 -19 2 127 -62 48 118 108 -261 -351 41 83 -17 90 -59 -168 -235 -47 39 141 27 -60 198 26
6665 26 67 -246 158 -91 298 -182 -217 85 -66 -8 228 -228 -113 184 -51 -30 -314 73 -16 6 -66 44 -60
6688 -60 -260 104 107 -95 -27 47 -167 -29 84 8 83 -108 -26 -208 256 39 -128 -159 34 138 381 81 -185
6711 -185 99 305 -152 -141 -298 -184 135 60 -106 50 32 259 -159 197 77 -84 -25 -89 130 -129 242 40
6733 40 -79 26 -124 -289 -132 105 -208 96 -49 -279 -59 -371 86 -247 -15 158 -11 158 -91 303
6753 303 137 201 64 -52 -124 197 26 -76 240 -46 263 160 317 -185 -157 232 185 112 112 142 122 -25 -16 -72
6777 -72 -200 -75 -5 131 -216 -52 62 167 107 220 30 25 206 -46 90 211 -92 -83 78 245 107 103 113
6800 113 307 -1 -120 53 -163 -93 13 -67 37 -16 -100 -179 -1 157 -61 57 146 79 -49 48 -53 -1 -73
6823 -73 4 -16 25 1 158 52 -125 73 -70 -57 -178 96 -32 -32 -219 80 -130 -137 -65 -69 -62 44 44 -4 197 297
6849 297 -39 -117 20 141 -99 65 -64 39 -25 -82 40 51 -12 -61 -170 30 72 -123 102 145 179 -5 201
6872 201 16 77 -236 35 -266 204 -72 -69 78 -237 -85 -117 233 80 -278 40 91 -171 -175 48 58 -39 -259
6895 -259 -163 -43 269 -217 -29 -27 -70 15 -103 -167 12 63 161 130 -29 -102 381 -16 -185 66 -129 36 75 -13
6919 -13 8 142 -198 -26 83 -37 -155 -36 5 210 -34 -127 170 72 -248 30 -12 -36 100 -21 -36 -17 -365
6942 -365 -257 180 184 -25 -114 28 53 -18 169 -143 -81 -115 -66 -171 23 -131 -96 135 20 0 -106 41 -113
6965 -113 42 -119 -37 -214 -140 316 158 269 107 -164 -58 -167 -149 95 -205 0 41 156 -204 80 25 -39
6987 -39 116 141 80 -186 -124 -186 -19 -114 -109 -98 131 63 -257 64 -27 -215 102 261 152 40 19 163 63 -208
7011 -208 -133 64 175 332 28 -94 108 134 -62 -99 -226 11 16 -269 106 -2 -251 56 70 68 -21 -39 77
7034 77 -28 -55 -119 -30 -261 -1 -117 116 12 82 144 160 198 10 125 51 -97 -55 10 -184 -251 -39 -14 62 26
7059 26 166 159 -118 19 -90 108 -67 1 14 264 59 78 -32 121 168 78 -13 11 65 7 -115 -78 -119 -99 94
7084 94 68 42 -86 -123 98 232 -86 -54 -313 218 -203 -111 -71 -38 113 -363 112 1 47 87 -58 49 282
7107 282 466 122 75 -90 -20 127 -17 36 202 -21 56 -25 -105 -40 -222 -16 -34 33 -194 56 43 -345 -60
7130 -60 -119 44 48 35 120 213 28 -26 -21 -5 -125 -82 174 48 -72 146 -191 31 101 -52 -10 -161 42 100 -107
7155 -107 13 89 202 -239 47 47 104 116 -8 -72 -3 -130 -114 -38 -66 -306 -84 -63 4 104 22 -284 -102 -3 45
7180 45 -108 -30 98 -35 237 -104 27 -129 44 93 92 255 151 188 -70 -143 63 -159 194 -400 -97 139
7202 139 -157 -176 -153 -114 144 117 -146 -269 206 -57 -127 -93 42 47 -99 163 -54 -107 92 -67 -178 -200 54
7225 54 121 -30 -250 -83 90 -107 -132 -119 -329 -195 157 -65 147 80 76 -171 -223 195 -1 -17 -16 -41 151 23
7249 23 5 277 183 115 -121 75 -19 -55 -119 97 -22 224 -138 69 -183 92 -93 21 -36 32 -182 50 53 17
7273 17 86 205 -135 -8 -167 29 157 0 97 -176 -67 269 25 -127 161 -58 -254 -55 272 -234 -22
7294 -22 44 77 -35 -37 71 36 -104 37 173 149 34 -72 -217 256 152 424 -3 -19 -202 163 -89 27 110
7317 110 -244 59 -265 50 419 -86 -178 -44 198 85 -42 -58 97 157 -279 -255 67 -178 -76 64 -70
7338 -70 -5 -169 -9 -27 115 -104 -266 185 104 1 -209 -86 37 -24 -43 -73 59 55 -42 -23 -15 -297 170 -105
7362 -105 -12 -6 -81 284 95 -319 99 118 -357 171 -42 59 -170 57 -11 -101 125 -13 205 54 165 51
7384 51 -36 -26 -161 -24 67 -28 -206 185 305 -96 -49 -183 -29 -146 -23 -117 -43 -144 -30 -49 -52 -176 38 -61
7408 -61 46 -137 -30 251 -42 -126 138 -314 214 215 89 50 -99 -199 83 -75 40 163 19 146 51 148
7430 148 -56 -5 -42 3 87 56 102 -41 -76 79 98 -198 -29 -38 -145 -176 -257 -44 73 30 37 131 77 -26 59 -54
7456 -54 -82 6 94 -89 -47 35 64 96 -58 242 -84 -79 -271 -95 -135 -63 280 -22 -171 9 -228 20 -41 -266
7480 -266 -102 -25 88 198 206 61 32 1 -2 181 83 -41 130 195 34 116 -18 -101 21 -363 191 32 -138 103
7504 103 -239 10 -32 -265 -39 -42 101 -12 -254 14 -173 -219 277 -6 294 191 231 -36 4 -55 -1 116 -39
7527 -39 15 -49 91 60 23 -17 36 42 -9 -17 306 -43 -10 79 -117 371 -61 -29 -119 -55 -345 -115 114 -97 106 -36
7553 -36 -124 202 -44 -79 -207 -90 -47 -101 -12 72 -122 -112 -182 135 -153 -40 108 359 -5 -126 93 -99 231
7576 231 36 -37 137 -121 -28 45 -247 113 -155 -136 75 248 -115 -167 28 198 240 280 -254 160 -72 -124 -105
7599 -105 -267 -115 195 165 359 44 47 -95 -150 -6 -18 27 22 76 3 -351 -61 75 -89 37 59 81 144 97 -162
7624 -162 108 -145 -146 23 -89 -37 -47 -83 100 -51 -113 -182 20 143 -147 -37 -128 101 27 60 -159 -116 2 47
7648 47 -120 82 181 -57 -12 230 -22 117 116 -115 -33 -63 53 -101 49 177 49 -142 260 159 -156 33
7670 33 -7 137 -26 33 -181 -13 -36 -125 34 12 130 -68 67 205 -1 -127 -77 20 -84 -103 -24 34 74 119
7694 119 -132 -66 22 -59 -204 205 227 -177 92 -285 -124 135 186 124 -138 -78 36 -153 105 -36 62 -45 70
7717 70 -194 32 -34 38 144 88 -16 -40 53 -153 -53 -198 110 8 -102 -28 29 65 -148 35 53 38 -71 247
7741 247 15 -113 -175 157 -153 -191 80 103 50 61 167 -186 170 193 -260 -59 224 96 -208 -20 159 -37
7763 -37 -194 -187 0 -172 11 72 130 254 103 38 -255 -113 91 277 -48 47 63 185 -3 47 -13 -27 -29 16 -12
7788 -12 -53 84 -41 21 145 -61 -44 114 66 108 131 -160 150 149 -85 39 39 364 -81 96 -51 -141 265 48
7812 48 -11 -108 -132 -53 74 29 -47 71 53 -172 -3 -86 -8 -3 139 105 107 28 111 -73 133 89 11 -14 -8 -330 45
7839 45 -125 -80 194 -59 -126 -270 -190 60 -40 67 25 47 33 204 29 113 54 -34 -2 100 62 345 151 -52
7863 -52 -23 -184 -105 114 -186 -8 201 -157 250 210 -27 -121 270 12 44 137 188 159 -138 74 -113 81 77 -75
7887 -75 -144 -22 -145 213 -69 113 160 -172 27 146 161 40 266 199 -114 -196 -6 -366 87 -92 -224 151
7909 151 -35 139 10 -236 177 -44 -272 -92 18 -138 -47 -77 -60 -32 113 209 65 -253 92 -61 115 -150
7931 -150 17 -99 -56 -5 95 -32 -105 -48 77 -132 343 -98 -78 76 -123 -19 102 -141 138 -74 -251 -337
7953 -337 115 52 240 280 -211 -103 -185 77 17 -63 -38 -364 -193 58 -205 85 -86 120 280 276 -193 101 -73
7976 -73 -6 187 19 4 -40 160 317 -93 59 -1 -15 110 30 -73 -119 -15 106 -7 -225 11 -3 47 63 -18
8000 -18 -41 -18 0 120 44 20 -94 221 43 49 -217 191 98 27 47 -27 26 31 -153 102 -27 -8 -74 -122 24 -33
8026 -33 10 174 -149 24 251 52 -135 116 21 -387 114 31 -89 -50 44 91 88 -10 -59 22 -64 113 99 210 54
8051 54 50 249 65 -102 138 -157 -61 9 71 -61 -89 -25 -49 144 -190 82 115 -40 -199 -93 -46 -238 28 261
8075 261 -70 -38 351 89 8 76 -48 93 -44 116 -146 32 -24 -133 265 -129 -65 -20 -155 -7 -87 85
8097 85 -288 -63 210 -80 -114 -129 -136 71 53 -79 -44 68 50 -4 -45 25 -158 202 128 -203 -293 -72 1 142 39
8122 39 215 42 -34 22 283 121 -252 194 -66 136 -140 229 -98 117 -96 -150 168 22 199 66 207
8143 207 -90 -211 -43 -83 -88 146 16 153 -71 -206 13 -112 102 -79 33 -7 -315 156 134 166 231 -32
8165 -32 3 -54 -47 179 1 125 -93 70 -221 -58 6 214 204 139 -146 -204 -122 23 103 -107 -52 242 -48 90
8189 90 134 -59
8191e9
$$ Imaginary data points
##PAGE= N=2
##DATA TABLE= (X++(I..I)), XYDATA
0 0 0 0 0 0 0 0 0 0 0 0 0 0 0 0 0 0 0 0 2 -8 8 -8 8 -8 8 -14 16 -16 20 -24 25 -30 33 -38 44 -48 54 -62 69 -76
40 -76 87 -98 106 -117 131 -146 160 -176 194 -214 237 -260 287 -317 349 -386 428 -474 532 -594
60 -594 672 -763 879 -1025 1217 -1489 1897 -2593 4101 -15718 33513 25899 -36744 -10911 -14356
75 -14356 -55274 -43832 -5146 -6836 4174 7272 -26445 -21373 26563 12539 -9211 36959 52586
88 52586 19 -861 34120 16871 3119 30494 16901 -15463 -1596 4677 -17878 -2280 15676
101 15676 -19459 -38426 -13550 -14715 -22639 2641 3914 -22674 -13248 -452 -20351 -8771 29186
114 29186 16112 -8755 12864 20795 -2749 5268 28021 18770 10202 11990 -2817 -5882 11459
127 11459 3433 -13475 2029 6517 -21515 -21810 951 -5989 -19573 -7540 -3478 -11679 -4742 628
141 628 -5923 2353 11704 -281 -3255 13110 13255 2263 7884 11846 2745 2472 6234 1748 3644
156 3644 7549 -4989 -12451 1151 3263 -10064 -8553 1758 -2967 -11016 -6795 -1173 451 -1376
170 -1376 -6009 -2472 7230 3496 -5854 1900 11898 2551 -6155 1995 8055 2288 -1216 1857 4137
185 4137 1811 -3292 -3097 3504 4772 -3486 -5704 202 -43 -4282 -1695 1918 770 -926 -1437 -2332
201 -2332 -64 2772 511 -1053 624 939 -792 -653 450 2467 3053 -1371 -5427 -636 3548 -1134
217 -1134 -3912 2317 4521 -2419 -4804 1485 4834 707 -2939 -412 4912 2554 -4377 -1807 7104
232 7104 4290 -5051 -2899 4486 666 -6507 -3351 2369 974 -4729 -5208 474 3211 -1948 -5298
247 -5298 -1 3859 -1360 -3644 2320 5394 1684 -453 2306 4112 2305 135 -205 2536 3732
262 3732 24 -2664 166 1882 -1104 -3424 -1856 -569 -1896 -4010 -3376 -885 189 -3057 -4012 782
278 782 3009 -876 -2988 1393 4621 1293 -985 1925 4956 3049 537 1662 4613 3096 -1594
293 -1594 -1771 1914 1808 -2148 -3291 121 690 -2666 -4335 -2422 -1076 -2248 -3598 -2640 -104 -103 -2121
310 -2121 -1974 1777 3119 370 -962 2052 4628 2810 -241 1543 4472 3385 -587 -41 3941 2655
326 2655 -2874 -3449 1685 1498 -4323 -5370 -28 1411 -3673 -6148 -1073 1563 -2295 -5260 -475 3164
342 3164 -375 -3447 1119 5534 2463 -1419 1291 4976 3460 -416 814 3761 3137 245 -190 2038
358 2038 1498 -1500 -2459 -697 -263 -2219 -3199 -2719 -1383 -1114 -2262 -3281 -1587 19 -595 -1985 -469
375 -469 1998 1174 -171 994 4061 3806 1056 -2 3110 4423 653 -1273 2309 3933 -34 -2513
391 -2513 318 1624 -2229 -4708 -2347 98 -1519 -4597 -3439 259 457 -3482 -3386 1232 1577 -1736
407 -1736 -1043 2586 3465 1027 329 2282 4112 2621 332 1516 3935 2721 -1784 -2024 1899 1842 -1757
424 -1757 -2108 357 -189 -4029 -4698 -1923 -403 -1805 -3844 -1778 1516 63 -3476 -1181 3750 2047
440 2047 -1294 703 3715 2070 114 1713 3616 3158 1319 -532 933 2632 407 -2644 -734
455 -734 1417 -1762 -3126 -1085 -204 -2041 -1984 -1894 -2722 -1355 -326 -1851 -552 2879 1365 -2780 -734
472 -734 2818 1836 901 2000 1611 1138 1357 -816 99 4490 2802 -2942 -587 3057 -1610 -5020 180
489 180 3248 -595 -2663 -1838 -1613 -632 -815 -2399 468 2875 -2118 -5321 1293 4052 -1422 -1457 3715
506 3715 2118 -1799 -719 949 1514 2925 1129 -1830 1429 2628 -2245 -2007 4093 2243 -3635 -2036
522 -2036 1000 -750 -867 1026 -838 -1043 624 -2804 -3737 1471 2638 -2865 -1366 2356 -686 -3353
538 -3353 793 2447 1180 1616 510 -1887 609 3149 -254 37 4578 2109 -3009 -606 2423 -515
554 -515 -790 1040 -467 -1114 -210 -2332 -3121 1390 1844 -3319 -2641 741 -1531 -3601 198 2413 625
571 625 293 -100 -574 1844 2539 -535 420 4717 2187 -2837 297 4202 1336 -1178 789 1223 -1369
588 -1369 -2351 -2159 -600 1411 -924 -4381 -2374 919 -2212 -3789 865 2776 -1575 -2962 204 1543
604 1543 599 1097 2093 2479 1914 -232 -1400 2067 3909 1097 -309 2178 1028 -2498 -1582 756 270
621 270 -1310 -1720 -2821 -2254 -786 -1027 -2177 -228 1073 -2023 -3134 424 1380 361 1003 1788 1098
638 1098 1066 971 589 2448 4086 836 -2045 1004 1843 -1117 -985 1897 962 -2093 -2275 -1751 -1354 -516
656 -516 -1568 -2474 -452 315 -2844 -2797 1441 2166 -1198 -762 1536 640 -136 956 1801 2609 2327 -301
674 -301 -428 2459 2486 -1399 -616 2648 759 -2775 -1603 657 35 -1194 -1350 -1179 -495 -1454 -3072 -1042
692 -1042 2035 74 -2784 -235 2228 -131 -1304 1233 1898 613 211 384 755 1671 1439 -20 1187
709 1187 2272 -298 -1402 161 946 -518 -1068 -442 -832 -841 -876 -1632 -1341 365 -507 -2112 -878 647
727 647 -180 -1055 196 1358 843 -11 -33 978 2395 774 -809 992 2607 524 -1113 914 2278
744 2278 -242 -1865 -422 1192 208 -1785 -1284 506 595 -2045 -2097 239 343 -2034 -1908 677 1161
761 1161 -1211 -1317 732 1668 507 -550 825 1811 1411 -215 202 1922 1542 -87 84 1277 700
778 700 -874 -1417 -121 498 -758 -2133 -902 177 -686 -1965 -1239 223 -98 -1829 -766 736 644
795 644 -563 -475 1441 2136 385 -371 965 2105 763 -86 786 1474 437 -308 120 677 123 -1271
813 -1271 -1029 -227 -58 -1167 -1522 -1045 -329 -475 -1190 -715 171 -21 -515 -798 569 1395 308 -296 1291
832 1291 2272 1154 -268 98 1930 1059 -1080 -38 1928 911 -1440 -998 890 281 -2339 -1928 739
849 739 578 -1805 -2438 38 879 -1192 -1967 30 1468 -407 -1136 395 1856 211 -831 707 2410
866 2410 1138 -419 317 1407 985 -649 -283 745 630 -393 -321 -89 -479 -633 -758 -862 -347 -617
884 -617 -694 -1146 -230 13 -598 -681 -233 954 566 -401 -337 975 847 309 132 1392 1905 -418 -729 1382
904 1382 1395 -578 -677 528 1068 -430 -1518 -479 279 -324 -1741 -723 398 -689 -2117 -955 657
921 657 -30 -859 -78 725 305 37 -455 232 1557 1165 -114 907 1715 724 -146 397 1210 620 -327
940 -327 -632 -91 497 -212 -1581 -773 660 -863 -2209 -593 785 -864 -1839 -446 837 -156 -1009
957 -1009 207 1398 946 -343 -920 1650 1936 7 184 2034 1643 -540 -688 857 777 -457 -172
974 -172 -337 -728 -804 -1071 -924 -171 -335 -1143 -1231 -294 -505 -999 -29 138 326 505 248 -579 180 1765 1041
995 1041 -406 680 1646 729 -359 1012 1522 571 -843 -572 260 -148 -1312 -1232 815 668 -1681 -2363
1013 -2363 301 662 -1703 -1171 1171 645 -1525 -930 898 1366 458 93 808 1337 348 -470 546 2323
1031 2323 992 -1124 37 882 -238 -646 330 293 -377 -736 -1054 -1284 -270 456 -983 -925 614 -361
1049 -361 -1943 -406 772 173 14 316 -30 277 1277 114 296 2115 1149 -1576 139 1847 632
1066 632 -479 987 896 -669 -565 -702 -815 434 304 -1394 -828 451 -995 -1866 489 920 -781
1083 -781 -490 262 -534 -618 793 312 32 1514 891 -1358 275 2199 332 -163 1199 896 -656 -88
1101 -88 80 -128 1026 396 -1724 -864 865 -1438 -2192 902 1122 -1665 -1724 376 58 -306 -17 227
1119 227 100 841 -718 -794 1686 1997 -513 116 2170 441 -1485 529 1643 78 -230 163 -368
1136 -368 -589 220 -788 -556 746 -267 -2075 -909 249 -733 -885 713 -24 -675 178 -3 -1028
1153 -1028 893 1564 0 -170 1240 782 -360 733 1248 660 154 -195 -589 621 732 -945 -646
1170 -646 675 -333 -2009 -980 699 -355 -1353 -305 71 -645 -864 -243 389 1149 226 -675 281 1282
1188 1282 78 -400 951 1586 253 -278 466 814 252 -89 -136 147 236 -734 -1234 -255 257 -341 -1339
1207 -1339 -192 -168 -892 -974 -382 293 32 -305 -186 668 1074 28 -77 1028 814 -44 -391 836 1225
1226 1225 141 -27 483 518 -309 -920 -168 296 -200 -926 -987 15 -438 -619 -803 -48 -171 -557 -467 -58
1246 -58 188 194 38 95 633 604 250 183 241 739 150 -225 412 514 490 -292 177 438 -92 -450 -677 119 200
1269 200 -970 -1113 -161 425 -897 -1013 164 439 -774 -934 497 836 -34 -728 516 1361 540 -389
1287 -389 561 1458 505 -565 163 872 342 -523 -189 663 34 -484 -513 81 -101 -681 -872 -382 -106 -668
1307 -668 -473 -282 -181 -176 -292 -113 -4 257 188 116 417 557 543 -135 273 814 524 53 -50 309 313 -141
1329 -141 -269 86 146 -672 -898 -392 234 -661 -1032 -402 165 -205 -803 -107 321 -8 -488 43 161 601
1349 601 120 87 519 971 366 83 380 583 265 -257 -267 391 -11 -626 -485 262 109 -775 -994 -83 257
1370 257 -457 -934 -141 453 -61 -552 -88 760 276 -232 129 1153 671 -33 314 1018 971 -273 -347 558
1390 558 336 -381 -325 38 144 -618 -820 36 313 -423 -655 -412 3 -348 -524 -314 93 56 15 -89 44
1411 44 364 151 108 -49 710 398 485 141 598 434 32 27 -242 610 41 -517 -199 254 44 -980 -340
1432 -340 89 -104 -885 -319 -35 99 -565 -432 150 574 -513 -377 595 567 125 -193 491 783 324 -435
1452 -435 454 512 283 74 101 573 271 -623 -598 38 473 -596 -605 -184 12 -583 -493 -79 -28 -129 -366 -83
1474 -83 420 461 -187 88 816 801 -65 39 624 413 115 132 333 176 167 -393 41 452 168 -457 -447 138
1496 138 -346 -825 -258 193 -331 -204 -375 -484 13 280 -369 -196 687 342 -213 42 945 559 121 350
1516 350 434 37 418 291 91 607 477 -644 -725 102 -85 -768 -442 299 -273 -923 -616 -52 117 185 -278
1537 -278 -313 461 19 -1022 359 1420 174 -326 496 876 -102 82 552 575 309 -167 -590 -71 324
1556 324 -180 -510 80 254 -1019 -730 288 12 -409 -397 -298 -250 -87 -295 -163 568 713 -84 -623 596
1576 596 538 -122 492 872 166 -556 69 -215 104 585 292 -452 -20 -124 -608 -634 592 213 -707 -163
1596 -163 -400 -445 7 15 -306 348 566 -307 -617 510 460 77 180 779 74 -192 304 204 418 617 -156
1617 -156 -662 228 206 -482 -490 404 144 -924 -137 145 -325 -329 80 -61 -58 -108 -656 -227 697 148 -347 136
1639 136 755 85 -667 379 782 355 88 116 230 337 178 -326 496 497 -266 -768 -177 261 -442 -323 140
1660 140 -144 -755 -284 -484 -89 456 -174 -456 -265 161 67 -219 468 501 4 56 323 161 94 163 195 91
1682 91 315 -19 -544 26 188 -184 -563 -90 -67 -379 -675 -147 -109 -97 -417 -492 -126 144 -309 -359 596 602 -192
1705 -192 -79 223 456 500 86 204 499 374 90 -28 305 75 -669 -473 359 -38 -355 -322 85 -258 -550
1726 -550 -287 -244 -350 113 -328 -66 320 194 -166 37 656 524 -59 43 555 207 37 -91 122 307
1746 307 123 -419 -100 142 -175 -778 -63 156 -197 -516 -274 -240 -92 -355 -152 26 36 111 -332 26 367
1767 367 124 -90 1 191 342 -14 66 121 550 50 -145 173 277 170 -464 -278 349 189 -591 -316 57
1788 57 -3 -493 -536 -6 -56 -240 -393 129 17 -74 -648 365 594 -349 -305 347 590 59 67 252 463 -136
1810 -136 -53 76 407 101 60 -232 194 -27 -446 -491 -396 -240 -200 -333 -318 157 98 -249 -35 -252 205 -66
1832 -66 120 286 520 71 -176 340 388 336 -77 -70 615 205 -51 -461 134 248 -91 -161 -62 -224 -318 -415 -223
1855 -223 175 -232 -334 -146 -119 -72 -86 2 116 86 -136 180 336 245 143 26 280 498 107 -46 195 158
1877 158 32 -268 11 266 -48 -266 -541 73 3 -424 -530 -86 103 -271 -312 -41 306 -83 -391 350 548
1898 548 -3 22 373 375 235 26 -40 566 366 -86 -64 387 -98 -535 -189 13 -285 -173 -208 -66 -99 -389
1920 -389 -96 -215 -313 -111 -239 86 236 -59 -19 -161 114 32 121 260 128 189 220 242 209 174 494 -94 -315
1943 -315 103 260 -98 -365 -44 80 -343 -669 -162 187 -29 -292 -243 247 171 -256 82 596 21 -242 -209
1964 -209 513 214 -25 -53 -38 312 192 -145 -103 536 76 -259 -235 275 -241 -283 -68 -35 71 78 -463 -206 179
1987 179 75 -211 -104 77 113 8 134 266 193 158 353 133 513 -19 -275 402 509 222 -159 -65 277
2008 277 -272 -24 71 156 18 -167 -49 32 -286 -250 44 -236 -135 -138 -531 231 240 -199 102 486 370 -242 164
2031 164 -69 337 207 252 -268 -8 107 -77 4 274 218 -355 -342 -62 102 116 -131 -346 -1 262 -533 -333
2053 -333 259 459 -165 -386 9 -59 -292 312 428 297 55 211 -187 492 535 -240 257 294 46 -597 21
2074 21 110 148 -66 89 -59 -179 -443 -192 -107 23 -66 -228 56 377 -76 -390 139 178 -18 -30 177 40
2096 40 -50 351 53 -20 219 189 -59 -292 402 -85 -55 -171 -65 -140 -61 -247 -42 100 -87 -636 -365 256
2118 256 -21 -301 357 155 -376 -140 -2 422 227 351 157 185 135 250 -169 220 485 -173 -183 -112 -78 -222
2140 -222 207 237 -72 32 -221 -325 -27 2 7 -149 -38 185 -212 -280 335 182 122 54 -17 178 188 -30 -111
2163 -111 81 470 -13 -250 433 195 -459 -221 300 77 -453 -94 -146 -132 -115 -240 -123 -120 -10 -197 94 284
2185 284 -151 -115 128 151 -127 169 196 -21 121 248 -129 -53 32 88 211 -15 55 9 102 -196 54 318 220
2208 220 -183 -458 263 -70 -518 -127 162 -94 -232 -153 92 -13 -73 87 271 409 217 94 275 368 4
2229 4 -71 184 358 -60 -327 -159 78 -234 -71 -126 73 154 -198 -215 278 71 -116 -337 -81 -96 118 -51
2251 -51 23 261 -35 -192 182 200 313 195 -51 173 355 -13 -25 -103 -60 -31 -68 120 -35 -308 -281 -212 -424
2274 -424 -110 -93 -451 59 101 -169 81 -74 289 -59 -255 43 120 -92 -2 -98 345 142 112 12 -133 18
2296 18 -219 -179 184 -46 -59 -86 -153 -331 189 -249 -343 -546 35 -275 -256 -203 28 -232 -384 143 -16 197 78
2319 78 77 440 353 280 139 246 106 -297 90 297 -47 -446 -254 275 123 -212 -150 151 43 -216 -204 -101
2341 -101 117 -361 -338 -33 -78 -212 -91 -138 129 313 -153 334 72 197 -83 236 170 330 72 82 152 286
2363 286 -46 -97 154 73 -168 -352 -249 20 117 -213 -106 143 90 -54 -246 46 183 -35 -241 130 153 128
2385 128 -81 -411 238 34 -199 -256 -93 244 -162 -149 -16 -105 -28 -282 -14 28 -21 -401 4 -132 -42 -41 -471
2408 -471 41 -103 31 -75 283 347 -13 92 45 357 -31 -153 -123 121 344 -229 42 420 243 -73 6
2429 6 140 -31 -201 -142 -13 176 -229 -261 -85 -128 -165 -173 -279 109 81 -163 0 -49 -106 58 156 157 195 -16 101
2454 101 132 262 35 53 107 338 -154 -133 -122 -74 -278 129 27 -106 285 -122 -186 -54 200 -173 -235 -252 232
2477 232 -27 69 -138 291 401 269 -172 219 488 142 187 167 131 57 -177 -35 -65 -99 -94 -346 -167 69 -121
2500 -121 -150 67 32 -250 -495 92 95 145 -222 155 -45 249 93 212 124 175 7 238 165 202 -190 -109 386
2523 386 -124 109 -4 -348 -126 305 1 -90 -76 -122 -276 -279 248 -25 -293 -152 -18 -176 -270 -113 -68 247
2545 247 458 111 -204 394 298 -43 176 423 34 -51 135 229 197 193 -64 -112 -126 262 -319 -83 124 -75 -366
2568 -366 33 -201 -278 -305 -192 135 32 132 -121 -108 215 70 135 203 351 -43 -308 284 278 291 -106 101 -49
2591 -49 -18 -70 -217 5 223 -219 -421 102 -135 -426 -158 -45 291 -291 106 25 -294 34 139 142 47 495
2613 495 -55 -129 252 431 151 -15 -79 153 -142 180 23 -175 283 -267 -237 -223 173 151 -36 145 53 -267
2635 -267 -220 -188 -77 -39 115 -342 11 16 115 -278 212 318 94 66 59 159 46 171 146 69 -29 66 -100 -70 175
2660 175 -56 -186 -72 -107 -363 -155 -8 0 -60 -9 -440 -50 -116 -16 147 327 129 -53 111 222 90 -135
2682 -135 -103 -28 -120 53 87 232 22 -195 -222 97 -80 -266 -262 -290 21 -286 -32 -233 -125 -196 -22 90 107
2705 107 -46 86 173 265 257 354 102 79 549 367 16 29 -110 -55 130 -101 23 -17 -54 -119 60 88 -41 -67
2729 -67 -335 6 -107 -1 -247 -98 14 113 -295 45 155 44 -153 377 240 -221 138 175 309 -93 -161
2750 -161 75 2 143 -228 -69 -84 314 -99 81 341 -90 -218 -22 147 137 -66 -140 -23 31 235 -20 0
2772 0 191 65 314 60 -71 257 50 48 38 182 -39 -62 326 -6 -177 70 100 157 -178 -442 -172 -12 -129
2795 -129 -127 -9 -77 -18 -207 -12 -205 -82 49 241 78 97 246 144 226 212 107 -152 31 194 -81 2 -43
2818 -43 52 192 -141 -44 -471 36 -141 -156 30 -160 60 -197 15 240 471 -150 -11 3 92 16 30 234 -75
2841 -75 186 86 30 220 15 0 -16 -68 -20 5 -129 -80 25 39 -36 -79 -104 -49 42 -142 14 -38 -2 -37 187 -66
2867 -66 -12 231 388 154 36 65 160 -21 -33 100 -5 -37 204 175 235 -110 83 -65 -135 56 -79 -184 -196
2890 -196 -131 -248 -10 -54 -112 -125 90 57 126 112 -81 -235 4 22 277 98 371 28 232 -63 2 -1 83 23
2914 23 -132 5 233 -288 -274 74 161 92 50 -307 18 15 95 -178 -98 227 -4 3 147 77 -55 37 119 -19 79
2939 79 -41 181 194 166 64 -45 -39 141 -75 138 103 -110 -10 47 68 66 -88 -157 44 88 -115 -47 39 142 -23
2964 -23 -39 235 21 4 4 160 36 438 -233 113 105 74 231 113 -21 -23 76 -60 -52 -166 -176 21 -129 -224 216
2989 216 55 -75 77 136 144 19 20 -211 140 136 263 63 51 94 163 -69 58 112 -55 -30 298 108 -89 65
3013 65 156 -227 -122 140 -108 24 17 -264 -207 -154 -368 -20 -142 -19 5 -136 170 374 -97 22 92 150 7
3036 7 -175 283 6 104 -6 102 16 210 -61 -203 -20 127 -95 44 0 -130 -195 68 140 -36 -182 178
3058 178 -41 -79 -169 -190 163 191 115 74 220 14 106 43 302 123 246 306 56 -17 46 -26 -310 -263 -15 113
3082 113 8 -50 80 139 -59 -135 -178 -300 349 -34 -161 63 107 -166 -285 21 -25 -160 16 221 0 -181
3104 -181 -136 18 -46 338 -32 -86 -115 -60 29 184 9 -58 -386 -289 -11 -62 -71 134 -59 -109 -192 73 -38 198
3128 198 168 -102 10 -77 -131 -46 232 -112 -3 170 -42 -205 317 147 -54 -34 -21 96 154 -76 32 -73
3150 -73 -150 -80 108 -231 321 -155 -208 79 216 149 99 -49 160 -534 155 224 144 261 -141 -84 118 156 24
3173 24 199 -23 -25 -174 34 109 56 -405 17 81 189 -300 -155 49 95 50 -69 151 15 -73 24 -49 14 -115
3197 -115 89 63 4 97 33 66 172 160 6 -219 77 46 -43 -167 344 -72 -304 -72 -251 -181 -24 -130 -466
3220 -466 67 -358 -137 32 -177 -14 -88 18 -89 67 110 229 -96 31 214 58 39 -256 64 -35 67
3241 67 26 -314 -19 -98 -1 -115 -22 -99 -78 -73 62 74 -127 -92 225 -139 6 124 -57 -54 -163 177 164 -90 143
3266 143 156 -22 -287 178 115 -62 203 33 -3 -198 168 -60 133 -86 -37 -63 -28 -154 -51 -211 68 -22
3288 -22 74 266 -25 362 16 207 67 90 -54 -80 192 59 84 -260 -62 -126 140 102 57 13 -206 -208 -222 -195
3312 -195 -16 -191 84 -46 81 -33 -126 -29 -8 327 -27 -190 -51 94 -150 272 109 -42 -55 -158 -166 413
3334 413 13 160 -188 60 -167 105 -67 -378 54 -32 -21 153 -220 41 111 49 -66 -85 -20 -144 -183 105
3356 105 131 181 -167 136 78 18 -191 -21 153 332 72 36 105 -72 -136 43 220 32 -40 -267 -185 68 -158
3379 -158 -209 8 113 -27 -80 -37 187 -171 66 -93 -63 95 -127 -32 77 -30 136 34 62 -197 145 30
3401 30 -124 141 23 24 -198 140 39 -115 -45 -23 -340 214 121 98 29 176 -148 130 195 90 -179 34 -142
3424 -142 -294 -42 166 -188 -103 118 54 -61 20 -99 -184 -136 -91 99 -18 10 -100 -27 -281 -127 -27 52 72
3447 72 44 17 139 132 3 -28 17 -17 -66 41 84 147 65 87 308 -174 -289 -105 203 102 171 -228 28 10 -39
3472 -39 -72 147 209 -292 -35 185 -23 -7 178 -27 162 -30 22 -88 129 -215 97 -46 -31 -51 0 47 44 127
3496 127 -13 -296 368 -13 -57 178 -177 192 97 40 -79 -136 -116 4 -260 -86 -73 -209 -102 227 113 15
3518 15 132 -180 40 109 -8 -76 177 -83 -94 -13 -79 -15 -291 45 -79 21 41 -184 193 -74 -71 -21 -155 180
3542 180 -110 -48 -237 -7 19 122 63 91 24 68 -92 -141 198 31 -333 -41 260 24 -211 -22 34 -293 -164
3565 -164 27 80 78 175 -112 -381 -263 237 1 -42 -29 74 300 -154 -133 39 83 204 -30 88 -9 -86 61
3588 61 -102 -50 88 126 -186 -57 101 62 -66 -221 -40 -318 147 -241 -225 190 191 -42 62 -146 29 -30 -15
3611 -15 -93 173 -14 22 -52 180 -188 118 2 -67 96 -14 77 -109 299 455 -29 -20 -30 -199 -210 19 103 -31
3635 -31 -127 -70 -103 110 5 -130 48 38 108 -52 -162 -1 -38 83 -74 -114 -126 75 117 -44 -78 314 26 210
3659 210 -29 -5 -142 30 -126 18 136 13 -115 -142 -20 -42 209 -29 120 16 167 -14 -121 229 40
3680 40 -39 12 -42 36 -60 264 212 174 -4 -9 195 -128 40 -255 -211 136 166 -4 128 -158 25 -43 -7 -17 277
3705 277 61 -47 167 17 4 -69 188 -61 69 98 237 23 96 12 -20 134 70 263 49 36 -111 -316 -13
3728 -13 147 -93 3 118 93 -59 61 117 -39 -241 64 -127 -30 73 -125 160 -163 -60 -124 -186 -96 182 273
3751 273 -2 38 90 -33 -41 -105 41 -41 -49 140 59 -8 24 -61 -150 76 -368 130 39 85 -151 -182 223 -76 -131 47
3777 47 -60 -221 15 -17 -164 79 6 -72 -126 -168 162 88 230 -199 98 -72 -49 239 -306 -151 -263 -113 -49
3800 -49 111 10 157 132 -61 190 185 -107 13 25 -244 -16 256 87 14 -217 49 56 257 71 93 -11 15
3823 15 113 12 20 67 24 -162 21 -232 28 -123 -172 -77 164 -132 2 -6 35 -50 110 154 -10 -94 -227 66 -84
3848 -84 -1 -125 74 -33 -222 -205 -48 179 182 62 -82 203 -70 83 140 -196 61 144 31 -284 -19 98
3870 98 138 -41 67 292 -210 -64 -211 -36 156 41 -79 20 147 202 -165 -68 -203 -26 -65 166 6 -136
3892 -136 143 -134 -92 -79 172 -9 -100 -97 -11 -92 91 169 87 56 35 138 -185 -238 86 91 -11 -104 5 -51 300
3917 300 -6 -108 182 106 149 -89 -84 100 88 -171 -52 -155 -262 60 64 29 -132 -31 63 -124 150 140 -280
3940 -280 37 307 208 197 207 76 -137 -168 58 102 -107 -38 61 11 125 187 -111 86 -150 88 99 167 20 100
3964 100 -68 318 -51 -197 166 4 -131 61 134 188 32 -228 29 139 -136 -162 151 366 74 -83 -72
3985 -72 -69 192 23 -137 18 257 116 -279 91 35 -66 -140 202 -32 -90 90 -145 185 -209 -147 410 115
4007 115 64 -170 140 188 -135 114 -181 -70 -277 105 16 111 63 -64 -252 65 -166 -145 97 -70 42 37 178
4030 178 20 -296 275 -27 411 -17 -42 376 4 -49 -33 -25 -95 171 -3 -5 205 -26 277 -37 158 -84 -58
4053 -58 99 -51 101 -247 -88 10 -183 32 23 -235 58 -78 106 -6 165 -317 -52 332 -159 30 66 149
4075 149 -111 29 8 131 45 11 132 -130 -74 -326 -65 51 98 28 181 48 -4 -24 129 102 30 206 -33
4098 -33 -62 86 100 90 -224 -101 -404 203 33 346 102 -232 123 -36 -99 22 59 -175 -140 -146 9 -69 184
4121 184 -156 -161 139 -95 71 -123 -18 264 -17 87 -33 -19 72 112 136 -35 58 -148 27 -33 293 -67 -119
4144 -119 33 -141 307 67 -364 -145 -14 -1 66 -260 149 110 -149 -102 85 -136 -45 -330 -127 -116 7 -61
4166 -61 87 54 195 -89 98 47 -31 -22 268 -233 81 -50 -125 149 -102 -264 -35 -46 -118 -33 19 20 -187 -125 119
4191 119 -22 -17 60 302 -60 15 245 6 -150 72 -345 -166 130 -111 -47 -190 34 29 -211 -196 -201 -299 -54 239
4215 239 -50 -78 -30 -237 58 -199 195 232 -343 266 91 257 230 12 -169 -22 -26 -96 -52 331 -10 79 293
4238 293 -95 60 -161 -182 -248 -30 200 131 -104 0 -291 78 -82 186 90 -212 141 31 -38 44 341 -5
4260 -5 186 -315 20 113 41 -135 312 114 42 -37 72 21 -47 -94 115 2 -40 16 -27 28 -83 -142 101 -17 -98
4285 -98 57 -77 165 -215 -72 -50 7 -33 130 63 195 170 -52 32 101 -59 -131 62 -93 -1 89 118 39 109 44
4310 44 -151 154 187 -174 93 26 30 -56 -154 50 -202 64 51 -187 70 83 104 -283 -247 9 -153 294 -59 -169
4334 -169 -142 18 -238 -113 85 -47 308 -156 -49 17 -19 -33 -105 74 18 -186 97 -154 -122 165 -117 -20 -167
4357 -167 3 48 72 91 -59 27 107 151 170 58 44 -221 99 6 71 1 319 247 67 14 -332 -63 9 71 -128
4382 -128 -90 55 228 118 -55 106 136 -21 -104 5 14 -34 177 56 102 62 -167 -88 5 -255 -103 -32 51 -4
4406 -4 -11 -240 -19 -93 -103 -95 -25 76 186 15 66 -23 -82 -154 -157 26 41 26 -29 -51 207 -87 -72 225 -120 88 45
4433 45 108 50 -81 15 -86 -2 128 105 -74 34 -66 108 37 185 129 261 -134 -53 290 76 -126 13 342
4456 342 13 9 -134 -74 -137 217 268 37 171 -101 167 158 -194 49 235 248 22 35 -25 -86 -13 -218 -22 70
4480 70 -20 -166 72 331 63 33 277 141 197 77 127 -37 43 218 -207 82 73 99 257 -232 34 -1 83 -47
4504 -47 153 -179 -32 36 -122 -173 -28 -139 -27 40 -153 62 271 101 -81 197 4 87 118 16 96 -34
4526 -34 52 -326 63 14 -166 -77 8 -217 -118 32 85 229 -270 -37 -113 101 -166 193 -87 -15 -255 111 0
4549 0 276 -422 92 225 12 85 108 103 94 94 -27 9 -59 -98 -180 -3 92 17 102 -48 -33 -97 27 84 114 10 -93
4576 -93 122 -88 4 26 -114 -354 122 125 -77 38 106 4 -187 -18 179 175 -136 -99 -55 19 39 -75 -92 -154 75
4601 75 -123 -180 111 -148 131 41 -147 56 -9 151 -67 27 -1 132 95 -94 161 97 185 20 28 128 -156 298
4625 298 40 -161 -113 -99 -212 -49 167 31 -143 -43 122 -120 51 -189 -193 22 193 49 34 30 -9 38 -9
4648 -9 189 281 87 -258 184 28 83 242 34 62 37 194 93 -130 94 -42 -115 430 -46 60 -51 -160
4670 -160 125 129 -68 -152 -85 -43 -137 -442 -214 172 -16 -36 2 108 381 200 27 108 -20 183 162 -179 26
4693 26 -185 -154 168 58 204 -168 -300 -320 -14 -104 220 -8 57 305 156 21 -113 59 50 53 295 -228 29
4716 29 -67 -60 201 -227 -116 -38 78 183 165 149 135 -23 -120 3 79 -27 -97 -108 190 -246 103 126 124 58 -130
4741 -130 91 148 -48 164 188 -193 -115 140 -128 -13 -29 -42 -52 -21 -41 205 -42 90 -95 216 46 -205 -80
4764 -80 70 -46 -49 236 -22 -141 54 -35 -176 101 177 44 137 46 -227 39 146 -50 96 -84 -117 -101 102
4787 102 20 129 491 -98 -18 -204 15 -170 22 -168 -154 58 -36 175 188 -254 -34 96 -226 73 -170 -88
4809 -88 -108 111 9 41 35 147 -211 51 191 123 -14 216 -92 -4 8 107 -103 -38 91 -5 18 -11 -122 -260
4833 -260 19 183 158 57 -192 -27 -217 174 26 80 2 22 -27 53 149 -24 -29 -101 -73 -86 113 124 325 -22
4857 -22 26 -69 -159 225 -3 -36 14 -196 -55 19 -94 78 137 23 161 124 -303 46 157 299 339 -80 20
4880 20 -86 -42 168 -96 -323 47 59 215 72 73 115 132 18 -109 200 -57 -31 -27 -185 -151 67 280 -125 243
4904 243 136 -214 -33 -76 -23 52 14 -7 -34 -126 90 -21 15 -124 53 -318 70 -361 39 78 31 -98 -76 11
4928 11 187 -131 47 -102 -162 51 102 -97 4 -111 87 86 227 341 104 52 24 -59 -238 89 77 82 -300 -118
4952 -118 189 89 248 93 -206 158 -64 -196 92 202 74 -17 109 46 15 29 -21 -151 -105 249 -42 19
4974 19 12 -75 225 47 -54 134 -54 -70 -147 236 230 67 -73 -25 -54 -103 -74 46 -49 -191 9 -504 38 -56 107
4999 107 -7 -176 167 191 62 -195 -23 -57 -196 -22 31 -160 -44 30 -26 57 203 236 77 229 105 -185
5021 -185 123 -70 -32 35 42 141 -104 151 -129 -4 -137 112 -200 9 198 -10 -132 192 -64 -82 -201 -74
5043 -74 -88 -28 -37 -36 35 63 250 -137 -32 -4 -309 -3 31 -105 43 -165 260 -102 -111 -221 -38 -67 -158 -217 -32
5068 -32 -1 -34 -47 -106 -206 -168 -41 -25 -204 103 72 104 -238 30 -9 -118 93 32 21 -30 -36 -56 -3 235 -100 54
5094 54 47 -294 -67 180 120 -32 -122 -112 117 -191 9 -97 -36 -150 21 -297 -124 88 165 320 -29 -29 -13 91
5118 91 12 162 -12 118 -23 46 26 -125 196 187 54 47 191 31 -185 -24 -255 58 90 -128 -131 18 69 -56
5142 -56 9 -280 -110 64 31 -17 -138 -112 -32 -179 -205 68 -108 110 -227 42 -16 225 -11 -119 -19 -109 -4
5165 -4 -108 -192 88 135 -237 -206 -22 -160 -59 169 -17 -201 -103 87 -144 -25 -234 -301 -44 -13 -130 74 -48
5188 -48 83 -146 -140 43 -36 101 -4 -8 51 -129 -37 123 51 88 -149 177 -66 215 -137 -217 78 84 -16 20 -154
5213 -154 -28 -14 16 4 85 -65 -56 24 221 110 -20 123 -40 51 -40 -66 56 -170 71 84 -147 76 -111 67
5237 67 142 -202 -74 -240 6 164 82 -41 191 38 -76 -2 -299 141 -98 -197 -4 237 129 13 -53 -28
5259 -28 65 126 -141 -117 255 -11 136 10 192 -123 123 24 92 126 104 -37 -66 96 -40 94 93 78 -141 4
5283 4 187 -33 47 50 -6 -40 -134 -90 -128 209 -100 68 67 -5 -218 51 165 206 62 122 -432 -8 -134 -11 60
5308 60 -94 -74 -70 4 140 -63 -62 -102 -73 85 151 157 -117 47 -135 74 -82 180 99 -54 -43 55 143 60 55 220
5334 220 88 17 -47 115 -164 190 10 -71 82 -106 -46 175 -117 -28 128 -37 -72 24 186 85 -189 -151 254
5357 254 -123 -166 -118 -9 33 163 0 -8 135 -207 -54 47 -32 -21 5 50 180 121 -13 -6 -20 -22 20 -53 164 -30
5383 -30 4 94 115 -83 -94 2 59 102 -65 -84 108 258 44 -65 -23 -95 -40 11 -64 -39 -6 -36 -160 -118 50 221
5409 221 78 -174 -250 -4 96 -109 197 315 -156 -247 -78 13 -8 37 275 -91 128 -29 -222 -114 -89 -21
5431 -21 276 55 -103 -19 83 193 -246 180 104 134 -115 93 -30 87 146 -157 167 -129 -40 -3 -86 81 -79
5454 -79 219 29 166 -85 3 20 -113 311 333 195 -132 67 -108 -229 37 298 210 -62 -153 182 -123 -106
5476 -106 213 -225 34 -121 47 196 20 -31 -114 18 -79 109 72 71 -182 -9 -165 -23 218 -35 64 -119
5498 -119 158 -22 -234 -177 81 64 115 110 -91 229 311 -17 42 64 115 40 -95 18 -17 127 230 -34 190 -1
5522 -1 190 210 21 -1 60 -33 41 -124 -54 -26 -191 3 -20 -92 -199 169 -70 92 -137 13 -144 -126 -232 11
5546 11 169 39 170 23 -94 -56 319 133 38 -30 78 -103 -50 242 103 83 98 45 -21 40 -150 88 91 171
5570 171 2 102 0 -180 117 259 76 -37 28 -133 51 -206 194 -125 -72 -63 -130 82 -75 146 -85 -64
5592 -64 -5 57 -155 6 -256 -351 15 -19 61 -46 2 55 -44 133 -59 -142 -39 18 97 54 -155 -110 139 149 -221
5617 -221 233 2 -211 36 -5 343 60 54 -68 68 124 -36 258 24 -13 -97 103 88 133 -35 92 -122 112
5640 112 -85 -20 279 53 249 17 261 130 -49 40 86 195 78 170 147 -123 -44 225 34 6 -115 113
5662 113 -160 90 -55 -191 -13 -144 -55 160 -45 256 64 218 209 -110 -52 -52 -138 89 77 -169 -115 -160 -175 -53
5686 -53 108 102 12 252 66 147 -94 17 -105 -129 -137 -70 -1 15 -61 -172 39 90 15 48 46 -58 -38 88 -175 -167 146
5713 146 98 -67 -125 -175 21 -115 -216 -74 -2 7 -84 -45 70 84 -109 5 -111 -62 -169 -48 -60 -119 77 -295
5737 -295 -130 16 -135 -13 -212 -73 -68 -135 -69 132 63 275 -24 -61 140 -45 -141 -161 -38 9 -166 -209 -106
5760 -106 171 43 87 272 -18 -185 10 -20 78 -260 92 6 -253 -79 40 -48 -229 -49 34 68 33 144 -12
5783 -12 93 135 -311 136 -326 239 -58 178 -131 46 -226 -2 -170 -141 88 -94 -64 25 -70 58 138 131 -135
5806 -135 -103 155 164 346 -120 -202 59 -107 65 -235 -85 -9 -17 217 -159 -163 51 -330 -93 102 -181 113 -9
5829 -9 -20 78 -8 -1 127 91 -332 -195 111 -236 87 24 175 246 53 -130 151 -191 81 -152 -315 78 -110
5852 -110 168 -58 -51 -106 83 52 -70 -51 -63 110 -223 -32 -67 71 -30 -55 194 -127 -76 16 59 -115 2 7
5876 7 -28 -23 -101 -2 -72 -130 -245 -160 -10 33 131 54 -140 136 59 -307 -134 -97 123 -113 -98 24 185 -61 129
5901 129 133 362 167 -24 32 6 311 85 -220 -130 19 101 -140 -97 -139 -172 120 159 -25 -14 21 82 123 79 -205
5926 -205 -69 129 12 72 130 -259 -18 21 161 14 -90 44 -208 81 109 -37 -53 32 -3 108 -84 45
5948 45 20 87 -111 -243 66 -94 -119 97 -261 125 233 44 -82 71 -264 -65 167 132 49 -70 -133 117
5970 117 25 30 -108 20 97 -114 43 -188 66 87 189 234 78 67 -160 54 -128 -93 -133 -182 145 159 -126 -2
5994 -2 -103 -94 110 262 -191 124 2 129 129 31 -35 74 -149 -6 30 -77 166 61 -127 139 -128 -6 -152
6017 -152 144 86 -108 22 -357 10 -139 -29 401 168 122 22 -156 -86 -106 33 10 114 212 -8 12 194
6039 194 101 -61 39 227 112 -12 -296 63 219 -48 46 -103 -187 32 -279 -103 234 38 21 96 28 51
6061 51 -121 -14 58 -11 30 -247 34 54 126 11 23 -52 -113 14 343 -179 27 -166 -79 135 108 63 128 48 189
6086 189 -193 -257 154 134 -87 199 -121 145 -55 152 17 186 -178 -78 239 -47 123 222 -36 -88 -296
6107 -296 -80 40 -30 -93 -50 176 -111 74 -202 0 -123 10 22 210 0 -47 104 209 92 -100 -195 -119
6129 -119 -158 49 -129 -144 -168 -218 101 -81 225 -47 -59 -116 -115 -107 62 -216 76 -18 87 -20 -129 47 206 110
6153 110 -38 -153 83 40 33 35 32 36 -25 299 -22 58 -96 -80 -48 -158 -47 -90 384 -300 206 56 -152 71 248
6178 248 -152 -22 -149 -90 -111 -144 49 -184 -101 -35 -116 -113 109 -1 -1 99 -100 31 -6 -26 12 -52 184 43 82
6203 82 267 -46 205 -13 -132 -106 76 -1 201 -150 -273 3 -278 322 202 183 -223 3 21 -37 131 -297
6225 -297 -66 -27 100 -159 31 -191 146 -29 -92 -38 -22 56 93 448 58 -51 -64 -13 -213 -35 -180 -20 -260
6248 -260 34 144 178 105 -44 46 215 23 168 100 8 74 -183 100 -71 50 -59 -48 -36 -26 26 -202 -228 -278
6272 -278 -79 -275 -56 -43 -17 -237 -98 41 64 119 202 215 -47 -19 -43 -240 -384 -171 -124 -39 169 131 98 -88
6296 -88 54 -37 235 90 -106 -228 35 96 -174 -118 23 -411 229 -165 -167 306 -103 -89 -87 291 -199 -98 -160
6319 -160 -307 -112 -134 -305 215 185 33 202 -162 19 -37 -99 185 -53 -136 58 -139 -6 -16 -80 151 -40
6341 -40 -61 -112 -49 -68 162 11 -135 -34 15 -66 -19 120 -53 -149 -326 64 50 40 140 76 -112 151 165 -156
6365 -156 -18 26 15 -143 -89 -47 15 -6 -25 -82 -74 283 -36 260 44 -52 47 90 -116 22 -232 20 -12 227 93
6390 93 -57 52 147 192 -165 -172 -51 136 141 147 -13 41 -164 -288 -51 -329 -335 25 47 -146 70 -191 362 254
6414 254 -60 -34 -92 158 -194 62 85 186 -211 30 113 -105 -61 -203 -237 -22 -178 44 -224 128 -50 -247
6436 -247 350 104 -154 40 99 30 43 -42 -47 -203 -247 -87 19 -263 171 197 -140 -147 -151 133 -6 114 59 -26 248
6461 248 -178 -161 55 -92 -215 -252 -196 155 -173 156 -143 95 49 -178 -253 -162 118 29 23 -204 18 293 -61
6484 -61 56 17 41 200 93 -235 61 68 -11 123 268 19 -5 92 26 71 19 -164 187 -218 -2 -20 141 42
6508 42 -61 71 175 40 -41 88 -40 -3 30 33 -228 -30 120 122 72 -218 -20 -4 -260 230 243 -135 -67 119
6532 119 170 27 -463 301 -315 179 -82 -115 -111 -204 17 4 1 -26 -27 -169 132 -36 -86 -77 190 190 99 210 154 128
6558 128 -83 -28 -99 31 114 88 -98 -55 -152 25 35 -124 246 -14 -93 -119 155 232 -242 -93 252 8 114
6581 114 51 12 -109 31 -168 3 -41 179 50 31 83 41 106 -81 -122 -212 -9 -43 85 0 -97 72 -5 101
6605 101 -131 -148 -14 54 -62 143 -16 268 -15 10 -19 58 184 18 -5 61 -27 -111 -96 23 -67 33 135 138
6629 138 51 -56 220 -85 373 209 66 -90 -58 -11 -179 -129 53 74 -74 -202 6 -152 94 175 232 -155
6651 -155 122 34 13 100 -74 -80 -129 23 -160 257 -84 44 -83 94 131 -53 -13 78 -218 -200 -10 109 -145
6674 -145 276 -56 69 87 33 -13 -229 121 79 -48 -30 142 82 102 -136 45 -84 192 231 25 -73 -47 -200
6697 -200 138 99 55 -348 78 67 -33 -72 103 -48 218 109 87 190 -193 19 -192 54 -89 -25 168 -25
6719 -25 -232 -123 -116 -13 107 -214 -38 42 147 140 -142 -49 16 -122 -95 -19 -302 101 -240 274 -39 -1 -160 17
6743 17 -12 -107 97 -109 -334 -98 0 -15 272 -30 2 -32 -12 -70 -225 -25 -31 -35 -150 -139 -161 -21 106 28 202
6768 202 60 314 12 -15 -42 -413 59 -26 -28 42 -126 210 -15 -219 -185 -222 -46 29 84 61 -1 220 168 -58
6792 -58 -306 311 122 94 106 -156 41 75 60 83 326 105 -76 220 -59 -71 55 128 -135 -36 -12 -9 -72 -105 -216
6817 -216 74 61 38 8 133 45 63 -169 13 -40 64 14 263 101 -79 -35 -108 68 -99 138 6 137 59
6840 59 393 -238 -38 8 -191 -39 -165 -102 60 -36 -314 146 -124 -27 205 -75 -70 -99 -224 117 -134 36 176
6863 176 -103 100 -149 24 51 -37 -133 136 99 191 -120 123 45 193 -88 -118 -59 -301 159 -25 -154 -51 -65
6886 -65 -93 -126 107 -36 -71 32 191 42 -30 -1 -68 61 -77 90 -186 351 -48 -11 -188 -78 -110 -65 -164 161
6910 161 38 -26 150 124 192 -4 46 108 128 -101 92 -84 245 -217 139 88 -141 262 99 -65 -8 20 -403
6933 -403 -5 131 111 -158 111 18 -161 -3 -80 -26 -169 -174 41 -32 107 91 8 -126 69 -65 -80 -66 21 134
6957 134 -56 153 -214 -170 -32 -79 155 -229 31 -95 30 32 -324 12 -128 176 -7 -62 -46 -127 -52 44 161
6980 161 -21 -71 -65 4 205 34 20 -19 -68 -49 204 39 195 -270 69 -164 127 -70 -132 32 367 44 176
7003 176 280 -183 173 -49 208 -122 91 -12 80 -65 127 90 -120 -273 -25 291 31 -11 8 76 196 20
7025 20 -141 -4 114 -252 -3 -169 39 -155 40 242 -59 -25 -98 19 72 54 145 110 39 28 -181 -27 -44
7048 -44 79 -23 96 -218 -119 -152 113 -62 225 59 -135 22 -177 137 28 63 39 145 129 132 -4 -239 -102
7071 -102 -111 -69 -223 57 -122 -38 -35 92 287 -2 73 91 60 -23 -95 -170 -92 185 101 -167 -169 420 -214 -153 98 71
7097 71 193 23 -29 -180 105 140 -28 -134 77 94 158 11 54 28 65 -67 209 -156 110 20 -46 26 -62 -108
7121 -108 -179 7 157 -124 -206 -119 71 -48 -148 -258 -2 -73 174 -17 91 -25 -179 -61 -239 31 -294
7142 -294 -72 -195 70 -6 103 -37 -106 -56 -99 90 67 -245 80 69 208 55 -60 181 -7 63 76 -75 158
7165 158 -76 -183 127 11 175 -93 94 27 169 87 30 -189 -33 -304 7 -191 -92 185 168 -207 17 25
7187 25 53 58 144 106 98 -298 -177 -75 87 -32 36 33 -239 -175 114 -127 -56 -66 -79 -74 -114 254 -150 218 -92 165
7213 165 140 191 -5 -117 -291 91 -143 73 40 214 135 -91 47 177 107 -216 -266 -18 -123 94 71 -277
7235 -277 156 -68 -14 -40 -369 142 92 176 23 246 -109 -199 29 125 -208 -217 133 -24 -95 39 -226 -55 -50 107
7259 107 198 42 -135 -144 -32 -212 370 -68 137 61 -44 -17 -194 70 170 -65 243 78 -54 -135 -85 -43 -78
7282 -78 -92 -101 326 -7 122 -113 195 27 208 29 58 -21 -114 -9 45 219 96 84 -154 1 -153 -43 -70
7305 -70 -49 -105 -127 206 92 191 -118 8 -40 -39 -376 245 -134 -78 -164 27 -55 89 1 155 -35 80 -88 -49
7329 -49 -9 31 -109 68 56 -28 45 -29 89 -38 102 30 -124 -52 -72 -70 52 143 11 -8 -193 150 131 -43 -30
7354 -30 -23 -19 -75 347 -152 86 -1 72 -10 95 -30 71 -149 54 212 233 30 -225 -195 85 -70 -39 -13 -20 -167
7379 -167 56 -212 -31 179 -108 164 2 -98 -118 -154 -4 -5 -4 152 171 53 247 40 246 178 117 105 -199
7402 -199 232 219 186 30 -98 45 146 -138 -29 -56 90 178 -204 126 57 -50 303 -62 -237 30 -176 185
7424 185 -366 -180 143 146 117 -108 -32 91 -141 -229 -44 -168 72 111 -16 -134 -28 -54 -87 -33 16 97 -66 -59
7448 -59 119 -92 65 -103 109 11 -176 224 77 58 -59 172 23 118 -47 -216 -21 -170 145 194 -154 61
7470 61 65 89 84 76 -7 -73 119 81 35 25 -184 -93 197 -74 110 -42 212 -210 -21 20 -8 186 -164 318 -230
7495 -230 125 -19 81 249 -182 2 79 -8 -98 92 -22 35 15 335 134 -54 160 -4 243 -68 -181 187
7517 187 -170 -137 -73 198 19 5 275 -54 -79 -85 93 -97 30 135 120 -25 85 77 -174 96 23 -89 99
7540 99 35 19 160 290 -216 142 220 -178 128 9 46 130 196 1 -99 -36 -154 -78 14 -58 -30 -17 48 -131 4
7565 4 165 -14 96 113 -55 90 -77 -161 -114 55 -54 105 316 -153 83 -36 -137 -44 5 -129 98 69 191
7588 191 80 -8 78 -105 73 138 -129 122 287 134 110 -195 -160 -75 361 -79 -266 -18 368 -145 -144 -142 56
7611 56 -65 -223 15 -39 -29 49 -110 195 -239 -133 124 -170 39 -200 125 5 41 28 -185 -290 -8 71
7633 71 -126 -75 -63 -15 -35 197 79 -1 -45 183 60 159 -181 -194 -6 -10 -102 2 55 -43 32 -107 104 133 22
7658 22 32 -13 -2 3 -197 -153 222 120 83 -273 -11 174 -262 12 107 -90 -209 -26 -290 34 -31 -252 -75
7681 -75 -48 -99 179 -91 -64 10 -67 49 -86 7 17 -131 80 106 -200 -79 80 37 267 -296 -43 -233 -56
7704 -56 118 -248 -296 -32 -166 -4 -180 96 -156 -36 -28 -128 -152 5 -282 -170 -163 69 45 32 198 -17 47
7727 47 -94 -292 -127 90 163 27 13 16 112 1 247 56 -244 29 -183 -45 44 106 -16 100 40 55 -301
7750 -301 35 8 204 23 140 113 -134 -277 44 -156 134 129 58 -15 132 65 41 18 286 -50 -101 -24 272 -186
7774 -186 238 157 -69 64 -74 -67 -131 53 -97 120 -125 137 -198 -43 370 -133 -75 162 49 100 490 143
7796 143 -182 320 -26 -85 77 -153 -204 -67 -50 -76 91 7 158 -37 -49 -89 250 26 -51 91 -61 -6 -8 29
7820 29 -72 -116 -141 143 -50 40 -107 -95 -14 -103 -80 184 280 71 -120 117 46 -6 311 -175 -36 -83 -263 -87
7844 -87 54 -112 81 170 140 -248 -83 97 -13 -16 -111 87 -166 -109 84 -182 23 30 106 41 -223 -117 42 106
7868 106 -174 -22 16 -37 -2 -126 -111 181 -62 309 -43 70 -113 305 -58 50 -36 -10 -135 -106 36 2 209
7891 209 44 -98 -94 -125 -209 146 83 359 -118 58 54 -70 213 10 -22 -9 -193 61 59 203 -88 143 -124 88
7915 88 -224 71 -150 11 226 78 -13 -112 42 -100 48 105 -234 -33 23 -163 182 222 -16 235 -59 -94
7937 -94 287 -343 -108 153 133 86 42 -48 -88 -100 115 39 -25 30 41 206 -1 188 164 -114 -40 207 86 142 -40
7962 -40 -11 -115 -53 -119 -104 150 38 -119 -205 -159 -240 -87 39 107 -51 173 248 108 12 51 -182 -143 53 231
7986 231 44 127 58 -166 167 -104 -16 116 -84 47 -185 -165 49 33 8 -99 259 -160 222 156 -97 -6 13
8009 13 22 72 25 77 -156 -60 -38 187 51 28 -10 127 114 -146 73 251 8 -10 -69 26 -20 2 259 -315 150
8034 150 30 -176 -119 91 -185 -117 -55 8 94 85 -46 -62 -110 86 -22 90 -15 8 149 247 174 174 -75 9 -31
8059 -31 68 183 -233 -28 14 154 -23 343 40 -6 208 -192 65 173 87 137 183 92 -86 -182 -60 -48 38 -113
8083 -113 72 29 145 209 20 -1 -157 174 132 370 -121 -120 -265 -178 36 90 -316 -34 117 153 -216 274 382
8106 382 -60 -89 86 44 172 100 -4 242 172 -37 101 10 80 -34 151 1 33 36 163 -75 20 104 -304 27
8130 27 -88 4 101 -237 149 81 -142 59 87 211 -154 178 44 -129 216 135 28 254 38 84 43 183 -32
8153 -32 -8 -154 26 -35 302 -22 -273 153 220 -7 -214 -260 2 -97 -40 -89 -10 -18 -121 129 -23 -194 -94 169
8177 169 -69 -75 127 -245 -138 -6 -211 90 -75 131 -190 -67 64 -89
8191h9
##END NTUPLES=NMR FID
##END=
