##TITLE=1H_DE-29HK_HCl
 D2O
 8 sc, 
 12.1.2024
##JCAMPDX= 6.0         $$ Bruker NMR JCAMP-DX V2.0
##DATA TYPE= NMR FID
##DATA CLASS= NTUPLES
##ORIGIN= UXNMR, Bruker Analytische Messtechnik GmbH
##OWNER= root
$$ XWIN-NMR		Version 3.5
$$ Fri Jan 12 14:31:31 2024 Russian Standard Time (UT+4h)  she@DPX200
##.OBSERVE FREQUENCY= 200.1313
##.OBSERVE NUCLEUS= ^1H
##.DELAY= (6, 6)
##.ACQUISITION MODE= SIMULTANEOUS
##.ACQUISITION SCHEME= undefined
##.AVERAGES= 64
##.DIGITISER RES= 18
##SPECTROMETER/DATA SYSTEM= spect
##.PULSE SEQUENCE= zg30
##.SOLVENT NAME= D2O
##.SHIFT REFERENCE= (INTERNAL, D2O, 0, 15.7039)
##AUDIT TRAIL= $$ (NUMBER, WHEN, WHO, WHERE, WHAT)
$$ ##TITLE= Audit trail, XWIN-NMR		Version 3.5
$$ ##JCAMPDX= 5.01
$$ ##ORIGIN= Bruker BioSpin GmbH
$$ ##OWNER= she
$$ F:/spectra/data/she/nmr/H-F/1/audita.txt
$$ ##AUDIT TRAIL=  $$ (NUMBER, WHEN, WHO, WHERE, WHAT)
(   1,<2024-01-12 14:29:55.37 +0400>,<she>,<DPX200>,
      <continue with go, POWCHK disabled, PULCHK disabled
       configuration hash MD5:
       00 E9 B6 7A A2 85 ED C7 34 08 36 98 17 FE 4E 26
       data hash MD5: 16K
       DC 67 3C 95 79 C0 D1 62 C4 13 76 21 E3 94 58 9F>)
$$ ##END=
$$ 
$$ hash MD5
$$ A5 A7 72 A3 FF AE 50 77 B0 E7 18 0B EC 64 E6 6A
##$RELAX= 
##$RELAX= 
##$RELAX= 
##$RELAX= 
##$RELAX= 
##$RELAX= 
$$ Bruker specific parameters
$$ --------------------------
##$DU= <F:/spectra>
##$EXPNO= 1
##$NAME= <H-F>
##$PROCNO= 1
##$TYPE= <nmr>
##$USER= <she>
##$AMP= (0..31)
100 100 100 100 100 100 100 100 100 100 100 100 100 100 100 100 100 100 
100 100 100 100 100 100 100 100 100 100 100 100 100 100 
##$AQSEQ= 0
##$AQ_mod= 1
##$AUNM= <au_zg>
##$AUTOPOS= <>
##$BF1= 200.13
##$BF2= 200.13
##$BF3= 200.13
##$BF4= 200.13
##$BF5= 200.13
##$BF6= 200.13
##$BF7= 200.13
##$BF8= 200.13
##$BYTORDA= 1
##$CFDGTYP= 0
##$CFRGTYP= 5
##$CHEMSTR= <none>
##$CNST= (0..31)
1 1 145 1 1 1 1 1 1 1 1 1 1 1 1 1 1 1 1 1 1 1 1 1 1 1 1 1 1 1 1 1 
##$CPDPRG= <>
##$CPDPRG1= <>
##$CPDPRG2= <>
##$CPDPRG3= <>
##$CPDPRG4= <mlev>
##$CPDPRG5= <mlev>
##$CPDPRG6= <mlev>
##$CPDPRG7= <mlev>
##$CPDPRG8= <mlev>
##$CPDPRGB= <>
##$CPDPRGT= <>
##$D= (0..31)
0 1.2 0 0 0 0 0 0 0 0.06 0 0.03 0 0 0 0 0.0002 0 0 0 0 0 0 0 0 0 0 0 0 
0 0 0 
##$DATE= 1705055130
##$DBL= (0..7)
120 120 120 120 120 120 120 120 
##$DBP= (0..7)
150 150 150 150 150 150 150 150 
##$DBP07= 0
##$DBPNAM0= <>
##$DBPNAM1= <>
##$DBPNAM2= <>
##$DBPNAM3= <>
##$DBPNAM4= <>
##$DBPNAM5= <>
##$DBPNAM6= <>
##$DBPNAM7= <>
##$DBPOAL= (0..7)
0.5 0.5 0.5 0.5 0.5 0.5 0.5 0.5 
##$DBPOFFS= (0..7)
0 0 0 0 0 0 0 0 
##$DE= 6
##$DECBNUC= <off>
##$DECIM= 32
##$DECNUC= <off>
##$DECSTAT= 4
##$DIGMOD= 1
##$DIGTYP= 9
##$DL= (0..7)
0 120 120 120 120 120 120 120 
##$DP= (0..7)
150 150 150 150 150 150 150 150 
##$DP07= 0
##$DPNAME0= <>
##$DPNAME1= <>
##$DPNAME2= <>
##$DPNAME3= <>
##$DPNAME4= <>
##$DPNAME5= <>
##$DPNAME6= <>
##$DPNAME7= <>
##$DPOAL= (0..7)
0.5 0.5 0.5 0.5 0.5 0.5 0.5 0.5 
##$DPOFFS= (0..7)
0 0 0 0 0 0 0 0 
##$DQDMODE= 0
##$DR= 18
##$DS= 0
##$DSLIST= <SSSSSSSSSSSSSSS>
$$ [...]
##$SUBNAM2= <"">
##$SUBNAM3= <"">
##$SUBNAM4= <"">
##$SUBNAM5= <"">
##$SUBNAM6= <"">
##$SUBNAM7= <"">
##$SUBNAM8= <"">
##$SUBNAM9= <"">
##$SW= 18.0517328524113
##$SWIBOX= (0..15)
0 0 2 0 0 0 0 0 0 0 0 0 0 0 0 0 
##$SW_h= 3612.71676300578
##$TD= 16384
##$TD0= 1
##$TE= 0
##$TE2= 300
##$TE3= 300
##$TEG= 300
##$TL= (0..7)
0 120 120 120 120 120 120 120 
##$TP= (0..7)
150 150 150 150 150 150 150 150 
##$TP07= 0
##$TPNAME0= <>
##$TPNAME1= <>
##$TPNAME2= <>
##$TPNAME3= <>
##$TPNAME4= <>
##$TPNAME5= <>
##$TPNAME6= <>
##$TPNAME7= <>
##$TPOAL= (0..7)
0.5 0.5 0.5 0.5 0.5 0.5 0.5 0.5 
##$TPOFFS= (0..7)
0 0 0 0 0 0 0 0 
##$TUNHIN= 0
##$TUNHOUT= 0
##$TUNXOUT= 0
##$USERA1= <user>
##$USERA2= <user>
##$USERA3= <user>
##$USERA4= <user>
##$USERA5= <user>
##$V9= 5
##$VALIST= <valist>
##$VCLIST= <CCCCCCCCCCCCCCC>
##$VD= 0
##$VDLIST= <DDDDDDDDDDDDDDD>
##$VPLIST= <PPPPPPPPPPPPPPP>
##$VTLIST= <TTTTTTTTTTTTTTT>
##$WBST= 1024
##$WBSW= 4
##$XGAIN= (0..3)
0 0 0 0 
##$XL= 0
##$YL= 0
##$YMAX_a= 3528947
##$YMIN_a= -3138378
##$ZGOPTNS= <>
##$ZL1= 120
##$ZL2= 120
##$ZL3= 120
##$ZL4= 120
##$ABSF1= 10
##$ABSF2= 0
##$ABSG= 5
##$ABSL= 3
##$ALPHA= 0
##$AQORDER= 0
##$ASSFAC= 0
##$ASSFACI= 0
##$ASSFACX= 0
##$ASSWID= 0
##$AUNMP= <proc_1d>
##$AZFE= 0.1
##$AZFW= 0.1
##$BCFW= 1
##$BC_mod= 2
##$BYTORDP= 1
##$COROFFS= 0
##$CY= 11.3945322036743
##$DATMOD= 1
##$DC= 2
##$DFILT= <>
##$DTYPP= 0
##$F1P= 15.7292609196834
##$F2P= 12.9074282941183
##$FCOR= 0.5
##$FTSIZE= 0
##$FT_mod= 4
##$GAMMA= 1
##$GB= 0.15
##$INTBC= 1
##$INTSCL= 1
##$ISEN= 128
##$LB= 0.24
##$LEV0= 0
##$LPBIN= 0
##$MAXI= 10000
##$MC2= 0
##$MEAN= 0
##$ME_mod= 0
##$MI= 1.114404
##$NCOEF= 0
##$NC_proc= 0
##$NLEV= 6
##$NOISF1= 3.799351
##$NOISF2= 2.8
##$NSP= 1
##$NTH_PI= 0
##$NZP= 0
##$OFFSET= 15.70392
##$PC= 1
##$PHC0= -24752.07
##$PHC1= 17.45268
##$PH_mod= 1
##$PKNL= yes
##$PPARMOD= 0
##$PSCAL= 0
##$PSIGN= 0
##$REVERSE= no
##$SF= 200.130013532006
##$SI= 16384
##$SIGF1= 3
##$SIGF2= 2
##$SINO= 400
##$SIOLD= 16384
##$SREGLST= <1H.CDCl3>
##$SSB= 0
##$STSI= 0
##$STSR= 0
##$SW_p= 3612.71676300578
##$SYMM= 0
##$S_DEV= 0
##$TDeff= 0
##$TDoff= 0
##$TI= <>
##$TILT= no
##$TM1= 0
##$TM2= 0
##$TOPLEV= 0
##$USERP1= <user>
##$USERP2= <user>
##$USERP3= <user>
##$USERP4= <user>
##$USERP5= <user>
##$WDW= 1
##$XDIM= 8192
##$YMAX_p= 0
##$YMIN_p= 0
$$ End of Bruker specific parameters
$$ ---------------------------------
##NTUPLES= NMR FID
##VAR_NAME=  TIME,          FID/REAL,        FID/IMAG
##SYMBOL=    X,             R,               I
##VAR_TYPE=  INDEPENDENT,   DEPENDENT,       DEPENDENT
##VAR_FORM=  AFFN,          ASDF,            ASDF
##VAR_DIM=   8192,          8192,            8192
##UNITS=     SECONDS,       ARBITRARY UNITS, ARBITRARY UNITS
##FACTOR=    0.0002768,     1,               1
##FIRST=     0,             0,               0
##LAST=      2.2672688,     0,               0
##MIN=       0,             -3138378,        0
##MAX=       2.2672688,     3528947,         0
$$ Real data points
##PAGE= N=1
##DATA TABLE= (X++(R..R)), XYDATA
$$ [...]
1480e776k665p28J662L316M348M312L039J557j011k779l894m512l566j787PK155
$$ -5776 -8441 -9169 -7507 -4191 157 4469 7508 9065 8054 5275 1381 -3131 -6697 -8484 -8477 -6322
1496f322L967M067L717K609N27j668l129m202l872l024j000Q27K718L906M156
$$ -6322 -2355 1712 5429 8038 8565 6897 3768 -434 -4306 -7330 -8330 -7503 -4785 -879 3277
1511C277L034J692j50k290l438l902l812j962k66J397L241L779L838K597O12p71
$$ 3277 6311 8003 7853 5563 2125 -1777 -5589 -7551 -7817 -6420 -3179 600 4438 7035 7647 6876
1527F876k391l893l697k881j506L60J851L551L667L179J965L58j665k951l400
$$ 6876 4485 592 -3105 -5986 -7492 -7132 -5281 -1730 1937 5116 7081 7439 5774 2823 -577
1542e77l714k181o82P03K676L280L452K848J370n30j996l197l447k824j901l1
$$ -577 -4291 -6472 -7154 -6451 -3775 -495 2957 5805 7175 6645 4649 1452 -1995 -4819 -6720 -6751
1558f751J408K765L542L079K084P35j111k317l228l264k457j065K43K067K945
$$ -6751 -5343 -2578 964 4043 6127 6862 5751 3434 206 -3058 -5515 -6580 -6337 -4270 -1325
1573a325L190K994J350L1j327k761l202k765k102l43R91K062L219L091K008J108
$$ -1325 1865 4859 6209 6240 4913 2152 -1050 -3815 -5917 -6260 -5269 -3207 12 3103 5111 6219
1589F219o85j939k493l155k549j252l2J538K475K907K694J714L90r20k251k963
$$ 6219 5534 3595 1102 -2053 -4602 -5854 -5886 -4348 -1873 1034 3728 5442 5832 4912 2661 -302
1605c02k512k163o99N68J665K705K825K097J309j28j587k075k837k424j561j63
$$ -302 -2814 -4977 -5676 -5108 -3443 -738 2087 4184 5493 5365 3778 1703 -1134 -3558 -5119 -5282
1621e282J053J937K642K516J933M75m15j865k513k436k007j228L23J420K123K580
$$ -5282 -4229 -2292 350 2866 4799 5274 4859 2994 481 -1955 -3962 -5190 -4867 -3447 -1324 1256
1637A256K056J481K80j144j813k518k394j660n93P53J639K302K465J735Q78j94
$$ 1256 3312 4793 5073 3929 2116 -402 -2796 -4456 -5049 -4296 -2657 -355 2110 3845 4723 4529
1653D529j322k087k271k000j454J9Q37J917K403J995J520O81q06j690k074k198
$$ 4529 3207 1120 -1151 -3151 -4605 -4586 -3749 -1832 571 2566 4086 4767 3961 2271 197 -2001
1669b001j569q38N9J359J975K288J779J124M6q68j689k228k070j333k40M43J589
$$ -2001 -3570 -4408 -4349 -2990 -1015 1273 3052 4176 4222 3354 1665 -563 -2633 -3966 -4206 -3763 -2174
1686b174J952J954J671P32n22r85j792k205j707q63j41Q82J801K028J847J092
$$ -2174 -222 1732 3403 4135 3613 2628 836 -1369 -3076 -3939 -4080 -3198 -1397 631 2478 3570
1702C570M43n16j588j846j730j738n12L70J146J813J946J578Q77o1j003j618j793
$$ 3570 4013 3497 1909 63 -1667 -3405 -3917 -3547 -2401 -588 1358 2936 3813 3752 2749 1131 -662
1719f62j830r96l07O54J373J929J800J384L95l94j211j772j653j610p10J54P93
$$ -662 -2492 -3488 -3795 -3141 -1768 161 1961 3345 3740 3346 2135 363 -1290 -2900 -3610 -3456 -2663
1736b663J640J868J412J088J39o46j352j746j516j186n21M58J179J537J797J103
$$ -2663 -1023 845 2257 3345 3484 2838 1486 -260 -1776 -2962 -3483 -3025 -1846 -309 1488 2591
1752B591P42Oj053j338j716j586p55j80P09J390J420J643J006M65m45j216j482
$$ 2591 3333 3339 2286 948 -768 -2354 -3109 -3289 -2580 -1190 230 1873 2879 3344 2899 1683 201
1769B01j619j267o48L12J005J365J397J435Q59Q2o44j424j289j535j027l18L32
$$ 201 -1418 -2685 -3333 -3021 -2016 -651 746 2181 3040 3122 2478 1054 -235 -1770 -2797 -3115 -2783
1786b783J240J488J347J149N61j49r76j316j441j238q06O5N69J185J471J370Q43
$$ -2783 -1543 -55 1292 2441 3002 2853 1877 561 -880 -2118 -2924 -2859 -2290 -1105 366 1736 2579
1803B579M32l61j233j311j432j067l24L2Q05J420J472J200N91j87o75j062j303
$$ 2579 3011 2650 1417 106 -1326 -2393 -2717 -2685 -1880 -460 1012 2212 2803 2616 1941 879 -424
1820d24j195r17k29N07R78J350J191J025L88j61r78j234j227j083o09J02N78J151
$$ -424 -1619 -2536 -2765 -2258 -1280 70 1261 2286 2674 2513 1535 301 -926 -2009 -2618 -2516 -1938 -787
1838g87J308J169P10J48n36r35j126j229q80m71L50P72J213J115J071N38N8o97
$$ -787 521 1690 2400 2548 2012 1077 -49 -1278 -2158 -2629 -2279 -1507 -294 821 1892 2430 2488 1791
1856A791j241j054j151o85k01N36R84J182J121O54M80l27p41q92j341q45n21O7
$$ 1791 550 -504 -1655 -2340 -2541 -2005 -1021 161 1282 1936 2416 2089 1348 456 -885 -1730 -2251 -2184
1874b184N35J079J096Q87Q17J73p56q59q66j135p64j45Q7Q69R78Q83Q91M77R6
$$ -2184 -1649 -570 526 1413 2230 2403 1647 788 -78 -1213 -1977 -2122 -2035 -1166 -188 695 1586 2063 2159
1893B159p77p15j151q32p05j00M12Q38J070P77P16K72j05p75q14r90q66n88K93
$$ 2159 1382 667 -484 -1316 -2021 -2121 -1709 -871 199 976 1692 1964 1859 1084 270 -720 -1586 -2174 -1881
1912a881L51R76R91Q53O20lm84n22r84r65n73l04K92M99R40P43Q96L93j53m32
$$ -1881 -1530 -554 437 1290 1910 1907 1423 901 -83 -1048 -1621 -1925 -1633 -1134 -194 549 1445 1838 1685 1253
1932A253p50j032o67m40k40M59N78R66Q41L45N22l25n66p82p00q73k67m5N18P85
$$ 1253 503 -529 -1196 -1636 -1876 -1417 -839 127 968 1313 1835 1510 944 162 -538 -1411 -1678 -1723 -1205 -420
1952d20Q40P74L17L29n01o58p94q16o03j19P7O94Q23O58O32M28o8n27n91q63o81
$$ -420 420 1194 1511 1840 1339 681 -113 -929 -1532 -1651 -1574 -880 -57 601 1233 1661 1593 1066 475 -388 -1069
1973a069m72p1N42N64N46O35N98L54k27o57o23p49m99l75J61L38N39Q56O94L38
$$ -1069 -1541 -1612 -1070 -506 40 675 1273 1627 1400 743 120 -629 -1128 -1503 -1342 -1004 -465 391 1085 1423
1993A423Q1k38o83p18o61n18o2K50K68P66P70L19J85J00m13n17p16n95m29L4J42
$$ 1423 1504 1266 583 -135 -796 -1314 -1376 -1126 -858 -92 678 997 1182 1282 869 352 -364 -959 -1388 -1354 -1212
2014a212N97O76O57N39K4p7l37p31p14n47l16J21M42O93P10M23K30O5k43n41n56
$$ -1212 -615 61 718 1257 1281 1204 867 136 -578 -1125 -1441 -1320 -878 -185 525 948 1178 1243 1000 459 -97
2035i7p71k85j47J61N78N14N92M07L21j02m12m31p62n40j68K6J91N21N33M18O10
$$ -97 -868 -1153 -1300 -1139 -561 -47 545 952 1273 1171 759 328 -434 -974 -1142 -1116 -925 -404 129 547 1157
2056A157n1j25l33o16n66n82k20K08L79N48M67O64K40j07j69l86q20l99l56j01
$$ 1157 1106 981 648 32 -534 -1116 -1336 -1128 -749 -201 266 930 1170 1063 894 508 -312 -711 -1067 -1168
2076a168J28N07O46N07L60K2p9j20o20n01m26m84K2K78M38P71M18K28Q5J9o50
$$ -1168 -1040 -533 113 620 980 1002 923 803 183 -318 -744 -1228 -1206 -928 -490 281 699 927 1012 1031 381
2097C81l95n51m66L5k8K40P38L44N83K15m2l70n32l54n87j63j69J20N58O31K95
$$ 381 -14 -565 -1031 -996 -1024 -784 -46 298 881 1096 1054 684 152 -202 -789 -952 -1121 -1001 -443 188 483
2118D83N34m6L6m46m36m44m33l10N4L31L55M40N36L27R3k94l48l95n52m40m9J57
$$ 483 1017 971 1007 561 125 -319 -752 -1062 -1008 -677 -322 118 654 981 1074 780 432 37 -515 -955 -1004 -847
2140h47J53O44N03L02K69j20k59l29n44m77k28R1m7L34O13N29K13J93j32k66m69
$$ -847 -694 -50 453 755 1024 904 645 316 -228 -705 -933 -842 -889 -555 58 587 800 993 861 595 126
2161A26n23l11j44l1K11L60M76N61K49Nk67k70n07m28l90o3J04L30L99M24L92
$$ 126 -397 -708 -852 -883 -672 -312 164 725 974 979 712 442 -65 -493 -883 -946 -842 -512 -113 311 703
2182G03K31q6k92l10m02m65j61j23J61L86L72M63P5L18p3k84m24l51l43l87J25
$$ 703 934 848 556 246 -156 -621 -782 -905 -744 -358 14 477 552 870 797 513 89 -262 -605 -992 -867
2203h67K09L69M79K24N06j24k70j00m41l13m21m4J43K10L82L39L63J32j4k89k29
$$ -867 -658 -289 190 414 920 796 526 426 -15 -328 -749 -793 -650 -440 -58 281 644 776 762 473 244
2224B44m68k28k88k9K23J64M06K47K85K11n1j73m57k53k56m85K39J65L21K00L13
$$ 244 -224 -452 -740 -769 -546 -382 24 271 556 767 716 543 86 -167 -423 -908 -669 -504 -183 17 330
2245C30L67rm0m64j40m64j51k02J24K32J78N26L08R7Lk62l13k91k36k33j75J22
$$ 330 697 688 648 184 44 -420 -571 -773 -649 -417 -239 287 595 692 695 433 120 -171 -407 -640 -815 -693
2267f93L13L24N12nO5J56l15n2o06k36j01L7O0K51K86M25J34J38jl40l59k88k93
$$ -693 -380 -56 456 451 516 672 357 305 -301 -537 -638 -601 -541 -290 -4 421 555 693 692 352 -7 -295 -588
2290e88l16M00J56L39K22L54P1N0k82j85k59l52j66o8J88Q3J99M95P3K26j72n9
$$ -588 -904 -504 -348 -9 213 567 638 688 406 221 -38 -390 -556 -624 -436 -353 -154 341 414 640 468 409
2312D09m08j46l03q6k36L19K68J01M45J30J28k18k18j38l02k09k25J56J81L03
$$ 409 1 -145 -448 -534 -770 -451 -183 -82 363 493 621 403 185 47 -255 -464 -689 -533 -352 -49
2332d9K00K01K20j7l4l57k73k15k13j05J80J66L99P9K24P7J58k73k00k29k18k93
$$ -49 151 352 572 555 521 164 -109 -324 -537 -642 -462 -296 103 182 406 483 641 368 168 -61 -279 -572
2354e72J63p9K27L88K05J97kj63K6k77k48k42j20J01K2J55L22K46J64L2j34k02
$$ -572 -409 -488 -261 127 332 529 527 364 390 113 -135 -377 -497 -396 -374 -219 103 349 513 545 411 209
2376B09k30k21k02m1K1K90J42K54J28k8K28j68l30j46k73p5k3PJ85L44K48J4M7
$$ 209 -21 -242 -444 -485 -464 -174 -32 222 350 322 550 382 52 -94 -367 -442 -465 -458 -273 71 319 333 380
2399C80Mk2k82j05m04O3j4Q6Q9J19M14R7K7m9k71k38j47k00N9o5K67L3L42J48
$$ 380 384 362 80 -25 -429 -366 -380 -294 -205 -86 328 425 452 403 132 -106 -253 -453 -394 -459 -192 -159 183 331
2423C31J14j13k3k32j79k4l78rJ32K5L77R6J84J68j6k03k17k97j57r9L1K34J55
$$ 331 445 332 309 77 -102 -126 -504 -513 -381 -356 21 117 301 469 453 250 33 -264 -421 -520 -489 -255 -100
2446a00J13L91p7J95j92k37J1l06r9p6K0K10l2K87K92j32M9jk63k54m9l02K25
$$ -100 13 404 327 522 330 93 104 -202 -301 -377 -357 -147 -179 108 400 268 317 316 53 -201 -250 -552 -327
2469c27j12K93Q6K59J35j2J61k43j65k84m9j60J25K6P9L01J61K9L2j11rj37l23
$$ -327 -439 -146 -60 199 334 322 483 240 75 -209 -258 -418 -293 -267 -188 113 274 303 335 224 215 78 -245
2492b45j02R4j65J76K61J79J66J40j20k02J0j77j71j82j17K90N3J17J89O4J41
$$ -245 -347 -253 -418 -242 19 198 364 504 384 182 192 15 -156 -338 -455 -165 -112 5 194 258 399
2513C99j35J6j43l12j61R2j13M9J37L46M0M7N8j40o7j41j73k16N5J1J65J39K24
$$ 399 264 280 137 -175 -336 -244 -357 -308 -171 175 215 262 320 180 113 -28 -201 -417 -362 -351 -186 -47 177
2536A77M4J42P4j47k70j95j8l9m8J4L13N2O6m0J27J66k41J3k35k17J3q8p4L65
$$ 177 221 363 437 290 20 -175 -193 -232 -280 -266 47 99 165 125 252 418 177 190 -45 -262 -249 -337 -411 -46
2560d6P8K1J57J46j1k58j46j30Rj47Q2P6Q2J08J34J20K4l0j41j67k42O9r0m0K63
$$ -46 32 53 210 356 345 87 -59 -189 -180 -327 -245 -169 -87 21 155 275 299 269 128 -39 -281 -212 -302 -342 -79
2585g9N5R9K78Q6j81q9o3q9k59p2l4K07j05K80kO6K37k52N9J7k66o8j26m6J80
$$ -79 -24 75 353 439 258 169 106 17 -242 -314 -348 -141 -246 34 32 98 335 83 142 159 -107 -175 -301 -347 -167
2610a67J70M5J60k4J02j1m6j40k81k2k4N0j0K31K06j05L09k12k08M4j65j45n5
$$ -167 3 48 208 184 286 275 229 89 -192 -214 -238 -188 -198 33 239 134 443 231 23 67 -98 -243 -298
2633b98q7K10J50O4L8J60j9Pj81k42M0j4o6k2K56q1O8K36K5j08k2J7j89Nj56m7
$$ -298 -385 -175 -25 39 77 237 218 225 44 -198 -158 -172 -238 -260 -4 -85 -17 219 244 136 114 131 -58 -53 -209 -256
2659b56l0K07Q8O2J51k1R2m4j13k76J16j54n9M9K00L5k8J07J06l7j4j76j69j3
$$ -256 -286 -79 9 71 222 201 293 249 136 -140 -24 -178 -237 -188 12 47 19 126 232 195 181 5 -164 -177
2683a77L0L8l0R9M6K03j11J39j51J44l83m5P0j08P4K13jO9J56j13mj71Kr4n5j8
$$ -177 -147 -109 -139 -40 6 209 98 237 86 230 -153 -198 -128 -236 -162 51 50 119 275 162 158 -13 -11 -105 -160 -178
2709a78J5p4K56j05K45J6q4M2p2j71J22l6j54J78j19P9N0M7J54r5P0j21k4j43
$$ -178 -163 -237 19 -86 159 175 91 133 61 -110 12 -24 -178 0 -119 -40 10 57 211 116 186 65 41 -102
2733a02j75J10J52j15O3K4J21J53j55J1p5L6j48l4QR2o5L1J14m4J13K9n7p3r8
$$ -102 -277 -167 -15 -130 -67 -43 78 231 76 87 12 48 -100 -134 -126 -34 -99 -68 46 2 115 144 87 14 -84
2758h4r9M6K15k50J24J12K4O3j03R3N1j27k17M0K5m5k7J61J2J80n3J55k43M3j67
$$ -84 -183 -137 78 -172 -48 64 88 151 48 141 192 65 -152 -112 -87 -132 -159 2 14 194 141 296 53 96 -71
2783g1O8j41j04Q9J61o8K06j51K82k12kj1k7l4r0J07p6l2R3J16P5J6j6j03n0r2
$$ -71 -3 -144 -248 -159 2 -66 140 -11 271 59 57 46 19 -15 -105 2 -74 -106 -13 103 178 194 178 75 25 -67
2809f7K5Oj54J65p8J74k6O4Q8k5r7P2k13Q4j42P4pK52j59R6qQ4o7k79J46q9L2
$$ -67 -42 -36 -190 -25 -103 71 45 109 197 172 75 147 -66 18 -124 -50 -57 195 36 132 124 208 141 -138 8 -81 -49
2836d9j26J24J85r5pJ57j82J84j74o5J5M3r7k8p7L6J79J0K3J70j22Nj01j21K2
$$ -49 -175 -51 134 39 32 189 7 191 17 -48 -33 10 -87 -115 -192 -156 23 33 56 226 104 109 8 -113 -91
2861i1QJ11n4J9J04J0n0m1j0k2Ln6o3k5J79Q9l7q0J33n6Q0l0j78Kl2M1p5N5l9
$$ -91 -83 28 -26 -7 97 107 57 16 6 -16 -13 -69 -132 -157 22 111 74 -6 127 71 151 121 -57 -55 -87 -46 -121 -66 -105
2890a05K40k1l9n8J26j90LJ6l5k50K31N4L7m7K43j56k4j81J61j0m7P4j02J12Q0
$$ -105 135 114 75 17 143 -47 -44 -28 -63 -313 -82 -28 9 -38 205 49 25 -156 5 -5 -52 22 -80 32 112
2915A12l6m3M5lJ0j86K0J18N0j44r2L9O9J22r6Q3o0R4j22J58j27m3J32l9K3R8
$$ 112 76 33 78 75 85 -101 -81 37 87 -57 -149 -110 -41 81 -15 68 8 102 -20 138 11 -32 100 61 84 182
2941A82r1l3jp0J10O2k67J27q5J10m0L5O3j16R2r1R4m6K7j28j0L8r8N1Q0K4j28
$$ 182 91 58 57 -13 97 159 -108 19 -66 44 4 39 102 -14 78 -13 81 35 62 -66 -76 -38 -136 -85 -5 19 -109
2968a09J30o1k6Q0k3m5P4j59k7J50j4N8jL2j5r2P8L9j01R0p8j06J43j3L5Q5J6
$$ -109 21 -40 -66 14 -9 -54 20 -139 -166 -16 -30 28 27 59 44 -48 30 69 -32 58 -20 -126 17 4 39 124 140
2995A40l1l3j4j25N2j48J17L1P5p7j22K24j84N8l2J23j49J19M5j32O3k78L79k05
$$ 140 109 76 62 -63 -11 -159 -42 -11 64 -13 -135 89 -95 -37 -69 54 -95 24 69 -63 0 -278 101 -104
3019a04R5K0k3k8J37j35N9p3l8J95j21k0j4J43K2j54j06J96m0ll3P6j07N7R7j00
$$ -104 -9 11 -12 -40 97 -38 21 -52 -90 105 -16 -36 -50 93 115 -39 -145 51 11 8 -25 51 -56 1 98 -2
3045bk6o8K07k49K10r4J7L5n4Q7M9q0j31K8M8OLR0n5o8J05p5J60k3o0j34J02r6
$$ -2 -28 -96 111 -138 72 -22 -5 30 -24 63 112 32 -99 -71 -23 -17 -14 76 21 -47 58 -17 143 120 60 -74 28 -68
3073f8L3JlK8M1p8R7k1j0o5O4j40N9K4k5l6%Q6N5k8p8J09j38j5l8J92M8o2m1J08
$$ -68 -35 -34 -37 -9 32 -46 51 30 20 -45 19 -121 -62 -38 -63 -99 -99 -13 42 14 -64 45 -93 -108 -146 46 94 32 -9 99
3103I9j37K71k66O1L2l5j23QJ34KJ02j28J43j31k7L5j14j5M9J03Jn4J1J2l5J7
$$ 99 -38 233 -33 28 60 25 -98 -90 44 46 148 20 163 32 5 40 -74 -89 -40 63 64 10 21 33 -2 15
3129A5nk3RL6k0j9k3n4o1K34j36j5K06j39k5j9K4o3K8M7p7K05l09J98K4k0p0P4
$$ 15 10 -13 -4 32 12 -7 -30 -84 -145 89 -47 -62 144 5 -20 -39 -15 -78 -50 -3 -80 125 -184 14 38 18 -52 22
3157B2j1j59J42j8j2LP3p3J07O6k17J0J08j15K8Q4J4p5p8J41j04O1j0rk7l1J76
$$ 22 11 -148 -6 -24 -36 -33 40 -33 74 140 -77 -67 41 -74 -46 38 52 -23 -101 40 -64 -3 -13 -22 -49 -80 96
3184I6k08Q4J09j66P7j17J66R4n8j29J11j81o8L7J03q8J47k2k1R7j45MJ42r4L6
$$ 96 -112 -28 81 -85 -8 -125 41 135 77 -52 59 -122 -190 -153 -50 -138 9 -13 -34 63 -82 -78 64 -30 6
3209Fk7J13j98J96n8j33J95j16j5R7l2m6q3O7j15K5Q0R2j12J76k5j02O0o6q7R6
$$ 6 -21 92 -106 90 32 -101 94 -22 -37 60 28 -18 -101 -34 -149 -124 -44 48 -64 112 87 -15 45 -21 -108 -12
3235a2p2N8J08p3qP8J5n4j18J07m3%N6p8QRo4n2K54mo9J3j45K16k59J13j22J1
$$ -12 -84 -26 82 9 1 79 94 40 -78 29 -14 -14 42 -36 -28 -19 -83 -135 119 115 46 59 -86 130 -129 -16 -138 -127
3263a27J54Kk2j2j44J89n4j33N3RQ7j16M3j2O0Q9q4nj2j27K10M8j51Q3j31J48
$$ -127 27 29 7 -5 -149 40 -14 -147 -94 -85 2 -114 -71 -83 -23 66 -18 -23 -35 -162 48 96 -55 28 -103 45
3289D5K7o6K7O8l6M2k0j41j4Q0r4P6oj37J03R4J1p5l0M8j83J05nJ19J0j56J53
$$ 45 72 6 33 101 65 107 87 -54 -68 12 -82 -6 -12 -149 -46 48 59 -16 -46 2 -181 -76 -81 38 48 -108 45
3316D5qj33J27L9P5q6j4r3%M0k1Kk7l8R4J17j36Jj14J70o9pP7k9mj3q2M7o3K11
$$ 45 37 -96 31 70 145 59 45 -48 -48 -8 -29 -27 -54 -92 2 119 -17 -16 -130 40 -29 -36 41 12 8 -5 -87 -40 -103 108
3346A08j81N4N9q2K3L0p6P3R9o4m7k0K31k35k2Q7j21MJ4L2QJ04j10J12o3j03L1
$$ 108 -73 -19 40 -42 -19 11 -65 8 107 43 -4 -24 207 -28 -50 37 -84 -80 -66 -34 -26 78 -32 80 17 -86 -55
3373e5J22j62K4rR6n1R7j05K0q5O5l3P4q1l2J19Q6j44l9L5m3K09j16J0k7J94k00
$$ -55 67 -95 -71 -80 16 -35 62 -43 -23 -108 -43 -76 -2 -83 -115 4 90 -54 -93 -58 -101 108 -8 2 -25 169 -31
3400c1o3O2J8j9J55j51nj70J42O9M3p1k6o6J64o2n6M9R8qj52m5P7p3M8o4o3J40
$$ -31 -94 -32 -14 -33 122 -29 -34 -204 -62 7 50 -21 -47 -113 51 -11 -67 -18 80 72 -80 -125 -48 -121 -73 -137 -200 -60
3428f0j3J13O1j93J40%L6m8k1R6k36O8J5k4L9J02j19K2J33j12J13o5j42O1J03
$$ -60 -73 40 101 -92 48 48 84 36 15 111 -125 -57 -42 -66 -27 75 -44 -22 111 -1 112 47 -95 -34 69
3453F9mL6J2j03N2j04j5K7M8N8m9j6m9O5n1J18J37o4j44p8N6k3q8J59j98J95j19
$$ 69 65 101 113 10 62 -42 -57 -30 18 76 27 11 -38 27 -24 94 231 167 23 -55 1 -22 -110 49 -149 46 -73
3480g3l8K02j01j71K43L4j20N8r4KJ0P5rJ58n6N6k34O3p7N6K7j28l5J91J2j16
$$ -73 -111 91 -10 -181 62 96 -24 34 -60 -58 -48 27 18 176 120 176 -58 5 -72 -16 11 -117 -152 39 51 -65
3506f5l2J33jJ14k65J20L0j36J39p1j51J62l2lJ45q7P6j14K0R3r2J0J47q4n7M1
$$ -65 -97 36 35 149 -116 4 34 -102 37 -34 -185 -23 -55 -58 87 0 76 -38 -18 75 -17 -7 140 56 -1 40
3532D0j66K39j56O4J31k22k8J53J2k1O4j4J3j41O4N2Pj38nj7l2L5mJ35J2p8j6
$$ 40 -126 113 -43 21 152 -70 -98 55 67 46 110 96 109 -32 32 84 91 -47 -52 -69 -101 -66 -70 65 77 -1 -17
3559a7m8J67j88O9P8l8L3n1L6r5%R9rk7j13P6L8j36Q9P0j8R3j90J32J8j15J10
$$ -17 -65 102 -86 -17 61 23 56 5 41 -54 -54 45 36 9 -104 -28 10 -126 -37 33 15 108 -82 50 68 -47 63
3586F3o8L6o7J5m1kKO7ON2J7j52J93j56m3l1o0J72J07p2k4K9j4J3j39R8l5O3q5
$$ 63 -5 31 -36 -21 -62 -64 -62 5 11 63 80 -72 121 -35 -78 -109 -169 3 110 38 14 43 29 42 -97 1 -34 29 -56
3615e6R5j23M6R6j44L8J86k7p3P9o9n0j7J3q7J31p4J42k6rj07J12r8q9M1l1J72
$$ -56 39 -84 -38 58 -86 -48 138 111 38 117 48 -2 -19 -6 -93 38 -36 106 80 71 -36 76 -22 -111 -70 -101 71
3642G1j07k9R9K8j55P5K7J3N3j48l7J9Q2P0j45K3J66l1n3M6j69l1n1K08j51j5
$$ 71 -36 -65 34 62 -93 -18 9 22 75 -73 -110 -91 -9 61 -84 -61 105 74 21 67 -102 -133 -184 24 -127 -142
3668a42J50M9ql9L5m1o6n3P7m6J24k06J80l7R3l7mQ8k23J02l5k9lJ17k6K5J40
$$ -142 8 57 49 10 45 4 -62 -115 -38 -84 40 -166 14 -23 70 33 29 117 -106 -4 -39 -68 -71 46 20 45 185
3695A85j31q8P5R2k05O8n9N6q5Q4nM1K2P6j07M1n4l0K6j57J47P4p2J35n3k7L2
$$ 185 54 -34 41 133 -72 -4 -63 -7 -92 -8 -13 28 50 126 19 60 6 -24 2 -155 -8 66 -6 129 76 49 81
3722H1j08j12R6j18J08M4m7LR2j21p1L04j1jl15J30j9P0o5j5l8J68p0j0P3m1r7
$$ 81 -27 -139 -43 -161 -53 -9 -56 -53 39 -82 -153 151 140 139 -176 -46 -65 5 -60 -75 -113 55 -15 -25 48 7 -90
3749i0Q7j4j59J29k2K1J25r8J36k65O2J55j70o9J19Jm5K12k36P0M0k8m7J65m5
$$ -90 -3 -17 -176 -47 -69 -48 77 -21 115 -150 -88 67 -103 -172 -53 -52 -97 115 -121 -51 -11 -39 -86 79 34
3774C4j6q3N2o1M7j07J20Q3m4o%P2m7o3J25k00Q8j91K66nr1K0J25j18J67j2j53
$$ 34 18 -65 -13 -74 -27 -134 -14 69 25 19 19 91 44 -19 106 -94 -6 -197 69 64 -27 -7 118 0 167 155 2
3801Bonj66J79K5n9l5rJ70N2k04P7l6r7k7m1K13p7M3J18l7Po7p0j41J66j44K32
$$ 2 -4 -9 -175 4 29 -30 -65 -74 96 148 -56 21 -15 -112 -139 -180 33 -44 -1 117 80 87 20 -50 -191 -25 -169 63
3829F3n5L1L8j09J6J63m5J9L0m0m4k1o4M0p3R2N0O9j43o7K30q5j39j07L5P7n4
$$ 63 8 39 77 -32 -16 147 102 121 151 111 67 46 -18 22 -51 41 91 160 17 -50 180 95 -44 -151 -116 -39 -93
3856i3P7J36j15l1R6j59K10j09J13k02k6J11r6KN7J35j24J38p9rj04K3n5J00Q
$$ -93 -16 120 5 -26 70 -89 121 12 125 -77 -103 8 -88 -86 -29 106 -18 120 41 32 -72 -49 -104 -4 4
3881Dr1O8J10m1r5N8l7l0Q0j46K9Q7r3N9K9jmJ4J15j29n9J23j73J16J23j69Q8
$$ 4 -87 -19 91 50 -45 13 -24 -54 26 -120 -91 -4 -97 -38 -9 -10 -14 0 115 -14 -73 50 -123 -7 116 -53 35
3908C5q6P3K0J05M5k37mJ20j83n6N8K60p9q1J69J0j71k4q9M4J2r1P5Q9n5j31J68
$$ 35 -51 22 42 147 192 -45 -49 71 -112 -168 -110 150 71 -10 159 169 -2 -26 -115 -71 -59 -150 -75 14 -41 -172 -4
3935dk6J1P3n7o0KJ0qQ2J4M0j82P5Q3L3N8j79O8j05k4R0M3l3r4K24k31Q0QK3L
$$ -4 -30 -19 54 -3 -63 -61 -51 -59 23 37 77 -105 -30 53 86 144 -35 33 -72 -96 -6 37 4 -90 134 -97 -17 -9 14 17
3965A7k13P4J04l01J48J47QL3j8J09k00N8K7j56J28n2q%J30N6rL1L6Q6k57j22
$$ 17 -196 -122 -18 -319 -171 -24 -16 17 -1 108 -92 -34 -7 -163 -35 -87 -95 -95 35 91 82 113 149 235 -22 -144
3991a44J79L1n3R2j49j03K03Q5nQ6j09j16j09J8J59k00M5J45P7r2q0J14oo7k6
$$ -144 35 66 13 105 -44 -147 56 141 136 222 113 -3 -112 -94 65 -135 -90 55 132 40 -40 74 68 1 -25
4016b5j1Q2j08m9K42k50R3qQ9k4J9m7o2K4N9j17M4jJ52J07k59J11jOr6p2L6j1
$$ -25 -36 46 -62 -111 131 -119 -26 -34 55 31 50 3 -59 -35 24 -93 -49 -50 102 209 -50 61 60 66 -30 -102 -66 -77
4044g7P3k6j01J75K5l7J08k62K06j29j22R7L1J56k39K24r8o7R4p5J46j07J44j56
$$ -77 -4 -30 -131 44 69 32 140 -122 84 -45 -167 -70 -39 117 -122 102 4 -63 31 -44 102 -5 139 -17
4068a7j52P9N8n6P2R0k03J82j42K03m6j62K08m9j26Q9J64k70N2N8Q7n8o3J06j57
$$ -17 -169 -90 -32 -88 -16 74 -129 53 -89 114 68 -94 114 65 -61 28 192 -78 -26 32 119 61 -2 104 -53
4093e3J01j60J39q1L1Q2L6j01m6J74j05l4j4O9j65k7J31M3N9R5r0j3J2j12K6k4
$$ -53 48 -112 27 -54 -23 59 95 -6 -52 122 17 -17 -31 38 -127 -154 -23 20 79 174 84 71 83 -29 -3 -27
4119b7m7rK7J56P3K0p2J8r4q6O1j73P9M0Q7J32j92J27j45N8O1k48J74j92J39j90
$$ -27 -74 -83 -56 100 173 193 121 139 45 -41 20 -153 -74 -34 53 185 -7 120 -25 33 94 -154 20 -172 -33 -223
4145b23J48R4J54j81K3jN1j5M3q9oN4j67J24o9Q6k6N4J25j26j35R6O0j83K06k32
$$ -223 -75 19 173 -8 15 14 65 50 93 4 -2 52 -115 9 -60 26 0 54 179 53 -82 14 74 -109 97 -135
4171a35J67J0j64R8p3J07j08J67j83N9J10j63p1N7O7J74o4N4q2n2J7j28QJ65j3
$$ -135 32 42 -122 -24 -97 10 -98 69 -114 -55 55 -108 -179 -122 -55 119 55 109 27 -25 -8 -136 -128 37 24
4196B4m5j4r0K94j37R4p3M8K6p9j42N2K4q7j2qL26q2q8q3p5J45q8N5k20K08J07
$$ 24 -21 -35 -125 169 32 126 53 101 127 48 -94 -42 -18 -105 -117 -125 201 119 31 -52 -127 18 -70 -15 -235 -27 80
4223H0j10J33Nk8KP9j52j21l5Pl9J47J23j83rJ86j02R0k9j24N7J8j6m4J05Q5l4
$$ 80 -30 103 108 80 82 161 9 -112 -147 -140 -179 -32 91 -92 -101 85 -17 73 44 -80 -23 -5 -21 -65 40 125 91
4250I1n5J23j21r7R8J9r6j05KN7J35j62J52k1O4n9P3k7j33k6j08J38n2O6m3J14
$$ 91 36 159 38 -59 39 58 -38 -143 -141 -84 51 -111 41 20 84 25 98 71 -62 -88 -196 -58 -110 -44 -87 27
4276B7j7J13j06M6M4l09l7K64l2O4j63J68p5J5J01l7o4Jo7p3J07N4o0N1o5J51
$$ 27 10 123 17 63 107 -202 -239 25 -7 57 -106 62 -13 2 103 66 2 3 -64 -137 -30 24 -36 15 -50 101
4302A01Lrj55M7j6j95J49K0j3K5j8J32m2Nj5k00N1R8mn7O0QJ45r6M7q5K8q1K17
$$ 101 104 95 -60 -13 -29 -224 -75 -55 -68 -43 -61 71 29 34 19 -181 -130 -32 -36 -93 -33 -25 120 24 71 -14 14 -67 150
4331A50l06J58k6O3j05k9J28K21k17l7n5J85j63P0q9k13M5L03o2n8P3o1J7j6j10
$$ 150 -156 2 -24 39 -66 -95 33 254 37 0 -55 130 -33 37 -52 -265 -220 83 21 -37 36 -25 -8 -24 -134
4356a34J67o4q4J38n2M2KR8j89J52l9J97j45q1N5K1J3k8m9j21jRK39j45j21J32
$$ -134 33 -31 -115 23 -29 13 15 113 -76 76 37 234 89 8 63 84 97 69 20 -101 -102 -93 146 1 -120 12
4382A2L6j40L8M9n3l2m2J12O7l2J19m4j20mp6K7l3Q9r8Q2N4N3q4J06N6q2l4j7
$$ 12 48 -92 -54 -5 -58 -90 -132 -20 47 15 134 90 -30 -34 -110 -83 -116 -27 -125 -43 11 64 -20 86 142 60 26 9
4410Ij80K09n9j2R9P2j27jO7j09J63j50L8j09J50j12M6k0mJ32n3p0K2n8lJ33j34
$$ 9 -171 38 -21 -33 66 138 11 10 77 -32 131 -19 19 -90 60 -52 -6 -26 -30 102 49 -21 1 -57 -60 73 -61
4437f1j41J13K7n1L9J01o5jJ23j6n6j33J06O7N2p1J22m7k8m2l6p2J36j63K00o1
$$ -61 -202 -89 -62 -113 -74 27 -38 -39 84 68 12 -121 -15 52 104 33 155 108 80 38 2 -70 66 -97 103 42
4463D2o3r2M2L3O6nRN8p3lk5l6n3K61k48J22p5K48q5j47l8J5pJ41N6j68N0k9m8
$$ 42 -21 -113 -71 -38 28 23 32 90 17 14 -11 -47 -100 161 -87 35 -40 208 123 -24 -62 -47 -54 87 143 -25 25 -4 -52
4492e2J92l9j4k9j17M0n5Q5L6Q4o9j97J54Nm0R0j23r4J67j3n8O6p9J58q2qJ25
$$ -52 140 101 87 58 -59 -19 -74 11 47 131 62 -135 19 24 -16 74 -49 -143 24 11 -47 19 -60 98 16 8 133
4519A33j37NKm6j65K8K24mQ4j08J65k6j20o2J6j10J92j05J06q3L7P2j8j4Mk1j29
$$ 133 -4 1 3 -43 -208 -180 44 40 124 16 181 155 35 -27 -11 -121 71 -34 72 -11 26 98 80 66 70 49 -80
4546h0R2j18R7J8j06Q3m6O1L3j7L9l2J34l47J04K5n9M5N1J76j66L4J10p8r2P0
$$ -80 12 -106 -9 9 -97 -14 -60 1 34 17 56 24 158 -189 -85 -60 -119 -74 -23 153 -13 21 131 53 -39 31
4572C1o6p1L1O1jN8O1n7O4k52K64j20p4N7P4j75L0JJ25N1q7J31k22P4P6j38j06
$$ 31 -35 -106 -75 -14 -15 43 104 47 111 -141 123 3 -71 -14 60 -115 -85 -84 41 92 5 136 -86 -12 64 -74 -180
4599a80R4o0PJ70j38N1Q4n1L3N3p8NJ5j79J82j28K78j86N9J5K6m2k9%p8P3j65
$$ -180 -86 -146 -139 31 -107 -56 28 -23 10 63 -15 -10 5 -174 8 -120 158 -28 31 46 72 30 1 1 -77 -4 -169
4626a69J80j6K3o7P2P1K5j84M1j27M6m5L5P7O2l6m8L5p1N3r4Q2m1N9l8l1K48k92
$$ -169 11 -5 18 -49 23 94 119 -65 -24 -151 -105 -150 -115 -38 24 -12 -60 -25 -96 -43 -137 -55 -96 -37 -75 -106 142 -150
4654a50J97oo2QJ41o4M2j46j43L11k95N9Q6lO1QQ4j28j4m8Q1N8j60M5K4J45o9
$$ -150 47 41 -21 -13 128 64 106 -40 -183 128 -167 -108 -22 -25 36 44 128 0 -14 -62 19 77 -83 -38 -14 131 62
4681F2r9L5r8J86r7%q5J6P9q8QJ38l1Nl7n5N4M7n9N0m7nl8n1K36o0j47K6J64r1
$$ 62 -37 -2 -100 86 -11 -11 -96 -80 -1 -89 -81 57 26 31 -6 -61 -7 40 -19 31 -16 -21 -59 -110 126 66 -81 -55 109 18
4711A8J27k49J08j65P3Q2R2qr9J72k04l9J33o5Nj34J11O4j35J65j65J63Nk6k5
$$ 18 145 -104 4 -161 -88 -6 86 78 -21 151 -53 -92 41 -24 -19 -153 -42 22 -113 52 -113 50 55 29 4
4736DJ0J01k10J51k21N6M8N3J21o2l3q5L33l94J11L8j8J00q5k3L0k9j10J06L4
$$ 4 14 115 -95 56 -165 -109 -61 -8 113 51 18 -67 266 -128 -17 21 3 103 18 -5 25 -4 -114 -8 26
4761B6M6k23K18m8k3m5Q0n2j11Q9O0K8j27LJ18j05R7q7k4K3N1r1K15j06J08j94
$$ 26 72 -151 67 19 -4 -49 31 -21 -132 -43 17 45 -82 -79 39 -66 31 -56 -80 -57 -6 -97 118 12 120 -74
4787g4Q8m7l9P0J02j43K9l8L6Rj63Q3J31p3m1L3m1K16N4k17J18j42K10k58J02
$$ -74 14 -33 -72 -2 100 -43 -14 -52 -16 -7 -170 -87 44 -29 -70 -37 -78 138 192 -25 93 -49 161 -97 5
4812El3Op7k0J33n5J09k4q8J19j4j87J67n7JPM2j11J22n0O3k8K2J00j20j68K03
$$ 5 -28 -22 -99 -119 14 -41 68 44 -44 75 61 -126 41 -16 -15 -8 34 -77 45 -5 58 30 52 152 32 -136 67
4839F7j50j8J95j99J34j23J63ll1p2J8j7o7MJ26j2o2O7M5p4N5j56J19K7j31l7
$$ 67 -83 -101 94 -105 29 -94 69 66 35 -37 -19 -36 -103 -99 27 15 -47 20 65 -9 46 -110 9 36 -95 -132
4865a32J73lj08J34j09MJ90o3l6p1j00J50K5j85J84j34L1K19k17J14o8j03J11
$$ -132 41 38 -70 64 -45 -41 149 86 50 -21 -121 29 54 -131 53 -81 -50 169 -48 66 -2 -105 6
4888Fj40J38l5K4nO0k5j60J00m0R8n4J9m8J33RPm4p0m4J54j12R3q5n8N5N3J1j74
$$ 6 -134 4 -31 -7 -12 48 23 -137 -37 -77 21 -33 -14 -62 71 80 87 43 -27 -71 83 -29 64 -21 -79 -24 29 40 -134
4917a34M3j07L9J90k1j6O1p0o0R8j00K07j04J4n0l1%J50k81J68p9O9k2k5j5M2
$$ -134 -91 -198 -159 31 10 -6 55 -15 -75 23 -77 130 26 40 -10 -41 -41 109 -172 -4 -83 -14 -36 -61 -76 -34
4943c4p4J97J5m7p6J14k4p8R4m8o6Q8j90J97J48j51L8j90J6J21k6m9l3l3J04j27
$$ -34 -108 89 104 57 -19 95 71 -7 87 39 -27 61 -129 68 216 65 103 -87 -71 50 24 -25 -58 -91 13 -114
4969a14l4J87Qm3L7m4K6J41j25Mj6r4M5O9n5J0R2k09J21N6j43J40J3j2%J4Lj45
$$ -114 -148 39 47 4 41 -3 23 164 39 43 27 -67 -22 47 -8 2 94 -115 6 62 -81 59 72 60 60 74 77 -68
4997f8J22o6R8j81J41p3m6J06p6NoJ88j85k0k4Q7r8qJ07K4p4QQJ99k04j4J01N3
$$ -68 54 -12 86 -95 46 -27 -73 33 -43 -38 -44 144 -41 -61 -85 2 -96 -104 3 27 -47 -39 -31 168 -36 -50 51 104
5025A04j40J6rK09j36l6J09m8M9j86J38k70K64j26K57k51N2j16o1K12j93J77J14
$$ 104 -36 -20 -29 180 44 8 117 69 118 -68 70 -200 64 -62 195 -56 -4 -120 -181 31 -162 15 129
5048A29p1O1P6k47K4K63j62r9J32m7kj8p5L5k1N1K5j42L8oM8R8j24j2J38N3o8
$$ 129 58 119 195 -52 -28 235 73 -26 106 59 57 39 -36 -1 -22 29 54 -88 -50 -56 -8 90 -34 -46 92 145 77
5075G7j01N9J07j32J2Q5Mj85J66m9K8j04po2J01l9P1r4J70k55J64k3JJ22j08o3
$$ 77 -24 35 142 10 22 107 111 -74 92 43 71 -33 -40 -102 -1 -40 31 -63 107 -148 16 -7 -6 116 8 -55
5101e5j6l7J5P9J28k8j68P1oKJ94j93O7L2k19J29k6K8Q9p1Q2r6j24K82j04j63
$$ -55 -71 -108 -93 -14 114 86 -82 -11 -17 -15 179 -14 53 85 -134 -5 -31 -3 86 15 97 1 -123 159 55 -108
5127a08J00NK4M5QK0n6q9J27%r3K9J41l14J13M3J7k13K70n2l1j1Q9k09K20q9m0
$$ -108 -8 -3 21 66 74 94 38 -51 76 76 -17 12 153 -161 -48 -5 12 -201 69 17 -14 -25 64 -145 75 -14 -54
5154e4J27j9L2k7Jr4K11j63O7Kl0M5L0j87p2L09k58K00j80J11r1Q7jp9J45j93
$$ -54 73 54 86 59 60 -34 177 14 81 83 53 98 128 -59 -131 178 -80 120 -60 51 -40 47 46 -33 112 -81
5180h1J08j03J05Q4k22J50n9m2N1j78J00lJ54o6J2n1N1p7J9N7N4o6K7J18p7K8
$$ -81 27 -76 29 113 -109 41 -18 -60 -9 -187 -87 -90 64 -2 10 -41 10 -67 -48 9 63 -3 24 142 65 93
5206I3j00J50k27Q2K1P0j5n3M0n7m3L8m5l4k3L7K00j37r3O5L0J7O3o7j7O1j29
$$ 93 -7 143 -84 -2 19 89 74 21 61 4 -39 -1 -46 -80 -103 -66 134 -3 -96 -31 -1 16 79 12 -5 56 -73
5233g3O5m2J15o1m5O6l8R1r4J9o0J35M4J4j52K17k46J19j08J42n0o5k1k0l0Q9
$$ -73 -8 -50 65 4 -41 25 -13 78 -16 3 -57 78 122 136 -16 201 -45 74 -34 108 58 -7 -28 -48 -78 11
5259A1N5o0n3q6J30l5j2kJ76j40L8K0o3pP5j13K7j2J36j47P5M2q6K5P4j21J60
$$ 11 66 6 -47 -133 -3 -38 -50 -52 124 -16 22 42 -21 -28 47 -66 -39 -51 85 -62 13 55 -31 -6 68 -53 107
5286A07j28J21j44R0j41J08j12J74R1j75n2L2J21j08N0n3l4m7J25p5r5Q4L3j7
$$ 107 -21 100 -44 46 -95 13 -99 75 166 -9 -61 -29 92 -16 34 -19 -53 -100 25 -50 -145 -61 -28 -45
5310d5q1J26Mn1n3Q4j8L6MK3NrJ5J5l4O6Nj0N7k01pO8r3P6R2K8K2j69k4Q3o5L3
$$ -45 -126 0 4 -47 -100 -16 -34 2 6 29 34 25 40 55 21 87 92 82 139 -62 -69 -1 -94 -18 74 102 124 -45 -69 14 -51 -18
5342a8M4l5mJ2o9J00j44LN2j02J81j21K00j90N7k9L1K8J35Oj96L7L9O5m3N6j35
$$ -18 26 -9 -13 -1 -70 30 -114 -111 -59 -161 20 -101 99 -91 -34 -63 -32 -4 131 137 -59 -22 17 82 39 95 -40
5369d0MP6M1j04M9J01j77Q8M6P4j60p6l4J31j12J75l57J96n6K03J2r1K8m9N6L0
$$ -40 -36 40 81 -23 26 127 -50 38 84 158 -2 -78 -112 19 -93 82 -275 -79 -135 68 80 -11 17 -32 24 54
5395E4p9J3n7J3M5p7N8J39o6rj52L37k27M9j59K20j09Mk2n6P0n3N0KP2k1m8l2
$$ 54 -25 -12 -69 -56 -11 -88 -30 109 43 34 -118 219 -8 41 -118 102 -7 -3 -25 -81 -11 -64 -14 -12 60 39 -9 -41
5423d1O6j25P0K4O9J1j43n3J86j53J32m9K8m6j11O6P7o8M6Q8p9N3J21k61N0Q5
$$ -41 25 -100 -30 -6 63 74 -69 -122 64 -89 43 -6 22 -24 -135 -69 8 -60 -14 74 -5 48 169 -92 -42 43
5449D3N2j20LN7l9pR6K9lm0Po0M2l0m8Qm3J10j96K12k57O1n8J66n6J94q4J51j91
$$ 43 95 -25 -22 35 -4 -11 85 114 111 71 78 18 60 30 -18 -10 -53 57 -139 73 -184 -123 -181 -15 -71 123 39 190 -1
5478aP3r8m5J02l2J50j36k4o5J40nj01J12p4O2k5l2K8j00J38k5J7q1J14P6j40
$$ -1 72 -26 -71 31 -1 149 13 -11 -76 64 59 -42 70 -4 58 33 1 29 -71 67 42 59 -22 92 168 28
5504B8L2m8Q9j04j13J62K7Qk38K76q7j46Q9N0j06k6K0M7P2j49nJ82L2j58J13j20
$$ 28 60 12 101 -3 -116 46 73 81 -157 119 32 -114 -25 25 -81 -107 -87 -40 32 -117 -122 60 92 -66 47 -73
5530g3J30M5j26J08r0OJ04k35J91L1j70p5J53J56j50j61J56L6n0j21N5J16lo4
$$ -73 57 102 -24 84 -6 0 104 -131 60 91 -79 -154 -1 155 5 -156 0 36 -14 -135 -80 36 33 -31
5554c1n5K3J5N4l4j1k5N7L4j53j0R4p0J29r5j07J33O2O5j25J29J1M7j13o5L6J07
$$ -31 -86 -63 -48 6 -28 -39 -64 -7 27 -126 -136 -42 -112 17 -78 -185 -52 10 75 -50 79 90 137 24 -41 -5 102
5581A02q9K09k52k2P2R6n4k13K37o3J8j28P9k6q1J12n5P3m4rO5Mj46KJ41R0Q5
$$ 102 13 222 -30 -52 20 116 62 -151 86 23 41 -87 -8 -34 -115 -3 -58 15 -29 -38 27 31 -115 -113 28 118 203
5608B03p1j73J40j93q8L9J63Q5j03P7p0N3n7J75j13j4K8r0R1J0j36K8j5O4J6M
$$ 203 132 -41 99 -94 -182 -143 20 105 2 79 9 62 5 180 67 53 81 -9 82 92 -44 -16 -31 33 49 53
5634E3j35J54p8k1M7m9J22m1m3j57K13r1L6l5j2O3Rj08Q9K1k0p2Q8M3l0L1J02
$$ 53 -82 72 -6 -27 20 -29 93 52 9 -148 65 -26 10 -25 -37 26 35 -73 16 37 17 -55 33 76 46 77 179
5661A79j99J25k04O3L6R7L9l4j36l9J74L3n8n8j79J22J63k19R1o2KJ04m4k8Q3
$$ 179 -20 105 -99 -36 0 97 136 102 -34 -73 101 134 76 18 -161 -39 124 -95 -4 -66 -64 40 -4 -32 51
5686E1m9Km9J08p8L3j17N5J31r9k8m6r2K71j5rj12L3NP5j0j39Q1nj08K17j70J26
$$ 51 2 4 -45 63 -15 18 -99 -44 87 -12 -40 -86 -178 93 78 69 -43 -10 -5 70 60 -79 2 -3 -111 106 -64 62
5714F2n4Q5j47P1l1o9Ko5J18L4j08J03j30Q9j3O1j92J54j28J64JJ5j50J59k18
$$ 62 8 93 -54 17 -14 -83 -81 -146 -28 6 -102 1 -129 -40 -53 8 -184 -30 -158 6 7 22 -128 31 -187
5739a87K74q2l1K5J0J75k69J31n4m9L4Q1K1mm5Oj05M7M8n7R9p5K5O1k05J05P2
$$ -187 87 5 -26 -1 9 184 -85 46 -8 -57 -23 58 79 75 30 36 -69 -22 26 -31 68 -7 18 79 -126 -21 51
5766E1k71K40Rj68J65p7O6q6L1P3n9j97K92j21J24l3p0pl0Q5o4P4k4pR5m1p7l8
$$ 51 -220 20 29 -139 26 -51 15 -71 -40 33 -26 -223 69 -52 72 39 -31 -38 -68 17 -47 27 3 -4 91 50 -27 -65
5794f5J07J4J0j16J60j71P1P9j57M0K8mq8O7P7j24J1j12K83j18p1M0R9q5K7QO
$$ -65 42 56 66 -50 110 -61 10 89 -68 -28 0 -4 -92 -25 52 -72 -61 -173 110 -8 -79 -39 60 -25 2 10 16
5821A6L5n8R5n8l1r1J29p1j9P3l7M9K5r4M7O2L2l9j82R8m1rJ28L0p3l4M6j93J79
$$ 16 51 -7 88 30 -1 -92 37 -34 -53 20 -17 32 57 -37 10 72 104 65 -117 -19 -60 -69 59 89 16 -18 28 -165 14
5850A4j13K4O3kJ73k27N3k7j10J42M0O7k20M3J37l6n7M1Q5N3j28j0j01P9J53q2
$$ 14 -99 -75 -12 -14 159 -68 -15 -42 -152 -10 30 97 -123 -80 57 21 -36 5 90 143 15 5 -96 -17 136 54
5876E4p7k7Q0o9J20q9k7N9nM4l20K32J06j13p3M2J84k49R7m8J38j62J16%n9O8
$$ 54 -23 -50 30 -39 81 -8 -35 24 19 63 -257 -25 81 -32 -105 -63 121 -128 -31 -79 59 -103 13 13 -46 22
5902B2J36k05J09Rq4M6j84M8l0K26q5L3p1K35q8j29M3k4j9p6K32j17J1k2J44k23
$$ 22 158 -47 62 71 -13 33 -151 -103 -133 93 8 41 -30 205 117 -12 31 7 -12 -88 144 27 38 16 160 -63
5928f3m8J8MJ8j4J32m6J2p6J41k3p8J1J94k58K56j75J74k36J32q6QJM9j3L7j57
$$ -63 -111 -93 -89 -71 -85 47 1 13 -63 78 55 -23 -12 182 -76 180 5 179 -57 75 -11 -3 -2 47 34 71 -86
5955h6K1J35j63K45r4n9P4L3j36j1J0J7k5M9r4J40J54k63l1Q2q3m7R9nK08j45
$$ -86 -65 70 -93 152 58 -1 73 106 -30 -41 -31 -14 -39 10 -84 56 210 -53 -84 -2 -85 -132 -33 -38 170 25
5981B5l5jnJ0p3L5J60j33J15j52J12k17J36J0L2o4J12q3q8J63j60P3J34j49k8
$$ 25 -10 -11 -16 -6 -79 -44 116 -17 98 -54 58 -159 -23 -13 19 -45 67 -16 -104 59 -101 -28 106 -43 -71
6006g1J00j37J54Jj4o2M1j83J19J32j25Q8Q0l21K46l4o0m9K0J22l6Q8j58j14K20
$$ -71 29 -108 46 47 33 -29 12 -171 -52 80 -45 43 123 -198 48 14 -46 -95 -75 47 11 99 -59 -173 47
6031D7m2kJ12j66J12J25j71o0J59n1j92J78l8Pm7K5o3K7n6O6J22JqL1l5q5k33
$$ 47 5 3 115 -51 61 186 15 -45 114 63 -129 49 11 18 -29 -4 -67 -40 -96 -30 92 93 85 116 81 -4 -237
6058b37J03P6l1q3J04K15j44P7j21Q5o2N2j56%r2J88p1P5ml8K03j35OJ30kj95
$$ -237 -134 -58 -89 -172 -68 147 3 80 -41 44 -18 34 -122 -122 -214 -26 -97 -22 -26 -64 139 4 10 140 138 -57
6084e7k1%J14k8j05J9J07k2l1K08l05K69p0p7k0K9K8j97K6J39J23j73J7j70J45
$$ -57 -78 -78 36 8 -97 -78 29 7 -24 184 -121 148 78 1 -19 10 38 -159 -133 6 129 -44 -27 -197 -52
6109e2K3O4P6p6j18J01JN3l4N6k54J50R0r3J04k84K40l3o0J19L8P9q7M5n6l2n1
$$ -52 -29 35 111 35 -83 18 19 72 38 94 -160 -10 80 -13 91 -193 47 14 -46 73 111 190 103 148 92 60 9
6136IJ6Kj03M3n3R0p5J65k43m3J32K8K3l5J0r0O9J66k9r3k2K24r3o6j01M1M1j58
$$ 9 25 27 -76 -33 -86 4 -71 94 -149 -192 -60 -32 -9 -44 -34 -124 -55 111 82 -11 -33 191 98 32 -69 -28 13 -145
6164a45Q0J58q5J0K3P7j56J6l3k1N4M4k9q8J36j66N6J0j8P2k2m8J2Q5J57j46j2
$$ -145 -65 93 8 18 41 118 -38 -22 -55 -76 -22 22 -7 -95 41 -125 -69 -59 -77 -5 -27 -75 -63 22 179 33 21
6191B1k7R6J2j81J39Ok0M6q5q0L3K6L8n7o4O6J0J22o1j22J79r6J00q3J60j09m7
$$ 21 -6 90 102 -79 60 66 46 92 7 -73 -40 -14 24 -33 -97 -31 -21 101 40 -82 97 1 101 18 178 69 22
6218B2M4J23j99Q9o0L4j09J08j58n6J37K0j97K27l4rk7N2j00P8L6M3m1M9p8O6
$$ 22 66 189 -10 79 19 53 -56 52 -106 -162 -25 -5 -202 25 -9 -18 -45 7 -93 -15 21 64 23 72 -6 60
6244F0j8n8J50j2n6J6l2p6rQ6o2K2N5O0j08N2J2J4O1j52J26j24K4m5r3j7J21R
$$ 60 42 -16 134 122 66 82 50 -26 -35 51 -11 11 66 126 18 70 82 96 157 5 131 7 31 -14 -107 -124 -3 6
6272Fj13J46P0j82N3J0PJ6k5M5J01j61J01M6j86J28K2j01R7r2J11j28J75j50J9
$$ 6 -107 39 109 -73 -20 -10 -3 13 -12 33 134 -27 74 120 -66 62 84 -17 80 -12 99 -29 146 -4 15
6297A5p4J10m9p9MO1N4k3p2nQ5j3Mj1M1l2j46Q9KL5K0j27L1JJ52l1K8j37J14j31
$$ 15 -59 51 2 -77 -73 -12 42 19 -53 -58 27 14 18 7 48 16 -130 -41 -39 -4 16 -111 -80 -79 73 42 70 -67 47 -84
6327h4O7J37j73R2O9p0J46j15jq0o3O2m7J63j15OM9j3k3q8L7J2j16N3O1m1P9j70
$$ -84 -17 120 -53 39 108 38 184 69 68 -12 -75 -13 -60 103 -12 -6 43 30 7 -81 -44 -32 -148 -95 -34 -75 4 -166
6355a66K12r0Q9m9J6j19J09O3j89K23j00j22R0N2L1J0M2j25M0M9j46M3O5k7q4
$$ -166 46 -44 45 -4 12 -107 2 65 -124 99 -1 -123 -33 19 50 60 102 -23 17 66 -80 -37 28 1 -83
6380h3J43j22n7K37n8j54J28k0N8n8P8r0L7r2N5J05j93J39Lj20M3J3j01J44l6
$$ -83 60 -62 -119 118 60 -94 34 14 72 14 92 2 39 -53 2 107 -86 53 56 -64 -21 -8 -109 35 -1
6405aQ3j38MQ3P4K1l4m6P4m7K2j71J4J10l5j36K01j33R0K9n4n0J10j08J47j01
$$ -1 82 -56 -52 31 105 126 92 46 120 73 95 -76 -62 48 13 -123 78 -55 35 64 10 -40 70 -38 109 8
6431Hl2J16Mj72N6J9j06J12L1j07r0J74M4rq0J31l0n4l4O7O5j28J20j21kJ26j87
$$ 8 -24 92 96 -76 -20 -1 -107 5 36 -71 -161 13 57 48 -32 99 69 15 -19 48 113 -15 105 -16 -18 108 -79
6458g9Q7k7n8J54Q8j79O6p5J04j27j09K22j68M1P8j00N6j9K5J20n7j80J74n1j0
$$ -79 8 -19 -77 77 165 -14 52 -23 81 -46 -155 67 -101 -60 18 -82 -26 -45 -20 100 43 -137 37 -14 -24
6483b4jR5j26K5L5R2n1m0L3k4j38K00m6K1j2n4J77k23M8j33K20j15k7K43k80J68
$$ -24 -25 70 -56 -31 4 96 45 5 38 14 -124 76 30 51 39 -15 162 -61 -13 -146 74 -41 -68 175 -105 63
6509F3n2m9J12j01J47q2j35R1Ko1p1O3j1Q8Mo7L3J1Q0k7j08J92j24n7K44j40q3
$$ 63 11 -38 74 -27 120 38 -97 -6 -4 -65 -136 -73 -84 4 8 -59 -26 -15 65 38 -70 122 -2 -59 185 45 -38
6536c8K33k88J16n1K7p9J42k7J32j56L6K2j26P9r7R4K5M1k04J14J04o5q8J14N
$$ -38 195 -93 23 -28 -1 -80 62 35 167 11 47 69 -57 22 -75 19 44 85 -119 -5 99 34 -54 60 65
6561F5p6j01J49o1k6%L7K3K8k4K0N3k9j36J48M5j53j49J57J22p9n9J66j79P0M6
$$ 65 -11 -112 37 -24 -50 -50 -13 10 38 14 34 87 58 -78 70 115 -38 -187 -30 92 13 -46 120 -59 11 57
6587E7K7n9j4q4o3R9K8J07j62N4j8l7L1J00j57P7K6k00J40j4R2p0L5L0Q7r3Lk0
$$ 57 84 25 11 -73 -136 -37 -9 98 -64 -10 -28 -65 -34 66 -91 -14 12 -188 -48 -62 30 -40 -5 25 112 19 22 2
6615Bk7J03J22j38q1K0n8J01J00j84K08j39lM6l7j59J31j55J36J4j46L2J02Q0
$$ 2 -25 78 200 62 -19 1 -57 44 144 -40 168 29 26 72 35 -124 7 -148 -12 2 -144 -112 -10 70
6639G0j05J07Mj78L7k3K6J16j49R3rM8K0r0Q7k41O2J06n2J74j75R4Q7N8j82MM6
$$ 70 -35 72 76 -102 -65 -88 -62 54 -95 -2 -11 37 57 -33 54 -187 -125 -19 -71 103 -72 22 109 167 -15 -11 35
6666C5j92J52J32j42l8J07j33J32j80J66j46K99o3j81K2P1p0l5M9q7lP0l4L8L7
$$ 35 -157 -5 127 -15 -53 54 -79 53 -127 39 -107 192 129 -52 -30 41 -29 -64 -15 -102 -105 -35 -69 -31 6
6691FN1k8nj0r1K37j14n6K5p4J00n1O8l7q5J17Q6k33M4p2J19J65K9k39%Kl7M2
$$ 6 57 29 24 14 -77 160 46 -10 15 -59 41 -10 58 21 -64 53 139 -94 -50 -122 -3 162 191 -48 -48 -46 -83 -41
6719d1JJ04j25O3m7rj5J01o8Q1m6j01N9K1K8k09K94j03J60l0p6o0N0N2k7p2J02
$$ -41 -40 64 -61 2 -45 -54 -69 32 -36 45 -1 -102 -43 -22 6 -203 91 -12 148 118 42 -18 32 84 57 -15 87
6746H7n3k1O3j03R5N9n6N0q6J31k17M4P1l1k2J0p0q9N0J57m7K8n7p7J16l4J8J2
$$ 87 34 13 76 -27 68 127 71 121 35 166 -51 -7 64 33 11 21 -49 -138 -88 69 22 50 -7 -84 32 -2 16 28
6774B8o7j01N3O0k3K5m4L5M8R2j18Q7j74O8L6j65K37k35J92j53K49m5Nq3j7L7
$$ 28 -39 -140 -87 -27 -50 -25 -69 -34 14 106 -12 75 -99 -31 5 -160 77 -158 34 -119 130 85 90 7 -10 27
6800B7j0J7q7O1m0O6j12l0J08N2k22J08j8J23L9k10Q2j3l7ln0J67L2n7L7O1j22
$$ 27 17 34 -53 8 -32 34 -78 -108 0 52 -170 -62 -80 43 82 -128 -46 -59 -96 -99 -149 18 50 -7 30 91 -31
6827c1O6k5j32J70M2j14Q2K4j08O3j60M1J93j22m7j74J68K2l3MJ19j34QrN4L1
$$ -31 35 10 -122 48 90 -24 58 82 -26 37 -123 -82 111 -11 -58 -232 -64 -42 -75 -71 48 -86 -78 -87 -33 -2
6853bOM1K3o7p6Q5nN9q4Pl6K6p0J75n4m4Q1k28R5K3l9R2J8j03J25M6k05J54KO3
$$ -2 4 45 68 1 -75 10 5 64 -20 -13 -49 -23 -93 82 28 -16 65 -163 -68 -45 -84 8 26 -77 48 94 -111 43 45 108
6883A08J2j22J3l6r6K06l3j59M7l7J78j21P2j04mJ5MQ1p1Q3J6m8oj04J46n6j15
$$ 108 120 -2 11 -25 -121 85 52 -107 -60 -97 81 -40 32 -72 -76 -61 -57 24 -47 36 52 4 -2 -106 40 -16 -131
6910a31K13K1L6l7j39R8J5o0n0K23n9k32Q4L8pj48J80j00Q1M6m6m5N5j38J57q8
$$ -131 82 103 139 102 -37 61 76 16 -34 189 130 -102 -18 20 13 -135 45 -55 26 72 26 -19 36 -102 55 -33
6936c3ON3J3K8k2j24J14j26P6L4o1M0M6o1J28m4k4P7j16JrMQ0M4l0j68N2j4J5
$$ -33 -27 26 39 67 45 -79 35 -91 -15 19 -42 -2 44 -17 111 67 43 120 4 5 -4 0 80 124 94 -74 -22 -36 -21
6965b1RJ68q5q1J9J7j09J12q6P5K0N1q7l4J15k04K44m06M46n7j06j70J65q7K16
$$ -21 -12 156 71 -10 9 26 -83 29 -57 18 38 89 2 -32 83 -121 123 -283 163 106 0 -170 -5 -92 124
6990A24j06MO5j63K20j85J29L7o9R1r0Ql8p3J44j37J91j19j2q9l6R0L8q4J3j8
$$ 124 18 22 87 -76 144 -41 88 125 56 147 57 65 27 -46 98 -39 152 33 21 -68 -104 -14 24 -60 -47 -65
7016f5j1L1M9l6o4L4l9O2m6N2P9r6l4J51j18O3J74j06l9M5j32lQ2p5R6m6k3M8
$$ -65 -76 -45 4 -32 -96 -62 -101 -39 -85 -33 46 -50 -84 67 -51 12 186 80 41 86 -46 -49 33 -42 54 8 -15 33
7044C3J7M9j55K34Mj3j51m9J12j47J65n0j00NkJ55j18R2q8K7j6j35J95q3j59J27
$$ 33 50 99 -56 178 182 169 18 -31 81 -66 99 49 -51 -46 -48 107 -11 81 -7 20 4 -131 64 -19 -178 -51
7070e1M8M7j09J04r1N4O4j19J22k1M6J36p2k01O7o8O0j10J79j4j02Q0j09M5%N4
$$ -51 -3 44 -65 39 -52 2 66 -53 69 48 94 230 158 -43 24 -44 16 -94 85 71 -31 49 -60 -15 -15 39
7096C9J50j66L2p7J55l6r2m5N6k1kM6j91J15K2PM2l9m2K07k6J0j9j62N9k1%R1
$$ 39 189 23 55 -22 133 97 5 -40 16 -5 -7 39 -152 -37 -15 -8 34 -5 -47 160 134 144 125 -37 22 1 1 92
7124I2j38l0J84r3k7J08j62J46J0m9k58K91L5M5j63J27k41K4J32n6j32J53j52
$$ 92 -46 -76 108 15 -12 96 -66 80 90 41 -217 74 109 154 -9 118 -123 -99 33 -23 -155 -2 -154
7147a54J82o2R4j01j65K34L1l2n1P9qp7J5O0j1j0p1m4J97p8pN7r7P4N9K2j52K8
$$ -154 28 -34 60 -41 -206 28 59 27 -24 55 47 -30 -15 45 34 24 -47 -91 106 28 21 78 -19 55 114 136 -16 12
7175A2J73j38j18K55k13J49j32l8R0m0n1p4J65k1q0P1qq7J39mL5p8J64k09R2n2
$$ 12 185 47 -71 184 -29 120 -12 -50 40 0 -51 -125 40 19 -61 10 2 -85 54 50 85 7 171 -38 54 2
7201Bk9K9K4N0q9Nj1J39k6j16K0M2J06J7k34O8N1oj4l0j38J57l2j66K8L8J91r1
$$ 2 -27 2 26 76 -13 -8 -19 120 94 -22 -2 40 146 163 -71 -3 48 42 28 -2 -140 17 -15 -181 -153 -115 76 -15
7229a5j74J11J34J5j67J40Qr9J69p9j35L1J0oM5J40k10pO2O6j36R1j06J65Qm6
$$ -15 -189 -78 56 71 -96 44 52 -47 122 43 -92 -61 -51 -57 -12 128 -82 -89 -27 39 -97 -6 -112 53 61 15
7255A5J11j32Jj6m8P8o3m6R8O2o4n5M5ml2JP1j00O5j07K43j16o3J06nr5K7Q2n4
$$ 15 126 -6 -5 -21 -69 9 -54 -100 -2 60 -4 -59 -14 -18 -50 -49 22 -78 -13 -120 123 7 -56 50 45 -50 -23 59 5
7284EQ6p6JL3Q3k51K40rj31p4L6J11lm5k6Q8n5ro3J49p8j20J24L8p1l1P0r4M0
$$ 5 91 15 16 49 132 -119 121 112 -19 -93 -57 54 51 6 -20 68 13 4 -59 90 12 -108 16 54 -17 -48 22 -72 -32
7313c2Mp7j5M8NJ1L5p8m6K24n4p6K28k17jM4q1M5M1o1l7L54k76J28m8j22J41j35
$$ -32 -28 -105 -120 -72 -67 -56 -21 -99 -145 79 25 -51 177 -40 -41 3 -78 -33 8 -53 -90 264 -12 116 68 -54 87 -48
7341d8K1L7Q5k22J36n9kL1J44k9l6rn8n0N8o1L4k3Q4p4k4r0J77p8k7J87j73J12
$$ -48 -27 10 95 -127 9 -50 -52 -21 123 94 58 49 -9 -59 -1 -62 -28 -51 33 -41 -65 -155 22 -56 -83 104 -69 43
7369D3j50Q7j0N5m0Q3J2L5r2J71l6j01j41K43j67OQ4q0m3R3j17J31j17K9p8N8
$$ 43 -107 -20 -30 25 -15 68 80 115 23 194 158 57 -84 159 -8 -2 82 2 -41 52 -65 66 -51 -22 -100 -42
7395d2P3j35N0j15O8Q2l9MN8k5J36j14J3n2k0J44l6j16Q0j02J34J20l5o5j27l6
$$ -42 31 -104 -54 -169 -101 -19 -58 -54 4 -21 115 1 14 -38 -58 86 50 -66 14 -88 46 166 131 66 -61 -97
7421i7J33p8l6O3pM5j12J36N0p3k8j9jP0R9l25J36K1M4n5p0J02j26J28Q9l4Ll2
$$ -97 36 -42 -78 -15 -22 23 -89 47 97 24 -4 -23 -24 46 145 -180 -44 -23 21 -34 -104 -2 -128 0 89 55 58 26
7449B6m2j9NJ62n3mm6p6R5k7O8O4j37J8p9N0J63j38L0r8l3j3K8l9J04N2n6P6k01
$$ 26 -16 -35 -30 132 79 75 29 -47 48 21 89 153 16 34 -45 5 168 30 60 -38 -71 -84 -56 -95 9 61 5 81 -120
7478a20m6K40m7n4K1Q6r1l0M4L8k10N2R2L7ll5K8p2M2J8l0K6n8K19q7j71J91p9
$$ -120 -166 74 27 -27 -6 80 -11 -41 3 41 -169 -117 -25 12 9 -26 2 -70 -28 -10 -40 -14 -72 147 60 -111 80 1
7506AR3j43L6jj42J26q9P4j9J25k17J63N5j3j8j95J12rP4k9K9n2l9J43r8L3o0
$$ 1 94 -49 -13 -14 -156 -30 -119 -45 -64 61 -156 7 62 49 31 -164 -52 -61 13 -16 13 -39 -78 65 -33 0 -60
7533f0P9N0j3j16J74j67nJ1Q0j1n1J35j55R4j74K22j71J35j09M2j8M2j6r0m0J17
$$ -60 19 69 56 -60 114 -53 -58 -47 33 22 -29 106 -49 45 -129 93 -78 57 -52 -10 -28 14 -2 -92 -132 -15
7559a5o8R4p5J1r1J46Pp1n1J14K8k5lQ6j23n8J26p8J35j67P9Q3m4j22J38k5np8
$$ -15 -83 11 -64 -53 -144 2 9 -62 -113 1 29 4 1 87 -36 -94 32 -46 89 -78 1 84 40 -82 56 31 26 -52
7587e2N1j31qJ53m9Q6m0J23j99J78j64mJ02R8j24k1k3j05R7j3J1n1J26j29J13
$$ -52 -1 -132 -140 13 -36 50 10 133 -66 112 -52 -56 46 144 20 -1 -24 -129 -32 -45 -34 -85 41 -88 25
7612B5m6K7o5l0Q8j24J86j00n3J93j22Q0L6j16L9J39r5l6q7M0K2L8rk0j7k1%M0
$$ 25 -21 6 -59 -89 -1 -125 61 -39 -92 101 -21 59 95 -21 18 157 62 26 -61 -21 1 39 30 10 -7 -28 -28 12
7640A2j72M8L7M8n0N1j34J79o8Q3p3j6O7J49q4j21J70r0J22k97K52m0j01q4J15
$$ 12 -160 -112 -75 -27 -77 -26 -160 19 -49 34 -39 -55 12 161 77 -44 126 36 158 -139 113 73 -28 -112 3
7665CJ77j65J16l3r7R8p2RJj93J1L0M8O2J63k25O8Pkj95J74m7l6J08j04N5q1J97
$$ 3 180 15 131 98 1 99 27 36 37 -156 -145 -115 -67 -5 158 -67 1 8 6 -189 -15 -62 -98 10 -94 -39 -120 77
7693G7j10J25r9n9J87n5Qj17o9J62m1N3j22J6L4q9J60mqJ67j11j10O6m9L0Q2P7
$$ 77 -33 92 -7 -66 121 66 74 -43 -112 50 9 62 -60 -44 -10 -99 61 57 49 216 105 -5 61 12 42 124 201
7720B01q6j16MP2o8O9j28P2Q8j48nl0J78j80K5k2l2J40j3K1j20J39o5J2J12k21
$$ 201 115 -1 3 75 7 76 -52 20 108 -40 -45 -75 103 -77 -52 -74 -106 34 21 42 -78 61 -4 8 120 -101
7746a01K02n1J16l2m1r2P0m4P8m9k6k0O7m6O6j45K03r3r3L3L4o3J6j12L3o8J9
$$ -101 101 50 166 134 93 1 71 27 105 56 30 10 77 31 97 -48 155 62 -31 2 36 -27 -11 -123 -90 -158 -139
7773a39J22p1R2N4K4j12L7km6j26J57o9K79j96k6L1O6k0Np0mJ17r8J2J33N7l27
$$ -139 -17 -88 4 58 82 -30 7 5 -41 -167 -10 -79 200 4 -22 9 75 55 60 -10 -14 103 5 17 150 207 -120
7800a20J27NK7l8j10J21o4M7J9L4j22R2n2o0K9J80j92J6j50J02J13j83J48R0k30
$$ -120 7 12 39 1 -109 12 -52 -5 14 48 -74 18 -34 -94 -65 115 -77 -61 -211 -109 4 -179 -31 59 -171
7825a71k4K61m1l2k9L5o6P6J08k08K23j40pL5k18J54j0J89k11R9o5PO8q0J13k04
$$ -171 -195 66 25 -7 -36 -1 -67 9 117 -91 132 -8 -15 20 -198 -44 -54 135 -76 23 -42 -35 33 -47 66 -138
7851a38J75r3J13O1k02LJ19J65k05n5J43m6mj82K68n2j65m5K48K2P1j10n9L6k4
$$ -138 37 -56 57 118 -84 -81 38 203 -2 -57 86 40 36 -146 122 70 -95 -140 108 130 201 91 32 68 44
7876D4J7K6l2m3J93k39J06k5j14Q1O2j5k9j06J39o1O9q8o6P5P5p2Jk4R7O0j07
$$ 44 61 87 55 12 205 -34 72 47 -67 14 76 61 32 -74 65 4 73 -15 -81 -6 69 -3 -2 -26 71 131 24
7903B4k0j13J88m3j19L8J36L5j48J24O3o6L9j23M8J6j55J84j2j02R0j16R9j05
$$ 24 4 -109 79 36 -83 -45 91 126 -22 102 165 99 138 15 63 79 -76 108 96 -6 84 -32 67 -38
7927c8J29n2l7L2n4O9j11l1Q9J14j37r5J09rJ42k79K00j5k8k0p2Q6j54P0K43j45
$$ -38 91 39 2 34 -20 49 -62 -93 -4 110 -27 -122 -13 -22 120 -159 41 26 -2 -22 -94 -8 -162 -92 151 6
7953FK6n3Oq8n9K58n3j7K16l10J04J03j46P2l7j17J05q2r2K19j26m9K5J15j4n2
$$ 6 32 -21 -15 -103 -162 96 43 26 242 -68 36 139 -7 65 28 -89 16 -66 -158 61 -65 -114 -89 26 12 -40
7979d0o3R7qm3N9pl9JJ15j16L0L8j85K58j96L01l7j45J43j79l0J2J05o8J05L3
$$ -40 -103 -6 -14 -57 2 -5 -44 -43 72 -44 -14 24 -161 97 -99 202 165 20 163 -16 -46 -34 71 3 108 141
8005A41j62J81j00p8J56j92K62k64J44m2j12O2P7r6n3J9P1m1R6q8j46J78k9o7
$$ 141 -21 160 60 -18 138 -54 208 -56 88 46 -66 -4 73 -23 -76 -57 14 -27 69 -19 -165 13 -16 -83
8029h3m4J39j06R3Jk0O0O1k80L55j69qr1K47j54J75j70k3N7j23K48k10J21o3p0
$$ -83 -127 12 -94 -1 0 -20 40 101 -179 176 7 -1 -92 155 1 176 6 -17 40 -83 165 -45 76 13 -57
8054e7m3J55qj28J68N8l51J94J18m5m8Qj18J49k7j23R8j04Q4J0l6J8O8n3l1p%
$$ -57 -100 55 47 -81 87 145 -206 -12 106 61 13 21 -97 52 25 -98 0 -104 -20 -10 -46 -28 40 -13 -44 -51 -51
8081e1J04q0L4n0p0J20K0Q6m5N0j42O6oRq8q7J27P4r5Q0k17K06K4k30J91o6j29
$$ -51 53 -27 7 -43 -113 7 27 113 68 118 -24 42 36 45 -43 -130 -3 71 -24 56 -161 45 69 -161 30 -36 -165
8108a65K3m6J96l9m2J06K9J1mN4j19Q5l0r9j4R3M1j62J73n0M9l5j44J43p1M2J4
$$ -165 -142 -188 8 -31 -73 33 62 73 69 123 4 89 59 -40 -54 39 80 -82 91 41 90 55 -89 54 -17 25 39
8135C9j81J13l8lJ03p2K34j99n0Q4r6R5j1j34J95j27n0j4J01P8j49M9j59J38O9
$$ 39 -142 -29 -67 -70 33 -39 195 -4 -54 30 -66 29 18 -116 79 -48 -98 -112 -11 67 -82 -33 -192 -54 15
8160A5j2O6kj59J32K36k80K6M1o9n1J38j02M8K0q1J63j38o9J57o6j11J71p0J49
$$ 15 3 69 67 -92 40 276 -4 22 63 -6 -57 81 -21 27 47 -34 129 -9 -78 79 13 -98 73 3 152
8185A52k73M7M0J07j07P6
$$ 152 -121 -74 -34 73 -34 42
8191D2
$$ Imaginary data points
##PAGE= N=2
##DATA TABLE= (X++(I..I)), XYDATA
0@%%%%%%%%%%%O4j28J28j28J92k56L20l84M48n76P04q32R60j088J280j472J677
$$ 0 0 0 0 0 0 0 0 0 0 0 0 64 -64 64 -64 128 -128 192 -192 256 -320 384 -448 512 -576 704 -768 909
28I09j995K302k624L007l391L840m352M897n488O159o911P710q582R533j0595
$$ 909 -1086 1216 -1408 1599 -1792 2048 -2304 2593 -2895 3264 -3647 4063 -4519 5014 -5581
43e581J1743j2994J4367j5860J7499j9280K1249k3406K5788k8427L1355l4634
$$ -5581 6162 -6832 7535 -8325 9174 -10106 11143 -12263 13525 -14902 16453 -18181
55a8181L8306m2486M7263n2797N9303o7046P6491q8285J03519j24068J53466j99354
$$ -18181 20125 -22361 24902 -27895 31408 -35638 40853 -47432 56087 -67981 85485 -113869
67a13869K81833m77139J833822K004300j364874j058600j831462j290035j023854
$$ -113869 167964 -309175 1524647 3528947 2164073 1105473 -725989 -2016024 -3039878
76c039878r8500N40979J265555J409611J564860R91915M50596l29308r81968j396774
$$ -3039878 -3138378 -2597399 -1331844 77767 1642627 2634542 3085138 2755830 1773862 377088
86C77088j366981j260351n84050Q8387P13227J194241J403689J199319Q23015
$$ 377088 -989893 -2250244 -2834294 -2745907 -2032680 -838439 565250 1764569 2587584
95B587584J09306m87170r83052j321133j254764q59066l95802K87848Q24460J135554
$$ 2587584 2696890 2209720 1226668 -94465 -1349229 -2208295 -2604097 -2316249 -1491789 -356235
105c56235J250522R86176M82236k5100o30144j033485j153233j058078o39622
$$ -356235 894287 1880463 2362699 2337599 1707455 673970 -479263 -1537341 -2176963
114b176963j06592L79056Q89752J112800J018070P75518K89795k49783o73431
$$ -2176963 -2283555 -1904499 -1014747 98053 1116123 1891641 2181436 1931653 1258222
123A258222j018651j047847p96381m54443N9966N55110Q59479J018404Q76123
$$ 1258222 239571 -808276 -1604657 -2059100 -1999134 -1444024 -584545 433859 1309982
132A309982N23332J25588l81325p71870r11318r08069o45869k13808J98599O23819
$$ 1309982 1833314 1958902 1577577 805707 -105611 -1013680 -1659549 -1873357 -1674758 -1050939
142a050939Q74225Q67285P22871L64281r0501m59144p70938q71920p29709m79790
$$ -1050939 -176714 690571 1413442 1777723 1687222 1228078 457140 -414780 -1144489 -1624279
152a624279o6987L63774O38488Q18027P87407N29133K00287k08442n61595p30818
$$ -1624279 -1691266 -1327492 -689004 129023 916430 1445563 1645850 1437408 875813 144995
162A44995p83228o21856k77895O8396M29164O87943P37926O61847M00903J9602
$$ 144995 -638233 -1260089 -1537984 -1469588 -1040424 -352481 385445 1047292 1448195 1467797
172A467797l01924n85109p32795o62574m76373j55344K14503M79082O68039O95144
$$ 1467797 1165873 580764 -152031 -814605 -1290978 -1446322 -1231819 -752737 -84698 610446
182F10446N12316K54376p8721m08831n93932o70185n81440l20047k9322K85557
$$ 610446 1122762 1377138 1298417 889586 295654 -374531 -955971 -1276018 -1305340 -1019783
192a019783N46495O30957N95756M15984J08970j81281m47156o14894n92456m62460
$$ -1019783 -473288 157669 753425 1169409 1278379 1097098 649942 35048 -557408 -1019868
202a019868k21510R9388L58884N45932O08106M92058K92054J7688k85986m81633
$$ -1019868 -1241378 -1141990 -783106 -237174 370932 862990 1155044 1172732 886746 405113
212D05113n73559n38699l47475j01139J75209M27697N38325N37219M19414J72774
$$ 405113 -168446 -707145 -1054620 -1155759 -980550 -552853 -14528 522691 942105 1114879
222A114879q9222l33033n09934n32300m47397k62442J1902K56940M40116N31760
$$ 1114879 1025657 692624 182690 -349610 -797007 -1059449 -1047547 -790607 -350491 181269
232A81269M71492L14400Q5261j83783l81148m91139m98796l61387j51419Q7276
$$ 181269 652761 967161 1052422 868639 487491 -3648 -502444 -863831 -1015250 -927974
242i27974L22132M56051M86321M12366K15785j6466k37357m16248m77205m28737
$$ -927974 -605842 -149791 336530 748896 964681 948215 710858 294610 -182595 -611332
252f11332k84995n4960J69334L49684M62468M44436L23044J35175r8351k95437
$$ -611332 -896327 -951287 -781953 -432269 30199 474635 797679 932854 834503 539066
262E39066m19023m53576l62863j89901J7804K32819L81749M37157L95559K44912
$$ 539066 120043 -333533 -696396 -886297 -868493 -635674 -253925 183232 578791 823703
272H23703M4986j57288l36409m22211m02412k96185j10456R6472K75253L96034
$$ 823703 868689 711401 374992 -47219 -449631 -745816 -856272 -759800 -484547 -88513
282h8513M10345L26606J73276k9560k20290l53785m07686l54093k19237l9923
$$ -88513 321832 648438 821714 792154 571864 218079 -189607 -543700 -762937 -802860
292h02860J59240L14942L86054L72177K65545R4950r3794k64571l65093l75096
$$ -802860 -643620 -328678 57376 429553 695098 790048 696254 431683 66590 -308506
302c08506l01021j50322L5004K08089L34118L73201L22204K01205K5897j56265
$$ -308506 -609527 -759849 -724845 -516756 -182638 190563 512767 713972 739869 583604
312E83604k92375l58991l41560k40572q1065R7652K48705L37440L48508K73529
$$ 583604 291229 -67762 -409322 -649894 -730959 -633307 -384602 -47162 301346 574875
322E74875J30768l9009j99820l11390l44176k97369j78903j4898J49562K74255
$$ 574875 705643 666634 466814 155424 -188752 -486121 -665024 -679922 -530360 -256105
332b56105L33532L14470K17494O6360r6618k33210l15863l22392k48504j14110
$$ -256105 77427 391897 609391 675751 579133 345923 30060 -292332 -540836 -654946
342f54946M2697J89316K90870L19761K72095J58898P367j42507k57730l11543
$$ -654946 -612249 -422933 -132063 187698 459793 618691 626058 483551 225821 -85722
352h5722k88095j95312n7063R4388K20531K93997K97296K25113J01399m3592j80386
$$ -85722 -373817 -569129 -626192 -531804 -311273 -17276 280020 505133 606532 562940 382554
363C82554k71597k95470k49632j41389l220J34831K43973K88011K62862J78730
$$ 382554 110957 -184513 -434145 -575534 -578754 -443923 -199950 88061 350923 529653
373E29653M8170r1541k07128k74373k71606k05270r1973M6797J70575K51276K74189
$$ 529653 577823 486282 279154 4781 -266825 -472095 -564068 -517271 -346696 -95420 178769
384A78769K26918J27373N62j31021k26814k64239k43107j60688l9890Q7027J96382
$$ 178769 405687 533060 533622 402601 175787 -88452 -331559 -492247 -532137 -445110 -248728
395b48728K52703K48266J89572P9041m7953j58100k35048k50964k06152j16232
$$ -248728 3975 252241 441813 520854 472901 314801 79753 -171211 -377363 -493595
405d93595N981J24542K08141K46106K21712J43493L4964q6102j82901k31158k30647
$$ -493595 -487614 -363072 -154931 91175 312887 456380 491344 405242 222341 -8817 -239464
416b39464j70154o7090M5642J50916K17527K28228J90070J01144j1740j15410
$$ -239464 -409618 -476708 -431066 -280150 -62623 165605 355675 456819 445079 329669
426C29669j96207k26565j99506j30779k5956Q4704J68277K15800K10130J50223
$$ 329669 133462 -93103 -292609 -423388 -449344 -364640 -196363 19437 229567 379790
436C79790N9793m7852j43914j99086k11655j71016q6370J2181J11828J84377K04873
$$ 379790 439583 391731 247817 48731 -162924 -333940 -420310 -408129 -296301 -111924 92949
447I2949J83314J15532J6712p9296j59762k00452j88221j37382n0083N0981J32784
$$ 92949 276263 391795 408507 329211 169449 -31003 -219224 -356606 -406689 -355708 -222924
458b22924J86561J94916J51211P7728j6249j08860j68951j90488j67084r9463
$$ -222924 -36363 158553 309764 387492 371243 262383 93432 -97056 -264140 -363603
468c63603j3983P7742J52361J82399J73902J24012L9027m8133j26145j75018j75651
$$ -363603 -377586 -299844 -147483 34916 208818 332830 371857 323724 197579 22561 -153090
479a53090j38662o8214K1821J01159J58039J78159J49650Q9953R614p7732j39811
$$ -153090 -291752 -359966 -338145 -236986 -78947 99212 248862 338815 348429 270697 130886
490A30886j69945j60840j08296l3951M7660J21708J60237J62561J27516N6293
$$ 130886 -39059 -199899 -308195 -342146 -294486 -172778 -12541 150020 277536 333829
500C33829k2340r5646j50092j61987j37084q1384k151P3178J30910J59606J45155
$$ 333829 311489 215843 65751 -96236 -233320 -314704 -316855 -243677 -112767 46839 191994
511A91994R7963K9095n0144j13351j48825j51708j13314m9965K2749R4283J37965
$$ 191994 289957 319052 268908 155557 6732 -144976 -258290 -308255 -285506 -191223 -53258
522e3258J48811J27465P0230j300o9897j25049j45949j33220r0492k1615M9275
$$ -53258 95553 223018 293248 291948 222051 97002 -48947 -182167 -272659 -294274 -244999
533b44999J05880J40291J37669J02880M5127k6890q9434j27829j39206j15165
$$ -244999 -139119 1172 138841 241721 286848 259958 170524 42695 -96511 -211676
543b11676o2517L059O9833J16609J34243J23999P9945J6594m7339j02236j29785
$$ -211676 -274193 -271134 -201301 -84692 49551 173550 253495 270089 222750 120514 -9271
554i271j25853r4719l7251K8281Q3848J21624J28214J03693N6560o977o7427j08811
$$ -9271 -135124 -229843 -267094 -238813 -154965 -33341 94873 198566 255126 248149 180722 71911
566G1911j26223j12684p0274j3661M7504R7215J20301J17528Q4327L0885k6909
$$ 71911 -54312 -166996 -237270 -250931 -203427 -106212 14089 131617 215944 246829 219920
577B19920q1382j14721j17092r5135m9060R600O3800J04092J17427J01780O4203
$$ 219920 138538 23817 -93275 -188410 -237470 -227870 -164070 -59978 57449 159229 223432
588B23432R687m7688r1161j13579j07774p5294k7217K8522P8684J06364J09298
$$ 223432 233119 185431 94270 -19309 -127083 -202377 -229594 -201072 -122388 -16024 93274
599I3274Q6850M2010j0668o2545r8786j08376r4147n7415n143M5927Q6742J06520
$$ 93274 180124 222134 211466 148921 50135 -58241 -152388 -209803 -214946 -169019 -82277 24243
611B4243R8998O9047K2351l0429p4054j00110j02691p8448l7194J3072O0942R2071
$$ 24243 123241 192288 214639 184210 110156 10046 -92645 -171093 -208287 -195215 -134273 -42202
623d2202J01363Q7559N0300K396m5018q2974r8914r1774o3201j7361L0380P0623
$$ -42202 59161 146720 197020 199416 154398 71424 -27490 -119264 -182465 -199826 -169446 -98823
635i8823R4704R4635P1988L2796j5590n8266q6858r5278p9570m5049l79M4964
$$ -98823 -4119 90516 162504 195300 179710 121444 34586 -60692 -140262 -185311 -185690 -140726
647a40726P8618R2154Q5415N6634J4131l0093o8422q8348q7155o6622k7968J6576
$$ -140726 -62108 30046 115461 172095 186226 156133 87711 -637 -87792 -154414 -182382 -165806
659a65806N5734Q2532Q8254P2756M0880j956m4015p3708q6857p8291n0841j2179
$$ -165806 -110072 -27540 60714 133470 174350 172394 128379 54671 -32186 -110477 -161318 -173497
671a73497L0281O5365Q2236Q1363O0392K3808j6523n4030p7628q1267o7498l6206
$$ -173497 -143216 -77851 4385 85748 146140 169948 153425 99395 21767 -59500 -126998 -163204
683a63204M227M2044O9880Q0922P1602M6302R293l0713o0988p7327p5001n4499
$$ -163204 -158977 -116933 -47053 33869 105471 151773 161066 130353 69365 -7962 -82963 -137462
695a37462k1146J7486N1975P1932P5871O1641L1304n001m0710o6209p4640o6042
$$ -137462 -158608 -141122 -89147 -17215 58656 120297 151601 146600 105890 39681 -34959 -101001
707a01001m1580o114K9309N7919P2651O8414M9498J7922j8443m8731o7569p0541
$$ -101001 -142581 -148695 -119386 -61467 11184 79598 129096 147018 128575 79844 12275 -58266
719e8266n5277k7842O078L9543O1833O9387O0838L6351M799k8618n5256o6856
$$ -58266 -113543 -141385 -135307 -95764 -33931 35456 96294 132645 137444 108826 53570 -13286
731a3286o3330m4882j4484J8190M6472O3861O4376N0513K4786q090l7821n7989
$$ -13286 -76616 -121498 -135982 -117792 -71320 -7459 56917 107430 132216 124126 86305 28316
743B8316o4554n5143l2707k730K8563N2032O2333N8541L9623J2179j8266m4938
$$ 28316 -36238 -91381 -124088 -126818 -98255 -46223 16110 74651 114274 126453 108187 63249
755F3249n9282n9313m6472k0832Q707L6233N5223N9415N0298K9468N68k7771m8873
$$ 63249 3967 -55346 -101818 -122650 -113943 -77710 -22487 36928 87226 116694 117262 89491 40618
768D0618n8599n3337l5987j0148J8807M2572N5218N5373M1626J8167r227l5269
$$ 40618 -17981 -71318 -107305 -117453 -98646 -56074 -856 54517 96143 114310 105083 69814
780F9814n1479n5164m6552k5768Q52K6795M6449N4318M9070L2743P493j8669l9982
$$ 69814 18335 -36829 -83381 -109149 -108297 -81502 -35053 19265 68335 101078 108571 89902 49920
793D9920n2126n1019l7913j5679J0247L3476M8103N1815M2308K2546j899k6167
$$ 49920 -2206 -53225 -91138 -106817 -96570 -63094 -14991 36824 79132 101678 99779 73612
805G3612m3855n0435m5625k9079n453J8347L8284M8857M7107L4560J3154j1094
$$ 73612 29757 -20678 -66303 -95382 -100835 -82488 -44204 4653 51760 86320 99474 88380
817H8380l1964m5553m8114l8388k0157L409K5721M1384M7471M1738K5867M247
$$ 88380 56416 10863 -37251 -75639 -95796 -92387 -66666 -25282 22189 63927 89794 94041
829I4041j8753l6593m5600m3569l1284j1128J1624L1196M2824M4338L5169J7823
$$ 94041 75288 38695 -6905 -50474 -81758 -92886 -81262 -50066 -7242 37096 72265 90088
841I0088m420k5038l9275m4197l8221k3477k699J8867L4790M2678M0366K8286
$$ 90088 85668 60630 21355 -22842 -61063 -84540 -87239 -68372 -33582 9096 49462 77748
853G7748R394j2101k9895m0486m1298l2169j5650N409K4468L7032M1164L5261
$$ 77748 87142 75041 45146 4660 -36638 -68807 -84457 -79048 -54580 -17548 23616 58877
865E8877K0852J585j8459l3431m0062l7298k5526p761J2038K8783L7932L8446
$$ 58877 79729 81314 62855 29424 -10638 -47936 -73462 -81223 -69185 -40402 -2470 35976
877C5976K9452J3497n975k3388l5444l8341l2432j8694j90J7964L1470L7642L4560
$$ 35976 65428 78925 72950 49562 14118 -24223 -56655 -75349 -75539 -57575 -26105 11537 46097
890D6097K2982O610j2375k7562l5732l5813k6721j1560O172K2980L3194L6017
$$ 46097 69079 75689 63314 35752 20 -35793 -62514 -74074 -67902 -44922 -11728 24289
902B4289K9691J6461o21j7572l0019l5453l1616k0778m725J2370K6066L3893L3099
$$ 24289 53980 70441 69820 52248 22229 -13224 -44840 -65618 -70343 -57973 -31907 1986 35085
915C5085K4174J0069p098k1943l1416l3504k7068j4362J391J7440K8716L2782
$$ 35085 59259 69328 62230 40287 8871 -24633 -51701 -66063 -64672 -47232 -18516 14266
927A4266K9174J8784L308j2487k4911l1903l0332k1970q252P430K1022K9725L1266
$$ 14266 43440 62224 65532 53045 28134 -3769 -34101 -56071 -64323 -56893 -35871 -6146 25120
940B5120K4193J3152k675j7120k6572l0976k6690j6577k521J2569K3906K9371
$$ 25120 49313 62465 59790 42670 16098 -14878 -41568 -58145 -60666 -48097 -24191 5180
952E180K8425J9699O606p469k0295k8062k8419k2740j1100L201J6321K5546K8864
$$ 5180 33605 53304 59910 52441 32146 4084 -24335 -47075 -58175 -54974 -38653 -13107 15757
965A5757K4136J5057J102j2506k2190k8047k5914j7449o029Q038J9799K5919K6589
$$ 15757 39893 54950 56052 43546 21356 -6691 -32605 -50054 -56083 -48045 -28246 -2327 24262
978B4262K0491R244l598j5944k4058k6511k2302j2965k67J1843K1410K6270K3366
$$ 24262 44753 53997 50399 34455 10397 -16114 -38416 -51381 -51648 -39805 -18395 7875 31241
991C1241J5938M721q739j7962k4665k4834j8085q194M225J5621K2186K4983K0357
$$ 31241 47179 51900 43161 25199 534 -24300 -42385 -50579 -46354 -30733 -8547 16436 36793
1004C6793J0906q6j1766k0546k3948k1728j4311k915P965J7520K3306K2420J6368
$$ 36793 47699 47613 35847 15301 -8647 -30375 -44686 -47601 -39636 -22116 1190 23610 39978
1017C9978P069m986j4382k1182k3260j8143r678N85J2097J8834K2720J9862J2127
$$ 39978 47047 42061 27679 6497 -16763 -34906 -44584 -43999 -31902 -13068 9652 29514 41641
1030D1641K556q057j7138k1314k0763j5037n126M647J4114K0402K1025J6456Q637
$$ 41641 44197 36140 19002 -2312 -23075 -38112 -43238 -38591 -24477 -4075 16950 33406 42043
1043D2043k121j1184j7943k1155j7851j0910j770Q699J5586K0083J9465J2673
$$ 42043 39922 28738 10795 -10360 -28211 -39121 -40891 -32192 -16606 3477 22942 35615
1055C5615M647n065j3737j8778j9308j5477o903K220J0806J7512J9142J6434R935
$$ 35615 40262 35197 21460 2682 -16626 -32103 -39006 -36786 -25980 -8468 10674 27108 37043
1068C7043L33q025j4820j9405j7306j1558l871N625J3130J7348J8376J3216O206
$$ 37043 37376 29351 14531 -4874 -22180 -33738 -37609 -31984 -18854 -1506 16870 30086 36292
1081C6292k405j0854j6035j8041j5338q005p1P552J5047J7380J5905J0848K235
$$ 36292 33887 23033 6998 -11043 -26381 -34386 -34457 -26905 -11858 5522 21427 32275 34510
1094C4510n486j1973j7317j6321j2093n375L138J0327J5259J6962J3511P198j52
$$ 34510 29024 17051 -266 -16587 -28680 -34055 -30917 -20590 -5331 11631 25142 32340 32188
1107C2188q329j3739j6105j4971r097j968N326J2300J5535J4992J1534M158l481
$$ 32188 23859 10120 -5985 -20956 -30053 -32021 -26695 -14395 1140 16132 27666 31824 28343
1120B8343r690j4924j5376j2324o661J214P941J2902J5475J3408Q080J759o085
$$ 28343 18653 3729 -11647 -23971 -30632 -29418 -21477 -8575 6900 20308 28388 30147 24062
1133B4062j1704j4278j4511r631l277K934J0272J3715J4061J1737N182j457p509
$$ 24062 12358 -1920 -16431 -26062 -29339 -26405 -16133 -2418 11643 23380 28562 27105 19596
1146A9596j2853j4401j1978p803k84N998J0798J4070J2943Q768K951m064r671
$$ 19596 6743 -7658 -19636 -27439 -27723 -21725 -10927 3143 16086 24854 27805 23741 14070
1159A4070j2587j3757r833m633J502Q049J2000J2894J1510O484j80n544j0905
$$ 14070 1483 -12274 -22107 -26740 -25238 -17189 -5189 7705 19215 25699 25519 19975 9070
1172I070j3143j1477q367k011M420Q800J2731J2359Q692M298k308p835j1130j2480
$$ 9070 -4073 -15550 -23917 -25928 -21508 -12708 23 12382 21074 25372 23064 15229 4099 -8381
1186h381j0189n301j17O275J0443J1814J1101O920J367m084r127j1642j1152q357
$$ -8381 -18570 -23871 -23988 -17713 -7270 4544 15645 22565 23932 19848 10721 -921 -12073 -20430
1200b0430l286K744P367J0995J1460Q940N080p19o491r552j1452j0083n989j061
$$ -20430 -23716 -20972 -13605 -2610 8850 17790 22870 22151 15660 6108 -5344 -15427 -21416 -22477
1214b2477M602Q887J0882J0353P272K512k699p600j0343j0346q572m009J302N789
$$ -22477 -17875 -8988 1894 12247 19519 22031 19332 11732 1389 -8957 -17529 -21538 -20236 -14447
1228a4447R552J0819Q694N858K40m686q230j0517r734o070k222L056P263R707
$$ -14447 -4895 5924 14618 20476 20716 16030 7800 -2717 -12451 -18521 -20743 -17687 -10424 -717
1242g17J0064P610L078j283n928r299r649q645m564K24M493Q038R938Q679N758
$$ -717 9347 16957 20035 18752 12824 3525 -6124 -14769 -19333 -19109 -14616 -6578 3360 12039 17797
1257A7797J468l300o650r395r309o602k879J622O026Q389R456P583L842m7m637
$$ 17797 19265 15965 9315 -80 -9389 -15991 -18870 -17248 -11222 -2833 6623 14206 18048 18001 13364
1272A3364q068q829q319n158p83L096O734R034Q149O365K373k207n518q372q660
$$ 13364 5296 -3533 -11852 -17010 -17793 -14697 -7963 1071 9220 15585 17958 15751 10233 1861 -6799
1287f799o766l662Q09M493P545Q483P664M318Q05l369o821q152p790n703j715
$$ -6799 -13565 -17227 -16418 -11925 -4380 4103 11767 16085 16890 13521 6700 -1452 -9242 -14945 -16660
1302a6660K104N524Q009P931O174L312j156m577p087q000o788m098l19L428O306
$$ -16660 -14556 -9032 -1023 6908 13082 16394 15238 10661 3574 -4426 -11214 -15312 -15631 -12203 -5897
1317e897P859P334M759J441j950n845p204p274n961k438R86M479O916P488O297
$$ -5897 1962 9296 14055 15496 13546 7701 497 -6777 -12738 -15176 -14190 -9711 -2795 4693 10990
1332A0990L516j4l431n997p588o597m372j136K407N292O972P004N028K179j083
$$ 10990 14506 14492 11061 5064 -2524 -9121 -13493 -14629 -12222 -6930 42 7046 12074 14253 13170
1347A3170m571o591o828n744l111K17L400N852O993O180L809Q64k477n013o755
$$ 13170 8599 2008 -4820 -10564 -13675 -13458 -10058 -4206 2787 8967 12776 13640 11163 6150 -605
1362f05o437m623j873J484M351O255O388N268K885n37l272n801o363n617l475
$$ -605 -7042 -11665 -13538 -12054 -7703 -1448 4940 10208 13093 12556 9284 3483 -2880 -8497 -11972
1377a1972p94K546M972O157O004M179J504j587m215n754o263m723k296O06L475
$$ -11972 -12766 -10220 -5248 909 6913 11092 12596 11009 6794 1040 -5223 -9946 -12242 -11636 -8161
1392h161N352O048N220L078K73k560m679n932n512l809j080J625M082N487N869
$$ -8161 -2809 3239 8459 11537 11810 9250 4571 -1361 -6873 -10682 -11762 -10137 -6055 -568 5301
1407E301M191K105p83l493n227n603m766k711l8K475M608N483N269L465P46j684
$$ 5301 9492 11597 10814 7321 2094 -3509 -8275 -10986 -11024 -8549 -3941 1542 6811 10276 11022 9338
1423I338l944n349n323l974j659Q57L565M777N370M377K476k27k700m345n215
$$ 9338 5394 45 -5278 -9252 -10911 -10054 -6489 -1712 3658 8035 10511 10284 7584 3239 -1976
1438a976m671l097m69J437M334M929M883L501J326j153l077m665m983l923k183
$$ -1976 -6647 -9744 -10213 -8776 -4442 487 5370 8871 10197 9044 5967 1302 -3681 -7604 -9787
1453i787L47K409M296M867M404K672O26j930l793m707m731l152j008Q65L445M368
$$ -9787 -9440 -7031 -2735 2132 6536 9208 9834 7904 4111 -596 -5327 -8479 -9487 -8622 -5177 -809
1469h09M624L742J743m52k400m257m474m077k512j57J967L354M620M148L033J092
$$ -809 3815 7557 9300 8848 6448 2191 -2283 -6360 -8872 -9029 -7062 -3708 912 5060 8093 9185
1485I185j464l075m164m312l374j423J95K616L744M394L789K087K43j760l656
$$ 9185 7721 4646 482 -3830 -7204 -8627 -8432 -5816 -2072 2322 6111 8198 8441 6681 3025
1500C025m151l903k695q01J308K960L992M014L121J592q50k617l424m114l308
$$ 3025 -1126 -5029 -7724 -8525 -7217 -4257 -265 3749 6870 8462 7612 4995 1571 -2543 -5851
1515e851j854j89J833L369L819L780K339O27j195k797l787l699k914j265Q40K219
$$ -5851 -7705 -7894 -6061 -2692 1127 4907 7246 7873 6678 3881 94 -3605 -6519 -7784 -6944 -4725
1531d725L568L762K948J801n7j928l002l823l288j907p30J229K767L588L356K497
$$ -4725 -1157 2605 5553 7354 7297 5369 2367 -1456 -4744 -6651 -7381 -6152 -3385 203 3559 6056
1547F056J057n47k334l328l348k855j694K22J701K950L653K786K172L99j396k492
$$ 6056 7113 6566 4232 904 -2444 -5299 -6993 -6771 -5070 -2120 1533 4319 6491 6890 5494 3002
1563C002l257l267k314r71P99K212L068L214K732J157k04j737k913k919k883j860
$$ 3002 -255 -3522 -5836 -6807 -6008 -3796 -728 2486 5218 6375 6171 4434 1521 -1398 -4281 -6141
1579f141j50J130K551L135K875K108Q86j166j795k909l105k257j231L12J790K594
$$ -6141 -6291 -5161 -2610 525 3400 5508 6394 5228 3433 524 -2581 -4838 -6069 -5757 -3967 -1373
1595a373K924K676J476Mj026k597k748k727j879l78N81K137K830K521K154J085
$$ -1373 1551 4227 5703 5707 4681 2084 -664 -3391 -5270 -5648 -5067 -2930 -100 2421 4575 5660
1611E660o23j423k393k890k128j472j54J259K152K793K440J701L84o68k167k478
$$ 5660 5037 3614 1221 -1669 -3797 -5269 -5423 -4164 -2012 781 3221 4922 5306 4638 2471 -7
1627gk476j930q89L86J642K401K386K080J378j77j152j944k554k278j614l26R43
$$ -7 -2483 -4413 -5302 -4916 -3274 -873 1513 3593 4971 4794 3642 1698 -856 -3134 -4748 -5074 -4131
1644d131J775K321K352J718Q35l80j726j973k330k027j153J58R66K190K390J921
$$ -4131 -2356 -35 2317 4035 4870 4490 2764 791 -1539 -3566 -4719 -4561 -3595 -1405 985 2906
1660B906J420K51p52j785k220k108j587o33N37J270K008K297J766R78m0j193j869
$$ 2906 4326 4577 3825 2040 -180 -2288 -3875 -4508 -3971 -2701 -693 1604 3370 4348 4308 3115 1246
1677A246k087j903j256k45O51J707K224J803J641L98n13j272j972k091j557r25
$$ 1246 -841 -2744 -4000 -4245 -3594 -1887 337 2140 3781 4179 3666 2394 422 -1669 -3226 -4151
1693d151J44J205J749K057J724J049L20q16j685j969j685j433m81M49J436J801
$$ -4151 -4007 -2802 -1053 1004 2728 3777 4097 3281 1596 -373 -2058 -3491 -3972 -3523 -2087 -286
1709b86J968J529O11j60j105j565k117j380j114n4Q42J340J896J725J102N24n83
$$ -286 1682 3211 3822 3662 2557 992 -1125 -2505 -3619 -3673 -2831 -1491 405 2130 3232 3756 3173
1726C173j297j755j720j426n89K72J173J572J698J490Q56r1o56j464j780j509
$$ 3173 1876 121 -1599 -3025 -3614 -3342 -2169 -597 1101 2591 3447 3356 2700 1236 -544 -2053
1742b053j184k78O49J111J635J750J074P46m47r43j597j547j554q09L8Q84J395
$$ -2053 -3237 -3515 -2866 -1755 -120 1630 2704 3450 3003 2060 463 -1084 -2638 -3447 -3409 -2525 -1130
1759a130J586J562Q66L68m63j223j610j448j300n03M30R71J374J624J385O34P3
$$ -1130 456 2018 2884 3252 2789 1566 -44 -1492 -2792 -3295 -2865 -1894 -520 1104 2489 3123 3196
1776C196q78j308j538j388j050j49O00J189J495J380J128L69j84j098j419j410
$$ 3196 2318 1010 -528 -1916 -2966 -3115 -2515 -1326 169 1549 2677 3046 2862 1764 345 -1065
1792a065j254o87N2Q11J283J628J120Q46J75n68j131j463j449q87l39M08Q91J346
$$ -1065 -2319 -3006 -2954 -2143 -860 768 1888 2734 2909 2341 1210 -253 -1702 -2589 -2928 -2520 -1629 -283
1810b83J425J214N23j03r51j232j233j192p32k47O08R75J573J104J088K10l45
$$ -283 1142 2356 2879 2776 1825 593 -640 -1832 -2564 -2811 -2203 -1228 345 1449 2537 2747 2402
1827B402j109j217j343q71m91J14O86J180J349J152O68J03p39j073j081j226q57
$$ 2402 1293 76 -1267 -2138 -2629 -2515 -1829 -649 700 1852 2520 2623 1884 811 -270 -1496 -2353
1844b353k64M38Q63J186J281Q65L13j01o31j051j157j213m95q9O31R82J011J359
$$ -2353 -2617 -2179 -1316 -130 1151 2016 2329 2228 1597 546 -611 -1824 -2319 -2408 -1777 -795 216 1575
1862A575O31J79m07p20j430q41r26m89L15P43R88R92Q38P60Pn40p53j283r95p98
$$ 1575 2206 2385 1978 1258 -172 -1013 -1939 -2428 -2113 -1370 -382 610 1448 2208 2215 1675 922 -361 -1356 -2154
1882b154MK56Q00R78J117Q64L06k78n56r54r90j008n95L1N98P85J086J054O15
$$ -2154 -2150 -1894 -1094 -116 1001 1865 2171 1893 1337 383 -607 -1615 -2210 -2179 -1581 -796 290 1344 1959
1901A959K53m75p34j017r04q07m69K61P01P24J193P69M36K0n43o19j005q94n86
$$ 1959 2212 1737 1003 -14 -918 -1725 -2194 -1933 -1232 -508 685 1454 1890 1910 1367 748 -257 -1151 -1737
1920a737k20K21O29R48R14P97L38k46n18q18q47q69m22J35K96Q57P03J041M93
$$ -1737 -1957 -1736 -1107 -159 755 1552 1890 1644 1126 308 -539 -1408 -1830 -1695 -1399 -542 161 1202 1695
1939A695K06k94p43p20r88o49k33J31N00R19Q05O92L46K3m96o14p60p30n58j14
$$ 1695 1901 1607 864 144 -844 -1493 -1726 -1595 -1095 -176 629 1321 1667 1690 1194 580 -180 -910 -1468 -1582
1959a582J33O54P82O88O15L86k82l55q76o47o85n02P6L57O68P86P67N41K9j07
$$ -1582 -1449 -795 -13 675 1290 1676 1394 1039 163 -484 -1169 -1671 -1595 -1238 -570 216 983 1524 1553 1446
1979A446p07p66o43n45k40J7N56N40Q21O27N15j52l30o28r01m03m84j83K64N16
$$ 1446 739 -27 -670 -1215 -1455 -1438 -882 -342 479 1106 1621 1469 1139 511 -390 -793 -1277 -1460 -1196 -680
1999f80O90N68N92K19j49l99p44p04m64l60K2L80N52P65N56M49N9k06m56p72o06
$$ -680 10 578 1170 1389 1240 841 97 -607 -1071 -1431 -1409 -1029 -477 288 844 1293 1352 1146 690 -82 -688
2020f88n31l13K28M48N32Q57N54P2L9l69m60m60p67k61j24O2O34N63P19K93L59
$$ -688 -1219 -1532 -1304 -856 -324 533 1087 1159 1198 829 369 -91 -858 -1119 -1243 -1181 -547 16 735 1028 1387
2041A387k56m43n98n70m69m58N4M99O23M60N32K92J15k45l70o52n49m04r1Q5K11
$$ 1387 1131 688 90 -480 -949 -1407 -1353 -854 -231 229 761 1053 1168 923 553 -99 -648 -1052 -1143 -1058 -847
2062h47P35M95N81K18j2l42n28n61m78m41j5L23M54M81O46K50K14j84l99m54o16
$$ -847 -112 383 964 1182 1170 828 300 -261 -739 -1180 -1195 -872 -418 63 709 959 1173 989 590 136 -480
2083d80m57k14n5L33M69O49N63L31nl46l18n83n10m55j40K05L32N46P24K84J36
$$ -480 -937 -1151 -1206 -873 -404 245 808 1139 1134 788 470 -113 -623 -1078 -1218 -1013 -681 -135 589 873 1009
2104A009k5k57o06m61m55j75l1R9M59M49P63K57J45j12n49m17n48l46k74M9L53
$$ 1009 984 727 121 -340 -795 -970 -1001 -902 -443 6 769 1026 1171 1059 510 93 -455 -801 -1075 -1026 -673
2125f73M26M19N80K37K03l30m74n29n19k77j93K45L14M69M09N40K11k19j33o28
$$ -673 -247 172 752 989 1192 862 388 -141 -660 -937 -1130 -885 -571 -102 307 847 1058 839 706 78
2145G8k55m39l41J23J59M39L50N11L45oj10k81m73m42l64l33K24K85L16L44M43
$$ 78 -177 -616 -957 -834 -675 -236 114 625 970 964 854 573 100 -342 -706 -1039 -815 -530 -214 130 573
2166E73K41M8j22m03n21m05j99j65J0M50L56O35J06J23J74k02m88l73o50o9Q0
$$ 573 814 862 740 337 -184 -589 -788 -953 -943 -493 -137 498 604 727 901 699 211 -162 -812 -881 -801
2187h01J53L32M73L41N07k58J2k69k45o01l83LL0K11K94M22M23J04J87l12j34
$$ -801 -648 -316 157 498 1005 747 759 490 245 -356 -739 -736 -706 -495 -201 221 644 748 935 623 489
2208D89p24k91j99n6J58K09L69M25K48J13R7k89l74k35n06k96J25J56L61L78K64
$$ 489 -235 -526 -725 -781 -623 -414 -45 380 628 741 838 549 175 -60 -566 -862 -737 -581 -220 158 422
2229D22K15K70k37j65n10k71l76Rj78J67M79L68M81J56j58ql21m63k36j42l06
$$ 422 637 907 670 505 -5 -276 -652 -643 -821 -654 -175 193 674 830 672 664 343 -120 -356 -498 -804
2250h04O0M62J98L57J46K46r4j6m38l39k08k33M6J80L31K04L65J84M2j17k18k79
$$ -804 -744 -282 -84 273 419 665 571 555 117 -222 -430 -663 -617 -437 -106 98 463 647 689 572 354 75
2272G5k41l20k27Q1J18K05L99M27J28J29j84k73k47l59k58k2L0J20L16M28K17
$$ 75 -166 -486 -713 -632 -514 -309 90 517 645 774 590 317 70 -289 -547 -569 -539 -419 -103 325 542
2293E42N6q3j03j82l36k53m76J04J78K19L44K49K57M3qj92k52l64k23k06L66m5
$$ 542 598 515 412 230 -106 -359 -835 -731 -553 -334 10 259 516 559 551 359 107 -257 -480 -686 -320 -365
2315c65K04J89M23P6J35j30j22j93l47l56oK3O4L04K58K09J93J2j52l38j99l19
$$ -365 -161 28 451 527 662 532 410 217 -130 -486 -492 -469 -405 -101 157 366 559 571 419 81 -118 -437
2337d37k3j84J85J39K34K19L36J13j9k09j62m56l04J03q3K22J10K72L48J96P4
$$ -437 -460 -644 -459 -320 -86 133 469 582 563 354 192 -264 -568 -465 -548 -326 -216 56 404 600 674
2358F74k05k65n5m71J2r8j95K46K87J79K22K06O9k34k07j94k72j90j5Q8J84J68
$$ 674 469 204 149 -322 -310 -408 -603 -357 -70 109 331 537 606 372 165 -29 -301 -491 -506 -418 -234 -66
2380f6K80J75ml3K0k77l4m15j30M4J35K2L83K05MK48q0j56k74k60r9l9N0J14J04
$$ -66 214 389 385 352 372 95 61 -354 -484 -440 -305 -283 100 305 309 557 477 321 47 -213 -312 -351 -301 -187 -83
2405h3J86L14j4l7l3j72k70l31Kk1P5J27K24J31K11J09LO0l40k98k02j30J57p5
$$ -83 103 417 403 366 333 161 -109 -440 -438 -459 -384 -257 -33 98 309 418 421 481 141 -157 -359 -489 -332 -407
2429d07K39K08J20K61j23K3M3l41n7k78j27J56J32ML92qJ56J46k65r8j83j93j27
$$ -407 -168 40 160 421 298 321 364 23 -34 -312 -439 -283 -151 -147 245 237 393 539 274 176 -7 -200 -327
2452c27j1J46K3R6K69J88M5l3j98j78j95r4j76J3J19J34L56j1K39m8j6j61k91
$$ -327 -338 -192 -169 -73 196 384 429 396 198 20 -175 -269 -445 -432 -313 -179 177 166 405 357 341 180 -111
2475a11j02l2j47J20q2K54J33K90j4J84j30l16j24p4l8j55N7J16O9L03K17On4
$$ -111 -213 -245 -392 -272 -354 -100 33 323 309 493 363 47 -77 -151 -189 -344 -287 -171 -102 201 418 424 370
2498C70j90n2j16j40k90r5J96J38K09J00R1Q1O7k68j33j88k0j75m8K71J38J62
$$ 370 180 128 12 -128 -418 -513 -317 -179 30 130 221 302 369 101 -32 -220 -240 -415 -463 -192 -54 108
2520A08N9J99k7o5j25j81o2j70j01J49l3J51L57L8J47j49o3j32j65j01r8nj07
$$ 108 167 366 339 274 149 -32 -94 -264 -365 -216 -249 -98 259 297 444 295 232 100 -65 -166 -264 -269 -376
2543c76L53J04P3P6J49j04j63p4j62j94n8J64o5J33K65P4J77j7J0j75j50k23r3
$$ -376 -23 81 154 230 379 275 112 38 -124 -318 -376 -212 -277 -144 121 195 372 355 365 190 40 -183 -276
2566b76J39j41J22J57J43K19l9R5k59j28M8m42P2m7j6K55K53J28o6J58j50o9m3
$$ -276 -137 -278 -156 1 144 363 324 419 160 32 80 -362 -290 -337 -353 -98 155 283 217 375 225 156 113
2589A13k19m6k22J52r2Q6K24J65K22j65Lp4j51j22j85o4K45j7R8J84J74q3K9K9
$$ 113 -106 -152 -374 -222 -314 -228 -4 161 383 218 221 147 -4 -126 -311 -375 -130 -147 -49 135 309 226 255 284
2613B84j21j55r5j11L2j7J18P2J90r0O5Q6j7j73j44q2j38k4O2K17j2K99j06P2
$$ 284 163 8 -87 -198 -166 -183 -65 7 197 107 172 258 241 68 -76 -158 -296 -320 -258 -41 -53 246 140 212
2637B12j58J92l00n0j13q4J6M5J72J27J03N6P7l8m4j21k06j51J76K8l0L8J38K3
$$ 212 54 246 -54 -104 -217 -301 -285 -240 -68 59 162 218 295 257 213 92 -114 -265 -89 -61 -91 -53 85 108
2661A08K43k48K12j37k09l10J27k1J87p8K90j61J51K5rq2l0q0l36J11MQ2J76J8
$$ 108 351 103 315 178 -31 -341 -214 -235 -48 -126 164 3 154 179 170 88 58 -22 -358 -247 -243 -161 15 33
2685C3P8M3R7j9k02lo1j39j19%R0K92o2K28n5N6j31j06j30J15j95m3Q0R4J50K8
$$ 33 111 154 251 232 30 27 -34 -173 -292 -292 -202 90 28 256 201 257 126 20 -110 5 -190 -233 -153 -59 91 119
2711A19l0P1j86M9p1j39p6j01K89N7K5N4P4J18j29m7J31k19m9q0j50J35J49J01
$$ 119 89 160 -26 23 -48 -187 -263 -364 -75 -18 7 61 135 253 124 77 208 -11 -60 -140 -290 -155 -6 95
2735I5j6Q7L2j38N7l7j30o0j14l5J57QJ41o5K30q3j49P9l5r4q5J56k06O7M0J52
$$ 95 79 166 198 60 117 80 -50 -110 -224 -259 -102 -94 47 -18 212 129 -20 59 24 -70 -155 1 -205 -138 -98 54
2761E4R0o4J6J54q3k47j25J95j13l5J42q4K10j05R4j8o6k4P9Qj77ORP2J6J63l6
$$ 54 144 80 96 250 167 -80 -205 -10 -123 -158 -16 -100 110 5 99 81 15 -9 70 78 -99 -93 -84 -12 4 167 131
2788A31J08j26jj89P4j30lR1r9J14M1nJ25m7r2J73k08j9j26J16j09J12R5LJ52
$$ 131 239 113 112 -77 -3 -133 -136 -45 -144 -30 11 6 131 84 -8 165 -43 -62 -188 -72 -181 -69 26 29 181
2813A81j92J69j04N8k28J02q5n1M8J2K81r2K8l3J9Jj1k02n1k9J05N4o1J73M4j03
$$ 181 -11 158 54 112 -116 -14 -99 -150 -102 -90 191 99 127 94 113 114 103 -99 -150 -179 -74 -20 -81 92 136 33
2839C3J80l1j82n7l2oj02K32o5j18K17L4N7o0o7j7L0j14O5j02%J04N6J02j26K13
$$ 33 213 182 0 -57 -89 -95 -197 35 -30 -148 69 103 160 100 33 16 46 -68 -3 -105 -105 -1 55 157 31 244
2865B44j44j34N8k1q2Qk4O1Q1l9J5l7Q5k1j09K5j3q8M2n1K44j04Q3l9PJ55j39
$$ 244 100 -34 24 3 -79 -71 -95 -34 47 8 23 -14 71 50 -59 -34 -47 -135 -93 -144 100 -4 79 40 47 202 63
2892F3j8j7k57O7J08j3J08kJ01o4P7j00n7PM4j53N4L6oM7J1J9J9N4l9q0n1R0k19
$$ 63 45 28 -229 -162 -54 -67 41 39 140 76 153 53 -4 3 47 -106 -52 -16 -22 25 36 55 74 128 89 9 -42 48 -171
2921a71J37m7kK01k14K74j68J6m9k0R9o5j68Q1L8Np9K36r5L9p3Q3q5M5m6nL3M2
$$ -171 -34 -81 -83 118 -96 178 10 26 -23 -43 56 -9 -177 -96 -58 -53 -132 104 9 48 -25 58 -27 18 -28 -33 0 42
2949D2Jj09N1j6k9J36k8N3k3j80J86j34J11r0N3p7N0j06J28QJ4k5Rq5L7J20j39
$$ 42 43 -66 -15 -31 -60 76 48 101 78 -102 84 -50 61 -29 24 -53 -3 -109 19 27 41 16 25 -60 -23 97 -42
2976d2Q8J05j10L2p9j6M2j00j7L8mJ35l3O8j91j1q5O4K25k87J1M3N3K8O6N7m7
$$ -42 46 151 41 73 -6 -22 20 -80 -97 -59 -63 72 39 107 -84 -95 -180 -116 109 -178 -167 -124 -71 -43 23 80 33
3003C3j30J36o0k1QO5j23j05R7R9K6j79K11Qj14J59j99P5n8M9P3q2P4j23J48j39
$$ 33 -97 39 -21 -42 -34 31 -92 -197 -100 -1 25 -154 57 65 -49 110 -89 -14 -72 -23 50 -32 42 -81 67 -72
3029g2l8L2J3J0m4n3K00nP4J0j44J5J29j03l5OrJ1o9o4R8m2L1M1K2j34J05j0r5
$$ -72 -110 -78 -65 -55 -99 -152 48 43 117 127 -17 -2 127 24 -11 -5 -14 -3 -72 -136 -38 -80 -49 -8 14 -120 -15 -25 -120
3058a20J03J6P5j62L3J4j5J14L8j13R2j5l4r8M7j08R1O3k2o3J32j61k3J13N3J4
$$ -120 -17 -1 74 -88 -55 -41 -56 58 96 -17 75 60 26 -72 -25 -133 -42 21 -1 -64 68 -93 -116 -3 50 64
3084F4k43Q2K44j47p4J56j18N8J60l33J47j04J36k8J19o2j04P9j12J28j18P0M9
$$ 64 -179 -97 147 0 -74 82 -36 22 182 -151 -4 -108 28 0 119 57 -47 32 -80 48 -70 0 49
3107D9P0l7r1n2O4n7R4J3o7j0L1Nj36K08p7m4O7p0NRK03l10M2Q0j23J15M9k8q9
$$ 49 119 82 -9 -61 3 -54 40 53 -14 -24 7 12 -124 84 7 -37 30 -40 -35 -26 177 -133 -91 -11 -134 -19 30 2 -87
3136h7J60p4k3p7J12K7j7j8p2R9jQ2l3J1r1J04k62K48o2J02r5N8j32O4j5k8J03
$$ -87 73 -1 -24 -101 11 38 21 3 -69 30 29 111 78 89 -2 102 -160 88 26 128 33 91 -41 23 8 -20 83
3163H3J9L9j03J67j40j05NJ9j57J76R7K4j72L1l3J62j27N0j29ok3Q1J28j27P2
$$ 83 102 141 38 205 65 -40 -35 -16 -173 3 100 124 -48 -17 -50 112 -15 35 -94 -100 -123 -42 86 -41 31
3188C1o8P9J02j35p4qM3Q9o2K0q1K17L2k12J2n4l0J26r4PN1j05J90oq5qk7K6J04
$$ 31 -37 42 144 9 -65 -73 -30 59 -3 17 -64 153 185 -27 -15 -69 -99 27 -67 -60 -9 -114 76 70 -15 -23 -50 -24 80
3217H0pk27J63J06j51m4Q2J7j23P9Qj04R5Q3M0j42j57M4J96pj18L9J34o3j04N0
$$ 80 73 -154 9 115 -36 -80 2 19 -104 -25 -17 -121 -26 57 97 -45 -202 -158 38 31 -87 -48 86 23 -81 -31
3243c1O8k5J33j73o8J71J8j92J57j78J97j23j26J14j61j15K37J3L2m5K14j05q3
$$ -31 37 12 145 -28 -96 75 93 -99 58 -120 77 -46 -172 -58 -219 -334 -97 -84 -52 -97 117 12 -71
3266g1K10j27J88k21N7o1K4o9j0J90p1mM8n1m1k8N7J0l6q5J11P1K2j5O8K5k26
$$ -71 139 12 200 -21 36 -25 -1 -70 -80 110 39 35 83 32 -9 -37 20 30 -6 -91 20 91 113 98 166 191 -35
3293c5J71j96%J08j72m9L9M8Q1j6K27j66q0j3l1m3K2O1JM0q9J82k30J65o0K4L4
$$ -35 136 -60 -60 48 -124 -173 -134 -86 -5 -21 206 40 -40 -53 -84 -127 -105 -44 -43 -3 -92 90 -140 25 -35 -11 23
3320B3J7j80J54Jl9j8J33N2n6mm3l4o9J01r5R9j85P7K8q3K18m7p4J58k49P3j7
$$ 23 40 -140 14 15 -24 -42 91 143 87 83 40 6 -63 38 -57 42 -143 -66 -38 -121 97 50 -24 134 -115 -42 -59
3347e9J34k85J87M2O9k14J07O4r1M7P7j23K4j0P0Kk9J25j94K01l7j21l2K2kr3
$$ -59 75 -210 -23 19 88 -126 -19 45 -46 1 78 -45 -21 -31 39 41 12 137 -57 144 107 -14 -46 -24 -26 -119
3373a19M5L3O6J66j21j39J53j90K5R7k6J96l44J60m4KJ6M4M6j14KJ2K2j25N9k6
$$ -119 -74 -41 25 191 70 -69 84 -106 -81 16 -10 186 -158 2 -42 -40 -24 20 66 -48 -46 -34 -12 -137 -78 -104
3399a04J61p6Q2%j62P4K3MO0n1j5NL3j21J41L3J25j96j62rJ36Q8n2m5l6j6K06
$$ -104 57 -19 63 63 -99 -25 -2 2 62 11 -4 1 34 -87 54 87 212 16 -146 -155 -19 69 17 -28 -64 -80 126
3426A26o1j8r1R5N8l8j05p2M0j10K09kl4J24k6om5j1n5rj34K60k19K49RK3k00
$$ 126 65 47 -44 51 109 71 -34 -106 -66 -176 33 31 -3 121 95 89 44 33 -22 -31 -165 95 -124 125 134 157 -43
3453d3mJ75j51K0q5N9L2M5k05Q1nQ8L2k0m5k4M0rj58J37P0r4qR4LL4l2J87k95
$$ -43 -47 128 -23 -3 -88 -29 3 48 -157 -76 -81 7 39 19 -26 -50 -10 -19 -177 -40 30 -64 -72 22 25 59 27 214 -81
3482h1J58K2r8q2J4Q2M6J3j25K10j68J86j45K4k0r6p1J74L1j67K06j29l6Qj36
$$ -81 77 99 1 -81 -67 15 61 74 -51 159 -9 177 32 56 36 -60 -131 43 74 -93 113 -16 -52 -44 -180
3507a80J65j43K32j58j6N6QP0K1k8j6KP9k90J31J18p9k0J53j43N3ok1J6NJ64j26
$$ -180 -15 -158 74 -84 -100 -44 -36 34 55 27 11 13 92 -198 -67 51 -28 -48 105 -38 15 9 -12 4 9 173 47
3534D7j2k3j4j21p0K90r5M0o6P3q9oj3P4m7m9p1J37J25j2l4j41N0j60K05l4q8
$$ 47 35 12 -2 -123 -193 97 2 42 -24 49 -40 -46 -59 15 -32 -81 -152 -15 110 98 64 -77 -27 -187 18 -16 -104
3561a04Q8R8r8L5j33J13N2r9K20r4k77J11R6r4Q6K8N1J00n9n6n2L1j96RJ61k7
$$ -104 -16 82 -16 19 -114 -1 51 -48 172 78 -199 -88 8 -86 0 28 79 179 120 64 12 43 -153 -144 17 -10
3587a0r3M7O6rj8QK05k81J04j23J58j04q1N8RL3Q3j1N5p4nj02L4MJ02o9j55J43
$$ -10 -103 -56 10 1 -17 -9 196 -85 19 -104 54 -50 -131 -73 -64 -31 52 41 96 22 17 -85 -51 -47 55 -14 -169 -26
3615b6l1J64n5n1n7R0j90J47J43j66rM8n6J34L1k5j66J75j20Ln2j42J96q0P1R5
$$ -26 -57 107 52 1 -56 34 -156 -9 134 -32 -41 7 -49 85 116 91 -75 100 -20 -17 -69 -211 -15 -95 -24 71
3641G1j11N7J49j71M4m1o3l8m1Q7R3k6m7P3N7O9j33O6j42L0K6m9R4j47N2R8k7
$$ 71 -40 17 166 -5 39 -2 -65 -103 -144 -57 36 10 -37 36 93 162 29 95 -47 -17 9 -40 54 -93 -41 57 30
3668C0p8Q5l0Qj90J30q1M2k3PJ00J7J7m6O6q0j6j2j85J56qK08j68r3J89N9j30
$$ 30 -48 37 7 15 -175 -45 -126 -84 -107 -100 0 17 34 -12 54 -26 -42 -54 -239 -83 -91 117 -51 -144 45 104 -26
3695b6J32j37j2K8J42l13K7J35R6n6N4K7j03R1j49L4l1m1N3j09J38J2RJ32o6j0
$$ -26 106 -31 -43 -15 127 -186 -159 -24 72 16 70 97 -6 85 -64 -30 -61 -102 -49 -158 -20 -8 1 133 67 57
3721E7j05l6N4J01j77R1p5K42j24P3q3nN5l5Q6k0m6j73O1M8R7J9j31N7J00j03
$$ 57 -48 -84 -30 71 -106 -15 -90 152 28 101 18 13 68 33 119 99 53 -120 -59 -11 86 105 -26 31 131 28
3747B8l3m6o4J87j05N7Q3n0q5m6J12J21q4q4j50Q8o9J06Q7PJ9q7n9K9nm5P6mJ8
$$ 28 -5 -51 -115 72 -33 24 107 57 -28 -74 38 159 75 -9 -159 -71 -140 -34 53 60 79 -8 -67 -38 -43 -88 -12 -16 2
3776Bk5m7J22N3j21j5K7J04Qj60k6R3q6N5J3kJ02l7J42n4q6N2j30o3l9m8J37M3
$$ 2 -23 -70 52 105 -16 -31 -4 100 108 -52 -78 15 -71 -16 -3 -5 97 60 202 148 62 114 -16 -79 -118 -166 -29 14
3804A4j92J72K5o1R8O0j02j19Q7m4O2N9o0L4J6l0P0j14P9n4K7n5k2n1J03r4Q2
$$ 14 -178 -6 19 -42 56 116 14 -105 -18 -62 0 59 -1 33 49 19 89 -25 54 0 27 -28 -50 -101 2 -92 -10
3831a0Q7J08j32r7k8Q5j04J11m4j17J06P0Rr2J8N5m7r6J08Mj58j7K45j36J16P3
$$ -10 77 185 53 -44 -72 13 -91 20 -24 -141 -35 35 44 -48 -30 25 -22 -118 -10 -6 -164 -181 64 -72 44 117
3857A17r5L3j17O4Po0L9j02O6J52p2j17J97j29J01j72k3L4J9K0k30K09J97mj59
$$ 117 22 55 -62 2 9 -51 -12 -114 -48 104 32 -85 112 -17 84 -88 -111 -77 -58 -38 -268 -59 138 134 -25
3882b5j4J27j19r5%J51n8l3k0K11q6j9O1j05J33j01j4M4j14J18l1j50J44K7n0
$$ -25 -39 88 -31 -126 -126 25 -33 -66 -86 125 39 20 81 -24 109 8 -6 38 -76 42 11 -139 5 32 -18
3907a8J24q5J00k05L4M7j67J42o0l2K4J56pqm6q3J60Mk04qJ17m2p3M7R4K54k91
$$ -18 106 21 121 -84 -50 -3 -170 -28 -88 -120 -96 60 53 45 -1 -84 76 80 -124 -132 -15 -57 -130 -83 11 265 -26
3934b6K7Q8j11k2J03q1n0L8l2N2J5R0m3L9r8q9K8N6q5Q1J17L6j7k83K77r3L0p3
$$ -26 1 89 -22 -44 59 -22 -72 -34 -66 -14 1 91 48 87 -11 -100 -72 -16 -101 -20 97 133 116 -167 110 17 47 -26
3962b6j7j35J30o8N6J14lm0mN9k6Kj08J9r5J65q0r8J63M1n8J82j99J3J2n7QQ7
$$ -26 -43 -178 -48 -116 -60 54 51 11 7 66 40 42 -66 -47 -142 23 -57 -155 8 49 -9 173 -26 -13 -1 -58 -50 37
3990C7j38M0K6L3M4L6L2j02o0o0j9J37j91Q5J37j29J40j6l0r9K38k15J38j55J46
$$ 37 -101 -61 -35 -2 42 78 110 8 -52 -112 -131 6 -185 -100 37 -92 48 32 2 -97 141 -74 64 -91 55
4015E5k07R6J7pJ53l5r3j6J90j53jl7j6R6r5K0o4J84J1j3q2lJ8r0j9l6M0K7L1
$$ 55 -152 -56 -39 -46 107 72 -21 -37 153 0 -1 -38 -54 42 -53 -33 -97 87 98 85 3 0 18 -72 -91 -127 -87 -60 -29
4044b9Q9K8K0n5k0j14J8K2q2k1J43j78J47j3J2J23L8k99K90j47l1K55l04J25Q2
$$ -29 60 88 108 53 33 -81 -63 -41 -123 -144 -1 -179 -32 -45 -33 90 128 -171 119 -28 -59 196 -108 17 99
4069I9j68J0R9Q3Q2k69Q5l3j04Qj4J02n1J14j5R4j63R0L5j40ro9N0J38k6L5k3
$$ 99 -69 -59 40 123 205 -64 21 -12 -116 -108 -122 -20 -71 43 28 122 -41 49 84 -56 -65 -134 -84 54 28 63 40
4096D0J06j7qj64l7J30m9j20m0M3J60J27n9kq3K6k5l3P0q3o2J13j64k4J51J8L2
$$ 40 146 129 121 -43 -80 50 1 -119 -159 -116 44 171 112 110 27 53 28 -5 65 -18 -80 33 -131 -155 -4 14 46
4123D6O5p9l4P0k47R5r0K43M1j47k9J12O3k18K15j99j35P2R2R1lm5P9O7J0j77
$$ 46 111 32 -2 68 -179 -84 -174 69 110 -37 -66 46 109 -109 106 -93 -228 -156 -64 27 24 -21 58 125 135 -42
4149d2P3L3k02Q0mq7R8l6J28P5n5p5P1k9L4k09J36l6o8J28nop7J61p0M8k3p4N1
$$ -42 31 64 -138 -58 -62 -149 -51 -87 41 116 61 -14 57 28 62 -147 -11 -47 -115 13 8 2 -75 86 16 64 41 -33 18
4178A8j21K06j74N0J7J69j34J42m3o5qJ3m3o1O1j39K00p1P7J0R3j53j24O3J1Q3
$$ 18 -103 103 -71 -21 -4 165 31 173 130 65 57 70 27 -34 27 -112 88 17 94 104 197 44 -80 -17 -6 77
4204G7L1j50K3J4K0K6M8o6j20O1p6M6j9m1N9o0J15O9j63jP6NK0K0O7p7p6L2j17
$$ 77 108 -42 -19 -5 15 41 89 23 -97 -36 -112 -66 -85 -126 -67 -127 -12 57 -106 -107 -31 -26 -6 14 81 4 -72 -40 -157
4233a57J3J99oJ19j79J14l0j77P5K4J61k03%M5J81j51P2p3K9j36J16l6l1o2J12
$$ -157 -144 55 49 168 -11 103 73 -104 -29 -5 156 -47 -47 -2 179 28 100 27 56 -80 36 0 -31 -93 19
4258A9J0N8q0m1M6PQj34p5R6L5q6J46lJ19j89L15j67j15L8j95K58j54P9j24J43
$$ 19 29 87 7 -34 12 19 27 -107 -182 -86 -51 -137 9 6 125 -64 251 84 -31 7 -188 70 -84 -5 -129 14
4284A4K6m1J17n3o2j28J61k58L08r2L2l8J20j4j78J16O3j63J8R2j39m8j4K59j66
$$ 14 40 -1 116 63 1 -127 34 -224 84 -8 24 -14 106 92 -86 30 93 -70 -52 40 -99 -147 -161 98 -68
4309f8O0k9K07k44J59j12n0L0k2O7pJ21p7MpQ8j61P5J07j98m8J15o7J11p8K1J40
$$ -68 -8 -37 170 -74 85 -27 -77 -47 -69 -2 -9 112 35 39 32 120 -41 34 141 -57 -105 10 -57 54 -24 -3 137
4336A37j18J29q0J7n1j57J65j49K5J9%R6J34j05l3J9q6K1%k07K44p9QR9L2j73
$$ 137 19 148 68 85 34 -123 42 -107 -82 -63 -63 33 167 62 29 48 -38 -17 -17 -224 20 -59 -51 48 80 -93
4362i3J86l8q3J70j97P6L6j52R8k0j24J87ll5Q9k3p4j46R3J26p3m8p8J89L0j18
$$ -93 93 55 -28 142 -55 21 57 -95 3 -17 -141 46 43 8 97 74 0 -146 -53 73 0 -48 -126 63 93 -25
4388b5KO5l3j5p5M1j2nj96K96rk8j4J44n8j2Nk23Q5K7L4Q7n4M1j11J59J1p8k3
$$ -25 -23 42 9 -6 -81 -40 -52 -57 -253 43 34 6 -8 136 78 66 71 -152 -67 -40 -6 81 27 68 -43 116 127 49 26
4417B6P3j38l0qR8j65m4M3K97j84k4J32l4j40nO8j11K07j12P9j09k5Q0R2Mj43
$$ 26 99 -39 -69 -77 21 -144 -188 -145 152 -32 -56 76 42 -98 -103 -35 -146 61 -51 28 -81 -106 -26 66 70 -73
4443g3O1k1k7N1L3J79j60k6N3N8J4j63L0r7K05k69K18r1K9J9o2R2J16k48J68j11
$$ -73 -12 -33 -60 -9 24 203 43 17 70 128 142 -21 9 -88 117 -152 66 -25 4 23 -39 53 169 -79 89 -22
4469b2j61R0J13q2J5Q2Q7n0l7N8k24L5L7J07j45J46Qq3n0K38j28N9r4m4o6P5K9
$$ -22 -183 -93 20 -62 -47 35 122 72 35 93 -131 -96 -59 48 -97 49 57 -26 -76 162 34 93 -1 -45 -111 -36 -7
4496gN8M7j4k24k0K67j61rJ19jm1p7m0j2j71P7R2J08r5R8K3n1P2o0j28K40j69
$$ -7 51 98 84 -140 -160 107 -54 -63 56 55 14 -63 -103 -115 -286 -209 -117 -9 -104 -6 17 -34 38 -22 -150 90 -79
4523g9r9O9J27nQ1j49M6Q6Lk06K57r9j17J7P6N5J2q8m4p1LJ50L6q5m7KJ30j31
$$ -79 -178 -109 18 13 94 -55 -9 77 80 -126 131 32 -85 -68 8 63 75 -13 -57 -128 -125 25 61 -24 -71 -69 61 -70
4551g0J43j50M6J30k03J60r5j9j4n8K41Pm5l3N7j60n8J45K1q9Jj5J64k6k60K02
$$ -70 73 -77 -31 99 -104 56 -39 -58 -72 -130 111 118 73 40 97 -63 -121 24 45 -44 -43 -58 106 80 -180 22
4577B2K8J28j09j12N6j7JN6j19M5J9o0K9Q4j44m5J43k5Kp0J9r0P2N8k3J00j32
$$ 22 50 178 69 -43 13 -4 -3 53 -66 -21 -2 -62 -33 51 -93 -138 5 -20 -18 -88 -69 -159 -87 -29 -52 48 -84
4604h4J84j38J31j36o7J29q9j3J12r3P4J21j43K99k19p1j5l4p3Q2J53j21j08J54
$$ -84 100 -38 93 -43 -110 19 -70 -83 29 -64 10 131 -12 287 68 -3 -18 -52 -125 -43 110 -11 -119 35
4628C5L5q5M0M6l9j42L5RPk8J49n8r5P7o9M4K5o2mj05J46l4K6M9R7oJ02k04l3
$$ 35 70 -15 25 71 32 -110 -75 -66 -59 -87 62 4 -91 -14 -83 -39 -14 -76 -80 -185 -39 -73 -47 2 99 93 195 -9 -42
4657d2Q9J4pJ16l4l2n7j00RJ56k11J13P0K5j23n3NnK7qJ50j43J7k3J28j41J20
$$ -42 47 61 54 170 136 104 47 -53 -44 112 -99 14 84 109 -14 -67 -62 -67 -40 -48 102 -41 -24 -47 81 -60 60
4684F0k7q3oJ10rLLq1O9m6J21k26J18J7l4K4r4O1P3j12J02J9j03j8M0j13Q5O8
$$ 60 33 -50 -56 54 45 48 51 -30 39 -7 114 -112 6 23 -11 13 -81 -20 53 -59 43 62 -41 -59 -19 -132 -47 21
4712B1J24k24J52k2L3p0l4J20j19N7j84j3J60L5j8M7L2k9j67pR9or2J33K5n7j
$$ 21 145 -79 73 51 84 14 -20 100 -19 38 -146 -159 1 36 18 65 97 68 -99 -106 -7 -13 -105 28 53 -4 -5
4739eP6nn8K05j46q5l1n6J29l2M1Pj72J37Q3j90J06L2o9R4k68K66p4L2o1O4j43
$$ -5 71 66 8 213 67 -18 -49 -105 24 -8 33 40 -132 5 88 -102 4 36 -33 61 -207 59 -15 17 -44 20 -123
4766a23J64J4j8Q6k10J4J10KO4r3lm5O1j13Q7O0n6N2j05poO7p6J43j30p6Q6O7
$$ -123 41 55 37 123 -87 -73 37 39 103 10 7 -38 23 -90 -3 57 1 53 -52 -59 -65 2 -74 69 -61 -137 -51 16
4794A6j1lJ21l8m6M0k27N2m5J85Q6j49J06K7j48q9J78qm3q7J51KK6ok65K08j5
$$ 16 5 2 123 85 39 79 -148 -96 -141 44 130 -19 87 114 -34 -123 55 47 4 -83 68 70 96 90 -175 33 18
4821A8N0pj36M5p7J99k8j78K51o7n0J01j41j1O0j7mr5K09q6J0k9rP8j69K02j74
$$ 18 68 61 -75 -30 -107 92 64 -114 137 70 20 121 -20 -31 29 12 8 -87 122 36 46 17 8 86 -83 119 -55
4848e5O1j60J21L8j67J36K8l4J01j69J88r6J08j00j54Q6J71j04Q1j50J86%j27
$$ -55 6 -154 -33 5 -162 -26 2 -32 69 -100 88 -8 100 0 -154 -68 103 -1 80 -70 116 116 -11
4871a1J25r1o1pM2n4J07L2K0mk12J68k6k01J03J23o6R7j15K2q2m9J11K32j80j20
$$ -11 114 23 -38 -45 -3 -57 50 82 102 98 -114 54 28 -173 -70 53 -13 84 -31 -9 -91 -140 -29 203 23 -97
4897i7O9j8JK23n7j06J54p3j50J60j51R4L0m1L7n1N2M2k8q0j37j1K22q1N1J29
$$ -97 -28 -46 -45 178 121 15 169 96 -54 106 -45 49 79 38 75 24 76 118 90 10 -127 -138 84 3 54 183
4923A83j98pjk09K3K11k4p5R2m3k5K43k10p3R4L3J38k26N1L9q9J92j53J14l8k1
$$ 183 -15 -22 -23 -232 -209 2 -22 -97 -5 -48 -73 170 -40 -113 -19 14 152 -74 -23 16 -73 119 -34 80 42 21
4949B1oL9l3j2J9k3P9k8j46J30p6O4pq3O8%q3OP1JPlj55J00jJ5J5p0K00j60L8
$$ 21 15 54 21 9 28 5 84 56 -90 40 -36 28 21 -62 6 6 -77 -71 0 1 8 5 -150 -50 -51 -36 -21 -91 109 -51 -13
4980a3pK3Q6p8K0K2r2J53l9k50J54L2Q5j8p5j8Q5j37K41k63J16j21J47j27jJ42
$$ -13 -20 3 89 11 31 53 -39 114 75 -175 -21 11 96 78 3 -15 70 -67 174 -89 27 -94 53 -74 -75 67
5006F7r7J9j3J2j9Jj67K52q3P1K5j6n6J0NR2j31qR5L4r6j03J57j48J34NM3j18
$$ 67 -30 -11 -24 -12 -31 -30 -197 55 -28 43 68 52 -4 6 11 103 -28 -36 59 93 -3 -106 51 -97 37 42 85 -33
5034c3j1N3k0M2O4j04K0R4j24K9R2r0j04Q2m3N1K7o7r2J26r1m6P7j27K19j5L6
$$ -33 -44 9 -11 31 95 -9 11 105 -19 10 102 12 -92 -10 -53 -2 25 -42 -134 -8 -99 -145 -68 -195 24 9 45
5061D5J0l0j0M6q7Rp5J84p1J3M6j51O1r9Q4j91J09J80M2J9k43K17l6q0K3Q0j78
$$ 45 55 25 15 61 -26 -17 -92 92 21 34 80 -71 -10 -109 -25 -216 -107 73 115 134 -109 108 72 -8 15 95 -83
5088h3j4j1R7n0Qm6M9p3L2J85j51k2oJ5R6k2Oj30k5R8k0K09j20J61k80Q3J28j92
$$ -83 -97 -108 -11 -61 -53 -99 -50 -123 -91 94 -57 -79 -85 -70 26 4 10 -120 -145 -47 -67 142 22 183 -97 -14 114 -78
5116g8J08j8R7j46l5k5J40N9m9k34Q6J66j19O6P8r8j10L7P8P6j59j0n5R6qN4N8
$$ -78 30 12 109 -37 -72 -97 43 102 53 -181 -95 71 -48 18 96 -2 -112 -75 3 79 -80 -90 -145 -49 -57 -3 55
5143E5r5P9q2J11j06j17J49KJ73j16RM6o7k09J98J2q0K9%J4p5J22n0O4pj13LJ2
$$ 55 -40 39 -43 68 -38 -155 -6 -4 169 53 62 108 41 -168 30 42 -38 -9 -9 5 -70 52 2 66 59 -54 -51 -39
5171c9o1n0J90P0J0j98Q7q8M9J47j85J51k07J7J33oL7o1n0L5kl0R0J5l3pN1j5
$$ -39 -100 -150 40 110 120 -78 9 -79 -30 117 -68 83 -124 -107 26 20 57 -4 -54 -19 -21 -51 39 54 21 14 65 50
5199E0o0J35q6k8M1j85O2K19k3j10j5J63j44k9Jn3N2M1q5R4j43J84k9K1nn3K4
$$ 50 -10 125 39 11 52 -133 -71 148 125 15 0 163 19 -10 -9 -62 -10 31 -54 40 -103 81 52 73 68 15 39
5226C9Q3k31l8J30J57j58R1n7jL5j70K44pj80O3j4J69p6rJ5j53K3N9k0L2m3jk2
$$ 39 122 -109 -147 -17 140 -18 73 16 15 50 -120 124 117 -63 0 -14 155 79 70 85 -68 -45 14 -6 26 -17 -18 -40
5254d0O0q0J00j27J66n8MoN9p8N4K8k2q6j2Po8J72o6n7J46k0mr5j24J26J46j59
$$ -40 20 -60 40 -87 79 21 25 19 78 0 54 82 60 -26 -38 -31 -99 73 7 -50 96 76 72 -23 -147 -21 125 -34
5282c4K62k06R7k7J5j15L0K1j26l4J74M3n5m9J6J8jL1p7OJ26q5l0J8r9L0J18o2
$$ -34 228 22 119 92 107 -8 22 43 -83 -117 57 100 45 -4 12 30 29 60 -17 -11 115 30 0 18 -81 -51 67 5
5310EK3J3R3Kj4m8J26j6k21J25j12L4O5j6L7q4M9n3k2N8j01M2J03j47L6J17r6
$$ 5 28 41 134 136 122 74 200 184 -37 88 -24 10 75 59 96 12 61 8 -14 44 -57 -15 88 -59 -23 94 -2
5337bl9m6k3P5j30K28k8r1J0j2L0K9J14j46m3k8J10J79k47J08N5j15L6J24j61
$$ -2 -41 -87 -110 -35 -165 63 35 -56 -46 -58 -28 1 115 -31 -74 -102 8 187 -60 48 103 -12 24 148 -13
$$ [...]
8191a1
##END NTUPLES=NMR FID
##END=
