##TITLE=1H_DE-28oil_TFA
 CDCl3
 48 sc, 
 10.1.2024
##JCAMPDX= 6.0         $$ Bruker NMR JCAMP-DX V2.0
##DATA TYPE= NMR FID
##DATA CLASS= NTUPLES
##ORIGIN= UXNMR, Bruker Analytische Messtechnik GmbH
##OWNER= root
$$ XWIN-NMR		Version 3.5
$$ Wed Jan 10 14:54:48 2024 Russian Standard Time (UT+4h)  she@DPX200
##.OBSERVE FREQUENCY= 200.1313
##.OBSERVE NUCLEUS= ^1H
##.DELAY= (6, 6)
##.ACQUISITION MODE= SIMULTANEOUS
##.ACQUISITION SCHEME= undefined
##.AVERAGES= 48
##.DIGITISER RES= 18
##SPECTROMETER/DATA SYSTEM= spect
##.PULSE SEQUENCE= zg30
##.SOLVENT NAME= CDCl3
##.SHIFT REFERENCE= (INTERNAL, CDCl3, 0, 15.7039)
##AUDIT TRAIL= $$ (NUMBER, WHEN, WHO, WHERE, WHAT)
$$ ##TITLE= Audit trail, XWIN-NMR		Version 3.5
$$ ##JCAMPDX= 5.01
$$ ##ORIGIN= Bruker BioSpin GmbH
$$ ##OWNER= she
$$ F:/spectra/data/she/nmr/H-F/1/audita.txt
$$ ##AUDIT TRAIL=  $$ (NUMBER, WHEN, WHO, WHERE, WHAT)
(   1,<2024-01-10 14:53:22.43 +0400>,<she>,<DPX200>,
      <continue with go, POWCHK disabled, PULCHK disabled
       configuration hash MD5:
       00 E9 B6 7A A2 85 ED C7 34 08 36 98 17 FE 4E 26
       data hash MD5: 16K
       78 FA 03 91 2B A4 38 52 7E 44 CA 2C 2E AF 93 EC>)
$$ ##END=
$$ 
$$ hash MD5
$$ 4D 86 37 E6 F7 6D 41 1F 8D 9A AA 15 13 34 56 80
##$RELAX= 
##$RELAX= 
##$RELAX= 
##$RELAX= 
##$RELAX= 
##$RELAX= 
$$ Bruker specific parameters
$$ --------------------------
##$DU= <F:/spectra>
##$EXPNO= 1
##$NAME= <H-F>
##$PROCNO= 1
##$TYPE= <nmr>
##$USER= <she>
##$AMP= (0..31)
100 100 100 100 100 100 100 100 100 100 100 100 100 100 100 100 100 100 
100 100 100 100 100 100 100 100 100 100 100 100 100 100 
##$AQSEQ= 0
##$AQ_mod= 1
##$AUNM= <au_zg>
##$AUTOPOS= <>
##$BF1= 200.13
##$BF2= 200.13
##$BF3= 200.13
##$BF4= 200.13
##$BF5= 200.13
##$BF6= 200.13
##$BF7= 200.13
##$BF8= 200.13
##$BYTORDA= 1
##$CFDGTYP= 0
##$CFRGTYP= 5
##$CHEMSTR= <none>
##$CNST= (0..31)
1 1 145 1 1 1 1 1 1 1 1 1 1 1 1 1 1 1 1 1 1 1 1 1 1 1 1 1 1 1 1 1 
##$CPDPRG= <>
##$CPDPRG1= <>
##$CPDPRG2= <>
##$CPDPRG3= <>
##$CPDPRG4= <mlev>
##$CPDPRG5= <mlev>
##$CPDPRG6= <mlev>
##$CPDPRG7= <mlev>
##$CPDPRG8= <mlev>
##$CPDPRGB= <>
##$CPDPRGT= <>
##$D= (0..31)
0 1.2 0 0 0 0 0 0 0 0.06 0 0.03 0 0 0 0 0.0002 0 0 0 0 0 0 0 0 0 0 0 0 
0 0 0 
##$DATE= 1704883838
##$DBL= (0..7)
120 120 120 120 120 120 120 120 
##$DBP= (0..7)
150 150 150 150 150 150 150 150 
##$DBP07= 0
##$DBPNAM0= <>
##$DBPNAM1= <>
##$DBPNAM2= <>
##$DBPNAM3= <>
##$DBPNAM4= <>
##$DBPNAM5= <>
##$DBPNAM6= <>
##$DBPNAM7= <>
##$DBPOAL= (0..7)
0.5 0.5 0.5 0.5 0.5 0.5 0.5 0.5 
##$DBPOFFS= (0..7)
0 0 0 0 0 0 0 0 
##$DE= 6
##$DECBNUC= <off>
##$DECIM= 32
##$DECNUC= <off>
##$DECSTAT= 4
##$DIGMOD= 1
##$DIGTYP= 9
##$DL= (0..7)
0 120 120 120 120 120 120 120 
##$DP= (0..7)
150 150 150 150 150 150 150 150 
##$DP07= 0
##$DPNAME0= <>
##$DPNAME1= <>
##$DPNAME2= <>
##$DPNAME3= <>
##$DPNAME4= <>
##$DPNAME5= <>
##$DPNAME6= <>
##$DPNAME7= <>
##$DPOAL= (0..7)
0.5 0.5 0.5 0.5 0.5 0.5 0.5 0.5 
##$DPOFFS= (0..7)
0 0 0 0 0 0 0 0 
##$DQDMODE= 0
##$DR= 18
##$DS= 0
##$DSLIST= <SSSSSSSSSSSSSSS>
$$ [...]
##$SUBNAM2= <"">
##$SUBNAM3= <"">
##$SUBNAM4= <"">
##$SUBNAM5= <"">
##$SUBNAM6= <"">
##$SUBNAM7= <"">
##$SUBNAM8= <"">
##$SUBNAM9= <"">
##$SW= 18.0517328524113
##$SWIBOX= (0..15)
0 0 2 0 0 0 0 0 0 0 0 0 0 0 0 0 
##$SW_h= 3612.71676300578
##$TD= 16384
##$TD0= 1
##$TE= 0
##$TE2= 300
##$TE3= 300
##$TEG= 300
##$TL= (0..7)
0 120 120 120 120 120 120 120 
##$TP= (0..7)
150 150 150 150 150 150 150 150 
##$TP07= 0
##$TPNAME0= <>
##$TPNAME1= <>
##$TPNAME2= <>
##$TPNAME3= <>
##$TPNAME4= <>
##$TPNAME5= <>
##$TPNAME6= <>
##$TPNAME7= <>
##$TPOAL= (0..7)
0.5 0.5 0.5 0.5 0.5 0.5 0.5 0.5 
##$TPOFFS= (0..7)
0 0 0 0 0 0 0 0 
##$TUNHIN= 0
##$TUNHOUT= 0
##$TUNXOUT= 0
##$USERA1= <user>
##$USERA2= <user>
##$USERA3= <user>
##$USERA4= <user>
##$USERA5= <user>
##$V9= 5
##$VALIST= <valist>
##$VCLIST= <CCCCCCCCCCCCCCC>
##$VD= 0
##$VDLIST= <DDDDDDDDDDDDDDD>
##$VPLIST= <PPPPPPPPPPPPPPP>
##$VTLIST= <TTTTTTTTTTTTTTT>
##$WBST= 1024
##$WBSW= 4
##$XGAIN= (0..3)
0 0 0 0 
##$XL= 0
##$YL= 0
##$YMAX_a= 263802
##$YMIN_a= -388315
##$ZGOPTNS= <>
##$ZL1= 120
##$ZL2= 120
##$ZL3= 120
##$ZL4= 120
##$ABSF1= 10
##$ABSF2= 0
##$ABSG= 5
##$ABSL= 3
##$ALPHA= 0
##$AQORDER= 0
##$ASSFAC= 0
##$ASSFACI= 0
##$ASSFACX= 0
##$ASSWID= 0
##$AUNMP= <proc_1d>
##$AZFE= 0.1
##$AZFW= 0.1
##$BCFW= 1
##$BC_mod= 2
##$BYTORDP= 1
##$COROFFS= 0
##$CY= 11.3945322036743
##$DATMOD= 1
##$DC= 2
##$DFILT= <>
##$DTYPP= 0
##$F1P= 15.7292609196834
##$F2P= 12.9074282941183
##$FCOR= 0.5
##$FTSIZE= 0
##$FT_mod= 4
##$GAMMA= 1
##$GB= 0.15
##$INTBC= 1
##$INTSCL= 1
##$ISEN= 128
##$LB= 0.24
##$LEV0= 0
##$LPBIN= 0
##$MAXI= 10000
##$MC2= 0
##$MEAN= 0
##$ME_mod= 0
##$MI= 1.114404
##$NCOEF= 0
##$NC_proc= 0
##$NLEV= 6
##$NOISF1= 3.799351
##$NOISF2= 2.8
##$NSP= 1
##$NTH_PI= 0
##$NZP= 0
##$OFFSET= 15.70392
##$PC= 1
##$PHC0= -24588.25
##$PHC1= 7.252729
##$PH_mod= 1
##$PKNL= yes
##$PPARMOD= 0
##$PSCAL= 0
##$PSIGN= 0
##$REVERSE= no
##$SF= 200.130013532006
##$SI= 16384
##$SIGF1= 3
##$SIGF2= 2
##$SINO= 400
##$SIOLD= 16384
##$SREGLST= <1H.CDCl3>
##$SSB= 0
##$STSI= 0
##$STSR= 0
##$SW_p= 3612.71676300578
##$SYMM= 0
##$S_DEV= 0
##$TDeff= 0
##$TDoff= 0
##$TI= <>
##$TILT= no
##$TM1= 0
##$TM2= 0
##$TOPLEV= 0
##$USERP1= <user>
##$USERP2= <user>
##$USERP3= <user>
##$USERP4= <user>
##$USERP5= <user>
##$WDW= 1
##$XDIM= 8192
##$YMAX_p= 0
##$YMIN_p= 0
$$ End of Bruker specific parameters
$$ ---------------------------------
##NTUPLES= NMR FID
##VAR_NAME=  TIME,          FID/REAL,        FID/IMAG
##SYMBOL=    X,             R,               I
##VAR_TYPE=  INDEPENDENT,   DEPENDENT,       DEPENDENT
##VAR_FORM=  AFFN,          ASDF,            ASDF
##VAR_DIM=   8192,          8192,            8192
##UNITS=     SECONDS,       ARBITRARY UNITS, ARBITRARY UNITS
##FACTOR=    0.0002768,     1,               1
##FIRST=     0,             0,               0
##LAST=      2.2672688,     0,               0
##MIN=       0,             -388315,         0
##MAX=       2.2672688,     263802,          0
$$ Real data points
##PAGE= N=1
##DATA TABLE= (X++(R..R)), XYDATA
0 0 0 0 0 0 0 0 0 0 0 0 0 0 0 0 0 0 0 0 0 0 0 0 0 0 10 -25 44 -48 48 -48 48 -49 58 -73 89 -97 102 -115 134 -146
40 -146 160 -179 200 -217 247 -268 295 -327 360 -398 439 -485 532 -585 649 -724 798 -890 998
59 998 -1125 1279 -1469 1715 -2030 2478 -3138 4219 -6299 11740 -46666 -115004 54940 117283
73 117283 69820 117471 260881 263802 151260 67031 55714 70688 61470 -51041 -190357 -191233
85 -191233 -92547 -101994 -195839 -192258 -79018 10267 42673 47228 31489 34785 109598 175695 114205
98 114205 8595 23940 118583 127930 29410 -69810 -86871 -21740 23026 -54445 -159425 -127372
110 -127372 -13834 3142 -57745 -56759 8933 66541 85690 59872 9412 10960 69238 85482
122 85482 24072 -38125 -35573 5787 20276 -19645 -65481 -53471 4887 27043 -23619 -73798
134 -73798 -41952 33262 51732 7151 -14587 16660 54288 55735 20488 -21950 -27709 6363
146 6363 19149 -18560 -51476 -37116 1574 21515 3867 -23068 -16045 22074 38724 6794
158 6794 -32444 -27934 12432 33701 10478 -14817 -3749 24357 30639 9626 -20328 -32194 -10017
171 -10017 14649 -4664 -39612 -33894 3602 25771 19972 736 -9998 7365 32644 19169
183 19169 -20250 -27038 5594 25829 11299 -9518 -13034 5747 24822 18583 -12862 -29228 -11848
196 -11848 7581 -6649 -31635 -28493 -1645 17120 16267 3364 -4176 11203 33075 24177 -7837
209 -7837 -15681 6409 18042 8272 -7535 -17435 -9970 9272 8993 -15912 -27803 -12745 1616
222 1616 -3916 -15518 -15646 -2330 18171 24867 10905 -418 11282 28232 23274 -280 -13346
235 -13346 -5228 6675 3056 -13557 -24688 -16980 1159 2020 -15898 -25482 -10822 7358 8840
248 8840 61 -4920 4576 22857 28259 13437 -770 5494 16260 12247 -4400 -17204 -16018 -5024
262 -5024 -273 -11229 -20425 -15054 -541 4031 -3578 -10266 -4200 7870 13013 8317 2125 5932
276 5932 17159 20596 9969 -1884 -1819 6085 5763 -4776 -14768 -15672 -5339 -407 -8972 -17364 -11406
291 -11406 1291 5577 -1378 -6975 -1854 8711 15824 9123 1096 4318 13328 15895 7402 -1488
305 -1488 -3383 1365 2593 -6238 -15541 -16309 -8727 -3457 -6894 -10540 -8292 987 9637 8731 4361 4057
321 4057 9749 13266 8612 1681 915 5061 6785 1363 -7117 -11164 -7665 -3363 -9302 -17308 -18039 -10150
337 -10150 -2706 475 -1086 1161 8533 16821 16008 11074 9938 12987 12158 5011 -4457 -8375 -7031
352 -7031 -4351 -8077 -14225 -15869 -12107 -5302 -3705 -3125 -1099 3420 7185 8611 6662 7955 12015
367 12015 13518 10251 4136 1071 1116 1494 -1811 -10778 -16973 -16168 -11875 -9473 -10343 -8579 -1691 5025
383 5025 9006 9680 10347 12929 15801 13292 5274 646 1078 2434 965 -3427 -7488 -8941 -7422 -5908
399 -5908 -8214 -10397 -6709 -3274 -1913 -1302 2355 6042 8683 10905 9169 5395 4825 7508 5556 -535
415 -535 -5106 -6183 -5378 -4143 -3818 -7235 -8304 -3953 -1394 -3157 -4319 129 4394 4990 4447 4379 3296
432 3296 5562 9683 6850 -578 -2586 -106 -1142 -5200 -5734 -5785 -5646 -3089 -3017 -6129 -4103 2745 2415
449 2415 -3434 -3397 1657 3017 2096 4464 5038 3790 6718 9435 4478 -1240 -812 -1343 -5173 -5591 -4572
466 -4572 -7007 -7013 -1492 397 -3850 -1895 4395 4912 2624 2794 3022 836 2469 6188 3459 2254 7043
483 7043 7336 1027 -3605 -4147 -5767 -8846 -7554 -7312 -8669 -6145 -1684 -509 -91 6152 11903 10627
499 10627 8747 6348 3334 1565 3090 2837 -2341 -3487 -1487 -2861 -5620 -6260 -5851 -6088 -5964 -5686
515 -5686 -5301 -4007 -331 2434 6673 9306 10311 10340 10239 8092 3415 -1476 -4338 -4483 -4841 -7638 -11031
532 -11031 -8698 -4734 -4909 -5738 -1910 3292 3255 1936 2844 3236 2438 6739 9828 7044 4525 5843 2541
549 2541 -2943 -3407 -4282 -8794 -9679 -5785 -6318 -8527 -3969 1597 -9 975 6002 7364 2693 3397 5834
566 5834 2769 2088 4407 4518 1194 2286 2070 -3414 -6450 -3908 -5435 -9404 -5431 -671 -3298 -5033
582 -5033 1962 5572 3881 4984 7070 3597 513 3090 1879 -3298 -1016 4084 1260 -658 2105
597 2105 -58 -5779 -4243 -437 -3988 -7072 -3536 -1548 -3032 -315 5081 4622 6407 9509 7505
612 7505 1124 -700 562 -1907 -3485 -1522 -902 -1909 -2232 -456 -2007 -3198 -487 -50 -3686 -4992
628 -4992 -2234 -1106 -1298 1386 4380 5105 8281 8864 5150 661 1166 1767 -3242 -7013 -6034 -4900 -5293
645 -5293 -4638 -3786 -2272 1358 2031 705 412 765 2104 2585 2723 4174 4974 6491 4540 2306 957
662 957 -1568 -3042 -3731 -5229 -7658 -7668 -5766 -4906 -3300 -352 2486 3285 4326 5387 3367 3066 4861
679 4861 4632 2930 2866 2736 494 -926 -1239 -2597 -6029 -7563 -6116 -6175 -6743 -3189 -482 150 590 5929
697 5929 6507 6270 6380 6381 1868 550 1961 57 -1493 -579 -664 -3883 -4919 -2281 -2606 -5485 -4056 -3541
715 -3541 -2685 -1381 1294 2984 4850 6900 7250 5348 4310 5361 3173 -846 -3205 -4264 -4948 -5440
731 -5440 -3762 -3437 -3102 -1156 69 -746 -608 1804 2613 1723 966 1537 2010 3488 4935 3518 2416
748 2416 1492 440 -2161 -3133 -3228 -5023 -5982 -4262 -2392 -1494 331 1278 1826 2960 2980 2667 1839 1572
766 1572 1506 821 565 41 -238 1104 692 190 -735 -2027 -3292 -3201 -3536 -2283 -2140 -1578 -870 1451 3794
785 3794 4726 2827 2241 2734 2662 2470 628 -398 21 631 -803 -1742 -2106 -1676 -2275 -2672 -2784 -2147 -2526
804 -2526 -1284 -837 728 1994 2634 2019 2792 3735 3314 2974 933 163 -566 -803 -1628 -2531 -3737 -3008
822 -3008 -2400 -2746 -3126 -3156 -2316 -1127 556 1737 2268 3498 4179 4558 4075 4333 3075 803 -179 -1089
840 -1089 -2335 -4027 -3564 -3146 -3152 -3788 -2936 -2451 -1453 -321 323 689 1416 2769 3469 4090 4844 4360 3905
859 3905 1249 1018 -422 -1755 -3510 -4276 -4924 -4605 -4353 -3362 -2007 -626 1118 1518 2351 3094 3773 3847
877 3847 3779 3018 2085 1318 1393 730 -191 -1510 -2004 -2359 -2962 -3712 -4053 -2892 -3298 -2460 -1140 418 1840
896 1840 2145 2431 3540 4264 4044 2068 1408 1010 86 -1786 -2615 -3026 -3420 -2683 -3275 -2037 -887 -1437
914 -1437 -911 177 1387 1259 1661 1417 2743 1957 1624 1399 1553 1884 910 1098 -680 -826 -2057 -2637
932 -2637 -2168 -2359 -2639 -2765 -1361 -519 144 155 1183 3537 2660 2569 1858 3109 1019 -827 -302 111 -268
951 -268 -1037 -1212 -1330 -1474 -912 -1945 -1405 -888 -584 -547 -752 1156 1633 444 816 2576 3057 1987 1706
970 1706 1838 531 69 -825 -1656 -1510 -1604 -2446 -2071 -2096 -1696 -2135 -989 751 2119 1014 1732 1966 1933
989 1933 1464 2570 2223 837 430 137 -124 -847 -1106 -1306 -2288 -1866 -1541 -2299 -1652 -1334 -277 -197 572
1008 572 1251 2642 1926 2631 2742 2710 1727 914 825 588 -884 -1891 -3652 -3058 -2467 -1977 -1731 -1343 179
1027 179 -37 1022 401 2946 1501 1251 1367 1318 721 1404 2265 503 235 520 -697 -2097 -2267 -2132
1045 -2132 -2458 -3354 -2907 -932 -686 663 1496 1828 2406 2630 3019 2783 1964 1297 227 -1269 -1239 -584 -1093
1064 -1093 -1183 -496 -1564 -2904 -2320 -2011 -922 -858 -90 533 -236 1415 2298 1991 1968 2879 2364 1070 312
1083 312 869 -1532 -1739 -1746 -1776 -3019 -1777 -486 -2027 -2318 -819 168 239 1271 2370 685 626 3079
1101 3079 1226 1057 2052 2081 967 -754 -548 -1400 -3052 -2776 -1952 -1814 -2079 -1427 -1262 -313 622 1024 73
1120 73 640 2428 2907 1008 1993 2182 2045 1759 1502 -14 -1017 -1579 -2408 -3267 -3194 -1703 -2097 -1781 -971
1139 -971 -47 634 225 1593 1862 2498 2980 2530 1856 1490 1723 1198 796 -691 -1210 -1624 -2015 -2813 -3115
1158 -3115 -3455 -2839 -1404 -854 -27 1898 2186 2258 3147 3692 3137 2516 1151 -400 98 198 -984 -1228
1176 -1228 -1471 -1956 -2453 -2377 -2261 -1934 -1280 -607 -388 -456 1594 1505 1878 3317 4012 2385 1752 1675 -316 -738
1196 -738 -1863 -1831 -3264 -2572 -2376 -2033 -2068 -1212 220 784 618 1351 2159 1769 1655 1596 871 1628 2272 1083
1216 1083 352 131 -816 -2288 -2340 -1941 -1762 -2480 -1426 -1252 -524 102 677 1314 1283 1681 1604 1271 1673 1746
1236 1746 586 1024 302 -495 -789 -1442 -788 -2217 -1718 -1058 -1076 -1178 -735 -405 715 612 664 1842 1163
1255 1163 821 1084 1055 871 773 576 272 791 66 -1009 -404 -1205 -1759 -1384 -1796 -1268 -1013 -190 357 137
1275 137 877 1396 2329 2049 1828 2129 1368 149 -474 419 -714 -539 -768 -1291 -1100 -655 -1141 -636 -950
1294 -950 -399 -981 -311 -126 415 1539 1193 1704 1428 1883 1982 1001 953 -105 -665 -909 -1378 -1425 -2437 -1796
1314 -1796 -856 -1434 -1177 -286 225 542 727 958 1185 1721 2134 1530 1288 1166 739 614 -252 -894 -1600 -1027
1334 -1027 -2999 -2245 -2087 -1371 -999 -1120 -233 371 769 1937 1894 2370 1756 1827 1403 1218 850 161 -874
1353 -874 -760 -1325 -2719 -1858 -2138 -2201 -1223 -1092 -419 -358 953 912 1242 1131 1873 2040 1366 1708 749 94
1373 94 -350 -743 -1040 -1613 -2317 -1891 -1904 -3025 -1904 -1406 -1240 418 711 1391 2295 2026 2206 1685 1133 1758
1393 1758 545 427 -277 -982 -1126 -1537 -2015 -1691 -1249 -799 -848 -38 -474 30 364 809 929 1055 825 1801
1413 1801 1649 1163 1279 638 142 -489 -1049 -1274 -1931 -1766 -1951 -1432 -488 -1073 -425 -67 -68 345 947 1753
1433 1753 1083 1089 950 818 936 508 225 323 -109 -276 -576 -1063 -2119 -2021 -940 -869 -953 -950 223 946 513
1454 513 1514 1189 2110 1358 1036 1070 1157 -116 -283 -13 -1002 -1253 -1633 -1447 -1618 -936 -453 -1542 -193
1473 -193 -89 526 16 603 852 753 1436 1106 1408 1852 1088 391 -981 -1307 -333 -1553 -1830 -1794 -1739 -1335
1493 -1335 -688 77 -288 512 1372 1207 1496 2003 1656 993 1159 -21 -148 -402 -928 -605 -1085 -1511 -868
1512 -868 -1429 -1791 -788 -166 -865 -641 114 257 1168 1461 1050 1766 1262 1208 1073 483 -34 -357 -1089 -1070
1532 -1070 -1297 -2070 -1147 -1301 -825 -1125 -339 474 398 530 1414 1115 1290 1472 224 160 1361 399 -468 -419
1552 -419 -294 -751 -1568 -761 -854 -848 -644 -256 -625 -593 -193 -382 714 955 788 992 606 1518 981 281 -606
1573 -606 614 -247 -957 -819 -728 -1158 -357 -505 -4 -534 382 973 -129 71 1342 161 -193 566 1244
1592 1244 -17 588 1150 -172 399 329 -6 -365 -770 -397 -946 -660 -911 -802 -916 -904 -113 307 149 955
1612 955 809 510 1167 1290 1301 252 304 270 451 127 39 -295 -972 -924 -1376 -1202 -974 258 -210 -262 824
1633 824 643 353 1737 759 1225 894 491 718 167 -566 -501 -537 -1338 -897 -609 -1643 -1515 -869 -511 59
1653 59 536 529 693 993 1204 1705 918 961 1008 894 142 -190 -544 -748 -1394 -1408 -1442 -1494 -894 -452 -381 -263 18
1676 18 1281 794 1140 1516 1823 1162 1051 920 986 -217 101 -786 -553 -748 -1076 -1483 -1563 -810 -764 -738 -34
1697 -34 264 -9 958 990 1495 1111 622 321 -143 222 -156 -103 -21 -308 -355 -582 -634 -928 -1416 -545 -781 43
1719 43 631 198 690 1083 642 658 990 1124 551 26 -276 658 -176 -559 -1107 -234 131 -678 -998 -632 -802
1740 -802 -771 -699 517 383 459 575 1228 1490 942 366 411 -295 35 -221 -387 -83 -1373 -317 -806 -1168
1760 -1168 -451 -707 -308 427 149 446 712 525 415 798 722 1511 678 175 220 334 -349 -736 -513 -1139
1780 -1139 -1333 -757 -1724 -1244 -89 -404 -185 304 558 1083 543 715 1170 1173 1274 660 222 -376 -761 -478
1800 -478 -492 -569 -819 -365 -1314 -1105 -588 98 432 18 792 596 1528 722 691 327 1042 544 166 -179 -353
1821 -353 126 -662 -1231 -1132 -1562 -368 -658 -477 -80 733 127 763 1279 682 1350 488 343 443 261 58
1841 58 -360 -211 -434 -783 -179 -1319 -1022 -462 -599 139 426 515 375 746 102 68 1188 319 766 901
1861 901 261 -517 -222 -1220 -619 -723 -892 -869 -778 -444 -429 -377 -111 257 180 373 397 734 160 -128 1298 315
1883 315 457 321 332 -283 53 -96 -940 -101 -368 -484 -359 -695 -624 -14 -268 -150 266 511 574 807 447
1904 447 576 192 133 566 393 635 -839 -511 -561 -1001 -340 -657 -639 -260 -450 -427 126 108 -272 593 749
1925 749 1387 245 416 1022 801 497 114 37 62 -874 -436 -399 -1056 -258 -877 206 -598 -176 295 615
1945 615 1044 -227 892 629 786 813 511 -176 60 -232 -537 -193 -591 -545 -490 -1423 -730 -639 14 -109 -241
1966 -241 784 852 199 739 1024 378 431 290 343 -469 -222 -370 -1348 -557 -626 -301 -118 -348 -527 -246 336
1987 336 -386 609 627 993 770 690 178 -181 423 387 351 -89 -305 -571 -641 -1121 -936 -174 -356 -813 -260 119
2009 119 137 437 802 139 413 347 870 987 540 206 -454 88 26 -518 -551 -894 -562 -360 -493 -406 -374 626
2031 626 189 484 17 305 325 392 63 543 792 -135 98 174 -172 -63 -79 -378 -840 -621 -790 698 -104
2052 -104 187 -10 425 517 469 756 782 54 485 451 638 488 165 -189 -687 25 -106 -578 -429 -352 -803 -310
2074 -310 -186 340 225 203 719 453 991 447 333 355 615 -320 -517 79 -554 -203 -867 -688 -563 -631 -557
2095 -557 -126 -910 -350 -249 -82 359 872 931 59 820 238 107 569 502 -316 0 -872 -496 -302 -805 -585
2116 -585 -722 -482 -492 -617 5 -246 510 350 911 398 525 446 649 58 -417 -20 93 -24 -1018 -649 -792
2137 -792 -276 -439 -282 -181 -64 409 630 -1 437 443 24 160 519 730 823 -88 -20 -1 -357 -489 -1015 -36
2159 -36 -216 -500 -558 79 -311 -32 -238 -414 272 326 164 97 101 1131 229 391 385 -497 -982 -76 -356 -400 -151
2182 -151 -517 -792 -704 -452 -373 -237 643 586 147 198 27 931 250 317 160 548 -82 233 -56 -576 -617 -5
2204 -5 -663 -632 -60 1 532 384 111 455 521 381 325 683 359 253 187 -39 207 280 -85 -281 -447 -161 -366
2227 -366 -948 -429 -638 -699 -340 197 61 -69 34 22 365 393 886 483 1019 -178 -128 817 351 -34 -607
2248 -607 -360 -381 -359 -40 296 -696 304 399 -10 163 762 464 759 254 682 310 190 118 -436 -257 -1020
2269 -1020 -326 -907 -702 84 -404 -154 -85 144 -33 155 -182 687 1155 604 472 252 463 58 171 -352
2289 -352 167 -241 -977 -440 -716 2 283 -65 292 -899 274 -9 -320 255 475 421 1484 703 -116
2308 -116 325 -640 184 -131 -453 139 -200 -586 -268 -123 -461 188 -425 275 200 616 683 432 761 342 140
2329 140 210 -71 -420 269 -319 -577 -71 -25 -990 -672 86 -192 323 -306 718 333 217 253 62 379 20
2350 20 95 544 -28 -50 -2 17 245 -158 -440 -463 78 -446 -305 -107 -202 -189 177 516 131 -31 451 401 204
2373 204 340 207 -169 244 439 -174 -232 -223 -256 -229 -527 67 -73 -931 -682 -218 238 534 -42 415 -324 364
2395 364 -247 254 313 295 136 -307 -3 -342 -633 149 -357 -254 -488 -666 -188 32 69 554 -39 1008 -235
2416 -235 565 196 348 83 -411 -219 -103 -528 -568 21 -179 -384 -518 -181 -437 -62 18 985 115 276 297
2437 297 521 29 -110 27 1079 -100 -39 -241 -645 -198 -306 125 -864 49 -631 451 84 -561 -66
2456 -66 17 563 855 815 615 514 663 -331 153 655 -812 -1185 -69 -183 -246 -887 -458 -446 230 -460 -79
2477 -79 124 271 129 491 270 74 -75 775 816 231 -53 594 -261 -437 -797 72 -315 -155 122 -24 -272
2498 -272 -93 435 -593 557 -128 488 90 -112 265 47 201 103 -133 -311 552 -131 -184 -943 -510 -88
2518 -88 343 0 -362 370 -9 279 364 -251 224 283 300 -310 406 486 -234 207 -1024 47 -852 -959 537
2539 537 -148 381 -521 120 64 515 -221 78 198 379 497 214 411 -531 456 418 163 -57 151 -267 -230
2560 -230 -281 -162 -139 -573 -335 -4 161 -165 153 306 721 274 540 189 -81 -30 -527 175 -279 -593 35
2581 35 -399 -847 114 83 -279 -378 24 596 -694 338 -184 35 -190 -78 12 53 -516 199 212 -42 105
2602 105 -379 203 219 333 -337 211 -159 -260 427 393 470 -180 -492 557 386 -89 138 215 577 310 -466
2623 -466 -680 -109 -486 376 -357 23 -233 229 -153 112 344 -218 -224 52 -140 365 378 186 -38 -455 418
2644 418 -691 35 -558 95 -232 36 -313 -541 -146 27 257 32 -272 915 788 45 332 428 255 -470
2664 -470 535 17 25 -103 -420 -175 338 24 -368 -392 316 -90 -222 -359 -262 -199 261 -515 436 425 602 20
2686 20 -456 -402 -629 278 99 1 -702 -573 64 -696 -135 -327 -419 52 -261 -124 29 111 -135 409 413 639
2708 639 -528 239 134 245 102 158 -605 85 -395 -421 -655 -314 224 -215 -435 15 161 238 -158 97 -318
2729 -318 -148 -557 -52 -265 271 -200 -94 188 -83 121 -166 -366 -214 -496 67 -903 211 165 502 32
2749 32 195 -74 133 535 182 -77 680 -351 -176 299 -228 -822 -455 -378 -703 -390 -175 505 -80 -68 -162
2770 -162 -42 -5 80 971 680 0 -344 260 438 -113 -365 -306 220 -189 -684 40 -414 -335 94 551 -35
2791 -35 170 35 221 335 23 -536 -338 822 -132 -521 259 -207 110 -230 -617 -709 -281 -14 -248 -175 -243
2812 -243 88 17 -441 -38 -87 -106 584 611 199 48 604 -176 -137 184 -883 -281 -51 -241 95 -384 -502
2833 -502 -263 213 -139 426 -125 212 -22 -49 471 210 117 437 35 -8 215 100 -851 -503 -124 342 -266
2854 -266 2 336 -282 619 -156 37 220 319 211 182 298 -463 -741 216 -234 548 -855 421 -631 -355
2874 -355 -381 -169 120 93 -78 -88 83 -59 -3 -204 -174 483 68 324 302 173 26 173 -749 51 294 -575
2896 -575 221 -408 -100 -196 -272 123 -58 230 473 378 431 -140 67 506 -726 -124 -30 354 -603 -617 293 26
2918 26 -708 253 664 -348 515 -81 102 -105 -44 -449 236 -5 482 685 733 -389 38 -262 247 223 -380
2939 -380 213 -440 -161 187 251 -590 -504 -531 -29 -442 -83 -136 184 102 531 217 214 887 322 -110 -604 -748
2961 -748 -107 -481 -255 806 239 191 -89 337 -191 -323 -25 410 287 615 626 102 85 2 457 152 -589
2982 -589 -149 165 -289 -68 -486 -240 49 -267 111 551 42 800 -113 660 543 356 80 -73 -287 15
3002 15 259 -736 475 48 -324 58 303 -59 -57 7 291 -504 282 317 -7 -136 181 599 351 -132 -213 -300
3024 -300 -300 12 -312 -33 -3 -6 -420 330 358 71 44 -232 -135 109 5 24 171 114 -75 681 348 -426 14
3047 14 -147 190 75 236 -151 -489 -21 565 -109 75 -171 -198 357 -263 63 273 105 68 -241 -238 222 309
3069 309 -135 78 -551 -454 498 -559 -377 -261 489 -298 -406 -183 211 -246 323 -213 107 87 654 2
3089 2 74 212 317 -196 -141 -589 -539 -749 -115 -151 385 -96 79 -600 149 102 149 1 -373 708 433 245
3111 245 -455 -286 -70 80 243 338 -708 -172 -836 -508 -671 28 -362 278 291 -94 -45 -263 282 -337 431
3132 431 -166 -134 -360 -469 287 40 171 -575 -401 -233 -207 -125 3 424 264 -438 -159 124 -284 -259 39
3153 39 -191 -512 445 -455 164 -52 -98 -196 -37 -23 151 -415 -427 237 183 449 413 262 -193 436 -367 67
3175 67 276 681 -292 505 370 -133 233 242 70 -197 -79 319 618 -74 639 -282 18 515 -594 449
3195 449 1035 912 185 393 254 -285 -446 611 -426 -37 -335 77 -489 -304 -276 -202 -204 -223 84 -378 506
3216 506 645 33 -380 -157 -122 -562 530 60 192 -139 -93 323 239 -27 -560 -241 -178 20 -79 -187 -3
3237 -3 58 -182 273 -385 205 -213 352 9 137 -202 397 -473 -114 -136 -488 298 12 -239 280 32 -15 -37
3259 -37 -76 159 104 -160 25 375 586 231 -261 379 -220 364 -28 497 24 -562 29 -286 -126 324 -181
3280 -181 -516 -226 279 63 500 198 325 269 50 54 185 -92 -149 321 193 -41 -53 349 -641 -101 -155 205
3302 205 185 -694 -354 353 -560 182 179 -54 -295 103 89 -24 378 252 159 -607 340 -9 537 283 126 -439
3324 -439 141 -557 -327 -188 -11 -302 288 257 204 -73 403 76 -440 -111 -356 -159 -101 -399 398 -215 -167
3345 -167 546 594 -308 183 748 -384 347 -110 63 253 -15 -562 181 -233 -99 -49 -337 -403 379 -132 48
3366 48 -613 -183 247 200 247 -226 -23 -445 241 126 142 360 105 98 -245 332 -29 -865 -182 -1 -104 -240
3388 -240 137 38 60 -131 -379 -372 363 318 255 -116 290 268 -313 -300 457 67 -411 -34 103 -163 220 100 241
3411 241 118 -112 -92 -627 279 110 -119 -328 204 -71 344 -334 308 886 308 148 -182 -237 55 -529 -791
3432 -791 255 -32 -124 -190 -275 223 399 455 -2 274 -12 647 -308 89 335 53 -1 -173 473 121 -542
3453 -542 -714 15 -666 -506 89 -82 108 -308 165 -140 136 -49 449 -180 186 -402 216 132 139 87 114 519
3475 519 -121 -46 -300 -478 -217 777 119 -439 20 -503 273 -39 461 -320 267 142 -53 -103 -12 -25 -262
3496 -262 -302 203 -762 -358 -339 -446 -398 -63 -216 43 354 -365 297 232 54 130 469 123 360 170 -290 270
3518 270 195 -322 78 -86 -21 -166 209 -298 -357 566 149 -236 -95 363 231 -511 -695 -59 137 -155 -140
3539 -140 224 -680 -477 36 -1225 -88 -109 -603 -239 618 481 407 443 302 558 -237 -147 -41 209 64 118
3560 118 729 -154 -229 150 478 -413 -29 -699 -440 -540 -255 493 292 -247 -249 -34 -410 540 285 631 -79
3581 -79 -375 -82 88 176 -285 -141 -887 547 214 -316 55 307 90 195 116 -267 40 -181 315 -378 -664
3602 -664 566 -169 707 265 -389 27 -400 535 274 -254 -560 -492 426 -195 -238 -219 242 284 360 160 127 126
3624 126 -338 98 348 37 -254 -82 71 -149 -146 -249 -410 -564 -250 -251 -412 -104 360 231 -101 276 -261
3645 -261 556 212 -81 -432 -222 19 54 881 184 -479 -222 -529 -164 468 115 382 178 267 135 -754 205
3666 205 96 8 -81 685 -653 23 -160 475 -255 -296 497 -69 -1038 -241 215 168 339 -255 765 507 -491
3687 -491 -32 299 161 8 133 -865 111 -107 -111 -710 -226 93 -168 -319 -294 -488 517 492 -676 -87 -221
3708 -221 31 336 187 289 -71 57 -345 -269 168 -292 -180 -273 -420 -7 314 -152 -563 -108 -75 -450 -214
3729 -214 191 -4 -219 -249 21 439 462 208 -184 950 32 329 -120 -689 -357 -9 -164 -445 -86 165
3749 165 -169 -608 626 -608 -280 354 -462 -87 309 334 -330 214 -111 -196 -192 -10 -343 -58 178 -337 196
3770 196 -488 -192 -217 159 -396 27 -53 232 -181 417 588 20 236 -269 -14 -302 602 -390 -32 -382 164
3791 164 -404 90 233 -254 -291 295 50 -360 267 -226 -90 38 815 51 -462 456 253 -586 -832 3
3811 3 -73 -284 233 -578 176 -254 -810 -443 -185 -172 131 496 -28 7 -444 186 -154 -633 -46 42 -189 664
3833 664 -205 -459 -298 -41 -507 -735 -344 -178 -492 -94 -26 -188 748 -120 -206 -32 -191 -564 -143 -699 50
3854 50 303 26 -204 -39 -222 -419 -105 152 -207 -316 -91 -149 -2 314 43 -266 -408 427 196 133 -336
3875 -336 -142 -472 -463 -206 123 14 -328 -532 -36 -46 337 161 211 -248 79 -12 44 312 75 381 -143 -592
3897 -592 -722 33 224 -63 75 343 -299 -224 173 -50 -31 309 341 -117 387 334 -270 41 274 -233 -51
3918 -51 -475 326 589 -149 161 167 364 49 -323 -253 245 312 -418 401 83 372 -180 -307 610 119 -532 47
3940 47 -215 -571 102 -331 -553 -282 647 -385 223 338 105 165 876 493 270 231 496 630 65 477 326
3961 326 -504 168 216 -257 13 32 272 142 -306 622 -177 -117 807 178 -343 73 171 190 -202 390 315 334
3983 334 -69 188 43 58 138 -371 3 74 -206 45 -76 -258 -254 132 390 421 237 5 277 -354 40 186
4005 186 -404 -387 19 -335 372 69 105 -203 -374 -292 264 -231 14 -383 476 414 168 81 -273 862 -642
4026 -642 645 -60 -70 -491 -177 -431 -442 144 -303 11 -44 101 253 154 308 209 144 516 507 -180 -22 -647
4048 -647 -79 -159 870 -263 428 508 -67 -463 65 -6 221 315 -367 -59 91 143 83 214 274 75 173 -164
4070 -164 -126 -205 -24 188 -120 143 141 40 -388 63 -235 0 -271 -428 -301 448 967 -49 509 118 -89
4091 -89 722 -45 90 -107 95 943 245 96 325 100 -270 70 4 -479 -121 330 -17 -70 -539 -88 -296
4112 -296 174 -280 -183 -195 -43 51 -274 29 -206 -106 93 -496 -73 -262 -110 427 -159 -730 -98 74 218
4133 218 155 266 536 -259 755 -191 231 -562 -201 -201 -627 -322 -69 -56 -225 31 170 232 -96 -664 187
4154 187 -95 -64 531 297 302 144 810 -642 65 -78 -98 -45 482 1104 24 -221 -20 7 -107 -109 -79 -23 -80
4177 -80 -266 -560 93 -341 344 -159 32 -297 190 365 38 -220 -252 -287 14 160 -4 81 -364 -193 -177 -54
4199 -54 -367 -123 107 -268 -67 247 -50 488 595 -522 51 -1 -659 -57 -796 -306 529 260 -259 172
4219 172 338 12 286 133 -311 121 -131 217 133 165 420 -96 -721 -329 393 -71 -643 -873 -372 -806 -401
4240 -401 -93 -19 260 -95 2 35 662 -53 122 -218 301 458 203 -86 -692 -99 -531 -531 100 -121 -259 -698
4262 -698 245 -322 186 262 -109 462 -10 -365 30 181 -115 -170 13 87 238 190 -23 158 38 -239 -64
4283 -64 571 502 516 142 -318 -181 311 -50 204 -781 212 -129 -340 126 102 -25 202 -122 255 187 -307 -102
4305 -102 -522 540 -482 -193 430 -663 -145 -99 -104 -263 5 -61 21 -281 -18 423 -131 89 -530 -614 -432
4326 -432 -119 -2 452 -360 -195 -539 318 22 -63 -262 -384 -309 50 -176 -175 62 163 243 401 458 -408 -120
4348 -120 -693 94 -452 -27 94 -227 -171 626 -525 -71 298 181 384 -80 260 520 145 129 276 -483
4368 -483 -722 224 -206 -295 -105 -594 127 -127 -378 -206 -334 17 15 -35 414 71 148 312 -20 -261 -242 237
4390 237 -483 514 -348 219 127 121 565 91 275 -179 -85 -344 -422 251 -453 -253 49 379 140 -232 223 22
4412 22 -192 -262 -213 47 364 -42 -2 -194 -296 -95 256 68 273 -470 593 619 -27 324 404 131 210 -197
4434 -197 -254 -601 196 -156 -143 -506 304 452 179 86 102 -458 -304 -278 -690 285 144 -129 612 -123 -644 -218
4456 -218 -562 -275 -222 -278 -222 -428 572 -610 -56 -404 -189 -357 332 277 397 -347 228 -36 12 300 643
4477 643 197 182 454 -149 -413 289 -196 -138 33 -215 297 -7 737 611 -337 314 338 266 -137 5 -192
4498 -192 184 433 175 -68 -214 338 40 429 257 218 -224 25 -86 346 497 -239 161 -173 212 -270
4518 -270 -416 -60 210 248 -376 -159 -113 -211 166 -371 511 300 -599 356 112 -288 -859 792 36 195 -158
4539 -158 -68 -294 133 -87 -1 158 163 -808 -787 -198 -60 -40 -263 720 149 -123 -146 165 540 143 217 -127 -642
4562 -642 154 149 -150 -240 215 -517 477 9 22 488 404 291 118 -472 -173 271 -74 -664 38 418 44 -135
4584 -135 72 212 105 -300 -386 -1183 -45 -570 85 -78 -92 19 267 209 -657 250 63 137 304 -343 331
4605 331 43 -234 -395 612 146 337 -81 -359 -278 679 -22 -675 -243 -546 263 42 -298 -754 -634 442
4625 442 -420 214 510 -207 176 884 106 -205 -574 -403 24 -646 162 -234 389 485 171 -220 -331 107
4645 107 -59 387 101 -201 233 -127 619 -44 41 227 22 -118 190 86 130 -450 -809 -281 -383 360 -33
4666 -33 313 -204 297 -289 64 112 95 278 461 4 28 -707 322 73 -460 -443 267 154 -41 650 17
4687 17 648 187 83 560 154 -22 495 76 -39 231 -467 -231 -127 484 295 -175 376 437 -12 83 176
4708 176 -281 29 -356 -337 -204 -335 598 254 224 191 287 -63 -147 73 -202 -517 -243 -276 -412 40 327 630
4730 630 536 211 85 -73 -367 -675 260 302 175 -147 -540 -187 0 -321 -377 -113 -275 -621 -168 -38 -81
4751 -81 -377 -464 83 306 313 147 167 64 22 423 -180 121 35 -250 -199 -764 -122 209 -247 300 -368 88 450
4774 450 218 263 -750 -136 572 459 57 -144 -184 -111 375 138 507 -156 43 548 -117 -161 96 -461 -678
4795 -678 -310 474 -106 -282 -13 -286 165 -78 110 -212 110 -113 198 -311 -593 -265 561 381 454 -293
4815 -293 -246 156 322 3 -209 115 100 318 356 136 -112 7 23 -124 249 -275 143 14 -274 312 167
4836 167 -6 -568 -493 -232 15 -74 -187 244 444 391 -230 281 33 305 -91 313 116 210 -118 -673 131
4857 131 134 -113 -400 427 121 293 171 -334 237 -62 512 -130 -155 34 -446 320 410 -120 -119 -309 -294 -560
4879 -560 -287 160 -680 -287 13 -417 -523 95 -486 584 262 -350 -203 -276 -194 664 47 -194 -43 -490
4899 -490 -599 -117 225 -430 35 275 -53 -12 98 -413 503 127 98 -258 -53 -512 375 -128 26 613 229
4920 229 169 -8 -133 50 -199 -117 -493 -92 -165 507 -305 -488 332 483 499 596 405 371 269 -290 -63 -294
4942 -294 46 924 189 -124 11 -21 20 -44 538 287 571 101 -52 277 111 316 -106 290 65 40 -11 289
4964 289 -555 113 204 -242 266 201 -313 279 -131 -463 256 68 74 236 -8 816 54 -44 -206 340 579 58
4986 58 655 -354 263 -135 449 477 -170 -164 -139 42 -154 335 -225 643 265 202 588 -139 -246 -403 700
5007 700 -174 -224 -597 616 49 32 269 -642 268 471 -332 635 -124 32 273 -205 -222 280 483 -377 -58
5028 -58 347 288 -21 191 -3 32 -321 -252 -75 -66 -285 14 -246 -548 13 -189 -400 -426 458 445 -9 -72 -586
5051 -586 59 148 -9 -157 -247 -287 -164 -149 80 45 577 -228 -441 42 -261 71 174 594 -151 -223 181 455
5073 455 -27 616 222 153 677 46 54 303 -215 -353 -4 -201 -480 -29 -85 -320 -64 -138 -61 -110 -362 773
5095 773 922 351 235 -255 236 -514 -330 -200 -69 199 -650 489 140 -143 -126 433 349 -967 396 195
5115 195 -320 -18 790 161 83 217 175 -255 109 -106 161 6 -103 -212 -94 -258 -150 -11 211 -519 23
5136 23 577 308 468 222 405 -298 242 198 -282 -113 125 -145 -377 -527 -424 480 -117 177 -130 -83 156
5157 156 -586 -68 74 373 118 190 -467 55 270 189 -184 -25 87 228 -239 -114 -254 -227 -41 -207 -63
5178 -63 96 -678 325 -209 299 576 -164 -382 101 -35 -265 194 228 -365 -189 -102 -263 -32 254 -329 -41
5199 -41 -562 328 -194 547 -330 -446 191 -162 -15 136 606 34 141 6 -384 90 -350 -405 21 -12 -84
5220 -84 73 -388 54 -252 315 -304 -339 -108 420 630 326 813 -282 -64 -46 264 36 173 153 -421 169
5241 169 510 -82 -46 458 -135 -203 -116 -302 -305 424 279 2 279 -160 72 -20 -216 -13 554 319 -161 286
5263 286 -31 -302 -228 544 -178 286 411 -590 -11 174 303 -382 591 443 -443 159 -607 -31 234 112
5283 112 -504 -182 -55 -264 264 232 -553 102 292 293 49 -129 -391 -147 237 65 -29 -39 -181 44 165 42
5305 42 -523 -599 -455 28 -251 -223 301 405 -389 407 239 280 -41 60 289 221 188 -68 -213 -478 754 329
5327 329 -148 -449 -219 182 -261 471 -328 137 -99 -269 -155 -240 262 -1008 -93 -119 917 -22 -354 -249
5347 -249 117 -151 144 -104 -842 -204 -123 -46 -236 249 283 -288 454 -390 116 11 -183 53 2 350 321 123
5369 123 194 592 514 109 -131 13 68 30 -441 435 669 -6 48 -58 -69 103 -108 -19 334 211 -150 -377
5391 -377 109 -306 -51 479 469 39 -162 148 -384 -139 255 -268 255 518 219 -159 441 -468 439 134
5411 134 201 97 121 5 86 -139 -412 -221 147 -189 -820 -136 -508 -62 -13 149 -27 -82 451 190 392 135
5433 135 83 312 -179 -541 1 -193 -23 121 -363 125 74 -194 -181 217 92 -163 -337 464 451 356 158 -95
5455 -95 -64 620 -364 -149 -291 -130 211 224 102 -35 -719 -239 280 -350 -126 -675 -145 253 26 -88 520
5476 520 172 800 -212 170 -325 -522 169 -172 -92 -288 18 -1054 501 356 270 -86 816 340 569 237
5496 237 21 464 837 712 -421 324 -410 186 39 -110 121 -178 -880 -119 -670 -365 243 667 45 196
5516 196 76 182 540 344 24 66 -431 -18 -235 228 -76 -736 411 -479 -171 348 -266 -38 308 -437
5536 -437 337 -301 529 213 414 460 -307 -223 -27 437 -41 -188 -169 -562 96 234 -182 -347 -553 189 205
5557 205 -522 599 -242 -220 -92 108 406 569 216 -426 144 -354 -192 -276 -275 443 395 -580 -400 276 -16
5578 -16 -238 315 -489 17 136 -98 400 -242 130 -25 381 -816 -431 210 412 80 -437 230 479 -35
5598 -35 -504 174 -340 -258 306 -122 354 258 145 -280 -196 691 228 -351 -310 -174 -20 183 39 276 52 -70
5620 -70 -260 678 -326 -286 185 187 123 411 -176 300 847 -192 -62 -583 705 -230 -605 179 -400 -361 -220
5641 -220 -532 -250 555 81 13 516 181 -452 15 393 -386 -125 -325 10 -357 423 297 85 -9 -530 279
5662 279 231 -188 -797 142 375 -462 185 413 224 155 -202 -480 56 244 -10 -235 -616 0 -395 -189 -56
5683 -56 -673 -544 -537 420 187 -281 -788 -70 -93 224 -57 -7 -247 -61 252 58 -81 278 56 -159 -582 3
5705 3 -239 158 13 -233 -17 -562 561 74 -110 -349 378 598 -124 285 -361 -211 -370 54 -28 302 340
5726 340 -137 174 524 17 35 -267 -454 -690 65 -168 -313 -91 15 265 -171 511 136 657 -298 -48
5746 -48 -28 69 160 -67 2 -279 357 -306 -205 -238 -393 310 481 271 573 722 126 155 -21 -79 47 290 -29
5769 -29 -411 682 -397 -114 3 -28 -352 124 -156 -117 -121 -292 460 38 -62 -167 88 134 217 270 614 217
5791 217 -285 -44 446 106 317 49 309 176 -98 265 -358 575 -200 -240 -282 56 264 -422 -427 -16 219
5812 219 -201 -252 -390 -576 87 -426 0 -289 151 167 150 -551 -344 -61 299 -123 828 -357 -144 637 -647
5833 -647 315 30 -368 34 219 -302 128 -186 -806 -185 432 -144 -65 329 23 -237 209 -245 -408 -1
5853 -1 -743 609 -24 -112 377 -477 -53 -160 69 229 -254 -81 17 104 359 -61 -59 19 90 -206 160 422 -108
5876 -108 94 169 192 -427 35 -611 191 139 -346 -273 74 -366 -414 85 -258 -131 -71 517 -1088 107 132 -473
5898 -473 919 -19 304 -572 -416 -133 -469 -30 -82 42 -35 -182 128 -80 -205 173 270 273 286 -385 -509 -23
5920 -23 -67 198 57 67 -239 506 248 645 -106 -300 610 -159 183 -161 73 -174 515 73 38 -447 51
5941 51 483 123 432 -98 -494 -376 359 318 545 64 -193 329 -754 152 -63 286 263 395 300 -146 301
5962 301 83 -211 516 -4 -504 219 -252 730 -241 7 -257 -252 -311 -227 -96 484 -121 174 853 8 -267
5983 -267 -460 417 -293 -94 -222 41 -107 545 19 -111 549 83 -600 -325 442 97 -574 -258 344 -164
6003 -164 -62 -121 -175 105 -151 -144 606 206 -547 300 376 -141 -203 -416 -381 -339 223 -378 420 -93 -771 365
6025 365 -231 -440 35 187 -260 318 -251 425 213 139 883 335 170 -137 641 230 -377 278 57 -43
6045 -43 -219 -525 308 -406 547 -530 311 -311 54 394 161 -550 264 156 -140 406 122 -909 284
6064 284 -522 -296 -75 -615 38 -274 246 -119 383 -14 63 -32 74 640 353 -618 429 327 10 -281
6084 -281 -9 213 -250 385 -365 95 -403 -220 -439 -150 459 337 249 -189 70 -6 452 -95 326 176 162
6105 162 -107 25 342 -502 161 -177 -53 -166 13 306 17 -225 606 -104 -334 -265 -87 -567 382 132
6125 132 282 38 -624 -2 -6 251 245 250 -302 121 -460 202 345 36 205 262 198 389 -170 -384 -394 -250 -339
6148 -339 202 132 -291 -105 -25 395 178 -471 411 -263 413 683 -133 411 158 422 -489 -179 510 7 128
6169 128 304 -366 138 -114 26 42 -638 -66 84 267 60 -89 419 -269 205 133 -452 -453 -398 194 421 105
6191 105 176 -360 -235 300 293 -242 53 229 460 -297 225 -11 -236 196 432 110 -313 677 -122 -53 484
6212 484 845 -36 608 -413 369 114 251 -73 437 -525 814 -334 35 550 695 -56 3 87 1093
6231 1093 34 -199 184 285 432 -177 178 144 -304 -686 -669 41 422 141 185 -52 652 -34 120 -79
6251 -79 292 205 489 -283 -563 -244 99 -664 21 -305 22 174 -318 164 273 193 -183 321 -270 -443 402
6272 402 160 117 115 -20 152 -95 -2 359 245 158 -5 245 78 -204 -225 -281 -45 252 133 -3 -237 51
6294 51 -414 74 -62 -338 205 -348 365 -385 173 98 -398 226 -208 -60 93 -609 -472 -456 -740 291 -39
6315 -39 430 193 -439 257 -3 116 103 -411 209 276 -169 198 -363 -66 -154 -196 -101 -248 -367 -131 -89 -162 381
6338 381 621 -192 -394 397 531 196 534 78 255 -299 -213 -461 405 309 456 -245 64 -412 -13 -248 -33
6359 -33 26 -72 -437 -46 312 -137 -161 474 507 178 386 323 -185 -513 -252 -26 268 -301 370 -85 -93 292 -535
6382 -535 377 -101 -177 -52 534 540 -325 -419 159 235 -16 254 -352 606 -152 -241 -181 -66 189 379 -75 152
6404 152 -79 342 -100 -47 232 -543 441 87 48 -182 -175 270 -336 -221 259 -40 -190 3 254 575 539 -382
6426 -382 566 0 -394 -229 -168 -118 -82 591 -403 263 -104 -25 -312 47 -185 -167 -231 304 -521 279 -448 -55
6448 -55 72 -286 -31 -204 973 388 101 439 -71 149 53 350 -35 -350 -370 -7 251 41 165 -253 -854
6469 -854 30 -662 -250 -63 292 -98 -337 770 122 -24 -396 -447 -394 143 -262 -349 159 145 -212 -578 1
6490 1 428 414 -338 -175 393 630 584 -354 127 -213 21 -73 441 -358 236 4 484 -92 161 -379 442 504
6512 504 -161 160 54 264 -19 109 -109 146 76 -110 538 -460 -276 94 -176 -701 278 -475 -381 427 264
6533 264 489 -484 344 -102 411 480 -236 -407 -462 7 -490 -582 -202 108 -119 344 -165 -551 -118 62 -111
6554 -111 64 -391 -87 -733 -174 -404 -247 -193 -90 -175 -358 314 -244 -229 169 -320 -91 509 -297 269 -22
6575 -22 -284 -462 385 120 -257 -500 129 553 -168 469 -180 -387 89 330 510 90 -243 40 -1 254 40
6596 40 -113 -66 385 237 -69 -329 -504 -187 65 -129 559 -402 354 -470 247 -149 59 -49 -135 602 39
6617 39 -451 83 82 81 -53 63 -85 -264 398 -161 293 413 261 120 -321 210 -461 -140 -101 -76 396 -132
6639 -132 253 -28 256 786 -15 70 279 146 -737 -336 282 -271 233 -117 209 510 -48 86 32 -250 131
6660 131 -875 362 641 204 403 340 -247 -241 -452 335 10 -482 71 -614 401 -119 -189 -80 -16 -76 -258
6681 -258 -555 85 -115 -108 -92 469 -522 32 -316 102 137 -146 604 -168 -5 329 -269 -525 312 -158 -498
6702 -498 -86 -211 18 79 -490 250 -23 579 411 -175 -221 139 -394 -716 109 -195 -310 -164 9 521 395
6723 395 -256 125 114 543 -229 170 -290 286 80 428 -363 -11 8 -272 9 488 -580 -849 173 411
6743 411 138 184 -151 -69 62 -250 -241 -160 -479 -310 312 -206 -180 -30 205 -80 212 202 237 -98 329 -162 -216
6766 -216 -275 -312 195 572 102 135 321 -231 -50 -440 73 -282 -20 175 10 -300 122 149 -371 -558 162
6787 162 284 139 21 -551 40 742 -53 676 -399 216 -384 -301 259 -34 291 -213 -125 499 -168 4
6807 4 -41 -309 -29 146 634 69 299 647 -33 77 -345 -736 -680 385 -171 -152 179 200 534 -106 177 270
6829 270 -402 -81 -125 -32 14 314 -387 139 139 -72 -80 216 8 -87 -501 -345 -194 367 74 -242 -303 -178 295
6852 295 -132 -63 493 -119 161 250 -509 -716 -8 -220 -15 245 -681 -100 238 538 213 49 -762 -142 425
6873 425 -354 361 -114 61 -61 185 -148 28 74 -202 187 196 -148 -189 -159 237 -163 -305 297 -358 -672 -405
6895 -405 513 365 478 294 343 195 -131 -205 288 -599 -64 -210 -437 156 -390 388 399 101 13 530 -62
6916 -62 -245 473 -370 -106 133 495 -143 301 175 -507 6 81 68 -636 -160 -210 245 -446 -538 -388 66 -233
6938 -233 9 341 132 -90 -34 565 341 -237 -307 -38 -166 -492 369 315 160 -315 583 268 294 -225 -339
6959 -339 458 96 84 -157 60 66 -29 273 -161 219 762 -232 -44 495 -328 -97 75 -197 -343 -129 127
6980 127 -308 246 162 55 -327 -232 291 -209 234 -417 306 -225 61 531 344 397 -364 -250 158 -38 68
7001 68 367 -143 -167 -203 241 264 0 -522 -56 -610 -166 215 99 85 220 226 -99 442 212 -165 -679 -81
7023 -81 -180 -400 236 -77 376 -175 -19 -354 -49 -435 202 -398 118 -18 206 -280 145 -89 227 -26 160
7044 160 -165 -317 203 -449 146 -385 -108 226 -203 -376 211 68 244 -224 497 -27 -32 580 -466 37
7064 37 265 163 -745 205 -485 -153 -650 26 -136 -231 47 -178 76 -139 354 550 244 243 62 -398 329
7085 329 -111 73 -571 -47 -19 749 -232 483 -14 -70 213 271 -586 -145 -64 211 -158 -544 -89 103 -167
7106 -167 137 241 297 93 -37 -60 -288 -373 -476 170 -70 167 -15 289 103 -549 -151 -161 462 292 224 -105
7128 -105 -773 130 182 306 -835 3 -52 159 -39 66 60 189 -202 -90 46 137 160 -51 141 -648 161 -193
7150 -193 -324 25 -384 -517 327 54 -369 -135 177 -64 -243 -175 211 264 245 260 -22 -103 -181 -3 -73 -326
7172 -326 -348 599 -466 -265 154 -17 -126 -384 -136 -131 -113 630 -216 -519 594 -14 -792 199 409 -84 -91
7193 -91 -270 -236 53 270 -336 -23 238 257 306 -131 -42 269 -250 454 532 95 84 565 90 180 212 -174 240
7216 240 148 -22 164 -88 215 182 490 -314 253 339 306 -83 150 -39 216 -534 -314 438 254 -102 -664
7237 -664 -137 -348 -54 -82 -424 -391 578 -27 139 -173 454 -466 156 -282 -151 291 97 253 654 175 -82
7258 -82 94 -250 384 -43 -174 169 314 -747 -185 -569 55 -537 265 177 -665 -589 127 104 -124 -13 -49
7279 -49 -240 -105 -156 53 -517 -367 -112 87 86 -524 -240 -419 121 465 94 -264 -616 -88 -330 -158 -186 0
7301 0 443 198 561 177 -304 -35 -56 102 385 -148 -100 100 -422 -277 54 321 243 488 132 138 45 144 -219
7324 -219 466 -385 -137 -125 -312 143 124 72 133 48 41 -430 136 -83 244 -198 589 410 107 -103 -30 -364 539
7347 539 -99 -562 75 35 122 -128 30 -12 200 -86 202 -401 191 -254 257 -383 -22 -95 -747 310 -211
7368 -211 739 459 -33 -28 -778 12 -458 -548 813 504 278 336 -42 111 -155 39 -86 -27 119 114 -168 150
7390 150 223 383 137 310 613 280 -266 228 317 178 -70 166 309 107 43 9 428 828 -275 263 -39
7411 -39 154 23 424 109 -53 -95 745 -111 334 209 50 68 -84 102 29 144 -83 -23 -67 288 -99 -363
7433 -363 -507 -111 13 138 66 483 -318 535 -302 -95 77 105 -47 -356 56 -435 127 -268 -715 -140 -647
7454 -647 -543 280 -107 -138 85 573 126 56 -392 -161 -244 -127 -165 -150 -56 110 103 -372 -475 564 -273 375
7476 375 -203 158 217 191 24 -93 -167 173 295 247 -551 -237 516 76 -94 -568 -99 -378 327 -14 -76 97
7498 97 19 318 525 -406 -83 297 248 50 486 -643 -15 -770 578 942 -172 409 551 94 -67 -118
7518 -118 -391 -609 -145 -76 -18 -62 -29 -107 -362 -237 -730 12 55 -160 -741 470 219 71 -305 8 135 -14
7540 -14 7 -80 17 656 -49 -306 241 560 527 101 621 -199 399 -141 188 155 -462 -202 -156 -596 -494 55
7562 55 -163 -479 -209 -234 -263 450 297 12 755 441 -203 411 -140 105 32 -530 -50 101 -37 -361 160
7583 160 -391 -154 30 409 78 508 -102 -240 297 419 -26 -337 -253 88 407 -141 220 176 -100 -214 -169
7604 -169 87 -187 30 451 22 20 -535 364 -5 212 -191 -10 67 431 -431 -276 -356 -617 394 -142 83
7625 83 -223 28 38 269 -1004 -232 205 -692 -3 59 33 270 -392 604 -106 55 -23 2 549 156 -226 -86
7647 -86 -241 -72 -53 -711 68 50 -572 -412 -634 -574 -104 -113 -91 -206 -77 -82 317 193 275 -275 331 584 358
7670 358 59 102 267 377 202 -75 70 -328 48 264 572 40 -573 487 -454 -12 -486 -160 -191 -125 124
7691 124 232 254 -363 0 197 -126 -293 391 -222 164 -464 304 476 57 258 -445 504 -286 -128 320
7711 320 -206 152 271 -65 362 313 -315 142 257 341 -123 -455 -271 426 -353 -162 -534 75 592 354 451
7732 451 -9 115 -368 -142 196 -609 -206 -717 410 -251 371 -123 350 -78 33 307 -418 777 -295
7751 -295 -48 -63 88 85 -197 284 -319 -11 -80 -307 91 590 63 117 191 127 214 388 145 -319 106 949 -418
7774 -418 -392 -353 -153 222 -243 141 -16 -506 54 626 -518 187 -317 -1080 -331 438 -480 576 -14 -690
7794 -690 325 -16 86 501 282 -303 -313 42 -534 -702 325 -72 -405 66 13 -151 379 -237 -539 220
7814 220 -101 -88 14 -116 338 582 -323 109 -368 -306 -121 347 516 11 669 76 -236 216 288 157 -128
7835 -128 223 90 209 606 -417 376 409 368 -197 -143 608 462 40 -105 388 -118 -252 262 92 -68 168
7856 168 -284 192 231 -696 -571 193 45 231 -271 11 129 182 395 -382 -169 -734 -119 -104 -746 167 -223
7877 -223 421 -231 240 -86 -729 612 100 -344 654 -439 -178 -75 328 94 -499 10 -627 28 -435
7896 -435 -42 140 -193 -337 -521 -435 348 -566 -1073 409 -521 93 -788 -521 -145 -169 682 -60 -181 -586
7916 -586 461 -513 254 136 -302 -679 -66 -434 -17 550 699 86 -376 32 50 -349 364 -128 -68 -84 178
7937 178 418 140 -153 208 490 -285 -200 245 -186 -159 -71 -146 837 -146 -136 776 683 -38 -372 765 -429
7958 -429 -254 286 -422 -93 374 -463 177 -245 280 -166 132 -31 -493 531 290 69 -143 401 259 140
7978 140 853 -668 -361 -327 -187 -299 452 375 -598 -203 439 -225 30 291 161 -424 -113 -325 296 753
7998 753 205 -99 332 717 208 462 -170 -152 109 10 95 419 177 -144 438 136 36 266 -333 631 74
8019 74 285 -431 -375 -174 -91 39 74 279 281 -472 -290 -88 3 -264 -151 -276 129 -264 -83 352 747 -299
8041 -299 -31 49 -146 -425 415 368 277 -195 227 -61 -441 168 -252 -163 -546 -625 126 399 -62 -229 -326 -349
8063 -349 -106 85 -344 -736 18 -239 534 167 -80 103 -468 -392 -59 -33 -106 -618 -502 -99 65 -444 589
8084 589 -36 -420 137 -416 -386 -63 -1 75 251 -100 198 377 172 440 -297 -9 -253 -351 297 458 128
8105 128 -203 -112 -164 70 -247 -226 -468 570 -338 -49 -392 -826 -418 149 -148 -249 158 185 140 192 -406 359
8127 359 -320 126 -6 91 50 361 -53 20 -574 -273 -128 -399 793 45 203 -255 172 169 -333 -393 374 -482
8149 -482 -517 190 125 -271 400 271 64 87 26 -100 -521 35 -369 -177 427 143 91 502 -400 134 181 -203
8171 -203 121 -347 -232 -100 390 -117 269 -476 449 880 219 -356 170 660 283 -457 341 194 379 98
8191I8
$$ Imaginary data points
##PAGE= N=2
##DATA TABLE= (X++(I..I)), XYDATA
0 0 0 0 0 0 0 0 0 0 0 0 0 0 0 0 0 0 48 -48 48 -48 48 -55 96 -96 97 -144 145 -192 195 -240 284 -313 349 -397
34 -397 454 -516 573 -643 717 -804 893 -995 1104 -1219 1349 -1487 1647 -1813 1999 -2199
50 -2199 2426 -2668 2945 -3249 3593 -3981 4415 -4919 5506 -6198 7026 -8048 9331 -11010
64 -11010 13319 -16678 22104 -32272 58229 -297020 -388315 5315 -43932 -123227 -148744 -7737
76 -7737 109471 193696 108974 45546 113179 245686 203085 77705 -3672 6377 33539 54910
88 54910 -28872 -158895 -181849 -67483 -37982 -148340 -212711 -98866 32671 51788 15344
99 15344 27000 80018 143170 147222 71717 12838 48334 84669 37253 -35570 -69147 -75469 -47284
112 -47284 -3356 -27986 -110003 -107524 -10940 33857 -9912 -42942 -6936 59681 90893 56026
124 56026 3266 8881 63898 82449 28483 -35990 -46485 -16482 2440 -15007 -44663 -50400
136 -50400 -13150 34500 31081 -23043 -41016 10018 50321 24182 -21945 -23229 15607 48155
148 48155 31827 -17423 -33683 3672 32673 6927 -41012 -53320 -21667 10297 5820 -20430
160 -20430 -21244 14498 49635 43063 289 -23248 4099 36267 15913 -26174 -29720 -876 20982
173 20982 16261 -8248 -23171 212 28264 8959 -34947 -40348 -12076 7701 4914 -10087 -16855
186 -16855 2820 33204 32805 1107 -13638 7213 25107 13027 -14408 -25132 -11559 11293
198 11293 15971 -4798 -24941 -11259 15283 10740 -18416 -28788 -13434 4537 12174 4147 -8191
211 -8191 3310 32110 34798 7986 -7040 4782 15562 9081 -10295 -27571 -23359 -664 6954
224 6954 -12998 -26529 -12402 8344 8128 -4956 -13662 -4700 12714 20826 11819 -663 5919 23447
238 23447 26365 8650 -7262 -6966 -20 1050 -10039 -23492 -24794 -8694 2192 -7799 -17201 -9214
252 -9214 5269 10879 7122 -428 1701 14962 22754 13638 1189 3756 13497 14410 1375 -13099
266 -13099 -15807 -6243 -1466 -11023 -22844 -20259 -3363 7179 982 -8574 -5111 7925 15491 10602
280 10602 1341 675 11073 18289 10999 -681 -3725 3238 7195 -430 -10627 -15458 -10473 -3030
294 -3030 -5073 -13869 -14294 -4718 4148 5216 1093 -484 7861 16519 14481 4791 927 7290 12842
309 12842 8617 -897 -6668 -3255 1726 -2457 -12375 -16937 -10483 -4721 -7142 -12777 -11011 -2536 8600
324 8600 11908 7788 5128 12064 17950 15283 5973 89 389 1178 -2705 -9544 -13915 -10321 -4180 -5147
340 -5147 -12168 -13564 -6840 1005 4662 2108 -839 3946 13810 17417 12463 7903 8113 9847 7070
355 7070 -1715 -9693 -11261 -7292 -9101 -16986 -22102 -16978 -5310 355 416 -1000 3731 13356 17903
370 17903 14446 9906 9719 10824 7600 1169 -3671 -4969 -2650 -3899 -10077 -15001 -12578 -6537 -4005
385 -4005 -6482 -8111 -4533 1884 7426 9872 9699 10400 15895 15170 8082 1490 -114 465 -1920 -7988
401 -7988 -13555 -14916 -8935 -2543 -3967 -8106 -5998 1551 5051 5218 4681 5807 8314 10714 9470 4073
417 4073 4379 7850 5937 -1403 -6857 -6468 -5602 -5722 -4985 -6573 -8172 -3595 818 226 -1088 2607 5018
434 5018 4148 1902 2486 1995 4167 6954 5575 -881 -1475 674 -303 -3096 -4184 -5314 -8502 -4855
450 -4855 -701 -3803 -6848 14 6071 4253 1589 3388 2674 2014 3711 1779 -2398 334 6738 3644
466 3644 -1825 -431 1710 -1538 -3691 -3969 -7276 -8967 -6113 -3652 -6275 -5143 2823 6469 5647 7600
482 7600 8761 4720 4217 5139 2087 -2185 -677 2269 -1739 -4643 -3614 -3362 -3274 -892 -1923 -6564
498 -6564 -7793 -3664 -2614 -1456 3206 8235 9680 9680 10007 7740 4654 4466 2882 -3111 -8037 -9054
514 -9054 -8119 -8083 -8743 -7975 -4421 4 2291 418 9 1830 4147 4972 5414 6138 8525 8201 4319 2748
532 2748 2067 -726 -3911 -4099 -4670 -9605 -12429 -8860 -5433 -4312 -1195 3629 5455 5455 6335 5466 3345
549 3345 5692 6745 2486 207 2123 1559 -3672 -3945 -2400 -5985 -7530 -2702 -3258 -10377 -7300 -262
565 -262 1194 321 4269 6343 5571 7649 7843 2032 -1387 3648 3012 -2480 -1795 703 -2103 -5037 -1808
582 -1808 -13 -4675 -5060 -1605 -3966 -6579 -1444 1304 901 4208 9184 7491 3911 6142 4208 -2556
598 -2556 -2770 1402 -816 -6769 -4061 -2379 -2716 -1523 2102 -780 -2513 1481 -273 -5488 -4518 629
614 629 2200 2548 5407 6367 4571 4943 5984 2854 -100 -1149 -2424 -5840 -7882 -4986 -5002 -4244 -869
631 -869 2176 2277 1807 3079 467 -906 1216 3076 1443 692 4085 5003 3224 2613 1556 871 -1722
648 -1722 -4028 -7444 -8698 -6490 -5799 -4586 -2330 739 3402 5166 3636 4079 5635 4870 3203 3472
664 3472 2784 458 -427 -143 -1944 -3095 -2174 -2274 -5372 -6952 -5586 -4998 -3463 -948 1101 2383 4885
681 4885 6947 6626 4731 5497 5466 1852 -620 -159 -1419 -3141 -2949 -3173 -4545 -6068 -3289 -2333 -3342
698 -3342 -2950 -1462 -1156 814 5013 6502 6182 8153 7892 4125 2210 2556 1088 -3119 -5277 -5537 -6283
715 -6283 -5169 -2344 -2709 -2172 -625 1455 178 425 2758 2781 1744 2082 3247 3190 3869 4445 3413 153
733 153 -694 -2290 -4886 -5556 -4562 -5590 -5412 -4509 -1115 1267 3051 4350 4078 3706 3465 2749 1009 679
751 679 1581 510 -981 -1207 -266 -486 -705 -1595 -2508 -2852 -2643 -3427 -3343 -2064 -787 1506 1049 2921 3910
770 3910 4458 4148 2667 1347 72 -887 -1045 -1250 -1389 -1953 -2381 -1735 -1597 -504 -1556 -2039 -1587 -550
788 -550 276 340 905 1469 3274 4612 3502 2686 2458 2381 1105 -419 -1171 -2165 -2126 -2910 -2409 -2374 -2372 -2197 -2723
809 -2723 -1236 -566 494 -173 1265 2280 3157 3842 4201 2573 2846 2633 2330 294 -1620 -2758 -3616
826 -3616 -3478 -2741 -3574 -2598 -2323 -1637 -649 -18 1466 2204 2621 2714 4053 3829 2757 3383 3969 2513 -208
845 -208 -317 -2622 -2784 -4033 -4449 -5247 -4010 -3029 -1563 -800 1072 2068 2559 2790 3697 3781 3321 2993 2093
864 2093 1904 981 247 -610 -1643 -1800 -3761 -4101 -4576 -3726 -2806 -2175 -934 -527 736 1958 4362 4666
882 4666 4501 4025 3831 2797 1730 844 -1262 -1853 -2396 -3054 -3609 -2853 -2958 -3117 -2378 -211 -3 483 -574
901 -574 1096 2970 3134 3042 2108 2352 2544 2711 1434 -97 -300 -2111 -2079 -3068 -3452 -3024 -2935 -2896 -2293 -976
921 -976 379 432 2822 2876 2383 3416 2505 1820 1020 1024 444 -214 -1262 -1584 -1651 -455 -1104 -1521 -2094 -727
941 -727 -1665 -1695 -184 227 -332 -468 1137 1851 2100 1839 2073 2227 1128 486 -980 -1207 -782 -1547 -2931
960 -2931 -2516 -1370 -1161 -2233 -1453 822 194 -191 922 1326 1553 1572 1854 1730 1345 2247 1278 -190 69
979 69 95 -1675 -1269 -567 -1572 -2253 -2763 -1506 -1435 -1252 625 654 45 1182 2633 3064 1862 2625 2528 1379
999 1379 959 202 -705 -1393 -1650 -2186 -2964 -2327 -885 -1382 -1306 -200 1146 1197 849 1845 1806 1834 1333 1442
1019 1442 398 863 1201 1576 276 -981 -1280 -1919 -2668 -2773 -2179 -2808 -2443 -1691 -233 873 2304 3380
1037 3380 3135 2636 2671 2311 865 -23 687 -330 -1532 -1159 -1368 -1305 -1830 -1016 -1982 -2251 -1509 -627 -214
1056 -214 -409 1239 1634 1171 2411 3673 2951 2616 1778 685 -1108 -812 -1055 -2337 -2671 -1842 -1465 -2948
1074 -2948 -1399 650 -241 -132 738 1446 552 973 2250 880 752 2840 2109 337 522 1255 -477
1091 -477 -1932 -1762 -1334 -2886 -2525 -1240 -2051 -2317 300 364 -238 1100 2005 2156 1461 1845 2004 1524 1523
1110 1523 1341 380 -813 -808 -123 -1978 -2245 -1960 -3791 -2922 -1069 -581 -1413 -750 1237 1857 1312 2338
1128 2338 2131 1655 2248 1788 390 809 664 -6 -1463 -1302 -1496 -2003 -1814 -2151 -2439 -2841 -847 -46 805
1147 805 892 2491 3119 3188 2441 2085 1488 1051 -84 -627 -1353 5 -773 -2435 -1872 -2227 -2045 -2247 -2369
1166 -2369 -1638 -587 -176 -238 1412 2586 3325 2792 3123 3156 1457 1149 -325 -387 -2196 -2590 -2361 -2521 -3464
1185 -3464 -1848 -1593 -1323 -1 902 1274 734 1985 2201 1673 1965 2177 2262 1287 1522 1085 -64 -940 -1793
1204 -1793 -2746 -2738 -2422 -2604 -2030 -1303 -1061 287 941 2042 3059 1845 1779 2424 1385 1208 956 -292 -572
1223 -572 -1083 -725 -1504 -1916 -612 -1539 -1986 -1341 -339 -308 -335 727 1711 1096 1957 1431 1465 1650 1197 241
1243 241 -182 -340 216 -916 -1405 -1354 -907 -1519 -1555 -1498 -1145 -468 -458 566 -41 1461 1365 1215 663 1808
1263 1808 2187 1717 604 -313 -743 -468 -590 -1190 -1368 -1040 -1604 -1489 -625 -800 -181 -703 -175 26 278
1282 278 224 1002 1349 1739 2148 1543 1859 1182 76 -704 -293 -2061 -2430 -2048 -1416 -1690 -317 -329 -684 291
1302 291 589 808 1226 988 987 1422 1230 1621 1254 1242 479 -615 -690 -881 -991 -1856 -2813 -2397 -2404 -1317 -797
1323 -797 -318 200 630 1925 2437 2281 2492 1602 1388 1024 74 1094 -328 -878 -1156 -1629 -2017 -2317 -1767
1342 -1767 -1774 -1631 -1132 -326 516 884 1202 1997 2319 1756 2097 1907 1447 1414 296 -239 -886 -1282 -1706 -1891
1362 -1891 -1532 -1721 -1903 -1577 -603 -78 889 677 1377 1950 1851 2446 1690 1521 1420 698 202 -477 -801 -1834
1382 -1834 -1757 -1506 -1713 -1656 -884 -1329 -1027 26 -324 1030 1467 1170 1600 1905 2069 1823 1174 1000 4 -929
1402 -929 -1241 -1442 -1909 -2566 -2094 -2264 -1264 -835 -375 389 1276 1079 1839 1202 866 1111 871 1252 765 717
1422 717 447 11 -801 -356 -1553 -1228 -1666 -1265 -1000 -1976 -879 -2030 111 288 561 1542 1429 1436 1844
1441 1844 1265 1289 457 665 -179 -524 -1174 -1073 -1146 -1190 -923 -1770 -1360 -1089 -742 -20 -386 801 470 853
1461 853 1063 1357 1423 1233 1293 695 496 -157 -985 -1196 -1347 -1777 -1639 -2185 -1339 -1441 -773 -628 -262 877
1481 877 775 1048 1518 1357 1356 1721 1469 728 146 189 -577 -711 -1139 -2098 -1604 -1376 -1010 -991 -119 9 228
1502 228 -180 1299 1300 2220 2274 1687 1863 1167 702 256 -559 -791 -1709 -1101 -1915 -1930 -2093 -799 -1091 -783 150
1523 150 228 1236 1118 1532 1508 988 673 605 -137 699 -72 -397 -658 -299 -1092 -1118 -1200 -869 -959 -812 -954 -407
1545 -407 629 561 156 1453 1266 657 694 862 336 487 265 -65 -642 -394 -781 -538 -250 -911 -333 -277
1565 -277 -296 -237 -372 272 636 439 772 809 712 282 -125 406 473 574 248 -284 -431 42 254 -1258 -1003
1586 -1003 -119 -1284 -705 -189 409 476 276 677 1156 350 481 689 618 -18 590 614 -600 -573 96 -615
1606 -615 -464 -588 -587 -1176 -1041 -1052 -907 -626 -324 79 78 1071 1304 1218 164 1046 1065 -412 29 123 -433 -629
1628 -629 -431 -1131 -1147 -1632 -671 -903 -750 -67 105 96 83 524 1337 1467 1521 1470 1593 1062 696 364 -539 -757
1650 -757 -919 -1209 -1881 -964 -1269 -1270 -924 -151 252 -141 899 796 1752 1086 2018 1340 386 292 57 -274 -823
1671 -823 -416 -569 -1516 -1530 -754 -322 -975 -726 -186 81 340 585 924 1091 828 1144 824 534 1062 803
1691 803 -5 -28 -940 -971 -1078 -997 -921 -1471 -554 97 125 -279 343 -30 1145 985 1330 665 380 324 390 -608
1713 -608 -454 -771 -115 -554 -338 -743 -953 -537 -716 -980 -744 536 333 34 579 875 1006 1310 1187 456
1733 456 -264 374 351 -439 -785 -499 -769 -1616 -1367 -902 -95 -714 -648 422 371 756 -56 1089 307 914
1753 914 804 1132 1259 284 1097 122 260 -323 -1284 -759 -1634 -904 -1607 -376 -1030 -804 -74 -158 197 835
1773 835 1030 217 618 378 1003 752 437 594 -324 -409 -932 -611 -994 -1245 -1021 -370 -303 -446 -49 -471 784
1794 784 377 701 677 1300 691 1578 872 1108 186 -694 -468 -224 -1393 -870 -1436 -856 -997 -1550 -920 41
1814 41 -237 467 1236 1184 1291 635 996 510 109 253 -638 -40 -1189 -955 -1039 -1285 -612 -912 -793 -319 -651
1835 -651 -411 -407 745 528 158 692 314 430 712 408 245 203 -138 -491 -987 -1139 -584 -442 -577 -507 -199
1856 -199 799 16 693 738 956 626 68 514 369 415 386 102 -39 -788 -352 -36 -631 -448 -1373 -759 -429
1877 -429 -856 -662 -92 311 13 20 -424 577 725 744 181 629 242 11 -2 -63 -318 -348 -92 -97 -407 -936
1899 -936 -585 -821 -458 -21 -22 75 223 330 884 184 393 721 642 690 213 175 -455 -625 36 -923 -921 -930 -924 -853
1923 -853 -607 -32 -360 -61 14 85 516 1388 1303 1417 233 506 330 -389 -190 -22 -643 -236 -676 -352 -687
1944 -687 -981 -546 -1093 -61 143 -162 78 677 1376 1206 627 937 587 16 20 -140 -888 -804 -747 -1248 -812
1965 -812 -1174 -138 -264 -204 -2 -357 145 847 230 681 372 512 -62 283 740 578 -468 -366 -388 -716
1985 -716 -371 -436 -279 -846 -217 -877 -32 -126 865 658 914 433 754 25 -35 655 231 -16 -429 -960 -553
2006 -553 -861 -457 -81 -302 -586 -180 -273 -555 153 -89 171 688 550 1030 797 1337 -308 311 -195 850
2026 850 -243 -669 -425 -750 -979 -60 -156 -714 -175 57 -124 455 230 83 231 172 443 666 339 -393
2046 -393 52 251 -137 -186 354 -725 37 -989 -880 -868 -774 74 -200 21 -396 4 672 99 465 321
2066 321 -204 280 827 -411 -387 -78 -564 -16 -603 -321 -719 -42 -488 205 -536 -484 -32 208 480 294
2086 294 773 375 47 411 539 -150 865 820 -198 199 183 -328 -347 -421 -469 -497 -508 284 156 185 676 842
2108 842 281 505 542 1065 977 315 645 149 -744 -76 -453 -567 -596 -624 95 -552 -133 -76 386 -209 -902 339
2130 339 957 580 762 238 -372 -43 289 -72 167 -884 -670 -927 -217 -262 -772 132 -346 406 514 -126
2150 -126 269 169 916 359 186 449 816 -192 39 -173 -65 -282 -191 -221 -70 -831 -139 -128 -528 -655 -249
2171 -249 482 279 753 802 688 811 529 -10 413 607 407 -447 -457 -675 -341 168 -549 -242 54 158 -280
2192 -280 548 -157 492 92 -47 712 399 337 -237 -221 -270 337 -110 318 320 -361 -68 -768 -482 300 -32 -579
2214 -579 147 -139 163 -52 658 660 662 147 339 -45 -116 407 183 169 -436 -476 -579 -338 -131 -473 -341 141
2236 141 141 -29 282 410 -234 510 225 346 574 287 474 -147 -51 -149 21 -414 -110 -176 -675 -1307 -256
2257 -256 -127 -297 -61 228 -42 202 497 598 549 633 928 -225 338 996 460 -768 66 -406 -631 -245
2277 -245 -639 -268 -398 -129 -73 -6 182 522 378 846 412 385 129 160 538 -80 119 -648 -44 -258 -815
2298 -815 -43 -525 -63 -132 -343 56 439 8 74 -431 182 407 814 520 304 2 241 -60 50 83 349
2319 349 -457 -374 -311 -420 -203 -480 -279 211 316 201 -79 -137 593 350 393 555 340 -303 309 -20 -471
2340 -471 493 -537 18 -394 -543 -390 -344 270 247 -124 141 863 26 518 -85 472 -29 433 20 -3 75
2361 75 123 234 -293 -340 -207 -103 -607 -432 130 -382 417 535 -68 113 257 217 194 94 635 127 265 83
2383 83 201 239 -21 -444 -112 -133 -424 -480 -244 -745 287 119 -212 -161 -100 38 170 -111 598 428 117 308
2405 308 -114 -239 -392 -464 -491 -426 -601 -584 1080 -202 -341 -242 211 117 25 381 104 952 714 662 213 72
2427 72 529 -572 -18 -755 -699 -136 -872 -192 -516 -610 155 -281 247 566 109 537 398 473 607 55 -227
2448 -227 242 -215 -172 -140 -267 -349 -557 -573 157 -922 -177 -158 388 502 -361 248 919 -43 68 237 -334
2469 -334 -33 188 95 -189 -641 -676 -634 -330 -528 111 -758 -968 -346 587 -433 385 -276 -116 389 855 -190
2490 -190 833 570 -225 507 164 -329 -2 -565 -788 -660 -625 -124 -561 -239 514 69 -289 535 223 607
2510 607 351 73 471 -43 -477 343 -404 -136 174 -355 -222 93 -416 -322 -520 -150 304 246 -117 179 580
2531 580 458 331 -171 -75 915 166 1036 -42 -81 -16 42 -759 -555 8 161 -391 -87 28 -418 -400 435
2552 435 108 363 664 700 386 88 -130 472 351 -6 -716 -979 -686 -710 -83 -597 -611 213 266 28 472
2573 472 530 160 -146 413 243 491 429 830 105 -376 -144 -560 -985 -294 -304 -632 -387 -728 -577 -104 -673
2594 -673 -211 464 315 170 538 504 43 197 -252 197 462 -227 194 38 286 27 -419 -600 -90 -469
2614 -469 -541 369 -292 202 190 455 257 1226 325 755 -181 -368 -58 -169 15 173 -300 -54 -1 -249 -585
2635 -585 -183 -31 28 544 -288 -12 340 753 209 -405 347 -185 -162 -310 -205 -244 -48 -394 243 -333 -107
2656 -107 -57 -191 -444 -167 -107 49 42 18 -130 177 852 290 260 411 241 389 117 -114 761 9 -289 -206
2678 -206 -393 -65 -233 -976 -614 148 -543 -385 542 97 177 84 348 91 -582 137 192 -26 164 -410 -306
2699 -306 -91 -228 -77 -441 -182 76 248 -82 187 499 -172 373 -45 173 283 76 -48 156 5 483
2719 483 -127 239 -414 -123 -82 -160 -34 -423 -146 -193 232 469 84 336 18 532 243 -77 347 203 -540
2740 -540 -501 159 1 -60 -165 40 -545 42 105 16 -102 214 -59 769 84 163 482 364 145 233 -511 164
2762 164 387 -146 -100 -492 -257 -280 -432 -55 184 197 20 122 283 311 762 118 159 -77 -54 -97 -229 -241 34
2785 34 -559 -440 49 34 -361 31 105 120 -201 3 59 262 -99 140 -309 342 369 -36 158 710 431 299
2807 299 46 -649 -451 -306 -444 -331 -168 -47 257 579 217 -319 -404 -281 320 -150 19 470 72 -134
2827 -134 -187 -60 602 -602 -301 192 -8 -421 -507 -401 -66 47 -161 630 709 601 55 -196 -237 -52 335
2848 335 561 612 96 201 -25 164 -244 -153 61 -78 210 -360 168 17 362 -49 -251 -345 523 339 59
2869 59 152 108 824 -783 -243 -313 -295 1 -161 -682 -420 -65 249 230 -57 29 288 824 -23 -13 38 174 381
2892 381 303 766 -101 472 180 251 -143 -183 -24 -497 -492 -668 -621 659 308 -19 67 288 273 -204 255 109
2914 109 -306 181 -612 822 -364 132 189 -16 -199 -337 -739 -609 131 -308 -301 532 -50 26 -159 86 66
2935 66 317 126 124 205 -491 103 283 -61 -458 -446 -318 -301 -479 -711 -270 -546 58 10 95 259 -469 -260 299
2958 299 -83 223 50 -384 -208 118 -398 -528 -250 -50 364 -521 141 74 482 293 -47 -131 -299 -168 341
2979 341 -133 -113 198 493 465 990 428 -114 31 -21 266 556 -1 -496 842 143 -60 4 -564 109 28
3000 28 497 47 664 -274 452 149 228 -439 -582 445 360 -213 -437 -365 -103 -24 -484 760 362 100 -198
3021 -198 129 -29 283 672 376 340 -275 -130 -504 -67 -12 61 25 -133 -26 133 -232 93 -64 -506 300
3042 300 357 30 -33 427 335 292 134 -512 306 -49 596 -119 -39 -65 -28 -432 -605 -501 179 -152 -347 -213
3064 -213 375 859 183 790 207 66 -215 -302 -90 565 433 1 -78 -47 -593 -113 -9 -109 -169 -373 -447 -184
3086 -184 -96 551 486 451 282 130 -370 212 245 -314 95 -348 6 272 -313 -557 150 -364 -629 138 -116
3107 -116 57 155 267 714 -297 816 499 403 -72 689 -140 -174 -281 -448 539 -687 -158 -680 918 -350
3127 -350 211 -987 -416 281 692 815 -777 126 658 291 -550 -178 -198 138 284 488 89 190 264 -378
3147 -378 -257 -316 546 -83 -122 411 161 -300 257 376 -293 99 -215 -212 -326 -527 53 -86 -62 -370 65 -804
3169 -804 -174 -18 -150 535 431 361 -368 126 -649 257 270 346 412 -148 -83 559 31 106 -209 232 -120 37
3191 37 79 -665 -134 249 11 -245 397 106 205 98 85 -287 331 398 -302 184 335 244 474 74 413 -441
3213 -441 -71 -61 133 -21 -366 -385 -117 418 208 -277 -617 -452 45 541 17 -336 -107 -602 495 -14
3233 -14 -243 740 399 -339 -147 -71 -388 -10 -490 -18 346 394 -353 65 -127 -229 141 272 261 -73 -150 732
3255 732 138 -21 -322 -46 -38 754 -234 -170 -190 -328 -284 298 -251 -60 65 300 262 352 342 53 91 -367 -53
3278 -53 190 -62 -382 201 -184 629 -113 97 143 -249 -9 85 276 205 -182 417 83 -6 -74 -153 -314 -222 -55
3301 -55 -760 -3 -418 158 -116 425 41 -428 266 243 -341 -83 507 -39 -291 -30 170 79 -314 -166 -395
3322 -395 -384 296 -351 -184 -5 359 305 189 207 239 364 119 340 303 27 311 30 479 24 -266 148 70
3344 70 -267 -6 -379 -77 146 118 131 30 -83 341 -822 34 -519 -191 -170 -156 -339 81 565 168 -427
3365 -427 239 271 44 466 201 93 -266 -490 -148 5 100 563 -111 -129 443 110 -101 -584 -5 -101 129
3386 129 271 -129 -96 158 184 40 -687 143 526 92 211 -194 667 447 190 405 -89 -78 -190 98 566
3407 566 311 777 -1 -139 -178 -550 -439 -223 -48 533 -771 -209 -249 325 -64 54 -97 475 7 91 293
3428 293 5 -284 -361 -313 -245 -316 190 42 -277 -164 -577 -217 682 -140 169 126 9 348 11 -22 91 475
3450 475 255 28 -188 626 -686 -404 -102 522 -736 -262 -133 106 596 -351 -344 -360 447 431 1106 64
3470 64 248 0 23 100 31 -523 -514 130 -18 -121 106 -388 23 109 523 168 -279 150 -2 192 -147 130
3492 130 633 -181 247 422 301 225 -125 -93 -960 -497 -350 -11 300 294 -243 79 73 -423 194 17 -170 217
3514 217 18 460 17 -208 -10 336 99 -516 444 550 605 -231 -434 -225 -89 -235 810 354 161 -119
3534 -119 341 -231 668 37 283 368 146 -144 679 247 359 -219 -376 140 -551 -474 120 462 338 -202 56
3555 56 209 -69 591 689 508 -10 -35 164 -77 99 -13 -2 694 196 295 -877 -773 -333 -496 -358 324
3576 324 -91 266 209 -76 -113 128 -38 -181 187 229 391 -199 -492 -15 602 -95 -708 -40 -105 -375 154
3597 154 -467 -148 167 -77 180 472 62 -188 303 396 -373 -221 328 149 206 -123 -855 214 -28 -346
3617 -346 -168 78 -47 -18 461 -365 -168 11 -792 -233 518 239 61 44 -6 106 -105 343 -494 -85 706
3638 706 -413 -372 -487 -79 -691 -230 296 429 162 52 559 -224 -478 -11 166 194 38 970 -11 187
3658 187 -232 -819 -429 -177 -204 361 214 445 -44 75 261 1019 494 708 -160 267 -474 161 448 -186
3678 -186 -8 -397 268 -382 141 -37 -155 370 69 -78 638 -520 79 180 105 879 -114 689 439 135
3698 135 10 36 -62 52 -78 93 -203 5 -98 195 -281 -312 196 242 82 -314 565 276 -534 -645 108
3719 108 226 -765 -111 240 -401 -593 21 -485 110 166 -102 -30 176 164 539 29 23 -602 449 361 294 392
3741 392 619 168 39 -10 -342 -5 54 61 13 129 -106 148 -130 -276 -145 -63 -701 435 99 25 158 -520
3763 -520 -187 -314 117 -395 287 400 -458 0 989 41 -150 -104 -52 -76 -68 239 -166 196 156 437 434 -327 -669
3786 -669 -151 139 17 579 -92 194 -95 -342 -304 -18 337 439 -326 736 8 137 178 -78 118 423
3806 423 -64 -478 -95 13 99 334 68 676 333 154 -158 -118 -20 584 845 1 -286 319 -479 -262 361
3827 361 -180 290 43 142 89 -615 -172 591 -307 254 -283 -349 75 87 339 -251 36 80 167 182 242 188 201
3850 201 84 -245 127 130 477 -323 191 155 -252 -144 -42 -415 -55 -433 227 -418 194 -981 -600 -55 -42
3871 -42 -352 387 -120 -123 -136 274 -160 -237 -747 357 21 209 196 -477 324 -180 139 469 31 640 -153 591
3893 591 12 650 -39 467 657 325 -744 398 254 232 191 -379 895 223 48 99 335 -461 -135 -393
3913 -393 -30 364 26 86 -17 107 -563 -213 951 -20 582 -85 -38 -360 20 -100 -5 48 -286 -306 -12
3934 -12 -254 -92 -208 -309 191 238 189 -341 212 -434 -143 -434 285 -60 -336 555 -140 -399 136 -120 98
3955 98 195 -7 -198 -6 466 -213 357 -47 -143 -332 324 -98 -619 -87 154 87 -417 727 333 164 -11
3976 -11 932 298 184 296 -14 -22 854 383 -428 -209 54 188 -47 -311 53 615 201 -546 -603 -408 -339 -171
3998 -171 -201 -129 -249 -465 -508 -213 247 -215 69 -238 350 598 -400 -72 -20 237 -323 497 -556 -430 -340
4019 -340 -297 173 -153 -46 -698 734 481 290 286 18 233 -571 -2 -2 -362 437 -21 -558 -191 -18 -70 -325
4041 -325 -770 312 -94 -25 812 324 -35 -841 86 456 344 -409 -50 476 873 112 -630 105 96 -78 385
4062 385 -36 -452 -169 201 -130 -700 297 17 223 264 230 302 -79 100 -27 -200 -194 -216 -299 -378 -303 -272 -528
4085 -528 -141 169 130 -824 16 -177 366 -59 -42 281 -75 140 275 -31 -20 -574 9 398 -179 -122 62
4106 62 -167 -125 530 -63 323 -550 -155 151 147 -508 433 299 52 -78 194 -219 386 181 -14 42 -171 67
4128 67 -351 -241 -112 -24 341 297 11 203 363 445 292 67 172 -1 239 128 -254 -321 -72 -200 453 18
4150 18 84 -510 -70 -688 -104 446 77 210 -136 574 606 33 -97 -169 -760 54 -104 270 -98 -83 144 63
4172 63 94 -467 -22 -329 77 98 104 -39 3 -321 -395 306 224 412 672 -317 -319 -70 -702 382 370 39 -62
4195 -62 -202 -701 110 85 21 -221 -446 -90 35 16 253 933 166 520 274 502 -589 -24 19 2 -269 -348
4217 -348 163 -532 766 621 -437 -186 161 -56 40 470 465 -29 183 33 632 -75 -307 526 -236 353
4237 353 222 -85 -444 230 213 -102 -79 -26 -474 -153 -536 508 430 65 -264 -203 -180 279 30 369 -800
4258 -800 143 92 342 -350 487 175 -309 -251 -164 489 511 382 -212 -173 270 -341 -141 300 -303 150 -249 440
4280 440 -428 -701 178 -377 -71 452 -98 820 -277 129 -280 -224 -144 -52 -156 259 547 -757 -172 246
4300 246 159 447 112 342 313 -297 359 -235 159 560 281 202 -544 -177 164 192 -250 -452 364 59 34 83
4322 83 119 -81 -252 160 -485 -434 -438 30 -267 460 -102 528 1 -205 -475 -174 366 509 148 82 346 -103
4344 -103 465 236 903 -189 235 -103 -47 -4 -37 -48 -82 -88 35 -222 -159 458 660 736 198 -113 724 -621
4366 -621 -39 522 102 168 -69 -300 -15 -364 -184 -156 -187 391 39 -523 -139 11 398 378 371 603 -255 -179
4388 -179 179 40 -108 117 551 -84 -39 -165 428 0 -201 -353 -137 -185 -595 -199 343 -98 62 358 16
4409 16 456 713 19 356 -278 528 182 -360 189 51 -101 119 -180 -106 -455 137 573 -352 95 -27 468
4430 468 64 887 243 444 577 -250 -213 12 -93 -234 -377 -517 212 -802 -374 317 -75 362 216 286
4450 286 7 699 -355 813 -62 -135 188 39 -84 400 -424 -123 -103 -113 -257 100 -890 368 520 -129
4470 -129 337 7 285 107 273 146 64 610 620 -564 -459 296 -66 68 87 -490 -66 138 -175 -171 133
4491 133 59 54 33 -313 -186 389 245 2 476 -531 -277 384 664 -107 -161 33 -265 -377 20 -334 10
4512 10 -247 -461 -79 406 -87 -340 -70 485 450 236 157 -338 -74 62 107 -216 -157 61 59 -125 -67 -311 -445
4535 -445 -159 -303 82 -448 -75 -433 -160 585 123 294 160 405 104 66 392 -116 -68 -502 242 339 225
4556 225 63 -78 460 586 61 -339 4 -223 -206 -421 904 -154 -522 -407 -320 -256 -302 -142 109 -236 258
4577 258 174 -318 185 177 281 -404 -190 -114 31 428 34 -309 -35 141 -355 47 203 -651 -250 21 -305
4598 -305 -80 284 61 -218 384 66 -588 -205 -674 -242 -65 -78 443 617 -95 -715 451 -241 -253 -161 -200
4619 -200 369 -359 23 53 -334 82 85 -382 -656 593 -398 -133 -40 -14 247 172 342 -409 327 -654 115 -739
4641 -739 -522 138 0 -296 322 -4 471 -618 79 30 271 134 459 320 -484 175 1 -499 90 62
4661 62 -176 -131 -129 -251 595 176 -359 664 247 -212 81 108 -13 187 239 391 -372 743 -150 -84 -380 -50
4683 -50 -263 3 30 -664 -456 349 59 -61 425 54 -196 100 191 -275 354 526 393 -285 -513 44 485
4704 485 -37 -486 -79 -449 364 -160 27 130 -490 -260 -545 -185 143 194 -466 -298 614 120 971 325
4724 325 199 -48 -45 235 -379 -274 141 -766 -621 451 -191 -154 193 -442 377 -93 562 605 -133 172 138
4745 138 234 -311 99 204 -266 206 523 320 -144 -586 -308 -288 62 -10 203 -146 -320 89 783 -229 760
4766 760 309 -312 -454 -145 132 432 546 -570 -584 -525 -706 -293 171 -31 -407 440 -218 305 399 46 -233
4787 -233 304 425 333 -645 73 16 -238 156 -1102 -715 -109 -175 42 -223 101 80 5 -235 566 418 -187
4808 -187 292 493 179 872 77 62 529 -303 -651 183 -426 222 341 90 -616 -563 -548 -142 -435 -299 79
4829 79 -27 59 -307 109 23 -145 33 -188 243 47 -52 -265 -774 -304 -193 210 -202 -319 -411 545 17 -398
4851 -398 315 285 626 -37 -211 -138 85 -215 545 -26 547 -295 398 340 440 -49 358 -159 492 -173 -58
4872 -58 459 220 297 -6 -318 57 -98 86 -386 238 33 -182 271 432 -73 -5 539 253 -69 129 -138
4893 -138 323 32 391 203 107 -11 321 260 314 51 150 147 -223 -503 -400 -516 -380 91 -348 -274 36 10 -596
4916 -596 93 -374 -450 180 -121 -624 526 398 -134 184 517 -143 -261 -362 153 713 -324 115 344 98
4936 98 -245 320 -464 -414 557 198 -300 780 -22 -367 -233 -157 -184 146 223 243 -117 -272 121 116 261 -64
4958 -64 -187 484 -196 -163 -839 -41 366 122 95 -222 -529 -255 46 -82 242 -31 472 -23 -382 -103 -179
4979 -179 -37 171 -265 584 -200 40 -203 461 477 -75 -281 -475 362 537 146 221 89 -210 -945 -197 -572
5000 -572 -595 181 -84 119 393 356 457 -165 -3 35 151 -180 351 -308 280 -119 -35 -184 -142 62 -91 38
5022 38 -14 -34 -227 70 -110 256 -132 481 -188 381 211 -345 -448 -168 -137 -408 -649 76 -997 -448 -4
5043 -4 -38 -114 -1052 -465 140 107 -386 -180 135 382 498 -51 292 34 151 510 226 927 198 234 369 -47
5065 -47 -254 -243 -373 477 149 -293 -112 -872 -681 423 12 65 436 690 297 -299 17 252 -200 120 444
5086 444 -189 -101 352 -31 75 -245 29 -633 650 -182 299 849 7 33 -119 13 -63 55 -261 -192 -438
5107 -438 205 -281 155 -107 -328 204 -201 196 272 -343 277 -44 87 128 110 -140 -85 -193 -197 161 205 -237
5129 -237 480 -158 263 -794 -522 395 438 1 -90 -670 558 361 314 -68 364 32 474 -251 -12 -469
5149 -469 -100 157 62 -118 -151 107 431 152 -186 64 -185 -337 -117 68 288 97 -221 74 147 -335 -23
5170 -23 -340 143 163 291 -205 42 46 84 249 104 478 253 -334 328 611 238 -120 339 98 574 471 15
5192 15 331 634 45 -6 451 -77 -154 -717 220 -581 103 -494 -12 -87 -322 -209 136 -206 77 249 205 272
5214 272 263 -344 376 -60 268 53 -525 -196 -94 5 343 550 92 539 -67 185 -54 -518 229 85 436
5235 436 191 -230 -597 -544 647 151 -139 554 295 178 -401 -330 -244 -280 -530 516 -117 -220 146 -73 -20
5256 -20 865 644 -103 805 59 36 -140 441 393 -112 104 -240 -148 -408 480 148 -257 -70 -36 66 45 247
5278 247 -571 -229 649 97 -303 613 -148 -676 -290 618 76 637 259 -222 -244 191 -243 -381 127 142 -116
5299 -116 245 586 568 450 199 -240 355 -727 -878 478 -78 -20 -147 -732 -421 -172 -195 -270 51 -3 400
5320 400 651 336 -22 -282 414 222 783 282 -539 67 -563 -286 382 -854 -165 -87 41 -351 -329 166
5340 166 338 288 136 781 -191 -864 -246 21 159 154 437 -268 -486 147 -276 191 -533 137 98 510 419 -307
5362 -307 -193 394 600 630 494 491 -688 374 462 101 -177 -709 -110 -467 197 -97 117 -337 -123 435 -37
5383 -37 -393 -347 150 432 -499 44 -8 -618 -86 -75 -76 386 -168 -21 -294 -330 -203 -75 -62 -135 -344 149 88
5406 88 -9 -131 -394 -517 -8 33 321 -174 161 331 -537 5 261 -38 -206 -349 -458 -228 -194 669 23
5427 23 -375 348 -518 -35 30 -460 -147 390 -702 -204 198 -399 383 -68 309 105 413 -205 70 -156
5447 -156 -439 333 621 -10 368 301 56 115 -51 186 -50 248 93 -484 279 421 -51 -113 135 476 -487
5468 -487 -16 -588 -383 729 -339 327 -43 138 75 1 -601 673 145 -132 -94 -187 171 351 11 -491
5488 -491 -429 -139 -210 529 -286 -510 -20 -631 -440 -110 416 -89 -272 507 -192 -389 -118 -201 114 -220 -374
5509 -374 239 184 -145 -430 -105 599 -246 -372 -585 392 -232 -88 -6 202 340 -21 70 31 -604 -658 -573 -163
5531 -163 -26 234 -26 214 633 182 -412 -219 88 125 -26 -485 491 -57 -270 -616 -103 56 183 -167
5551 -167 91 52 -457 44 -327 -85 -303 559 105 -228 -276 412 -266 -161 669 166 87 698 -322 236 687
5572 687 202 -412 -176 161 -128 -335 139 -573 399 201 -271 159 196 -259 -98 451 204 16 -377 146
5592 146 145 -709 -545 -508 -135 -325 -372 -20 -418 469 169 47 78 309 -345 137 216 -130 103 186 -279 -50
5614 -50 254 131 -254 436 130 425 156 -469 -389 -352 -620 -846 153 432 925 179 -257 -50 784 302 -183
5635 -183 -432 436 -324 68 361 -610 70 -531 -213 112 -279 -58 573 -23 -170 -393 159 126 397 -24
5655 -24 -622 293 48 522 364 -369 138 71 451 316 -517 -62 364 176 120 -127 -164 -206 330 -52 13 705
5677 705 21 20 197 196 -100 -348 186 438 -120 -72 194 198 337 -230 -86 76 -333 -53 -249 -85 -430 198
5699 198 210 190 73 -129 -694 -316 -116 42 143 213 117 -276 -208 286 446 134 -383 701 610 -756 220
5720 220 -228 157 -341 -47 147 -369 -223 -328 200 163 10 -612 -665 45 -146 -128 -697 -500 -179 -610 -671
5741 -671 -229 294 -167 -17 685 231 -166 559 25 -408 -150 343 924 -473 -330 -245 -453 97 -527 71
5761 71 -796 218 -402 -284 -304 -176 222 719 -395 -347 82 169 -295 -299 -140 181 -240 14 447 -256 106
5782 106 441 31 -567 -526 -113 506 679 126 -282 -119 74 201 193 1039 -81 441 213 -12 426 570 88
5803 88 153 -3 -305 183 -320 320 121 398 -140 -502 116 -490 -12 -135 81 -461 145 56 375 35 482
5824 482 -73 325 -135 -235 -409 6 -343 58 166 72 230 27 122 -79 -99 -78 -86 -236 152 -360 -516 247
5846 247 -419 -1 -191 -242 240 -434 -122 10 -255 181 458 181 392 29 -412 252 -269 -108 -414 138
5866 138 125 291 693 -251 -386 -205 -187 201 -162 391 150 -128 -438 -203 -12 512 11 28 -28 -141 212
5887 212 -819 -139 24 -116 166 -342 -1195 44 -9 156 -486 215 1 325 -113 28 -385 172 824 -133
5907 -133 254 398 -17 64 -1014 -642 633 332 -328 -328 379 -18 229 -142 284 366 162 297 76 -271 -211
5928 -211 -356 -518 381 341 -255 -228 -550 -484 -39 502 -596 528 -208 603 637 -239 -339 79 625 303 453
5949 453 -311 -60 33 -369 182 -354 136 -335 -484 59 -90 -290 -349 21 -317 213 -293 -169 46 -537 41
5970 41 -6 277 -600 543 506 -113 235 -42 -164 -170 200 27 -21 -5 302 -506 -56 -110 110 -219 -31 -330
5992 -330 431 -71 -1004 246 -140 268 529 323 -246 -382 -447 257 180 -276 280 430 -97 39 433 295
6012 295 686 -48 140 169 49 -22 277 204 437 -334 364 -342 -373 -138 90 -163 -41 122 -5 533 -327
6033 -327 -680 564 -188 -424 145 -7 -424 208 311 -275 -449 92 -10 295 -139 -408 -185 470 16 89
6053 89 -387 15 -94 -532 327 -474 -7 56 706 -621 -72 -168 -130 196 -316 -37 -766 189 -193 343 255
6074 255 -184 -419 150 -360 -176 788 -541 183 -26 -96 378 -312 -431 -33 66 -250 -836 830 -295 -611
6094 -611 -18 -393 -104 523 -64 -213 199 -437 436 120 -403 94 -275 -39 -3 -27 -290 -266 -851 52 -38
6115 -38 -284 118 -108 414 -19 205 -403 -138 33 36 26 -103 71 -90 110 -90 74 14 414 -521 -136 164
6137 164 -673 265 8 -312 -508 800 -44 39 138 -304 -188 219 524 -30 309 403 11 33 183 168 -278
6158 -278 -658 -136 -98 273 616 -683 47 -337 268 -526 -10 168 -146 -154 339 -33 -150 -534 -307 -268 -433
6179 -433 -104 57 -65 -243 -495 77 -322 -171 25 475 -457 404 -81 361 -133 373 90 -533 -552 190
6199 190 -309 -317 -391 -208 -579 481 -14 3 88 517 355 115 508 -120 995 221 -71 398 -68 -35 834
6220 834 351 45 185 -170 55 -109 -1001 378 -316 -222 -281 -441 -306 437 452 125 203 315 159 99 297
6241 297 -460 -663 249 373 -676 -732 -325 -273 -492 627 -147 391 121 -232 305 106 176 315 -88 -237
6261 -237 -688 -726 -278 192 -381 251 83 316 210 106 -77 -659 185 -71 -208 352 -105 601 -144 -766
6281 -766 579 -461 -264 229 -271 352 51 -147 -532 -246 13 -490 428 -507 -370 -194 -105 -66 324 432
6301 432 -205 185 -282 -164 -206 53 243 -64 407 441 -214 -442 118 280 92 -90 -80 -451 -159 287 162
6322 162 382 -641 154 -359 -57 200 -229 389 -483 -402 -547 -146 68 149 -96 47 123 118 -86 6 161 -2
6344 -2 145 -92 261 203 137 125 225 -335 -176 324 237 450 -482 -281 196 -292 107 -636 -194 -195 51 373 -149
6367 -149 -408 650 501 -373 -336 -110 -583 -20 104 474 132 208 -246 27 82 -100 111 -277 650 100 -216
6388 -216 5 415 105 -219 335 92 51 487 -198 93 -102 -146 78 -96 251 457 -289 54 480 -82 -421
6409 -421 22 451 -191 179 -111 69 -6 668 351 -26 -249 357 -416 -25 21 46 -431 271 90 -42 -619
6430 -619 -317 -25 -660 181 -113 -220 416 522 -151 -214 -696 -35 -139 166 -315 -251 248 -159 -601 -3 145
6451 145 -417 -23 -6 -481 -40 -273 251 98 -213 555 -325 508 153 1 -150 -231 -438 126 20 -53 88
6472 88 195 -188 314 -191 638 -271 -78 601 38 149 18 286 -15 282 -83 128 812 53 -191 13
6492 13 -76 -260 158 -61 -79 13 101 -63 492 343 24 -112 -72 378 -838 267 368 60 682 549 -457
6513 -457 -342 274 375 -65 -8 -436 -41 -603 340 -38 -77 -99 32 -297 -487 -18 93 258 72 -321 118
6534 118 22 123 -462 -265 104 -555 -72 75 -187 294 -32 103 235 -201 656 -161 11 541 342 -306
6554 -306 97 402 -241 -57 -49 212 -267 45 639 -509 250 -376 -15 116 -656 -172 104 393 -607 -488
6574 -488 -429 546 17 89 -475 -5 98 -169 436 15 20 42 -28 -27 -569 -88 142 -108 -375 -403 115 425 407
6597 407 25 354 -452 -1155 -673 -16 -164 115 -132 114 -163 -470 212 -451 500 264 -39 -158 -127 398
6617 398 -266 334 -378 -26 398 -196 -60 -211 -7 38 -501 -479 241 -123 226 14 -357 18 -347 -285 -3
6638 -3 71 520 5 -110 572 -131 -191 156 321 -228 438 -126 45 -148 602 203 -147 -74 -338 342 -611 763
6660 763 318 -128 107 -299 -148 -76 -193 -323 -696 -346 -201 -279 -262 -198 234 179 278 133 -478 132 330 93
6682 93 -178 -57 118 -116 142 -166 18 -122 -588 284 -264 148 95 -350 -378 27 -310 416 200 563 11
6703 11 -128 -82 400 750 -465 -92 -161 190 65 -59 -362 -493 -58 -402 -420 -197 -266 -259 44 279 210 454
6725 454 30 236 -436 252 -542 70 12 -80 -554 192 -163 62 573 -523 -181 -774 393 -155 -372 -287
6745 -287 -192 -106 556 -236 268 -59 -89 286 -112 -516 394 103 205 186 -122 -82 -71 272 11 74 -336 68
6767 68 -147 -2 38 -665 -185 99 -36 124 -57 445 -294 4 142 -250 -369 -54 -160 -455 -47 -305 -163
6788 -163 -37 119 -221 110 -209 -71 271 311 -157 -377 -233 211 -228 -624 242 362 -130 74 -100 149
6808 149 -110 -4 433 486 -271 179 -7 -390 193 221 -275 -213 -195 -201 212 -478 -116 256 -201 268 -234 -46
6830 -46 -1 -410 -249 72 -3 167 -121 418 -30 -388 -365 -281 910 -73 -276 -748 -39 -355 -430 -282 -160 -188
6852 -188 -133 -433 297 52 -156 -127 100 -192 353 -392 61 -47 472 417 326 53 -12 -398 -272 145 131 -241
6874 -241 -312 73 -202 -57 -137 20 639 327 -274 -450 -66 -349 189 337 44 296 148 692 -400 -162
6894 -162 291 -188 191 29 -140 154 -11 -520 -131 86 -233 -67 -505 369 -196 711 -136 91 325 -359
6914 -359 285 -475 -216 -616 -108 -472 440 -210 204 377 78 -438 -116 34 56 245 234 234 32 77 163 416
6936 416 46 183 141 -396 -275 51 435 360 -395 -102 237 -9 -401 189 -38 -326 183 -272 416 -74 54
6957 54 33 188 -484 -119 329 -114 -173 159 -589 783 74 42 102 503 104 156 -442 -528 -527 -134 -132 -371 -24
6980 -24 -85 -271 204 -121 122 -226 347 241 -1049 -72 -47 -396 -265 614 -335 -82 66 119 -362 -461 24
7001 24 381 436 135 51 298 157 -123 200 221 110 -293 132 507 -3 -82 -220 247 -402 336 152 -111 237
7023 237 -30 -120 -301 -314 -494 -346 -41 144 -273 51 -33 -394 -64 97 170 -384 166 -147 57 186 43
7044 43 244 -421 181 279 -318 -80 17 262 -262 -462 188 -372 117 -100 -234 250 -324 286 307 501 200
7065 200 584 169 -202 209 114 -88 -413 -686 379 344 324 -852 92 576 -29 -117 -89 123 403 437 -78
7086 -78 402 -350 -69 431 613 48 -125 141 -6 -434 623 -18 -261 -310 178 -404 596 651 -534 133
7106 133 566 -58 69 -594 -31 161 -18 273 -263 -341 607 240 -133 294 -112 46 -591 -271 173 6
7126 6 -195 -572 -58 87 154 153 153 417 -342 437 -293 -325 -175 238 214 -226 150 35 -339 -381 108 564 626 -257
7150 -257 -222 -397 395 -657 96 -606 -156 -169 163 162 -306 37 128 -345 -291 -44 -190 -39 -61 -205 10 54
7172 54 215 150 -165 38 -322 -192 -498 -77 159 77 -218 346 -498 -262 -278 582 -486 -250 150 -343 184
7193 184 100 -470 -156 204 -529 -194 -319 -165 -44 151 -277 -217 -239 -138 274 372 206 -133 -96 330 354 -538
7215 -538 -70 -679 -159 -373 335 27 213 -260 -180 -208 -224 68 -147 -339 96 439 151 -464 -355 97 -196
7236 -196 -118 -469 -187 458 84 -10 -777 70 100 -183 -430 220 -546 -1 8 -2 222 -56 -100 -219 749 53
7258 53 643 34 229 -235 41 214 117 -251 141 -132 144 -363 -23 -379 163 37 419 146 -80 188 -1037
7279 -1037 -368 -150 -277 687 -342 -381 358 222 -600 -9 -184 80 2 91 -179 223 186 109 -297 264 341
7300 341 -454 -291 -338 -19 456 7 -277 129 -95 -324 129 570 564 -62 516 -71 81 -486 198 462 401
7321 401 -126 -7 491 -276 -122 105 -66 55 264 -197 522 87 -135 53 -445 -377 1102 -615 -250 654
7341 654 -865 -47 85 432 144 201 219 502 475 -496 -182 188 184 641 -73 -154 97 387 354 571 -807 106
7363 106 -76 230 -133 638 -228 -562 159 -334 224 194 161 -379 -861 -108 -241 -140 312 74 -256 409 -517
7384 -517 507 -252 162 -280 -511 -212 -275 85 329 140 -235 22 292 -130 -366 392 147 403 517 -275
7404 -275 185 -393 -804 138 -602 391 -106 146 -46 -132 36 964 -241 31 -301 -411 253 361 -570 -693
7424 -693 -580 218 -66 401 -385 122 151 146 445 -287 402 -515 -249 -591 546 241 99 242 -123 216 -498
7445 -498 523 606 320 -63 -127 487 334 -511 -517 165 116 634 268 201 309 59 -238 -61 -203 130 28 -182
7467 -182 -224 62 -342 171 189 128 -232 -16 507 61 89 649 -119 -691 42 650 97 -371 -231 -381 -648
7488 -648 -529 -63 168 899 -140 395 -586 584 -213 439 -37 -496 535 -481 227 62 97 -357 43
7507 43 316 499 319 -64 -176 -178 447 -14 298 85 -116 -698 -238 -240 203 384 -79 -341 -295 -177 78 280
7529 280 -144 22 -433 172 -595 4 -388 -487 14 222 23 -41 -341 512 -66 151 -208 -481 -200 1 657
7550 657 -534 -54 315 -194 -205 -702 73 -62 -184 285 595 -190 -494 -116 -513 -333 -129 455 -318 -70
7570 -70 -445 -310 -54 494 -150 -504 18 160 -519 -361 319 -45 -124 160 70 -169 11 -130 -410 224 -64
7591 -64 91 -116 64 -182 386 -403 -185 7 -384 292 -375 -315 322 -424 584 -44 -315 122 364 338 107
7612 107 -289 43 724 -254 65 172 270 -237 -663 -424 225 -295 107 -396 43 -80 -6 -213 -517 -396 351
7633 351 243 -522 29 49 -376 107 30 132 55 1122 533 220 660 -6 351 190 -785 -263 48 -641 175
7654 175 -485 -91 -177 364 -291 -205 -410 301 -217 211 -212 26 -141 16 29 271 -232 -120 348 -296 149
7675 149 -434 -69 -448 456 409 -213 -137 36 56 4 428 229 -371 -326 -141 284 -401 59 -260 -494 524
7696 524 516 -421 283 195 -106 263 -220 -94 31 40 341 286 -78 114 -200 274 -432 9 169 64 -62 -205
7718 -205 345 397 388 -413 463 -670 -152 269 258 -296 286 365 54 178 95 359 199 15 -401 121 -90 -306
7740 -306 -809 -21 55 561 -180 -267 293 -537 -79 -79 -74 -138 -188 273 142 377 185 -294 311 -48 31 -83 208
7763 208 -481 -469 264 -10 -271 -446 -160 329 75 580 273 -56 100 -311 -104 -381 166 186 -13 -133 -51
7784 -51 -701 482 -551 -199 -732 8 -77 171 -203 57 59 -95 679 -71 805 -498 464 -8 -198 326
7804 326 -110 -294 -503 -83 -282 406 218 -346 -48 35 90 512 -292 -434 -375 629 715 213 292 -108 132
7825 132 -99 611 262 101 -123 105 -118 254 79 9 -274 140 615 125 168 568 204 131 247 -124 142
7846 142 72 62 129 407 -183 444 155 -344 670 378 -321 567 -142 -423 143 92 59 -204 250 -124 19
7867 19 0 -124 -520 107 -163 -87 -439 29 -84 146 94 1 105 -39 40 -318 148 22 -1 165 -187 208
7889 208 279 -240 176 -259 -164 328 253 415 -134 476 156 99 276 202 463 -391 140 -371 -119 -169 -328 -351
7911 -351 -705 -208 -67 -358 -454 203 -13 221 -50 297 -508 47 -161 151 -10 427 1061 -104 105 689
7931 689 53 4 -121 -48 309 -484 3 441 464 -153 560 72 518 -340 -188 278 -229 82 312 359 372 513
7953 513 556 17 -447 -28 -88 230 -257 148 192 62 -267 -613 -448 141 -103 -320 -29 -100 -704 -40 66
7974 66 -144 130 -424 29 10 -45 16 -328 145 169 353 -46 -207 -27 324 -236 -408 805 -97 -116 602 -472
7996 -472 -304 41 408 -388 -366 256 424 498 227 -170 -138 914 402 353 261 -316 -205 -1 -519 -917 -258
8017 -258 350 -35 281 708 -152 89 368 -587 -28 -241 -166 -18 102 -2 311 551 -595 8 -759 158
8037 158 114 182 -143 -148 -459 -428 540 112 -559 -664 425 72 -51 -13 -74 -255 -498 -109 320 231 -109 -84 -33
8060 -33 -141 -246 304 118 98 178 -54 160 280 -99 190 -455 -271 412 -517 523 -304 94 119 -119 -287
8081 -287 -52 -262 227 299 -81 685 154 -870 403 -128 -80 -274 31 -761 125 -451 -188 -116 -149 266 -222
8102 -222 284 -120 -304 -518 144 197 -122 -287 -402 -702 349 -303 -453 -599 394 -595 325 251 -312 509
8122 509 291 654 509 19 185 148 467 71 141 309 174 -123 -466 -154 -384 546 -171 -554 65 358 -666
8143 -666 -38 203 296 -530 -120 313 -309 -687 28 -145 377 89 170 -144 -192 -194 -35 331 -281 -387 484 409
8165 409 364 27 -231 205 183 -17 158 -374 -111 -607 -139 360 -31 298 -357 122 -109 346 387 257 304
8186 304 -451 -55 96 -372 125
8191A25
##END NTUPLES=NMR FID
##END=
