##TITLE=1H_DE-28oil
 DMSO-d6
 64 sc, 
 11.1.2024
##JCAMPDX= 6.0         $$ Bruker NMR JCAMP-DX V2.0
##DATA TYPE= NMR FID
##DATA CLASS= NTUPLES
##ORIGIN= UXNMR, Bruker Analytische Messtechnik GmbH
##OWNER= root
$$ XWIN-NMR		Version 3.5
$$ Thu Jan 11 14:59:07 2024 Russian Standard Time (UT+4h)  she@DPX200
##.OBSERVE FREQUENCY= 200.1313
##.OBSERVE NUCLEUS= ^1H
##.DELAY= (6, 6)
##.ACQUISITION MODE= SIMULTANEOUS
##.ACQUISITION SCHEME= undefined
##.AVERAGES= 64
##.DIGITISER RES= 18
##SPECTROMETER/DATA SYSTEM= spect
##.PULSE SEQUENCE= zg30
##.SOLVENT NAME= CDCl3
##.SHIFT REFERENCE= (INTERNAL, CDCl3, 0, 15.7039)
##AUDIT TRAIL= $$ (NUMBER, WHEN, WHO, WHERE, WHAT)
$$ ##TITLE= Audit trail, XWIN-NMR		Version 3.5
$$ ##JCAMPDX= 5.01
$$ ##ORIGIN= Bruker BioSpin GmbH
$$ ##OWNER= she
$$ F:/spectra/data/she/nmr/H-F/1/audita.txt
$$ ##AUDIT TRAIL=  $$ (NUMBER, WHEN, WHO, WHERE, WHAT)
(   1,<2024-01-11 14:58:05.39 +0400>,<she>,<DPX200>,
      <continue with go, POWCHK disabled, PULCHK disabled
       configuration hash MD5:
       00 E9 B6 7A A2 85 ED C7 34 08 36 98 17 FE 4E 26
       data hash MD5: 16K
       34 0E D7 D0 47 15 C6 49 F1 CE 12 D6 41 60 72 69>)
$$ ##END=
$$ 
$$ hash MD5
$$ 57 5F 34 43 6F 1B 28 53 D3 41 D7 99 81 5E 74 24
##$RELAX= 
##$RELAX= 
##$RELAX= 
##$RELAX= 
##$RELAX= 
##$RELAX= 
$$ Bruker specific parameters
$$ --------------------------
##$DU= <F:/spectra>
##$EXPNO= 1
##$NAME= <H-F>
##$PROCNO= 1
##$TYPE= <nmr>
##$USER= <she>
##$AMP= (0..31)
100 100 100 100 100 100 100 100 100 100 100 100 100 100 100 100 100 100 
100 100 100 100 100 100 100 100 100 100 100 100 100 100 
##$AQSEQ= 0
##$AQ_mod= 1
##$AUNM= <au_zg>
##$AUTOPOS= <>
##$BF1= 200.13
##$BF2= 200.13
##$BF3= 200.13
##$BF4= 200.13
##$BF5= 200.13
##$BF6= 200.13
##$BF7= 200.13
##$BF8= 200.13
##$BYTORDA= 1
##$CFDGTYP= 0
##$CFRGTYP= 5
##$CHEMSTR= <none>
##$CNST= (0..31)
1 1 145 1 1 1 1 1 1 1 1 1 1 1 1 1 1 1 1 1 1 1 1 1 1 1 1 1 1 1 1 1 
##$CPDPRG= <>
##$CPDPRG1= <>
##$CPDPRG2= <>
##$CPDPRG3= <>
##$CPDPRG4= <mlev>
##$CPDPRG5= <mlev>
##$CPDPRG6= <mlev>
##$CPDPRG7= <mlev>
##$CPDPRG8= <mlev>
##$CPDPRGB= <>
##$CPDPRGT= <>
##$D= (0..31)
0 1.2 0 0 0 0 0 0 0 0.06 0 0.03 0 0 0 0 0.0002 0 0 0 0 0 0 0 0 0 0 0 0 
0 0 0 
##$DATE= 1704970450
##$DBL= (0..7)
120 120 120 120 120 120 120 120 
##$DBP= (0..7)
150 150 150 150 150 150 150 150 
##$DBP07= 0
##$DBPNAM0= <>
##$DBPNAM1= <>
##$DBPNAM2= <>
##$DBPNAM3= <>
##$DBPNAM4= <>
##$DBPNAM5= <>
##$DBPNAM6= <>
##$DBPNAM7= <>
##$DBPOAL= (0..7)
0.5 0.5 0.5 0.5 0.5 0.5 0.5 0.5 
##$DBPOFFS= (0..7)
0 0 0 0 0 0 0 0 
##$DE= 6
##$DECBNUC= <off>
##$DECIM= 32
##$DECNUC= <off>
##$DECSTAT= 4
##$DIGMOD= 1
##$DIGTYP= 9
##$DL= (0..7)
0 120 120 120 120 120 120 120 
##$DP= (0..7)
150 150 150 150 150 150 150 150 
##$DP07= 0
##$DPNAME0= <>
##$DPNAME1= <>
##$DPNAME2= <>
##$DPNAME3= <>
##$DPNAME4= <>
##$DPNAME5= <>
##$DPNAME6= <>
##$DPNAME7= <>
##$DPOAL= (0..7)
0.5 0.5 0.5 0.5 0.5 0.5 0.5 0.5 
##$DPOFFS= (0..7)
0 0 0 0 0 0 0 0 
##$DQDMODE= 0
##$DR= 18
##$DS= 0
##$DSLIST= <SSSSSSSSSSSSSSS>
$$ [...]
##$SUBNAM2= <"">
##$SUBNAM3= <"">
##$SUBNAM4= <"">
##$SUBNAM5= <"">
##$SUBNAM6= <"">
##$SUBNAM7= <"">
##$SUBNAM8= <"">
##$SUBNAM9= <"">
##$SW= 18.0517328524113
##$SWIBOX= (0..15)
0 0 2 0 0 0 0 0 0 0 0 0 0 0 0 0 
##$SW_h= 3612.71676300578
##$TD= 16384
##$TD0= 1
##$TE= 0
##$TE2= 300
##$TE3= 300
##$TEG= 300
##$TL= (0..7)
0 120 120 120 120 120 120 120 
##$TP= (0..7)
150 150 150 150 150 150 150 150 
##$TP07= 0
##$TPNAME0= <>
##$TPNAME1= <>
##$TPNAME2= <>
##$TPNAME3= <>
##$TPNAME4= <>
##$TPNAME5= <>
##$TPNAME6= <>
##$TPNAME7= <>
##$TPOAL= (0..7)
0.5 0.5 0.5 0.5 0.5 0.5 0.5 0.5 
##$TPOFFS= (0..7)
0 0 0 0 0 0 0 0 
##$TUNHIN= 0
##$TUNHOUT= 0
##$TUNXOUT= 0
##$USERA1= <user>
##$USERA2= <user>
##$USERA3= <user>
##$USERA4= <user>
##$USERA5= <user>
##$V9= 5
##$VALIST= <valist>
##$VCLIST= <CCCCCCCCCCCCCCC>
##$VD= 0
##$VDLIST= <DDDDDDDDDDDDDDD>
##$VPLIST= <PPPPPPPPPPPPPPP>
##$VTLIST= <TTTTTTTTTTTTTTT>
##$WBST= 1024
##$WBSW= 4
##$XGAIN= (0..3)
0 0 0 0 
##$XL= 0
##$YL= 0
##$YMAX_a= 336629
##$YMIN_a= -463770
##$ZGOPTNS= <>
##$ZL1= 120
##$ZL2= 120
##$ZL3= 120
##$ZL4= 120
##$ABSF1= 10
##$ABSF2= 0
##$ABSG= 5
##$ABSL= 3
##$ALPHA= 0
##$AQORDER= 0
##$ASSFAC= 0
##$ASSFACI= 0
##$ASSFACX= 0
##$ASSWID= 0
##$AUNMP= <proc_1d>
##$AZFE= 0.1
##$AZFW= 0.1
##$BCFW= 1
##$BC_mod= 2
##$BYTORDP= 1
##$COROFFS= 0
##$CY= 11.3945322036743
##$DATMOD= 1
##$DC= 2
##$DFILT= <>
##$DTYPP= 0
##$F1P= 15.7292609196834
##$F2P= 12.9074282941183
##$FCOR= 0.5
##$FTSIZE= 0
##$FT_mod= 4
##$GAMMA= 1
##$GB= 0.15
##$INTBC= 1
##$INTSCL= 1
##$ISEN= 128
##$LB= 0.24
##$LEV0= 0
##$LPBIN= 0
##$MAXI= 10000
##$MC2= 0
##$MEAN= 0
##$ME_mod= 0
##$MI= 1.114404
##$NCOEF= 0
##$NC_proc= 0
##$NLEV= 6
##$NOISF1= 3.799351
##$NOISF2= 2.8
##$NSP= 1
##$NTH_PI= 0
##$NZP= 0
##$OFFSET= 15.70392
##$PC= 1
##$PHC0= -24597.28
##$PHC1= 18.4527
##$PH_mod= 1
##$PKNL= yes
##$PPARMOD= 0
##$PSCAL= 0
##$PSIGN= 0
##$REVERSE= no
##$SF= 200.130013532006
##$SI= 16384
##$SIGF1= 3
##$SIGF2= 2
##$SINO= 400
##$SIOLD= 16384
##$SREGLST= <1H.CDCl3>
##$SSB= 0
##$STSI= 0
##$STSR= 0
##$SW_p= 3612.71676300578
##$SYMM= 0
##$S_DEV= 0
##$TDeff= 0
##$TDoff= 0
##$TI= <>
##$TILT= no
##$TM1= 0
##$TM2= 0
##$TOPLEV= 0
##$USERP1= <user>
##$USERP2= <user>
##$USERP3= <user>
##$USERP4= <user>
##$USERP5= <user>
##$WDW= 1
##$XDIM= 8192
##$YMAX_p= 0
##$YMIN_p= 0
$$ End of Bruker specific parameters
$$ ---------------------------------
##NTUPLES= NMR FID
##VAR_NAME=  TIME,          FID/REAL,        FID/IMAG
##SYMBOL=    X,             R,               I
##VAR_TYPE=  INDEPENDENT,   DEPENDENT,       DEPENDENT
##VAR_FORM=  AFFN,          ASDF,            ASDF
##VAR_DIM=   8192,          8192,            8192
##UNITS=     SECONDS,       ARBITRARY UNITS, ARBITRARY UNITS
##FACTOR=    0.0002768,     1,               1
##FIRST=     0,             0,               0
##LAST=      2.2672688,     0,               0
##MIN=       0,             -463770,         0
##MAX=       2.2672688,     336629,          0
$$ Real data points
##PAGE= N=1
##DATA TABLE= (X++(R..R)), XYDATA
0 0 0 0 0 0 0 0 0 0 0 0 0 0 0 0 0 0 0 0 0 0 0 0 27 -63 64 -64 64 -64 64 -75 115 -128 128 -141 173 -193 206
37 206 -240 265 -293 330 -363 406 -446 491 -543 601 -661 729 -804 880 -977 1077 -1183 1311
55 1311 -1454 1617 -1809 2033 -2293 2619 -3019 3530 -4220 5194 -6656 9114 -14050 27679
69 27679 -139785 -463770 -59190 336629 262402 36076 92356 275792 327906 134458 -71907
80 -71907 -10293 195282 96375 -231402 -307612 -84781 5237 -133046 -229925 -125860 46309
91 46309 74707 -87091 -176806 15513 241962 141652 -82490 622 266129 254821 4769
102 4769 -79891 72926 164738 23942 -195108 -215675 -28059 52200 -116596 -215778 -31217
113 -31217 131811 15431 -133783 -60341 105877 142396 29867 -72173 5514 173627 146507
124 146507 -56686 -84357 102169 145053 -57927 -187969 -80837 60941 32549 -110834
134 -110834 -151105 -991 131344 33336 -126982 -57421 133135 121349 -55169 -92233 53232
145 53232 139189 50603 -68334 -44796 80626 100433 -56958 -162521 -47141 79695 -146
156 -146 -132028 -82580 66123 93650 -8636 -74352 2065 118932 88331 -65772 -93584
167 -93584 60836 130359 2435 -95543 -10116 95617 47599 -83837 -115097 -8223 65573
178 65573 -22537 -134742 -69738 81341 79023 -47132 -66904 53230 117013 32536 -62186
189 -62186 -28541 78442 92465 -17413 -78748 12306 101397 26567 -100302 -80768 30274
200 30274 38945 -69265 -119921 -34429 64537 37740 -60020 -52716 67525 113338 7743 -71784
212 -71784 3294 99486 58873 -45775 -49991 46552 88602 3473 -86057 -44167 50346 25847
224 25847 -89167 -108159 1519 62926 -8709 -77924 -23771 75042 72757 -20451 -55937 26452
236 26452 94677 33779 -58252 -28891 71198 74136 -27903 -73093 -3638 53896 98 -85471
248 -85471 -75821 15744 46559 -28508 -77295 -4864 80828 45712 -42413 -36607 49968 73508
260 73508 -442 -55304 -4927 72188 51377 -38110 -54848 22594 57442 -19164 -88794 -43823
272 -43823 33759 22048 -50590 -59943 18061 70642 20460 -47244 -20116 58908 56544 -24604
284 -24604 -51521 18676 68831 21263 -44807 -28348 36696 41106 -31814 -73173 -21536 38464
296 38464 6705 -60980 -44208 35654 55595 -5962 -40871 4937 59060 33437 -32195 -36001
308 -36001 29023 57363 -1882 -52584 -11882 48489 26152 -44353 -53005 5984 34831 -12069
320 -12069 -57177 -24403 42257 40884 -21845 -39077 21723 58094 11715 -40816 -17387 39507
332 39507 38562 -15541 -38262 6818 45335 10594 -49215 -39476 18143 26429 -26380 -49255 -1304
345 -1304 44142 22197 -25851 -22426 28216 44808 -4968 -43672 -8018 41866 23036 -30384
357 -30384 -27254 25491 41474 -3674 -39067 -16534 24469 14751 -33261 -40772 7794 35827 111
370 111 -33354 -6593 37729 29913 -16015 -30691 6562 35454 7275 -32239 -17588 30881 32906
383 32906 -14824 -33689 3840 30874 868 -38236 -27355 15092 25563 -9714 -29434 1596
395 1596 35259 16959 -23756 -19932 19338 28885 -5769 -27084 -405 32199 22368 -16983 -25408
408 -25408 8278 23475 -10759 -38167 -15053 19065 11371 -21962 -21609 13259 31278 8096 -18182
421 -18182 -6586 23327 21708 -10864 -19801 9423 28168 6379 -21554 -11968 16269 14659 -17298
434 -17298 -33865 -10451 14823 2157 -24816 -15790 18679 25554 -605 -13623 6176 25368
446 25368 12463 -12891 -13259 14173 25258 1609 -19523 -4799 18090 5019 -24433 -28824 -5632
459 -5632 5929 -9814 -21669 -6042 22396 21264 -4881 -11035 13868 26186 6469 -13692 -4869
472 -4869 14098 12941 -5455 -11662 3088 14747 -1137 -24027 -20969 1175 6100 -12764 -20515
485 -20515 -1168 17123 10344 -5197 -426 18016 21337 890 -12596 -69 15959 7211 -11672
498 -11672 -9706 8451 12848 -3395 -17204 -12177 2268 -254 -15529 -15168 4876 14410 1648
511 1648 -6730 5059 19362 13741 -3009 -9536 143 9370 1929 -8731 -3037 10605 8286 -7727
525 -7727 -12921 -2398 4360 -3370 -12994 -11614 1720 8247 -1356 -6308 4467 16743 8284 -5031
539 -5031 -3001 7521 8063 -2155 -7249 -1016 8628 5371 -6147 -9410 969 5035 -5596 -13013
553 -13013 -7643 356 565 -3482 -2312 6523 13695 8008 -3163 -2269 8219 6612 -4027 -4309 3919
568 3919 5412 -215 -3199 -3128 -100 1203 -6756 -13413 -8535 855 -2351 -4630 1133 8890 8489 4656
584 4656 2289 3898 7830 5733 -3276 -5396 2436 4433 -3913 -6885 231 2054 -2930 -7498 -8123
599 -8123 -6630 -1778 -1805 -6698 -1461 8591 9266 2843 4088 9915 8848 3939 -352 -2667 -936 -191
615 -191 -4151 -7488 -2077 2443 -4808 -8995 -5521 -3016 -4641 -3952 -420 1280 3949 8850 6716 4717
631 4717 7940 9638 3129 -2379 -2209 -1392 -3235 -3796 -3976 -4292 -2662 -3893 -7255 -5931 286 711 -5054
648 -5054 -2128 5494 5514 3113 5729 7567 5679 6237 4061 -821 -1167 487 -4347 -8213 -5034 -3602
664 -3602 -5716 -4128 -2315 -3256 -2012 1371 18 -1053 3032 4703 3416 3321 8672 7614 3229 1789
680 1789 374 -2579 -2825 -2078 -5714 -7664 -3839 -3179 -5571 -2925 -81 -1169 -1347 367 2151 2755
696 2755 4741 5574 3110 4126 5871 3419 619 2042 2077 -3915 -5059 -3080 -4852 -5891 -4723 -3912
712 -3912 -3992 -475 1621 52 1889 3640 2770 2146 4921 5074 2284 2963 3868 1028 -751 727 -1537
729 -1537 -4585 -5918 -5198 -5412 -5382 -1962 -450 -519 749 948 1859 2848 3306 4114 1905 3123 3596 1741
747 1741 1428 2123 91 -1985 -1814 -2418 -2939 -2568 -2663 -3230 -2775 -1444 -963 -475 2828 3561 2172 1851 2879
766 2879 2935 2114 1776 687 -1478 -1034 29 -746 -1153 -1297 -2624 -3975 -2621 -1056 -1624 -467 167 746
784 746 2119 1945 2917 1923 1811 2161 530 532 716 795 -371 -1141 -1047 -1346 -879 -133 -1143 -2056 -772 -914
804 -914 -889 -460 1155 175 -163 1296 2326 1695 2682 2594 900 200 91 -200 -1195 -258 -1029 -1635 -437
823 -437 99 -252 -1412 -1223 -1010 -1517 -759 -400 954 854 1891 1632 1449 1941 2738 1389 122 423 1199
842 1199 -441 -503 -778 -1963 -1773 -3106 -3361 -1583 379 -8 -687 -439 1129 1803 429 2010 2438 2252
860 2252 1900 1998 692 255 1361 -534 -2999 -1703 -217 -698 -2337 -1961 -584 -762 -1647 -1824 -1169 446
878 446 2065 344 351 2916 3973 3057 1213 1004 1044 -491 -1504 -1693 -1594 -492 -149 -2852 -3384 289
896 289 1211 -2097 -1429 888 1683 -962 -258 767 2331 1923 1926 163 1492 2886 -363 -2047 -771
913 -771 -759 -1416 -1880 -1390 -1862 -207 1125 638 -756 691 3728 677 -2819 6 2342 972 -1016
930 -1016 0 619 918 99 -3005 -2458 524 -514 -2554 -1352 1810 1629 -1649 134 982 456 1256
947 1256 581 -396 -705 2626 1853 -1421 -956 1990 633 -1947 -1504 -738 24 187 -267 -752 -226 2690
965 2690 -32 -1628 1301 3949 799 -628 141 364 -991 216 -1023 -1542 402 2604 -875 -2343
981 -2343 1086 2525 -1870 -3348 -539 -1015 979 -17 -236 -163 1867 1196 -1464 -73 2514 1520 -1703
998 -1703 -273 1241 230 -643 379 -1297 -479 1614 -653 -3470 -826 2001 36 -2593 -1186 564
1014 564 -398 440 718 38 1925 3441 91 -1187 868 1841 -1447 -2335 1142 643 -1249 -1072 -2027
1031 -2027 -2204 1590 970 -2620 -2434 2087 1480 -2068 -821 3391 1923 439 713 -789 486 2724
1047 2724 1798 -1008 -717 1689 -1374 -3728 -1368 1067 457 -678 -571 -1508 24 1622 65 -1766
1063 -1766 1725 4084 271 -979 1440 1560 -338 -1042 -938 -1241 -244 -401 -3155 -2033 1816 1768 -2417
1080 -2417 -1811 595 772 -377 -271 1661 1863 2180 560 -1530 900 2515 -12 -2840 -1458 862
1096 862 -1362 -1706 146 -94 -652 670 -884 -1656 1065 2619 -20 -1225 -85 1326 -268 -32
1112 -32 514 174 395 556 -1487 -1954 839 -130 -3805 -2329 1381 2213 160 293 876 1049 1297 541
1130 541 -1462 206 1836 242 -2176 -537 2713 937 -1673 -1494 -1458 -93 -610 -242 -1659 -399
1146 -399 1130 -442 -585 846 2607 970 -197 432 1158 610 1220 -603 -1333 983 396 -1854 -1604
1163 -1604 135 311 -1557 -1559 -942 348 588 -23 -560 1022 2531 1544 520 43 821 401 -1478 -588
1181 -588 481 398 -288 -1137 -1411 652 16 -1026 -2146 -923 376 71 42 1566 2107 1527 -250 -986
1199 -986 432 1848 368 -606 -1238 -916 739 49 -818 436 35 -1147 -1045 -596 759 878 215 -603
1217 -603 -311 769 805 883 499 969 1333 -150 -812 -538 399 -766 -1418 -322 523 992 1197 -416 -220
1236 -220 -172 -203 -1180 -487 725 160 280 60 1234 1638 1339 250 -607 -1184 595 -222 -32 621 329
1255 329 -122 -34 75 -434 -100 -188 -1427 -1051 148 652 -77 76 242 1059 338 645 772 651 700 -21
1275 -21 -242 -688 386 270 -836 -853 551 -158 -856 -440 -1283 -844 -240 231 336 287 1338 1130 577 535
1295 535 47 -431 -252 -277 -750 -884 -445 -3 -457 122 125 -681 -1238 159 174 36 687 1337 1012 1104 1603
1316 1603 492 505 -62 -41 -234 -229 -163 -562 -756 -740 -151 -921 -740 -281 -723 -351 180 393 280 -1 673
1337 673 599 1774 2006 1736 619 -428 -708 -662 -1000 -1242 -1518 -1331 -813 -18 524 -408 556 -347 -352 292
1357 292 1266 440 426 1391 794 436 538 345 411 -187 -604 -638 -1605 -356 -976 -673 -536 -1113 -256 58 -39
1378 -39 431 207 776 1427 698 737 231 403 -393 -251 614 358 -927 -707 -994 -1152 6 -452 -732 -1349
1398 -1349 -205 -505 -1244 353 656 104 -255 464 823 1235 1111 816 654 675 115 -1089 59 -350 -1691
1417 -1691 -626 158 73 -819 -332 361 -607 -828 909 304 1527 390 736 666 406 768 -10 -414 -576
1436 -576 35 -547 -594 -438 -1417 -464 -1161 -545 -880 -413 473 -53 -181 834 1089 594 522 1074 1009 430 708
1457 708 316 -854 479 293 -860 -1265 -583 -642 -1097 -1354 -206 -414 -303 47 -1200 1276 1946 1048
1475 1048 628 731 2022 867 -86 114 -143 -697 295 -460 -1182 -527 -308 -737 -1806 -689 -661 -343 -318
1494 -318 -503 822 1035 1259 47 930 3022 1525 -1120 -877 953 435 -1273 -1487 -988 -818 -1698 -2134
1512 -2134 -2278 -622 954 -213 -1473 1009 2625 1253 981 508 1497 1588 1524 149 -258 1288 1245 -1669
1530 -1669 -2958 -770 381 -1389 -1817 -1799 -419 90 -890 -374 -244 1981 1784 0 351 3158 2668
1547 2668 -303 -597 228 108 86 -1378 -2507 -361 859 -709 -3076 -795 1623 721 -1751 -703
1563 -703 1784 1534 2003 248 140 2484 3221 -432 -1493 1116 1230 -2115 -2933 -1400 -5 -1033 -1057
1580 -1057 -1566 -985 2057 1530 -1021 -407 2063 2134 -310 -766 2161 2571 1784 -296 -1055 86 977 -1422
1598 -1422 -3237 -2812 1702 2 -3074 -1509 1350 2121 252 -159 -232 1880 2824 -521 -2093 1188
1614 1188 3328 -115 -2222 -375 1141 -35 -1491 -2868 -167 1492 -33 -3090 -2414 2691 2118
1629 2118 -695 -1754 1415 2031 1018 -708 -883 647 2736 -263 -2793 -500 3387 616 -3610
1644 -3610 -2364 1068 648 -1639 -2912 -1047 1646 2351 -1268 -2712 2591 3762 359 -2754 401
1659 401 2917 1590 -991 -1576 529 3254 324 -3439 -2200 1814 1358 -3564 -2846 582 2572 -142
1675 -142 -1774 -1177 2200 2931 -710 -3045 657 3646 1881 -3103 -1994 2598 1972 -936 -2199 -748
1691 -748 2132 1206 -3223 -3600 1337 2192 -1180 -4054 63 4021 2025 -2214 -2403 2021 3567 267
1707 267 -3574 -1134 3271 2313 -2935 -3498 2178 3529 -193 -4049 -2306 1955 1815 -841 -3372 897
1723 897 4331 1681 -3207 -1578 3216 3041 -850 -2803 -296 3605 1958 -3160 -3568 2042 3283 -1693
1739 -1693 -4367 -1152 3218 972 -3860 -3150 2892 3802 343 -2317 -593 3960 3192 -2463 -3767 1582
1755 1582 3210 -820 -4251 -1357 3054 2596 -3715 -4095 832 3396 89 -4498 -1901 3705 3694 -693
1771 -693 -2652 833 5395 1155 -2753 -2510 3099 3764 -2121 -5050 -669 3822 982 -3974 -3045 2337
1787 2337 3511 -1075 -4178 -719 4233 2281 -3432 -3417 2178 4672 1029 -4300 -1227 4320 2598
1802 2598 -3034 -3461 1399 3766 -578 -4913 -2261 2928 3210 -2824 -4465 483 4229 81 -3638
1817 -3638 -1456 3715 3843 -1835 -4098 454 5094 1113 -4350 -2074 3427 3787 -1441 -4343 -353
1832 -353 3865 1945 -3702 -3932 2318 4546 -1359 -5150 -845 4173 2535 -3056 -3262 2404 5005 194
1848 194 -5077 -1374 4384 3140 -3438 -4548 2001 4719 -24 -4655 -1887 3970 3366 -2823 -4698
1863 -4698 648 5560 1237 -4344 -1754 4236 3752 -1888 -4143 1108 4952 920 -4396 -2805 2349
1878 2349 3988 -1796 -4757 -786 4645 1427 -4044 -3757 2316 4671 -512 -4690 -1432 4664 2954
1893 2954 -3092 -3669 2632 5250 -807 -5004 -1657 3642 2886 -3932 -4934 933 4964 373 -5124
1908 -5124 -2612 4050 2928 -2290 -4657 1142 5109 1489 -4627 -1632 4061 4513 -2202 -4073 -206
1923 -206 4610 1234 -4476 -3398 1791 3264 -1314 -4562 -644 4738 2591 -3463 -3520 3062 4601 -570
1939 -570 -5107 -584 4699 3304 -3245 -4231 1082 4439 -432 -5809 -2861 3920 2583 -3312 -4504
1954 -4504 1799 5185 -137 -4084 -2176 3787 4211 -2042 -4607 1650 5603 1611 -4317 -2574 3030
1969 3030 3767 -1978 -4663 -207 4127 1327 -4077 -3343 2459 4611 -1770 -4427 -1302 4925 2539
1984 2539 -4251 -2825 2612 4714 -27 -3962 -261 4230 2851 -3818 -4393 1766 4189 -1137 -5397
1999 -5397 -2551 3509 2782 -2993 -3410 1473 5463 952 -3698 -1588 4464 3666 -1814 -3915 1396 4408
2015 4408 594 -4615 -3057 2133 2642 -2131 -4977 9 4258 1204 -3852 -2290 2784 4719 -263
2030 -263 -4565 -55 4127 2835 -3101 -3706 2248 4581 -1328 -4932 -1759 3715 2112 -3738 -4257 562
2046 562 4642 -47 -4955 -1670 4434 3184 -1426 -3042 959 4089 1515 -3897 -1961 3657 3131
2061 3131 -2190 -4145 863 4307 820 -4400 -3221 1769 3588 -1013 -3304 -19 4428 2396 -3381
2076 -3381 -2594 2844 4662 -749 -4011 152 3458 1731 -2584 -3598 1010 3464 -1165 -5045 -2808
2091 -2808 3379 2369 -2504 -3163 1610 4370 720 -2945 -814 3137 3033 -856 -3514 587 4155
2106 4155 108 -3421 -1990 1971 2315 -1544 -3353 -78 2910 647 -3623 -2090 2359 3486 97
2121 97 -2202 379 3930 1321 -2729 -2043 1421 2690 -165 -3768 -1616 2931 764 -3489 -3272 1301
2137 1301 3212 -930 -3341 -1296 2826 3495 -1155 -2442 1254 4082 336 -3076 -946 3166 2508
2152 2508 -2467 -3019 -409 1991 -770 -3840 -2030 1990 3007 -212 -3347 429 3622 766 -1606
2167 -1606 -1211 3063 3266 -15 -2198 -758 2948 946 -2546 -3154 841 2175 -1256 -2938 -796 2638
2183 2638 1074 -1781 -1476 1497 3763 657 -2194 -925 3587 2677 -1093 -2189 442 2246 -567
2198 -567 -2587 -1892 1471 1495 -1262 -3426 108 2430 482 -2500 -886 2153 1936 -414 -1795 551
2214 551 2589 1354 -2161 -2030 1657 2538 -443 -2928 -363 1295 626 -1668 -2137 1387 3133 122
2230 122 -1874 -514 2441 1824 -976 -1183 1100 2083 205 -2337 -655 2085 1124 -704 -2583 460
2246 460 2148 567 -2814 -631 1691 1412 -1407 -2269 -216 2456 1612 -1711 -1343 1481 1962 -73
2262 -73 -1566 29 2355 693 -2014 -1348 907 1695 159 -1989 -1153 2289 777 -1631 -1345 846
2278 846 2189 445 -1244 -201 1254 1889 -1189 -1284 664 1778 84 -2242 -340 886 685 -1741
2294 -1741 -890 -75 1891 421 -1919 -1203 267 1644 -1436 -1746 -59 1966 574 -1273 -835 1317
2310 1317 1901 -551 -1572 -188 1363 -218 -1501 -1820 1264 1817 -10 -1286 226 1240 934 -17
2326 -17 -735 870 1257 498 -1534 -308 1738 579 -701 -480 330 1253 -129 -1308 -592 745 868
2343 868 -918 -1017 -21 1414 901 -1156 -296 917 813 37 -1206 -153 1113 856 -1539 -527 380
2360 380 1161 -465 -1634 273 443 873 -1087 -672 356 1853 554 -744 -623 1355 1030 -625 -253
2377 -253 311 970 316 -457 -620 902 176 -1305 -1306 821 570 68 -953 -325 -26 704 -478 -289 899
2396 899 668 255 -451 -628 542 962 -781 -592 109 745 497 -1363 -1492 198 26 -737 -726 48 854
2415 854 553 -171 -314 -5 728 -176 -1077 0 -63 242 -311 -1096 -347 552 -204 -165 -722 725 1064 -343
2435 -343 -333 170 942 156 -1107 -459 1035 353 -669 -645 457 586 37 -72 -1039 102 437 -619 -1015
2454 -1015 -362 -52 -111 -1298 -60 -302 84 -113 -437 -457 854 746 -718 -184 -174 767 -1630 11 389
2473 389 498 426 -926 -895 -68 567 -59 -1121 -556 823 551 -271 -498 669 40 -153 531 703 1164
2492 1164 701 -130 60 164 130 -489 -405 125 79 -528 -240 -603 143 -308 134 -448 327 164 430 440 -871
2513 -871 157 655 198 -259 -190 -542 510 -117 5 -817 -541 -235 -463 179 307 -244 297 -150 30 74
2533 74 116 35 -536 591 723 222 193 -292 -237 -724 -126 146 348 -247 451 -67 -858 598 -23 191 -923
2554 -923 -141 429 465 -598 -269 -35 -384 463 129 -246 -320 -376 -217 -486 121 -42 -155 -242 16 -502 -461
2575 -461 -39 252 163 81 90 -598 550 -298 -133 111 -554 150 203 -580 -118 69 314 -380 -266 -45 -102 -35
2597 -35 -31 257 3 534 430 50 -28 -256 -423 818 -124 -539 735 715 -127 351 707 268 -1074 -169 590
2618 590 121 37 -274 -312 -553 -766 -338 86 661 36 98 131 29 -266 -370 164 -368 -761 141 -216 -29
2639 -29 206 169 318 165 -892 -106 -301 386 578 -344 -209 -235 420 -222 -689 256 -157 -35 -142 204 82
2660 82 -20 37 -923 -429 474 404 -451 205 65 -350 389 54 -267 331 25 852 390 -129 469 -455 6
2681 6 254 484 423 434 730 420 440 -240 326 -456 835 -649 286 -75 -214 108 743 75 62 453 311
2702 311 99 108 -205 -278 528 -113 366 -227 -110 483 -300 -470 -785 -352 -301 -80 533 136 430 -796 490
2723 490 318 -112 620 36 395 146 40 335 -541 -62 210 -74 -938 37 -461 -343 530 383 297 -175
2743 -175 -367 65 279 189 593 459 89 -477 -854 17 67 -826 -22 132 382 -639 -133 -26 -476 -547 127
2764 127 298 305 291 165 234 -269 -309 -435 805 940 -596 -263 -329 552 326 299 134 -131 -372 259 -383 -127
2786 -127 572 106 -320 -228 -364 557 -40 181 -478 -183 132 -83 -248 -243 -731 104 411 194 551 -311 -124
2807 -124 332 305 -404 603 -52 89 516 384 531 25 904 150 -740 -208 -41 394 -261 -344 -226 -74
2827 -74 767 450 -31 37 617 -348 514 37 464 -288 -708 304 -345 -151 109 14 -201 562 -74 -216 23
2848 23 1031 -511 -330 315 123 286 247 -320 246 171 -1001 180 -410 91 135 353 71 -256 -372 1
2868 1 -140 402 293 299 -348 -29 400 -199 -445 340 -180 126 -814 -54 -679 -153 176 39 -489 145 221 -950
2890 -950 538 -502 320 145 62 980 -344 345 -570 -332 -318 282 -70 225 -480 -291 -686 -151 -111 464
2910 464 -63 -18 -484 -1327 546 843 167 -706 -132 -613 -148 -449 -166 -178 48 336 319 -260 313 -773
2930 -773 674 -311 722 -395 413 -262 -223 377 166 -318 286 200 -109 393 -651 304 686 350 141
2949 141 168 257 -109 583 -306 332 135 -241 -2 -203 657 -249 -709 212 54 -99 153 -403 -368 -972 -357
2970 -357 -290 225 -469 61 -190 -238 251 -170 152 -408 291 -137 532 85 -673 -505 -465 169 -202 -241 -140
2991 -140 634 580 -652 761 -101 217 807 -32 -63 744 282 129 -28 -317 -142 282 -49 -9 273 -170
3011 -170 753 155 -284 -19 434 -113 249 -435 712 126 -360 559 -24 -850 613 -4 428 422 -87 -43
3031 -43 161 192 -327 555 63 -213 68 255 -382 -93 -283 337 -51 550 203 602 451 167 357 200 574
3052 574 -256 -228 149 -25 -306 199 -530 -427 -97 -252 351 -668 536 535 130 361 50 -679 368 -369
3072 -369 -882 -470 -7 653 252 -185 -422 -943 495 -264 0 392 -701 825 -348 259 503 -427 -54
3091 -54 -57 -293 -20 -19 157 314 304 -284 -98 -133 669 310 -206 33 536 -81 -277 92 278 113 -225 495
3113 495 -386 51 -411 182 511 42 -917 81 505 -14 416 794 -247 441 -339 -126 66 -278 -160 198
3133 198 -86 -74 526 -237 -264 -239 183 307 416 767 -461 -263 -180 107 181 -96 -139 -202 26 96 677 164
3155 164 401 1116 125 -79 443 687 -241 63 91 -191 516 559 -16 -129 383 -317 359 225 -340 -20 40
3176 40 138 347 307 132 48 -196 -142 367 -17 -363 -296 6 -275 15 -183 -43 -497 500 3 262 -277 167
3198 167 56 362 -316 438 103 24 -108 214 -210 -22 -145 201 -435 -70 429 37 -244 -101 -22 -221 -35
3219 -35 322 255 -216 -120 -430 -22 -234 -467 79 169 -543 -162 -497 -364 232 640 -88 -679 -137 6 14 -286
3241 -286 -164 112 -418 -11 -348 -424 -190 68 302 409 763 -329 -810 137 -437 -242 -39 -428 423 -559
3261 -559 506 -153 -223 311 196 169 20 -435 141 -582 -791 372 -292 614 -321 153 -657 -70 177 -25
3281 -25 158 2 -620 50 205 -375 554 -295 -46 -213 600 -127 301 21 -677 473 -146 -242 140 112 -125
3302 -125 -450 -61 469 193 115 -518 307 136 -270 363 17 -224 662 -114 244 244 -99 -490 -260 361 542
3323 542 -643 206 527 -674 -600 347 -586 -305 75 -66 -114 573 -167 -83 50 252 -512 251 411 26
3343 26 417 -92 -569 -467 205 357 -592 -705 610 511 -314 -941 -222 -281 336 839 307 -296 26 -699 116
3364 116 -407 -538 673 -134 227 102 -239 117 -144 -497 153 -308 -364 -965 -259 -714 -53 194 -19 -8
3384 -8 274 -314 672 152 662 245 -357 652 -702 -234 -650 -623 -48 430 360 -225 -205 -54 440 173 -488
3405 -488 -253 380 42 58 259 591 729 23 -627 115 276 -252 -787 129 523 118 15 699 500 -25
3425 -25 -329 -327 -159 632 -219 -249 151 73 430 -502 -472 99 379 -225 -868 -475 177 143 -157 -95 622 -75 324
3448 324 -315 -372 256 368 -238 57 354 -57 -523 88 940 171 -279 238 -544 595 261 -283 -134 250
3468 250 515 -153 573 -421 70 457 -231 246 -231 -608 621 -405 -146 -136 -263 -481 -569 -52 -687 -479
3488 -479 362 -115 152 29 389 -261 -287 -408 1069 265 -343 -628 -371 71 21 -31 -560 -133 149 -191 90
3509 90 123 88 478 158 331 19 452 -647 119 509 27 -112 -7 6 623 131 72 460 662 716 77 164
3531 164 167 -501 12 445 -329 -106 116 -212 53 -493 39 550 533 143 196 198 448 222 -718 -503 179 -225
3553 -225 -755 520 266 17 -445 8 681 64 305 -450 -534 -165 -246 -33 -148 -309 413 -624 -241 125
3573 125 517 125 -508 -128 450 329 -211 34 -229 115 559 -41 -45 -205 -487 844 147 -509 -223 177
3593 177 -382 -622 -176 1240 276 -54 297 198 241 254 524 33 664 785 -299 -325 -18 28 376 405 273
3614 273 263 90 -265 -304 -663 162 -114 -375 -559 -200 278 -137 -514 397 -292 618 82 -204 32 -20 200
3635 200 -674 -289 875 317 -407 82 221 543 -95 -265 -98 -518 344 504 -368 172 92 618 73 -52
3655 -52 -98 -87 -456 -856 -612 275 270 -31 249 726 -27 316 -218 448 93 -77 -525 159 446 -314 82 -131
3677 -131 325 405 557 -197 129 338 -334 31 -339 402 68 66 144 -527 131 249 278 173 -550 177 138 -434
3699 -434 -387 -369 466 169 -511 -479 261 477 342 -74 383 693 4 221 38 120 -108 -299 -538 -229 -116
3720 -116 188 -684 -466 148 327 -335 -813 -209 919 532 222 -774 234 904 -27 -52 -382 276 -205 619
3740 619 -143 -64 512 303 -32 -12 -219 685 -328 -323 266 271 -152 -180 349 899 294 135 -58 539 838 -369
3762 -369 -493 -658 108 890 -474 30 41 641 600 440 59 123 455 -245 -420 205 127 -35 -4 -574 91
3783 91 91 -693 -647 -563 219 124 -530 -68 296 220 -667 43 263 718 833 87 -191 267 43 231 -446 -477 466
3806 466 170 -167 -245 -291 -157 770 -841 156 -287 -743 -78 -167 948 -1 -49 -251 -544 -31 421 134 -920
3827 -920 -358 398 115 -880 -573 -403 548 -213 -663 -181 199 986 457 -1 321 1271 23 64 -137 -73
3847 -73 -740 74 -464 -64 64 -237 462 -321 121 934 32 -154 253 437 -47 -98 -423 646 741 306 -37
3868 -37 -43 935 33 -173 32 446 -37 -516 66 -179 1195 592 33 -375 584 332 424 -41 -305 -541 676
3889 676 -195 37 -302 141 740 -208 -872 114 45 -270 -12 -370 -257 0 -451 336 187 -51 105 -437
3909 -437 -190 345 437 -49 35 456 864 -24 344 266 296 -515 -575 -285 -388 487 22 -393 -148 279 8 -435
3931 -435 -28 -433 282 647 -499 -277 138 321 -602 141 157 3 -269 -260 -208 -351 98 376 -374 122 373
3952 373 453 -490 10 -611 -214 -32 -180 383 765 676 -462 -588 159 -172 352 355 148 24 379 256 -147
3973 -147 306 236 -316 -664 694 760 -228 16 369 365 545 783 -855 216 238 271 -459 58 83 -388 835
3994 835 -41 -764 24 144 -258 -544 35 241 707 -484 -311 413 425 158 -755 13 -647 8 -475 -334
4014 -334 -49 145 -95 -122 447 545 621 -291 -143 247 -492 -223 233 324 152 332 -135 -444 -307 134 -458
4035 -458 -381 -343 -58 817 84 -531 -331 -4 -95 -358 163 3 566 185 -71 -768 517 -142 -356 -273 -603
4056 -603 506 44 -832 -336 644 502 140 583 -194 -110 -289 -635 -612 458 369 183 -377 -187 127 937
4076 937 -941 158 169 760 211 -206 49 -1172 -14 -470 19 863 -289 -134 84 -282 -358 -341 -540
4095 -540 -518 28 -214 -183 -110 -402 -418 93 -834 -11 -251 -379 -779 -90 -534 416 13 -192 -137 -334 -307 -374
4117 -374 170 -107 -428 32 18 -781 -919 879 304 -681 -544 -294 131 -200 -29 274 -67 486 -272 -23
4137 -23 -179 230 151 21 -589 309 558 0 78 65 -159 28 13 164 -282 -547 354 -399 98 452 -198 960
4159 960 636 221 12 -355 -674 -745 -380 64 1012 -267 -220 -481 455 125 -370 192 250 205 190 -771 496
4180 496 248 -428 -372 351 544 -356 -251 -432 140 -285 -320 454 673 -387 79 -942 -477 265 -96 -246
4200 -246 -143 -51 -463 498 -121 484 335 -554 -209 80 810 -342 266 -552 -47 6 -691 -486 519 -46
4220 -46 -186 116 -839 -353 609 412 -73 -336 289 -27 -25 -389 -52 287 37 214 37 -83 -298 -269 47
4241 47 126 -210 299 -353 -452 -105 -201 -268 -415 616 374 -42 350 -217 -282 365 140 460 378 -152 572 -175
4263 -175 369 -252 -340 -155 26 -439 208 286 -196 36 -683 -420 318 -428 -191 294 -249 369 -994 -465
4283 -465 -222 455 -783 183 61 -428 221 -250 700 49 -603 -424 283 71 351 -272 -426 46 -96 316
4303 316 45 -23 1129 -209 -227 13 308 361 155 87 -663 -131 -204 119 380 -619 -98 -9 -571 404 405 483
4325 483 571 285 154 -375 -11 377 21 57 -541 115 193 -8 75 438 -399 34 -48 556 90 -19 57 -414
4347 -414 610 358 -507 -357 -155 -499 -1 514 -181 292 18 -177 189 -548 -268 171 -60 170 -170 387
4367 387 937 453 166 42 300 -827 -156 445 54 -150 352 161 576 -444 357 -393 -414 -44 -102 152
4387 152 -254 166 484 -328 464 -115 575 -152 -45 58 -136 -258 109 -369 77 521 389 37 363 1017
4407 1017 -608 -27 439 455 279 -321 471 -505 250 456 -682 251 -62 700 149 -151 -534 375 -814
4426 -814 -63 512 431 382 -648 -116 -303 -615 -10 218 -584 395 -131 -155 510 -65 64 11 173 -533 34
4447 34 60 -4 195 -44 525 -464 -323 765 59 83 -180 -574 -370 -66 -545 -1241 -478 -777 874 -354
4467 -354 -511 69 -397 359 -310 -175 -139 -490 209 -33 191 -490 -107 -49 341 -237 243 172 -401 -531 -281
4488 -281 120 -413 271 -334 418 -846 -143 -421 -208 -273 600 381 487 119 201 -158 -106 235 -556 112 97
4509 97 -317 199 -283 -516 -561 275 -92 499 208 -657 402 747 102 -1054 60 303 -107 503 -146 206
4529 206 189 273 -278 449 -318 280 476 23 -324 386 153 -214 -169 -359 -261 855 354 15 -89 -8 452
4550 452 464 219 -200 -183 665 -37 600 590 -598 193 -203 808 270 -77 -496 -150 414 -617 -139 151
4570 151 -403 1049 191 178 32 71 -240 113 1022 -271 149 120 -172 -181 733 -89 -305 263 -177 138 292
4591 292 -122 -418 -744 -454 -441 195 381 795 342 -752 871 -417 -125 -191 292 -448 -283 656 -454
4610 -454 479 290 -163 -148 -469 120 88 -358 378 -31 -53 -672 -15 -384 85 182 351 -501 -87 341 370 -66
4632 -66 -220 111 -186 -281 388 -109 20 -666 114 -280 -421 398 -243 -142 -454 603 -293 -782 -235 -134
4652 -134 -7 -674 2 -415 297 -714 -756 612 -191 -61 -470 316 -816 377 35 307 454 -75 -240
4671 -240 458 -285 -556 356 87 92 -170 75 -320 -373 -190 1086 -310 474 -994 134 306 -476 -406 -397 654
4692 654 -509 -510 286 70 -1 518 844 -321 18 958 51 -1 183 -89 91 128 331 414 -372 -485 -381
4713 -381 -89 -294 503 457 13 -26 262 214 -554 490 188 -16 -545 -146 1125 -61 213 -477 -461 240
4733 240 -40 210 29 258 177 156 -12 197 -212 124 -283 119 655 298 -25 751 -222 -109 -529 -344 169
4754 169 113 -162 -656 641 397 -248 359 -694 381 299 -649 21 302 106 251 -707 -309 -305 -544 -281
4774 -281 -344 -577 -86 207 -516 -474 -29 256 -549 564 -257 -348 96 -310 528 -318 349 42 -65 -164 140
4795 140 -58 -378 560 104 131 130 -245 -539 -239 492 406 -63 54 122 135 473 177 -130 -418 59 -70 -53
4817 -53 82 -7 -950 186 25 187 390 -153 -231 -65 245 441 457 -490 -37 -225 412 -74 0 -142 -97 271
4839 271 -480 -25 356 54 776 -456 -63 -481 698 -234 -407 -874 125 -34 -50 -264 -820 53 184 -125
4859 -125 1030 -16 519 -264 242 471 -137 -27 414 -2 -323 83 -598 -236 -172 -542 -88 -68 339 128
4879 128 -482 134 -514 596 113 -57 -212 443 360 105 -161 -34 339 -166 469 -234 -259 196 560 -153
4899 -153 -196 143 -171 -136 224 -698 379 348 -399 277 -717 -37 73 119 -76 -514 -398 -277 -34 7 82 -179
4921 -179 -653 -537 335 -363 -275 445 84 88 156 650 974 431 -130 615 32 60 334 -111 -127 481 293 -605
4943 -605 53 -531 148 203 -248 597 -300 -98 -21 -148 -556 431 -292 -272 219 -485 57 363 -616 -73 -469
4964 -469 204 682 -403 -420 -326 -97 -148 117 -185 -176 -109 153 23 -843 -135 293 -88 -28 600 85 47 307
4986 307 -792 -584 -272 317 612 283 579 -195 -162 -98 -138 -90 -260 -604 4 -218 442 -66 -120 171 469
5007 469 638 26 628 -482 -122 -432 -671 -99 -46 -379 61 227 422 98 380 555 327 123 452 424
5027 424 -49 -379 516 500 -436 -411 226 740 858 543 516 -530 -297 -350 -551 20 -81 -367 -46 -154 -622
5048 -622 -173 -374 -656 -47 -86 20 504 293 75 220 -90 211 -30 -168 -292 270 -60 -188 135 -363
5068 -363 -7 41 -304 170 -1 57 -379 455 -148 -223 -399 -203 -70 664 -45 -287 104 -75 359 -39 555
5089 555 -329 -516 687 -19 -280 30 176 56 757 -460 334 91 365 -355 -155 196 359 18 -275
5108 -275 -270 -114 55 -46 660 -1419 -207 129 15 -494 -217 317 -94 260 24 -79 -501 -683 -156 224
5128 224 -44 523 207 -146 -71 -641 -521 239 14 331 -213 -299 -20 396 530 221 408 -593 -352 93
5148 93 363 -82 -451 -190 871 -35 -87 3 -25 -219 523 -417 123 -146 413 82 227 -49 612 -316 -623
5169 -623 651 -108 445 91 -158 332 38 268 -60 -261 26 -543 480 353 -162 -57 -285 450 373 -235
5189 -235 -477 -9 38 822 -572 -404 254 -317 659 219 997 389 150 -204 -114 365 -262 -467 -277 638
5209 638 -622 307 661 101 -285 131 -280 -323 77 -476 -673 -12 -341 542 246 -253 151 -1021 -247 -580
5229 -580 134 536 475 446 -52 -541 133 203 -15 364 246 -518 -930 203 11 -83 -83 -276 51 -247 -757 -320
5251 -320 -172 -364 -46 267 280 -81 143 -269 393 -34 168 -322 100 159 782 -576 -64 -747 -151 117
5271 117 -490 -190 -446 -94 244 430 27 -683 -121 -335 -325 -625 -240 87 -90 172 850 -141 -523 -838
5291 -838 -18 558 219 -556 -192 219 -7 -10 536 -119 -546 268 195 -372 6 99 449 -523 -564 -468 275 140
5313 140 297 23 -33 421 -532 -62 235 -186 29 203 -170 -1024 -241 -90 303 -157 -619 -82 -80 21 -33
5334 -33 -74 -511 -664 604 -53 191 -381 291 -179 293 227 -206 -135 -487 35 -90 68 155 519 -2 -19 400
5356 400 198 511 174 -39 -328 -27 223 -496 22 -610 -89 43 391 269 373 53 256 -159 980 -952
5376 -952 -302 -800 385 933 184 466 308 536 -220 618 -190 -217 -30 47 386 -842 653 -234 -234 -688
5396 -688 743 -410 -418 -451 -73 -464 761 549 -167 -35 294 -200 -312 -348 82 877 369 -165 -543 -204
5416 -204 -41 -6 611 268 -680 174 41 -264 726 -383 -205 91 204 132 -173 82 303 -40 77 -179
5436 -179 -864 -251 -134 -102 -198 580 29 -231 458 -133 214 -95 119 0 -47 351 -183 -7 38 953 -294
5457 -294 362 566 -165 -209 -183 -787 -278 1020 193 175 334 195 -363 102 -646 219 21 97 -773 -294 226
5478 226 56 187 94 -108 341 615 -161 497 262 -30 -474 -292 -765 -36 284 -171 -55 25 -125 408 -260
5499 -260 -69 480 -5 -145 122 -7 58 396 387 -556 -185 -258 -356 -503 -70 111 68 931 -61 -420 348 769
5521 769 -139 -99 -445 377 35 136 -221 104 52 -560 -586 -286 -13 432 -165 -52 110 35 -666 210 726
5542 726 -109 -288 -648 -466 -237 314 -494 -46 96 147 -29 337 376 186 -428 -221 -376 210 278 324 -393
5563 -393 -369 -278 1062 -422 -170 43 620 -328 -318 778 123 457 -49 168 81 26 -221 -875 -397 -234 -376
5584 -376 -430 153 468 -543 -509 -385 406 -24 549 -123 -552 -252 32 154 -72 -86 473 -334 369 -265 359
5605 359 420 583 120 -294 84 -666 -448 -248 424 -1042 1033 -52 113 -357 -39 445 -332 -353 -826 -89
5625 -89 -561 -532 -138 -663 302 -160 325 96 -550 -154 923 254 39 -132 -176 364 -119 -405 -167 999
5645 999 180 -15 -173 142 173 95 -207 234 -236 -259 -233 -293 -78 1 -712 9 -2 -251 359 234 465 12
5667 12 172 136 451 217 -528 2 196 450 -439 -229 -637 236 254 -60 -257 98 -102 35 -634 -374 -958
5688 -958 -429 -136 -494 -588 -18 60 23 -641 -377 299 666 -801 268 348 166 -369 -522 212 -207 -378 437
5709 437 -114 -581 74 268 -77 86 247 134 -112 139 -9 447 71 -184 287 -298 -248 286 -90 407
5729 407 -143 -320 -35 -750 -293 17 152 -796 164 -59 -404 -433 307 -62 352 241 149 -138 714 41 -36
5750 -36 58 7 9 479 240 4 -249 -889 -76 -249 23 -446 553 505 -282 -216 38 387 123 -39 435 -442
5772 -442 152 -280 91 610 -699 608 710 369 -818 -318 315 -58 -190 468 -176 -2 545 -29 -193
5791 -193 -311 -91 -7 209 10 685 -24 -132 -159 436 -651 -488 317 385 -117 245 -533 452 19 -358 -295
5812 -295 364 82 124 -188 196 -126 -20 84 522 -161 -112 52 337 429 300 -127 159 -319 97 -157 298
5833 298 -319 -160 -31 253 1163 -148 -338 107 -169 295 63 399 -14 84 78 -96 706 -99 -177 43 84
5854 84 -280 150 -693 -19 -467 -352 57 56 244 189 -558 -383 39 -853 -389 487 618 -283 -63 324 286 -92
5876 -92 -661 17 515 38 532 53 -14 105 -74 29 -95 616 213 230 260 -31 -792 469 -117 -503 525
5897 525 -95 567 -230 -291 42 -67 88 51 127 -368 173 399 38 466 -132 -98 179 382 -341 593 475
5918 475 344 311 -242 -1135 -446 366 267 -271 -795 529 -237 -90 654 -262 -397 -573 -43 -154 -113 547 -38
5939 -38 -592 -176 221 339 -507 -164 571 289 -146 446 -803 -38 889 598 259 -368 -7 218 387 95
5959 95 302 -493 -30 437 154 -218 171 119 118 -338 337 7 837 10 398 282 101 -540 101 -255 -12
5980 -12 -312 -130 -2 -295 -781 246 391 -318 213 -275 507 10 -468 478 34 -401 -404 -299 -517 -194 156
6001 156 -425 560 -484 -55 -320 -431 -207 -304 335 -551 782 93 542 321 122 132 -592 391 84 -214
6021 -214 -198 -172 -927 -161 -192 -19 501 518 -295 -77 34 -115 198 15 -110 -315 -388 -135 -601 -404 -342 -477
6043 -477 190 25 243 -92 127 334 -301 240 -67 48 210 -140 25 -164 292 -97 -9 500 -302 158
6063 158 196 -237 81 265 -404 -834 -446 -173 64 -463 -237 242 492 -706 -538 207 89 666 303 -233
6083 -233 237 570 -59 -890 -316 -274 247 -901 -99 -35 72 -25 -38 358 8 -332 -344 -262 -188 -295 20 -383
6105 -383 642 116 426 -7 539 107 153 -21 -110 164 876 -189 54 72 519 205 -118 357 -56 86
6125 86 572 -389 -404 -299 -188 20 -262 155 -102 -281 -69 302 217 -212 -427 239 -122 6 201 -122 256
6146 256 -432 -437 186 -276 210 -797 47 -60 294 122 151 95 341 107 -680 121 144 -338 -16 -334 1146
6167 1146 -231 -473 219 286 178 149 -216 660 170 733 -141 654 -611 192 5 359 209 -350 -152 569
6187 569 322 355 409 -494 -341 -119 -328 464 317 47 237 -456 350 -601 -72 111 28 430 -405 -43 534
6208 534 600 999 -42 -286 741 56 416 -7 47 -308 690 -683 83 -460 -28 30 373 -161 466 533
6228 533 151 -541 402 193 -512 -228 84 -191 -726 -313 -660 -495 320 -99 -211 120 -52 540 -7 155
6248 155 -6 43 -105 352 -301 -8 138 499 -248 360 -128 26 45 -295 -238 607 33 210 293 167 542
6269 542 655 209 564 -360 -705 278 -65 -13 -612 -453 -303 -434 454 21 133 170 -321 -511 -205 173 273
6290 273 -345 190 -175 -147 -340 157 -603 -89 70 225 -417 -228 296 82 232 -3 351 46 -866 262
6310 262 -325 -510 -40 31 -171 522 77 282 753 -65 147 330 195 -418 282 92 -263 -264 -31 69 -62
6331 -62 -875 409 25 229 -540 -443 417 -35 -287 123 -220 -263 -31 -33 411 -383 -146 -419 317 253 -252 -701
6353 -701 507 -693 -23 921 -328 -415 456 181 112 -355 -519 -10 -573 -287 -8 -308 79 -180 -324 91
6373 91 708 295 231 16 -266 22 189 -1008 -131 467 27 -79 207 74 568 602 101 593 -112 107 72
6394 72 -357 -362 269 376 -76 -281 148 -597 358 895 192 -259 -164 113 781 -659 125 5 -157 251 -153
6415 -153 -294 459 14 -470 77 -241 187 12 873 465 73 186 485 58 -202 -609 462 -47 -248 -163
6435 -163 -93 224 146 -268 426 -266 27 497 -350 -39 216 202 -567 507 -326 605 -805 -489 194 -323
6455 -323 -578 -1010 -937 186 164 2 -661 -27 165 201 -853 113 24 -236 -755 -149 -22 -252 -464 -44 -211
6476 -211 -115 359 92 -316 61 460 -614 -87 -435 -318 256 503 63 -289 -14 23 -587 -105 -76 -177 -116
6497 -116 -467 -311 -407 338 233 133 1229 -232 335 -319 48 508 -306 -799 623 -438 -83 634 -833
6516 -833 256 -520 141 304 -260 664 150 -682 -13 271 595 -226 322 -298 -39 95 -477 557 -142
6535 -142 -151 -37 246 -142 68 -439 135 -193 885 368 384 -502 -109 687 292 16 1 -285 -301 402 -274
6556 -274 -620 20 178 -114 -128 -207 -83 -28 -490 219 -10 -479 200 -181 -436 233 607 -289 305 -232 -621
6577 -621 593 -819 136 24 86 85 508 264 -724 103 -78 380 404 -427 -60 -84 392 481 -18 623 165
6598 165 142 -279 168 28 783 34 44 107 138 179 559 154 -110 -723 -980 144 -168 72 -513 11 -269
6619 -269 122 -234 -689 483 -723 349 -594 -435 195 646 340 101 421 92 -193 -470 -376 -336 -204 -1166
6639 -1166 118 -85 48 -494 -306 693 -236 256 -383 -353 122 325 263 -477 -28 -116 67 -44 407 322 427
6660 427 529 -276 580 452 16 -92 -106 -370 -125 673 13 -123 77 413 -205 394 -43 -659 154 185 12
6681 12 181 -430 222 -161 80 -528 529 -259 -288 108 436 301 207 -187 6 557 -70 346 -382 -102 81
6702 81 319 44 86 -600 -153 216 368 42 628 873 494 26 -69 -275 291 388 302 229 -26 69 -208 -129 -192
6725 -192 303 59 -158 -47 137 53 123 -257 -305 -38 203 -192 -154 1354 206 23 -372 -96 286 144 -214
6746 -214 -409 -475 -239 697 179 51 -528 431 -694 -228 -124 -791 146 -300 24 250 -345 199 156 -806
6766 -806 -507 427 941 613 -104 -20 158 278 400 333 -570 -641 631 20 241 -74 -38 -42 31 -452 -589 -481
6788 -481 176 -461 -800 -286 -412 -619 -63 804 -135 414 -259 85 13 301 -30 -326 127 -312 -70 -289
6808 -289 360 157 44 -296 192 -428 374 801 189 -47 -383 -220 -9 126 -464 121 88 457 -520 -163
6828 -163 132 147 104 36 -391 518 361 -349 -373 252 186 -337 422 -780 80 -551 -190 688 625 -53 417 -180
6850 -180 18 44 -12 -194 152 -91 1277 330 -900 -156 172 -215 10 -468 -559 -135 132 -528 190 69
6870 69 -279 101 -10 472 -58 -663 168 -204 25 -369 7 -139 -642 -583 282 217 -158 20 -232 -154 390
6891 390 26 -242 549 336 -602 -247 -164 -90 -8 -529 -373 -648 -211 706 -219 -265 667 -477 -285 -346 167
6912 167 216 446 319 76 -63 478 49 -113 69 -126 594 -296 -422 -117 -72 268 -312 -458 -12 -529 864
6933 864 59 514 874 -699 419 -62 205 406 -163 218 1145 -382 481 292 572 386 -292 -41 554
6952 554 145 -231 -169 -309 -566 -230 -354 -312 -203 -129 90 -39 94 -511 53 685 -103 -192 116 224 -237
6973 -237 -506 -448 -90 360 -421 427 -460 39 -252 185 419 -143 -55 55 328 -61 -163 65 216 -4 -750
6994 -750 323 218 615 -284 -149 387 479 100 -29 553 -315 8 -282 246 -122 -197 270 -498 -257 349
7014 349 574 -40 -230 -114 74 200 -179 283 269 -316 -227 109 564 -193 137 153 336 103 144 -116 -421
7035 -421 -547 302 144 -760 -251 50 -151 149 -348 153 -493 -298 213 300 -323 360 -316 -562 152 344
7055 344 40 61 -143 -151 -563 342 457 -418 -225 174 615 -956 243 696 186 540 112 -360 -232 115
7075 115 -530 -572 659 -212 -435 -347 332 -411 -414 109 -337 605 419 -20 -1089 444 -281 -377 -372 -24 -306
7096 -306 -108 44 -68 -42 -23 -549 1 6 -87 306 1048 8 -175 212 -278 23 -218 -32 514 811 -92
7117 -92 -516 88 -595 107 -146 -729 -263 -826 -74 274 266 -94 -605 185 -352 -20 229 -748 209 292 443
7138 443 -355 -390 -124 615 -442 119 294 -263 661 391 342 233 531 -325 166 323 10 -259 -657 -472
7158 -472 278 55 261 192 -497 665 334 437 803 389 -25 -774 80 -773 -308 159 164 598 359 533 -16
7179 -16 32 -558 253 -213 174 217 304 130 366 -1258 -117 -323 -278 766 350 447 167 172 494 474 300 -508
7201 -508 -241 18 95 498 -520 193 255 -411 -485 20 88 -479 -519 133 23 52 -391 32 371 -231 389 -515
7223 -515 509 85 -403 373 277 22 -564 177 -549 -498 -191 -8 71 -599 61 253 33 558 -188 -81 -22
7244 -22 496 245 -1017 174 126 -241 -77 -260 -33 -158 660 -34 -337 -96 569 -124 -426 774 -675
7263 -675 -479 125 -301 -178 -37 146 -318 -498 336 187 -182 386 -542 -192 118 -368 181 897 -490 -179
7283 -179 538 -232 -444 425 482 46 93 -39 141 332 146 54 -267 -225 118 -137 -457 194 33 -173 383
7304 383 -414 141 -426 197 -218 -542 -147 -138 -386 -439 161 -178 208 373 462 455 226 -152 -323 239 -5 479
7326 479 21 -53 -531 27 -169 -343 29 272 300 29 59 699 88 145 453 -208 354 309 -478 120 45 83
7348 83 157 -108 317 683 18 -851 -477 126 692 289 565 42 -520 425 -339 400 98 -320 -129 -628 -383
7369 -383 -22 -79 -291 234 -732 249 -159 -29 409 204 108 -369 66 -391 -425 -58 508 -60 103 159 -3
7390 -3 -394 -517 -24 258 442 -199 -193 -258 -509 325 -358 420 636 580 -456 -154 563 489 356 171 -54 -272
7412 -272 -123 341 -171 212 536 361 -175 -175 207 -559 -118 -91 -454 315 -338 -729 385 172 -262 -302 646
7433 646 402 -70 -684 -158 -369 288 248 688 -212 -21 340 144 -782 382 30 -72 -349 -444 299 297 391
7454 391 366 162 642 -251 -85 416 468 -634 233 -571 -544 197 -162 100 -111 245 -869 309 -368 221
7474 221 490 179 -107 267 122 -855 33 -666 169 114 118 -610 31 -684 -658 -407 -100 -3 102 -772 -491 -41
7496 -41 -113 2 -6 -431 -830 51 552 -252 -1012 85 370 -346 -50 -8 71 -646 431 -381 162 337 211
7517 211 -345 251 537 642 300 -223 -413 -42 -136 943 71 -300 108 -380 -57 -63 -596 209 19 640 232
7538 232 218 405 -498 -274 -225 -588 337 -414 668 188 -19 180 -120 -220 424 -86 -83 -388 126 118 586 419
7560 419 289 109 -310 584 -36 -533 1 261 204 -507 361 348 -146 -409 -494 198 -178 -251 96 -593 -450
7581 -450 459 -211 -65 401 -26 190 78 -774 -96 -804 -562 -400 259 -508 -309 -577 440 339 -96 6
7601 6 -370 618 19 -499 72 16 29 -345 290 -260 -85 -231 -320 278 -96 -343 166 -629 247 450 318 -154
7623 -154 65 87 197 631 -536 131 -107 -419 629 -358 1031 88 -233 -143 -557 -6 -164 -330 437 252
7643 252 183 217 -117 76 300 -945 470 -401 8 -75 121 44 -4 -18 315 12 71 -208 -181 319 -35 -168
7665 -168 347 521 355 -946 493 -161 356 -275 -497 355 111 405 383 583 -27 79 -460 -298 8 -346
7685 -346 47 1152 -832 351 -153 150 235 -25 -307 -200 329 -314 -357 -626 -300 -86 -160 402 -19 -259
7705 -259 -337 -23 76 186 -35 -441 97 116 -384 -859 248 382 21 -32 23 303 86 -648 45 69 399 -119
7727 -119 -468 -250 -465 -114 -108 -604 183 -324 415 602 222 -307 443 -558 757 -136 141 129 424 -361
7747 -361 -871 200 50 445 -253 -514 -162 -197 377 74 -151 110 -253 -57 53 -259 -449 -201 -126 -274
7767 -274 -179 228 -266 -51 507 399 -249 -56 -71 -40 73 -48 -503 36 -714 -509 -105 249 -592 110 177
7788 177 -166 385 -463 67 -124 51 -52 -14 -44 378 155 522 233 366 -100 1060 -183 889 -69 -72
7808 -72 -733 834 -488 -19 977 -258 198 37 -105 -213 465 -1000 475 -99 420 483 -148 -280 -275 -17
7828 -17 205 128 186 -376 -205 -844 -169 139 128 381 37 44 490 163 299 251 204 -606 -517 -83 -556 -436 65
7851 65 -90 679 -255 -48 349 880 -17 -238 26 183 -358 -500 187 584 67 328 699 -154 -15 -37 961
7872 961 -206 -150 -55 -202 -232 58 -198 418 -209 769 101 -151 -417 296 -105 -23 96 39 325 -158 -269
7893 -269 -12 81 672 88 -326 -53 427 215 -265 579 258 -615 -600 722 -1029 -139 689 539 -296 -410
7913 -410 140 368 -598 175 -243 16 561 -242 63 700 -121 -695 95 -373 428 123 394 202 465 -26
7933 -26 457 527 22 76 594 -386 350 23 -218 279 -21 -1083 130 -852 244 349 -215 -41 295 -125
7953 -125 -105 250 -358 -286 -90 315 426 -74 311 -104 122 -2 -381 336 361 -237 7 -86 357 -490 306
7974 306 626 -305 248 64 -11 61 235 -492 379 870 -664 9 -112 68 906 140 870 -480 -92 -59
7994 -59 -826 -110 187 143 307 136 -88 468 247 -552 199 -394 483 104 569 166 79 -723 162 457 152
8015 152 189 426 619 116 -55 313 294 25 -531 327 -78 166 -433 433 -382 -63 -188 -918 118 100 -161
8036 -161 -22 -638 -272 222 -50 -400 -359 -256 125 730 74 -859 -924 -392 898 -506 -348 -353 21 -200 -27
8057 -27 276 -196 -298 -525 362 -5 215 117 176 -448 49 492 211 -322 -476 119 -650 299 132 -295 -39
8078 -39 -18 -378 242 355 343 -56 -536 379 425 655 -239 6 134 105 -452 131 -474 161 306 223 170 -84
8100 -84 -546 -160 -713 -268 -360 171 138 0 358 -149 331 41 -231 289 56 -565 114 -28 157 -592 -97
8121 -97 733 -378 658 255 -333 545 -628 295 -262 106 -89 -892 -199 67 64 640 -126 101 -9 -1 -324
8142 -324 443 -266 -774 120 527 202 354 -324 -30 813 -364 426 -549 395 -213 174 377 301 433 367
8162 367 -337 -706 -126 -330 -490 710 86 691 464 -176 363 47 294 -923 253 68 -727 788 82
8181 82 -11 -60 -690 -138 -49 74 485 452 470 122
8191A22
$$ Imaginary data points
##PAGE= N=2
##DATA TABLE= (X++(I..I)), XYDATA
0 0 0 0 0 0 0 0 0 0 0 0 0 0 0 0 0 -2 64 -64 64 -64 64 -120 128 -128 170 -192 201 -256 301 -322 384 -447 506
33 506 -569 640 -710 808 -898 1006 -1126 1252 -1389 1540 -1709 1886 -2087 2305 -2540 2799
49 2799 -3080 3395 -3738 4122 -4550 5029 -5561 6174 -6878 7695 -8661 9819 -11233 13023
63 13023 -15349 18529 -23168 30590 -44365 78994 -397260 -364429 192753 -70204 -268509
74 -268509 -179822 120943 151359 40853 -68257 108310 318136 249360 -52267 -49014 197159
85 197159 260008 28279 -103528 -36141 57924 -28023 -221037 -297473 -107761 63994 -57148
96 -57148 -258934 -124536 162173 157715 -69724 -71659 152653 252808 99279 -69592 -26379
107 -26379 159154 187558 -20764 -144058 4813 109802 -64155 -232776 -134835 32972
117 32972 27223 -97039 -144965 -25690 135787 104558 -69078 -60941 139574 172943 -30737
128 -30737 -122875 29683 161513 82960 -74134 -96255 36420 109026 -29124 -186595 -103623
139 -103623 80015 49129 -124488 -123093 58293 138193 31290 -65145 -7265 115883 110704
150 110704 -40931 -110905 21755 133107 26474 -114805 -57704 78680 59490 -72573
160 -72573 -122935 -30529 66158 17519 -111347 -98786 72446 136254 3336 -76462 33944
171 33944 135469 61291 -66183 -66699 45268 90769 -15241 -115886 -42134 88392 51267
182 51267 -94906 -106301 17866 60349 -39860 -111206 -39969 76491 79179 -20250 -48841
193 -48841 56243 133071 44936 -70629 -29927 83594 68459 -51400 -88586 3038 72446
204 72446 9828 -94280 -81924 28350 49757 -59448 -116652 -15272 85153 36768 -54549
215 -54549 -28962 78703 104349 12824 -56073 2371 89758 48560 -65807 -69982 38397 73021
227 73021 -23726 -95030 -34659 49373 20239 -77528 -90193 5243 66935 4648 -67246 -13961
239 -13961 91622 81896 -20168 -47556 35214 82509 14082 -63971 -37526 49951 56869 -33113
251 -33113 -78644 -7023 57260 -13 -89098 -64882 29653 45609 -27467 -60302 9974 83061
263 83061 50226 -34076 -31782 50601 71873 -9860 -65948 -9298 61198 28327 -52249 -54702
275 -54702 19905 49302 -18106 -78196 -37661 40293 29137 -48083 -54688 29359 74303 18002
287 18002 -38010 -5017 60222 50923 -23409 -51254 6830 55433 10300 -57342 -35575 37258
299 37258 36754 -35842 -64879 -9243 37475 4847 -48908 -33458 39996 60940 1079 -39455
311 -39455 8987 63524 28047 -42719 -37135 25668 43002 -11540 -49647 -12203 43079 23104
323 23104 -43977 -52542 10354 38332 -12600 -53645 -14403 45965 38235 -16573 -25901 25593 55146
336 55146 12011 -41800 -21740 34317 30774 -29349 -45944 5406 40467 6761 -41039 -28266
348 -28266 22021 29022 -20824 -48013 -3434 44498 18791 -31059 -18129 36193 41865 -8629
360 -8629 -36387 -3501 34138 15795 -30153 -28833 19675 36005 -7484 -40102 -9514 29198
372 29198 11486 -33896 -34088 10952 35525 4843 -27720 -5863 37338 30179 -19465 -30723 11243
385 11243 34502 346 -33975 -13274 27553 27006 -13991 -31546 1565 27642 2813 -36002
397 -36002 -24152 17129 22149 -13230 -26353 6403 36465 19849 -16873 -16395 18715 28582 -7291
410 -7291 -30504 -3713 28240 10715 -24041 -20758 12295 19711 -11600 -34441 -15529 15330 12339
423 12339 -16391 -16145 18415 33686 7642 -15984 -1096 25758 16973 -15573 -23920 3701 24213
436 24213 4155 -23210 -14235 13740 11984 -19402 -31280 -5669 14457 182 -19859 -9733
448 -9733 20943 28335 4853 -11017 8681 29046 12945 -17150 -15688 8159 12099 -9149 -22392
461 -22392 -5395 13924 3902 -21724 -24221 2454 15090 -6103 -20615 -2999 20262 18501
473 18501 2995 123 15736 21882 3425 -17222 -9867 12062 9478 -12842 -19457 -838 11896
486 11896 -1865 -19372 -13833 4503 6118 -11496 -17952 2683 21167 13215 -3955 1886 18310
499 18310 18538 -659 -12525 -3220 8742 3947 -13069 -13394 3995 8890 -7747 -16638 -3730 9031
513 9031 1143 -12459 -12394 2230 13089 6180 -2919 3472 16775 11940 -5410 -7285 3413 7424
527 7424 -2703 -11890 -7630 5663 7975 -4063 -9503 -353 7761 -2906 -15050 -8613 4991 6503
541 6503 -667 -1488 7984 14564 9859 -1638 -4117 4927 7001 -4400 -11843 -3980 3506 266 -5852
556 -5852 -5324 560 3487 -3135 -12101 -7770 4271 5020 -4580 -2203 8552 10118 3984 2603 5268
571 5268 7148 4925 -2840 -8875 -4704 1664 -2701 -8265 -4693 1060 -817 -5421 -6309 -3588 1809
586 1809 2551 -2555 -1886 8377 12631 5775 2292 8310 7541 -1167 -5847 -5402 -4595 -2272 -3050 -7861
602 -7861 -6323 1856 393 -8159 -6224 1336 1997 -1532 -455 3283 7262 10227 7346 3333 6885
617 6885 9168 -924 -7153 -4007 -2080 -5772 -7372 -4933 -4913 -4683 -1309 -1035 -3046 2074 4583 915
633 915 -1068 2952 7248 6556 5494 5899 5654 4163 1025 -3763 -4948 -2465 -5041 -11363 -9739 -1133
649 -1133 -2163 -4670 -1171 2357 876 1634 2505 1944 3236 7792 6162 2534 5473 6331 85 -1658
665 -1658 -652 -4212 -5642 -4177 -6378 -8228 -4781 -451 -3685 -2250 3317 4322 1229 2317 5207
680 5207 4689 5301 5192 2275 1161 2987 2425 -1368 -2220 -364 -4438 -7286 -6522 -5134 -4625 -3352 -1221
697 -1221 -815 734 4495 4256 1724 4298 5622 2212 1521 4197 3858 1146 1241 -467 -2933 -3435 -3524
714 -3524 -6283 -6556 -3789 -3846 -3629 -1538 2213 1436 1961 4152 4672 3092 5271 5028 1871 1221 1780 -233
732 -233 -1545 -395 -1049 -2907 -3894 -2820 -3985 -3598 -2584 -3038 -2125 -752 1523 2141 3833 4656 4518
749 4518 2713 2321 2487 870 -159 -377 -1864 -2552 -1278 -1976 -3393 -2400 -1399 -3399 -2879 240 1500
766 1500 859 1549 2308 1538 2633 3307 2234 1477 1851 1196 -515 -525 370 -2000 -2781 -2230 -2588 -2054 -1160
785 -1160 -603 -1205 407 226 8 134 828 1478 1453 1560 2078 1371 1693 1784 -94 -1329 -1386 -591 -1970 -679
805 -679 -722 -320 -1727 -1002 -1128 -283 -825 83 101 736 2476 2293 1257 1627 2518 -245 -799 871 607
824 607 -1068 -1101 -581 -1168 -2030 -1026 -884 -1604 -668 -468 -1054 -429 300 -303 -618 1199 1319 1774 1837 2734
844 2734 3285 1592 1055 -410 -973 -606 -2346 -4104 -2722 -735 -667 -1540 -134 343 -270 -566 454 -131
862 -131 1242 1762 1668 908 1485 3720 2133 629 476 594 -50 -1124 -2803 -1743 -1746 -1625 -4089 -2936
880 -2936 -352 2125 928 97 855 1967 1910 1564 1135 1130 1962 2534 -822 -1105 2050 1354 -3027 -3113 -699
899 -699 -625 -2803 -2160 -480 630 1035 -380 -821 1446 1456 592 -141 1199 2538 1389 -590 806 354
917 354 -1219 577 -596 -2524 -927 1331 -1129 -3274 107 2383 1027 -1338 -99 1452 1921 851
933 851 -465 -890 1307 1187 -2401 -2031 1205 1060 -2844 -1079 525 -436 -579 -560 -480 -43 2348 2216
951 2216 -977 -1 3180 1707 -1830 -1154 544 218 -543 -892 -182 756 1491 -549 -2755 188 2050
968 2050 -1211 -1810 227 1408 -447 1100 579 -250 1947 2212 -1380 -2685 1985 2175 -1521 -2626
984 -2626 -79 425 -1307 -335 -34 -998 1295 1043 -2565 -1816 2274 721 -2865 -1277 1650 1041 927
1001 927 1429 912 365 1677 931 -3056 -339 2343 -95 -2500 -1131 496 95 -400 -965 -1158 -140
1018 -140 1232 -500 -2433 1513 2723 -590 -1298 2940 2730 451 837 -1148 116 1521 1250 -2488
1034 -2488 -3245 789 -228 -3368 -1995 1793 301 -1281 -727 -40 867 2234 1336 -1016 321 3365
1050 3365 564 -1653 440 1783 -195 -2205 -2077 -1371 -331 251 -338 -2411 471 1993 -1421 -2867
1066 -2867 568 2645 569 -514 1544 1844 1749 883 -1401 -819 2424 1021 -3087 -3294 636 59 -1818
1083 -1818 -1263 857 751 -18 -750 -1743 971 3690 94 -1747 -683 1193 269 -1 1479 715 329
1100 329 -1294 -1845 -2355 -741 416 -1306 -2327 547 1996 569 475 1200 1129 500 987 147 -923 1351
1118 1351 1542 -1493 -1718 1211 1006 -1195 -2255 -508 249 106 -125 -1456 -98 825 872 -582 1548
1135 1548 3971 1657 -1322 -356 906 348 123 -1512 -1508 -763 828 -742 -895 -205 1572 -1053 -2529
1152 -2529 -358 917 1441 1377 744 392 2591 2401 -164 87 761 789 -1774 -1755 -196 1062 22 -1479
1170 -1479 -1127 -933 831 -151 -1951 -988 1291 518 387 1158 2024 2401 -131 -628 367 981 1129 -1326
1188 -1326 -2188 -1469 100 -1123 -1214 69 721 -552 -986 -1748 918 179 -48 -492 -653 923 1548 2258
1206 2258 391 656 891 -892 -2073 -1552 -617 -686 556 -194 -576 751 638 394 -1205 -863 -218 -743
1224 -743 -1081 -61 924 1421 489 273 1695 1004 -417 -955 -888 438 -146 -1358 -888 744 -20 -57 813
1243 813 228 335 243 -673 -516 -788 445 340 249 285 663 727 1449 1320 24 7 -310 -265 -754 124 67 -62
1265 -62 -634 -149 498 -207 -758 -386 113 576 123 377 762 1341 1530 9 -36 696 -468 -1117 -214 105
1285 105 -907 -93 -260 -262 -189 -101 -254 -476 768 796 166 316 947 694 549 476 936 227 74 -471 -895
1306 -895 -1708 -1645 -237 -893 -1278 376 -40 372 485 189 484 -73 942 -271 834 886 1123 794 1533
1325 1533 1196 -394 -1239 -1630 -1408 -761 -1360 -1013 -123 -185 -113 -456 707 397 608 515 373 1539 457
1344 457 888 -153 859 -24 237 -232 -590 -432 -947 -1510 -1286 -604 -1350 -496 -226 -286 338 835 1323 1496
1364 1496 1154 -634 659 459 767 -3 679 -92 389 -709 -223 -903 -484 -839 -908 -706 -179 -539 311
1383 311 767 112 108 564 1258 844 654 -557 503 75 264 -184 -226 -290 -321 -933 -1154 -363 5 -617 -684
1404 -684 489 -28 -591 616 269 604 615 1145 507 235 425 63 -576 324 -157 390 -49 274 -254 -1333
1424 -1333 -1926 -217 -762 -261 -469 -1133 149 1277 565 113 1013 779 669 606 900 118 600 478 -971
1443 -971 -772 -658 -554 -1104 -861 -551 -15 -938 -472 -21 65 1070 356 298 1266 1828 904 786 278 1174
1463 1174 -157 -1113 -843 -1050 -1049 -942 -1476 -1068 -822 -286 -778 -2013 -25 1358 -259 -433 605 789
1481 789 449 1500 714 495 1238 709 -163 -1305 108 -377 -896 -1935 -1061 -1278 -985 63 -960 -593
1499 -593 1480 1904 -831 403 2331 1650 198 288 1977 718 837 -127 -1580 -333 -460 -1349 -3506
1516 -3506 -1165 -396 -577 -1069 -370 18 276 713 -385 544 2274 2238 467 -394 1964 2554 -479 -2099
1534 -2099 -328 268 -542 -1289 -2323 -1454 77 -186 -2061 -838 1415 1530 560 99 1589 1443 1932
1551 1932 463 -1133 547 2363 -316 -2155 -356 1502 -709 -2965 -1691 192 120 -343 -1674 162
1567 162 2287 1925 -313 -1130 1783 3141 127 -1095 873 2311 511 -1334 -1383 -1106 687 -287 -3951
1584 -3951 -2242 1154 1029 -1931 -1495 1640 2259 592 -70 329 464 2454 571 -2365 -119 2771
1600 2771 13 -2548 -1813 1557 -365 -1768 -1804 -666 243 745 -2123 -2446 1364 3725 -400 -1219 1627
1617 1627 3774 1127 -323 -1741 -125 1209 282 -2900 -2026 1936 1686 -1989 -2865 460 872 -149
1633 -149 -2234 -671 1580 2287 384 -2377 792 3850 1292 -2462 -1145 2227 1294 -2048 -2391 -999
1649 -999 1817 586 -3015 -2846 399 2490 -1728 -3807 -137 3572 1744 -1662 -583 2517 3713
1664 3713 633 -2910 -855 2936 1788 -2435 -2321 1206 2482 -760 -2614 -1059 1813 1140 -1781
1679 -1781 -3191 194 3265 322 -3543 65 3689 2890 -1253 -2444 276 3143 1337 -3072 -2227
1694 -2227 1328 3378 -1395 -4558 -540 2912 815 -3255 -2336 1635 2368 607 -2787 -459 3476
1709 3476 2557 -2587 -2601 3341 3699 -88 -2420 -884 2266 1317 -2687 -3352 619 3465 -434 -4209
1725 -4209 -1386 2536 1738 -2383 -3409 1381 5008 1459 -2663 -1572 3234 3675 -1624 -3512 629
1740 629 3527 389 -3304 -2502 2842 2961 -1478 -4425 -1404 3673 1929 -3646 -2613 3255 3565 1
1756 1 -3853 201 3978 1772 -2704 -3790 2506 3419 -1005 -4930 -1977 3338 1921 -2747 -3192 1231
1772 1231 3830 -46 -4110 -2401 3819 4093 -1348 -3703 1368 4896 2118 -3876 -2080 2935 2577
1787 2577 -2139 -5169 -348 3357 1102 -3647 -2757 2349 4192 -1351 -4102 -337 4648 2789 -2702
1802 -2702 -2707 3159 4141 -1219 -4133 -534 3300 2382 -3875 -4303 1533 4214 -1151 -3890 -1206 3732
1818 3732 2957 -2465 -3665 1297 5105 660 -4056 -2198 4170 3658 -2234 -4397 1110 4655 1349
1833 1349 -4426 -2936 2786 3673 -2875 -5421 -55 5089 1424 -3380 -2915 2808 5034 -1773 -4103
1848 -4103 -1222 4382 2592 -3324 -3329 2866 4472 -395 -4321 -787 4361 2782 -3743 -3610 1151 4435
1864 4435 -574 -5067 -1970 4194 2871 -3265 -3685 1145 4851 815 -4980 -2702 4720 3887 -1909
1879 -1909 -3710 913 5055 1142 -4467 -3325 2938 3801 -2285 -4878 509 4941 1702 -4431 -3111
1894 -3111 2964 3732 -1168 -4893 -468 5043 3505 -3556 -3609 2487 4677 -484 -4907 -1280 3666 2593
1910 2593 -3833 -4551 2444 4437 -777 -5169 -1524 4875 3650 -2688 -3814 958 4775 640 -3902
1925 -3902 -1988 4045 3219 -2023 -4820 -245 4147 324 -4571 -3335 3194 4882 -1375 -4412 -39
1940 -39 4771 2386 -4052 -3378 2417 5144 125 -4648 -786 5039 1762 -4512 -3666 1986 4581 -707
1956 -707 -5385 -2187 3870 2610 -3057 -3665 1670 4161 129 -3990 -1539 4074 3197 -2409 -4349 1163
1972 1163 4946 1152 -4348 -3351 3061 3495 -2781 -4917 215 3970 1197 -4176 -3612 3719 4605 -834
1988 -834 -4545 229 4476 2762 -3580 -2994 2630 3890 -1045 -4001 -1292 4589 1447 -4263 -3648 1355
2004 1355 4288 -780 -4418 -819 4355 2956 -2252 -3400 1578 5019 1325 -4072 -1660 4358 3829
2019 3829 -3030 -4980 314 3630 695 -5057 -2800 2775 2884 -2327 -4523 136 4692 1376 -3320
2034 -3320 -2301 2891 4535 -275 -3852 -565 4120 1750 -3324 -3554 2614 3399 -1204 -4388 -2398
2049 -2398 3688 1575 -3861 -3889 1781 4067 -795 -3848 -1180 3640 3402 -1660 -3652 1261 4915 459
2065 459 -4225 -1724 2666 2774 -2451 -3699 -57 3442 174 -3401 -2017 2016 4445 -2067 -3443
2080 -3443 902 4990 2004 -2925 -1824 3512 3700 -1692 -3872 -788 2790 1632 -4049 -2764 768
2095 768 3392 -1246 -4328 -515 3224 2021 -2174 -3207 1934 4174 484 -3396 -530 2720 2756 -2229
2111 -2229 -3555 945 3368 30 -3821 -2835 2066 3016 -1860 -3518 -240 3475 161 -3463 -1660
2126 -1660 2906 3137 -53 -2365 -646 3511 1779 -3387 -2542 2613 2677 -1183 -4259 -611 2561 1653
2142 1653 -2711 -3492 1138 3149 -254 -2818 -557 3488 2241 -2044 -1932 1654 3225 351 -2506
2157 -2506 -1295 1425 1408 -2401 -4013 453 3007 418 -3762 -1751 2331 2390 -781 -2384 246 3318
2173 3318 1828 -3083 -2478 2154 2856 -765 -2808 -101 3073 440 -2610 -3052 1021 2425 -1615 -3375
2189 -3375 -158 3272 2392 -1960 -1598 1753 2817 -116 -1456 -733 1666 1924 -1180 -2794 480 2929
2205 2929 -906 -2803 -1755 967 1458 -1808 -1419 554 3280 1372 -2313 -1332 2203 2055 -866 -2904
2221 -2904 393 2863 1060 -1635 -1394 679 1739 -1380 -2899 -734 2410 1172 -2021 -1742 1956
2236 1956 2000 40 -2498 301 2348 1805 -1173 -997 798 1987 -245 -2701 -200 1713 1611 -1629
2252 -1629 -1561 177 1768 -289 -1815 -1422 1159 1406 -1058 -1459 789 1838 511 -1787 -578 1989
2268 1989 1715 -555 -1970 -781 1293 297 -2336 -1720 1778 1402 -616 -1930 -292 2009 670 -1693
2284 -1693 -1016 1159 2701 753 -1381 1009 1708 1245 -1059 -1185 470 1382 -260 -1791 -809 1507
2300 1507 775 -1365 -2175 428 1787 -166 -1140 -359 1812 1397 104 -1034 807 1755 909 -1352 -971
2317 -971 426 1173 -182 -1986 -403 918 -236 -1637 -1657 1177 1316 -623 -1547 -368 1578 1473 -648
2334 -648 -370 1252 1322 602 -1621 -688 1427 714 -622 -1105 -473 770 -446 -2210 -1017 1067 503
2351 503 -700 -1897 -286 1397 1002 -1246 545 967 639 57 -841 7 1070 61 -1408 -1256 312
2368 312 6 -1189 -715 -106 702 232 -670 -681 1510 1434 353 -392 69 940 498 -711 -951 -299 876
2387 876 -390 -1186 -248 -197 -89 -229 -794 210 812 465 -864 -412 1076 1123 -1096 -568 322 716 654
2406 654 -472 -552 619 181 -216 -605 -363 478 22 -953 -453 513 685 141 -975 130 591 414 -190
2425 -190 20 372 838 -441 -805 60 647 970 -318 -1011 -37 706 -975 -1173 -79 92 377 -451 -12
2444 -12 525 716 45 157 -465 143 703 -204 -422 132 70 235 -240 -675 263 396 -189 -619 -101 332 573
2465 573 683 -938 -52 349 18 -392 -316 410 426 -681 -968 266 1477 192 -1154 -202 130 202 -595
2484 -595 -425 468 204 71 -1048 206 321 731 -134 339 571 750 693 -374 -484 125 -419 655 423
2503 423 131 505 405 -20 112 -486 288 -138 -873 -356 -110 190 402 562 -289 -502 317 -788 -303 430
2523 430 -351 -382 -851 -501 171 -217 -32 55 -29 223 -756 462 -541 193 -190 -206 216 424 220 -489 385
2544 385 510 454 452 -400 313 481 366 431 -3 -923 209 56 -726 -195 418 424 473 57 -135 110 497 -473
2566 -473 73 976 360 -469 405 305 -390 57 768 -894 -204 111 119 -141 148 10 -107 -306 391 960
2586 960 -203 284 270 25 -139 21 2 162 89 78 -636 -328 193 -83 130 446 324 358 -712 -384 -136
2607 -136 -98 198 560 -377 -222 -176 433 285 -143 -176 489 -7 585 -392 -568 382 -33 238 -314 132 -244
2628 -244 277 173 238 -479 971 1 -481 -203 1016 295 -29 374 233 -96 30 205 534 -24 -277 -857
2648 -857 328 -559 -222 343 351 107 142 146 -262 504 117 185 349 -293 296 488 46 79 44 -74 -541 -242
2670 -242 -108 -17 -784 -353 -998 53 -22 277 50 79 -235 -237 -158 -266 208 517 250 -206 414 343 -90 124
2692 124 -780 -73 5 -33 130 -206 -185 -439 356 156 -236 222 -28 327 -50 305 -29 223 -302 -32 -172
2713 -172 142 311 -443 -1059 -466 250 -274 422 517 -288 -347 514 -18 634 60 -119 251 -385 396 367 -354
2734 -354 97 490 -28 56 -238 91 -313 -387 774 -467 -336 -226 174 -516 -153 85 548 346 121 -81
2754 -81 -669 369 86 -286 87 333 193 -60 -398 -81 -89 -22 -234 296 683 532 50 -72 -34 6 -174 53
2776 53 -290 -189 720 252 6 -26 447 528 -461 -104 29 -102 153 -319 263 569 -290 61 -78 -543 178
2797 178 16 456 191 122 -423 -188 29 -581 224 718 -100 -541 -325 -22 -492 -431 398 227 687 310 -134
2818 -134 -72 -127 201 -394 -49 -195 57 316 62 474 604 99 370 -695 297 646 240 -6 354 193
2838 193 101 -363 351 -603 -671 -192 -279 558 -260 -170 -132 763 106 -42 -436 597 150 -323 368 983 -196
2859 -196 513 72 -402 461 27 107 -68 -123 -500 575 130 289 44 1085 201 436 504 -360 -895 -283
2879 -283 -362 -624 83 501 -368 313 288 -304 -473 -557 76 -85 356 -165 266 -179 -21 372 17 416 229
2900 229 -920 319 -409 674 -386 -670 383 -209 -594 839 -302 163 -323 209 -462 -92 469 -294
2918 -294 22 131 -28 -200 242 -48 321 122 -65 353 531 105 396 78 174 657 142 -443 -24 -61 -94
2939 -94 726 -660 -891 265 -483 -235 105 380 -205 29 469 47 153 -688 575 312 -43 -183 -500
2958 -500 931 285 200 -444 306 249 72 181 -897 -5 115 473 174 -435 -369 373 -261 -154 -322 70
2978 70 -495 152 189 -421 104 587 406 141 635 107 196 -152 760 49 -40 -862 -49 -142 44 279 554 -113
3000 -113 302 183 297 112 -71 772 -458 -32 -134 -307 131 295 907 466 -120 135 34 -486 81 49
3020 49 116 394 -63 -297 -332 139 -198 -161 607 685 227 271 -316 -127 503 363 91 23 23 604 -311 492 447
3043 447 -403 -69 -571 91 -365 -520 216 -379 71 11 108 -188 -331 -150 -387 84 210 -31 -724 401
3063 401 189 -284 343 110 209 -221 -5 330 -86 -311 -238 -909 -35 -67 312 740 -203 -44 -821 155 83
3084 83 -459 -35 395 -487 -111 -40 -556 -231 -251 -109 506 -174 470 203 -650 18 -520 33 -567 -114 1
3105 1 491 -75 354 148 755 -29 -498 56 108 633 -523 -220 -249 523 -202 -781 311 376 230 -544 -667
3126 -667 282 -136 -381 268 742 573 -136 -389 408 302 -157 -539 -146 -996 -135 451 -813 228 -129
3145 -129 -587 -95 -130 -184 -247 550 -664 350 228 -526 20 -368 77 420 964 791 -771 4 -349 -522
3165 -522 -108 406 -340 -72 -37 73 225 380 -287 35 -539 -48 249 366 572 120 84 -184 64 227 -177
3186 -177 672 -448 137 10 -171 -54 -270 14 278 -152 -163 202 -46 147 433 -603 608 966 -17
3205 -17 -259 674 204 -116 161 201 -215 76 -9 -4 -125 -374 317 -339 104 -723 -20 -386 -96 -332 -459 47
3227 47 -40 137 186 -146 -684 -361 -221 -74 292 74 548 546 -304 366 748 17 414 -394 -271 411 809 -560
3249 -560 -173 162 342 -821 -788 249 -4 435 251 94 -256 -214 -141 720 -275 211 463 -525 -15 459
3269 459 237 -115 68 -314 -117 337 287 -506 305 -726 -152 56 381 352 498 488 528 177 102 179 220 300
3291 300 48 274 496 157 569 144 414 -210 334 176 -1074 377 140 590 -413 -105 -25 -94 -791 -831
3311 -831 531 490 431 87 -3 -435 479 -5 -33 346 -524 -78 -122 427 426 28 -94 243 -457 383 -465 -424
3333 -424 664 -265 -209 592 -1 276 68 284 430 -526 -92 359 456 378 -123 294 930 -349 454 473 -442
3354 -442 -529 623 18 -379 528 -185 -264 318 129 -504 487 -230 -116 -4 -529 -106 -450 -64 -265 -75
3374 -75 715 -252 -752 513 -59 87 133 159 633 62 -90 -398 124 -96 -157 -68 424 100 -37 -91 243 -128
3396 -128 450 -217 -99 -37 -280 274 -78 -93 -473 65 442 111 761 -26 359 347 -239 341 641 312 -190
3417 -190 41 -135 -23 -169 -581 -202 468 816 -289 -115 -401 517 -270 -64 135 -343 -293 157 -499 342
3437 342 86 -513 299 140 -302 -325 -85 -408 598 -306 -133 186 -11 -126 -502 -278 15 302 714 237
3457 237 -203 302 286 -8 -816 238 453 56 257 -73 466 -102 372 134 -142 -91 443 -268 -268 -156 431
3478 431 391 -68 24 -220 630 490 -212 -724 449 97 -590 381 -68 198 7 168 -282 -77 -256 -246 -91
3499 -91 -53 216 343 186 -87 45 -400 -127 313 -917 -60 492 -219 -125 525 535 254 42 101 242 707
3520 707 -70 301 472 -354 -534 328 -96 75 3 245 -552 282 -1 -337 -371 -15 122 99 275 -258 -522
3541 -522 -99 445 471 199 314 73 -691 -129 266 104 830 -434 149 241 -170 -315 -156 -184 -273 635 -66
3562 -66 -194 187 -22 -384 -572 111 143 -302 56 -158 -172 -293 80 -119 198 -324 149 -608 -797 125 728
3583 728 -26 -450 96 -20 -463 -221 -200 161 1112 151 -352 -392 1007 1312 196 -156 -274 377 270 -364
3603 -364 146 749 -121 -285 -23 -174 80 572 -718 153 443 164 467 713 -171 951 566 32 151
3622 151 170 883 -578 -183 -106 757 -669 -297 -74 244 451 683 -673 480 38 330 -519 -208 -148 944
3642 944 54 -502 -344 167 587 608 63 -700 422 -354 -493 537 793 -291 266 -117 -489 -69 572
3661 572 -283 -124 427 955 434 34 -750 810 -910 -374 -303 165 222 -618 376 388 -5 -13 -25 -185 919
3682 919 -135 -253 171 830 262 -18 -143 -496 153 891 287 -951 -23 86 -443 -83 -17 227 482 -57
3702 -57 -1292 -1101 243 585 362 -1025 275 3 -355 -659 189 978 62 -472 -540 -311 872 8 -989
3721 -989 -190 -341 207 139 -603 -237 34 -97 -163 -28 639 -251 -13 -293 458 201 361 282 -90 262 -279
3742 -279 786 233 -395 756 -60 -31 -611 360 -158 -209 30 135 474 649 -345 -529 -354 1035 -361
3761 -361 -42 589 -804 466 378 956 -167 333 232 -756 -77 292 578 26 -476 590 414 572 -847
3780 -847 554 -510 -267 -478 -776 643 339 -134 8 -20 -523 -366 151 -257 250 -209 -435 236 -407
3799 -407 -264 439 -1038 -203 353 441 -322 -138 -313 50 1203 18 -164 218 491 -74 -323 -355 -177 399
3819 399 231 332 -330 551 102 -68 237 328 -404 45 -161 -499 626 646 175 -381 -887 111 725 -187
3839 -187 182 69 315 -563 -252 -288 439 -182 42 147 -26 821 573 147 -589 -205 170 415 -190 -71
3859 -71 702 -406 -281 -832 -81 268 206 179 -287 261 -454 -542 -287 -358 749 231 -100 -728 212 -540 48
3880 48 -657 -172 45 508 -531 -852 570 403 118 -125 602 17 -27 -684 -428 361 867 -230 -738 -209
3900 -209 110 -291 410 -529 -234 187 269 -606 -323 -195 -17 -17 -287 388 210 -110 -701 303 408 -31 -805
3921 -805 -184 120 275 194 33 2 53 535 623 -426 415 456 251 -39 663 195 607 -208 -105 770 309
3942 309 346 -93 -236 122 -373 167 -797 66 -25 1081 -489 -504 -12 129 486 -488 260 828 -248 -234
3962 -234 96 238 -138 302 -103 930 20 535 -362 37 -184 -7 -298 -676 -137 -91 272 -536 -505 346
3982 346 474 500 -365 -97 128 187 -218 -375 -354 692 -112 -283 -383 128 -342 -55 -873 -218 591 -119 -805
4003 -805 -434 295 49 203 -526 -395 -419 463 -499 159 -230 238 -561 -798 376 91 67 -103 -154 477 873
4024 873 197 -305 -628 164 -10 -760 -156 781 158 -322 -562 321 535 -802 -512 74 282 -278 -177 -520
4044 -520 161 -130 355 -44 -283 515 538 601 242 -384 789 816 246 178 -90 897 50 1 166 -511 28
4065 28 -220 51 38 601 160 -63 253 429 397 40 -442 354 -79 174 49 -702 141 68 -163 175 -600
4086 -600 -109 238 -248 -346 -601 -413 576 162 368 345 -74 -198 -361 -404 79 477 49 189 312 64 248
4107 248 428 -562 85 469 625 -431 271 36 -305 -1152 -486 561 481 531 -307 -565 -244 36 -900 77
4127 77 305 252 209 312 -77 129 424 -298 -50 243 6 -28 -328 -66 534 824 121 -32 -148 -36 -43 -720
4149 -720 549 306 -187 262 170 -26 445 336 344 519 -80 -83 161 888 399 -108 -35 36 423 -30 73 -200
4171 -200 134 323 -96 192 2 102 -136 22 -214 215 -74 58 206 -735 283 -224 -80 544 1096 -74
4191 -74 -303 422 197 -713 25 573 70 -305 -480 421 809 817 -103 -294 837 376 59 -156 277 120 -142
4212 -142 175 488 988 -412 -229 -571 182 234 -332 111 203 18 308 -172 17 163 113 223 -169 -584 9
4233 9 -560 27 359 51 1188 373 114 21 97 587 -153 -8 -372 231 159 362 -52 -173 -44 286 153
4254 153 279 458 -661 -435 750 314 -221 -95 184 -254 53 436 -37 -55 585 852 -673 -252 -339 179
4274 179 262 464 -49 -631 -52 214 -361 -197 140 -46 -118 385 -257 -125 470 28 -484 840 326 115
4294 115 -333 34 134 -117 -203 -423 124 -414 -416 438 165 116 241 211 -186 -42 -75 -479 -686 15 81 -454
4316 -454 609 80 408 -408 -361 -221 -371 143 -416 353 283 91 -460 -450 -503 427 -289 713 -918 -649
4336 -649 -540 -81 -34 -613 -442 88 -4 635 127 -89 -532 -2 162 -277 -798 -324 366 17 238 319 364
4357 364 -451 -141 380 -138 -63 222 74 -215 -5 -31 304 -102 -191 -654 -240 -409 8 -671 -448 68 81
4378 81 142 -211 230 431 -503 553 977 905 -34 -83 659 -58 230 250 -312 512 337 -139 -30 880 210
4399 210 87 -606 -311 -144 -86 564 322 9 -2 204 -144 100 108 215 -772 612 99 345 -520 385 -744
4420 -744 560 20 -758 -965 -717 104 457 -406 -343 -231 -425 531 -36 -416 207 1066 -319 -247 374 -605
4440 -605 -407 -120 -72 -128 -49 -176 -776 375 -267 496 89 -239 510 -820 258 609 335 157 27 -232
4460 -232 158 504 562 -686 228 1218 613 316 -75 644 135 353 -83 114 -507 -635 818 197 -297 166
4480 166 634 401 130 56 597 -349 87 44 -80 58 -295 138 667 344 708 -203 -183 225 103 -169 -93
4501 -93 71 -300 245 338 -141 -397 84 397 6 -421 511 -795 -167 -278 -427 -467 -33 -238 -702 949
4521 949 412 -37 -48 480 477 137 -135 -37 169 -509 435 230 204 393 137 71 -388 -137 118 -386 -38 241
4543 241 518 284 -131 -298 -23 -266 288 173 149 594 567 757 436 301 179 144 -174 -222 656 774 10
4564 10 -484 -37 540 -325 8 412 359 -116 383 60 -139 -167 140 -233 -456 222 -421 97 -191 375 -27
4585 -27 -96 349 -206 324 -357 100 -386 -110 -89 -541 -179 -191 1427 259 -40 -333 477 -765 572 633
4605 633 -175 69 -83 -237 463 67 -994 -703 -164 755 44 546 99 -727 319 -138 426 -347 164
4624 164 -494 232 486 205 452 -72 329 -585 -60 -43 1658 -539 -717 -112 634 23 -1 -213 -421 443
4644 443 99 926 -100 -373 -66 44 -186 246 262 -66 508 -155 -446 747 305 -599 578 156 -11
4663 -11 -895 111 -86 419 500 -336 -349 -185 -9 -326 91 -259 -163 -408 -445 -515 -239 -268 -614 597 14 212
4685 212 43 -447 620 148 -215 -315 378 -135 291 108 0 430 -202 -97 638 -460 -46 -217 -106
4704 -106 124 -205 -778 303 172 -207 -98 351 -105 107 22 3 -228 -144 -101 420 403 -236 -123 -197 -370 -275
4726 -275 -168 -249 -144 577 195 663 328 -178 92 -291 -290 231 -17 -82 -335 463 -254 -306 132 -481 423 601
4748 601 617 228 -235 -146 26 -202 -341 -398 -676 -45 4 251 468 -234 332 304 -129 -934 -63 20 -183 -31
4770 -31 271 100 -3 -836 -423 619 -145 -661 776 466 -115 -342 -55 -813 428 351 255 -358 -780 -163
4790 -163 -606 11 -225 -388 -163 -303 185 -446 250 -88 -558 846 915 165 204 123 468 -200 114 70 -513
4811 -513 289 -228 34 443 -242 -894 425 -253 -306 320 320 122 -216 105 -78 -467 338 -55 -482 253 383
4832 383 328 -58 -113 202 757 -391 379 43 -136 -214 93 -30 -598 -385 -54 -71 411 -187 -364 -111 -555
4853 -555 -311 -517 -127 156 6 -581 -16 269 502 -105 622 351 80 541 353 -331 138 -276 15 -146
4873 -146 105 325 -663 -295 -307 2 -86 -550 -27 54 -196 -375 371 -472 -526 506 104 112 -437 -103 -108 175
4895 175 293 -43 -513 940 448 -625 38 170 -166 -161 635 456 -196 91 -63 -588 -64 165 -176 291
4915 291 239 -353 327 270 186 -287 -597 313 135 -125 -56 2 211 1057 51 625 -975 -8 399 -87 -88 -126
4937 -126 32 312 297 -461 -550 -345 298 376 358 269 72 507 263 -891 -529 261 95 -482 -371 273 -557
4958 -557 -145 682 -329 193 -596 375 189 -273 328 -323 155 846 95 136 -115 -451 281 -281 590 580
4978 580 107 -39 713 -16 -202 -35 -469 625 -393 -820 306 196 -218 73 380 142 535 438 316
4997 316 90 710 -524 111 691 627 12 222 -201 -167 -289 -237 -665 20 -803 467 343 -394 -388 498 -136
5018 -136 103 -551 44 164 -450 497 -341 -100 75 -15 -386 -57 -18 679 -776 468 -48 -303 75 426
5038 426 114 334 169 -19 284 209 -96 -434 93 -125 283 -484 -51 -497 -355 451 -108 46 -79 -83 -43
5059 -43 -136 -798 -311 85 634 473 -199 -512 673 -17 293 109 143 448 -173 -456 777 536 310 178
5079 178 1336 170 -594 -108 469 166 -463 -392 -146 -519 775 -529 -315 107 111 113 -365 -38 -30 312 -592
5100 -592 -92 268 -600 103 11 425 -348 409 497 -905 360 102 -299 -241 694 -400 78 290 143 -348
5120 -348 -385 -762 395 4 222 236 108 -521 -154 147 -122 31 754 225 -393 104 -332 381 -452 -407 405
5141 405 478 -108 117 228 -165 389 -428 -192 -89 -112 733 19 -1156 -554 297 368 -289 482 -33 86 -253
5162 -253 -367 127 396 -61 201 614 -207 101 -897 58 -404 -423 -42 -345 -509 -148 -89 586 -27 90 -250
5183 -250 -211 40 -396 -468 857 47 -482 280 428 676 59 -349 -322 -221 348 182 -183 125 -318 -89 225
5204 225 -252 286 511 -35 -179 76 382 -593 291 683 512 -221 156 -554 139 -423 8 262 23 -450
5224 -450 662 -188 -583 -61 -615 -21 -336 36 -190 -638 -287 199 -402 -241 306 454 -152 43 604 367
5244 367 -86 18 140 -170 598 -326 739 -492 -166 86 -603 -116 694 301 -57 94 -212 -181 -369 733
5264 733 559 317 1044 582 -377 194 -36 -312 30 -144 -398 364 577 29 112 1007 238 -508 587 -134
5284 -134 204 -208 -448 -183 -188 140 160 299 -169 -205 102 -673 10 -167 -347 -477 -775 55 188 174 -722 773
5306 773 202 -211 -733 -321 -50 -12 468 230 -433 512 -1 171 705 93 -258 -258 328 120 -559 -95 344
5327 344 -429 268 -93 -328 346 454 97 602 987 -518 -292 -168 -508 -414 -192 13 -461 -203 -118 250
5347 250 -356 -25 516 120 54 -71 256 -335 -278 -501 654 -193 -230 137 290 -350 -18 -78 418 -970 -232
5368 -232 20 -283 457 498 207 -58 -574 466 -236 638 4 -9 -217 84 752 243 111 293 200 -465 -448
5389 -448 -191 195 383 161 -24 -274 -219 76 688 267 25 60 114 -46 586 -324 17 -14 415 375 -73 308
5411 308 -441 -134 178 -177 -272 143 268 295 367 -78 -258 -105 778 -455 1030 155 499 -33 -148 286
5431 286 496 -211 -1069 -38 375 427 62 680 -445 -366 -288 -281 -77 -319 -254 -13 55 -115 -270 -881 -21 -432
5453 -432 111 379 -301 649 -208 245 306 565 -40 -359 -46 -386 286 336 569 -50 426 -79 258 -269 -312
5474 -312 441 -279 -73 -419 464 41 -343 436 635 113 -103 191 -240 -37 -204 350 77 -92 216 -286
5494 -286 -208 702 250 -219 48 -223 606 615 332 647 206 -251 -313 257 46 139 -211 634 -529 306 -800
5515 -800 48 225 -204 -209 -298 343 -226 231 -232 -73 441 -255 316 -580 73 -107 -507 190 457 550 -200
5536 -200 -291 181 550 -486 -131 87 -470 -633 -112 -238 -861 -168 864 325 -317 179 -738 1015 -652
5555 -652 -447 70 337 -211 -468 186 47 -118 165 338 -455 1025 -496 227 -22 -31 -238 -220 11 548
5575 548 -220 25 405 710 190 222 21 891 705 -562 428 -401 565 -196 -511 365 40 61 256 123
5595 123 -437 184 718 -36 -350 -937 144 182 -179 131 268 191 171 -267 114 694 -98 -224 541 -526
5615 -526 207 -325 -573 303 248 -139 192 226 1027 -206 617 170 -278 -587 264 -734 545 538 -638 52
5635 52 26 -215 -96 256 -479 -201 -133 254 250 -248 -379 -508 450 -585 751 484 -72 307 -508 -784 -220
5656 -220 24 -752 -150 138 -91 104 -87 152 163 -537 365 -319 -29 285 -245 -147 -564 -77 84 -7 -59
5677 -59 222 -229 9 221 -32 37 -26 738 303 -396 629 251 -225 351 -321 -303 -451 -476 -511 -93 355 235
5699 235 547 200 -190 541 338 344 -335 127 194 237 855 -180 78 204 438 -563 907 155 205 244 49
5720 49 -166 -414 -244 302 616 223 -182 -903 -195 226 -143 275 494 876 304 138 -430 31 347 -344
5740 -344 -278 149 558 322 57 99 -168 58 -424 52 -212 628 20 -256 535 666 417 -296 -141 -432 -318
5761 -318 709 -302 290 230 433 95 74 323 -208 -17 -76 451 -271 -124 -48 -67 681 153 -329 589 -945
5782 -945 -258 -263 642 -312 -489 36 -943 -311 -121 -172 632 -375 -256 591 -353 434 -530 178 244 24 -158
5803 -158 -343 -393 -21 222 20 -336 102 8 -285 431 -83 32 253 146 -316 531 319 209 237 -80 505
5824 505 175 -399 337 81 -335 111 -345 -185 -163 28 218 -396 -518 -310 -191 -118 359 148 -122 -345 338
5845 338 191 -467 -165 -687 363 132 -253 -591 -371 9 -16 11 657 82 -328 587 -361 315 -557 268
5865 268 790 501 -78 309 15 485 299 979 -63 458 421 -246 785 -66 124 -720 -251 154 216 123
5885 123 -93 215 -495 -183 -67 -262 -123 -473 -123 604 -19 97 102 256 -331 -177 550 148 464 -573
5905 -573 261 87 32 -79 -22 87 -284 -473 -188 -38 60 -311 92 -332 -461 4 -651 -946 396 174 -683
5926 -683 -122 -498 -61 -185 407 294 392 -309 305 -501 276 208 -540 -488 427 39 -64 80 73 155 97 -226
5948 -226 -3 832 -167 50 605 -121 28 26 476 446 -507 241 226 357 -144 330 18 153 -579 -526 -1069 180
5970 180 -332 223 -145 -267 -836 -108 25 69 -559 386 423 -141 -129 -410 338 -698 421 -570 572 102
5990 102 420 -508 -178 -17 -543 94 -465 -557 424 -827 245 -229 -30 -207 -538 580 349 763 -81
6009 -81 448 -323 79 138 19 -799 -252 791 467 115 -493 -451 -725 142 -230 49 -149 -211 21 -246 64
6030 64 -209 -596 145 -97 661 -16 -60 -65 -375 645 -321 159 -943 373 797 -514 -242 -239 -230 -257 177 253
6052 253 67 130 191 44 640 251 337 135 -746 -88 315 -989 -438 613 64 -438 -832 10 471 -201
6072 -201 -530 353 475 -227 311 452 529 412 -30 366 -282 65 -15 20 704 -46 -110 419 285 -1039 45
6093 45 507 -123 -286 354 74 -595 -956 120 -69 -123 -31 4 205 150 -15 -20 646 -132 283 -56 -159 75
6115 75 563 534 467 191 -298 -54 -669 364 -17 4 -165 -146 151 322 6 -278 -236 300 -294 -163 -433 -77
6137 -77 208 -695 55 -342 618 -607 218 394 13 -44 -227 -466 -396 -120 151 17 306 -413 -49 -187 860
6158 860 -134 -485 378 111 160 491 -339 27 55 504 16 147 -49 -373 -142 545 480 -22 861 349 -161
6179 -161 76 -325 12 210 -59 122 148 -87 -123 150 555 -374 -197 -162 -80 194 564 223 690 172 -439
6200 -439 286 622 182 -652 397 520 -27 -440 -802 161 -319 282 110 -191 390 411 184 -71 -239 -143
6220 -143 72 -466 684 488 -297 348 79 388 -243 190 -254 124 333 -125 519 -402 1084 -229 474
6239 474 -309 -74 -275 791 638 -460 195 765 -118 -57 577 602 102 168 124 406 57 -333 -527 81 336
6260 336 538 838 157 -31 -637 39 -421 -347 -305 -34 -596 335 -38 -146 79 -319 327 -82 -851 554
6280 554 271 -15 132 683 171 -74 390 326 971 215 6 618 -95 381 -311 -497 289 -486 576 778
6300 778 -293 571 -582 -68 -481 -178 -281 38 -216 154 234 188 -220 -115 157 -895 607 -62 -205
6319 -205 -501 744 -79 121 105 93 -575 315 483 155 -110 84 -167 612 312 373 382 143 -365 -145 -234 646
6341 646 -594 357 -33 -183 409 196 443 797 119 300 -6 909 642 34 -206 -720 94 -123 159 359
6361 359 -544 82 -306 -86 -673 526 -319 20 586 -923 728 -595 -313 -364 510 560 362 27 175
6380 175 342 -574 -55 500 567 642 318 -515 -85 69 -386 -363 -52 373 -10 114 705 877 105 -105 -330
6401 -330 -113 -238 11 -79 -318 222 -4 227 158 -430 -512 -586 -257 324 -221 631 259 161 -314 176 -665 98
6423 98 101 -22 -809 113 -415 629 153 -294 -52 -318 78 -36 188 -56 -73 -109 96 -227 -372 -122 897
6444 897 415 -209 379 439 -390 -177 -744 390 391 1078 717 -9 353 399 522 -121 -135 -112 279 -432 -179 -419
6466 -419 -227 148 101 -617 343 12 96 576 -244 -292 -147 133 -194 105 -179 -7 -493 3 -31 304 -513
6487 -513 75 -183 -449 -208 -877 -633 -117 -250 180 -328 536 -318 61 329 169 951 3 -19 469 165
6507 165 -805 -228 242 -303 -109 -218 -20 -226 -480 270 -315 219 -24 301 30 -84 -829 32 185 -181
6527 -181 -276 -596 389 30 -207 480 -66 884 -291 -523 -249 374 -351 14 483 -107 456 -504 -294 -29
6547 -29 -248 87 428 -314 114 257 558 40 288 -193 431 -71 -164 33 1122 -631 -90 222 -548 550
6567 550 -326 445 743 15 -453 -68 -448 -213 -40 -40 -575 -177 -182 757 376 0 -668 155 616 76 -25
6588 -25 724 155 -404 -321 795 -650 -562 437 -1 109 -366 666 326 -29 -59 292 -905 712 -350
6607 -350 -290 337 444 342 96 -127 155 624 133 419 -109 223 -459 -647 84 -959 -97 407 551 0
6627 0 -198 -306 -34 -247 -26 -275 -863 -390 -326 -543 27 -169 12 -430 -143 -402 -618 227 -247 -466 -99
6648 -99 59 -45 63 610 -122 530 -224 93 212 110 -31 -438 282 -284 117 91 -196 -69 -23 -675 231
6669 231 -243 465 130 201 -3 215 222 7 -472 296 -246 -213 191 -66 73 -19 -89 -165 222 -199 -517 126
6691 126 -386 258 -297 248 111 216 1029 884 512 61 121 123 190 682 125 -437 -310 106 -337 708 -312
6712 -312 -539 -392 253 -239 253 289 -35 -410 -119 42 157 102 -130 -112 -785 115 266 369 329 -24 621
6733 621 -863 -81 41 153 46 -138 -342 -194 -614 135 128 -297 -102 -687 371 190 379 -455 -526 213
6753 213 290 192 -468 -46 168 327 245 475 -233 -247 179 587 344 -207 -90 -653 85 -368 -507 -253 95
6774 95 -350 -2 -42 152 -188 12 83 -486 333 115 -32 1755 211 -258 706 349 88 -582 395 -138
6794 -138 243 90 -741 -545 572 -20 -25 549 117 74 -72 39 -742 -934 631 814 17 -6 -230 -79 369
6815 369 598 495 225 869 573 203 -83 -11 60 65 622 456 430 -781 -35 135 -304 893 209 578 -140
6836 -140 282 -198 51 198 -161 -78 -8 312 137 -143 151 -652 237 287 -85 -566 217 -357 -203 317 559
6857 559 977 -17 -413 140 -71 336 24 -374 315 486 -68 306 -170 -590 417 -577 69 333 550 58
6877 58 337 -625 283 952 240 -337 53 13 44 314 315 -532 -458 -574 -168 136 -443 -450 356 562 143 -182 727
6900 727 -103 286 578 2 645 290 -320 59 -184 -217 -364 -12 685 75 -92 201 23 -27 -486 -32 -220
6921 -220 442 95 -713 -384 -21 169 -297 -597 101 -447 -819 -70 62 280 -480 348 499 -295 -602 15
6941 15 288 -693 384 217 -558 95 -286 83 684 623 62 68 372 -25 -157 -430 -213 32 652 131 -250
6962 -250 -18 61 816 93 282 -295 -280 52 -219 217 100 65 230 718 94 -618 -39 101 -262 457 -455
6983 -455 254 162 170 101 -24 -170 -396 -137 -153 456 119 -227 -29 -574 297 28 279 202 329 25 -315 889
7005 889 119 -143 -313 -236 -392 14 232 -941 260 420 -142 26 56 -402 340 -565 -181 -541 -29 245
7025 245 -142 -613 -67 81 233 -46 333 582 -194 -360 -453 80 249 -148 72 267 -111 291 129 97 710
7046 710 335 -554 224 -387 -380 -178 181 -234 18 -30 -871 -359 827 93 -97 476 84 483 -317 897
7066 897 -122 -91 828 -277 -264 -521 -472 -24 229 232 -121 510 -73 226 261 608 17 -233 69 -584 -343
7087 -343 -863 580 29 724 -728 -286 -745 -315 -574 -47 279 -743 376 -181 196 -466 333 -627 37
7106 37 -181 -659 -371 611 597 -19 -418 -179 -133 -524 -256 -72 264 260 -248 8 -35 60 -83 -228 560 106
7128 106 321 -131 137 406 273 -144 62 28 361 -159 126 -375 346 108 411 -431 51 229 -848 -270
7148 -270 -215 -643 390 -63 -173 254 237 36 -44 35 554 -362 14 -16 -66 445 324 447 -136 -113 91 404
7170 404 663 646 -376 -393 551 272 594 -172 251 -87 440 -120 620 -242 369 283 -304 -876 -66 23 -771
7191 -771 302 87 -54 -455 322 -102 0 -133 164 244 -82 -82 337 173 110 310 524 -272 -482 -246 367
7212 367 -206 199 84 -5 397 804 -349 -57 121 491 11 -7 -398 30 378 -177 -370 424 -209 -104
7232 -104 24 -334 81 -116 168 -604 -608 -689 11 -292 730 -405 581 92 428 487 68 214 420 -270 -290
7253 -290 -69 306 -111 108 264 137 451 -298 -133 -527 408 365 221 394 -41 -481 23 132 340 51
7273 51 -445 -380 421 297 793 -157 188 -19 293 134 -412 -245 111 527 225 -127 32 -268 500 -608
7293 -608 -1152 408 350 -528 -451 -1087 250 137 627 152 601 -396 361 842 -295 6 397 -348 -213 -399
7313 -399 -124 -359 241 -136 284 280 -401 -462 390 9 75 227 -175 212 -294 286 -492 232 163 -226 -124 196
7335 196 -57 -154 174 -153 -186 -124 -176 214 58 -992 81 707 98 -144 -669 -275 4 -161 212 227 452
7356 452 -561 -350 229 392 -43 -463 -365 19 30 -405 8 251 -264 637 -176 36 417 -409 89 404
7376 404 -130 -185 -330 -110 -806 -262 -217 147 251 -242 -455 238 -60 249 317 -19 410 -154 -57 -798 -418
7397 -418 -133 576 -814 -72 -174 -268 -248 331 472 -843 12 -337 777 83 -824 492 150 -341 86
7416 86 74 -598 29 -171 -468 176 100 -427 43 180 -359 11 264 -404 168 470 -134 1009 979 -416 -398
7437 -398 -89 -230 -599 -169 -691 247 -36 -201 1 100 -374 -282 403 229 -125 -524 627 -55 803 370
7457 370 187 -852 -183 83 -142 338 -300 -503 428 41 -428 -22 563 -290 114 213 305 -233 364 -12
7477 -12 -359 309 -173 348 -612 312 -532 200 -15 372 124 -88 305 -14 89 413 -145 241 -256 -605
7497 -605 102 -588 -235 -189 -340 -259 235 -286 183 -313 -271 42 652 301 -226 -77 -159 297 34 419 349 449
7519 449 180 149 161 281 -640 -77 794 -183 192 -578 -8 -780 -240 -68 1058 -35 229 -670 -209 205
7539 205 -573 599 294 -91 -460 -295 -407 -73 986 464 -57 -422 61 39 61 -115 778 158 113 348
7559 348 -412 -370 515 -155 -100 377 -277 599 -780 67 37 -423 955 200 -406 341 78 184 -138 145
7579 145 263 436 108 -108 -925 -481 291 -48 575 452 -348 147 400 940 98 379 -248 -152 47 -445
7599 -445 199 -194 -436 -88 505 31 400 -321 191 -27 48 -403 532 -20 593 373 -36 770 32 -165
7619 -165 -185 5 639 -245 42 164 321 707 -489 645 365 -8 -227 79 -261 -411 -664 160 54 402
7639 402 36 168 -153 489 -429 103 87 -344 -123 -395 -97 182 -528 -134 -355 -13 179 119 -27 68 -87
7660 -87 -446 90 385 599 -106 -227 149 -306 110 375 269 -154 116 745 -367 -496 18 -159 -223 661
7680 661 -80 -47 58 -585 32 348 304 164 -578 463 -128 -43 -75 -1109 -226 -353 -198 26 -226 -144 641
7701 641 84 -565 239 -129 -55 -281 483 628 -272 -303 236 771 -447 495 -228 -362 37 286 -168 572
7721 572 -173 103 -390 -1067 -921 149 -329 -373 8 -844 243 -297 -89 8 -118 -207 -12 392 -458 243
7741 243 -192 173 -506 427 559 163 114 362 276 206 -33 205 131 49 175 130 164 166 -48 -435 197 537 -187
7764 -187 -63 -101 114 -2 231 -295 -108 -409 -1036 763 -289 274 161 -363 -201 359 374 -678 434
7783 434 225 -57 254 -274 80 -193 -648 -137 222 -347 282 450 -28 392 -153 -479 -815 -363 -140 -472
7803 -472 -125 562 211 393 -413 33 -35 215 -136 -518 98 -395 26 87 111 402 -539 1156 508 -196 100
7824 100 509 -539 280 -536 308 -138 245 516 2 48 210 528 690 -129 153 -2 -416 -364 -178 828
7844 828 436 534 -112 -78 -142 -543 -658 -441 160 570 -68 -135 -262 -90 -62 264 -19 305 -364 11 -341 327
7866 327 94 -3 432 58 -17 450 -709 -70 253 210 86 518 591 262 -1024 49 -43 403 7 -233 322
7887 322 -432 105 -428 9 -312 -406 -2 -58 -470 -7 -114 93 -542 -229 31 -66 593 390 -157 787 1004
7908 1004 -408 -145 930 964 346 488 -194 586 123 -375 -254 -78 50 -384 -573 -172 -164 -83 78 26 -373
7929 -373 -40 -345 -74 183 558 537 -374 201 350 325 -189 985 392 721 375 38 -517 -5 284 1030
7949 1030 -564 309 -254 -94 -38 -936 236 72 -613 65 -73 593 -552 -241 -141 -495 339 -465 -263
7968 -263 56 -431 -463 -67 -211 111 -198 69 -290 182 332 -63 334 785 380 -394 -196 274 141 5
7988 5 -324 248 149 -194 477 -611 -198 204 -417 -77 -203 -225 -305 771 73 -315 -479 -245 419 155 -32
8009 -32 216 -525 19 -106 48 -36 -744 96 -134 -133 -844 380 38 -87 340 621 -2 -534 -66 174 -391
8030 -391 -731 123 445 151 324 94 178 454 164 -17 527 613 426 -391 -1194 115 -417 -310 -559 159
8050 159 225 639 -418 490 195 234 -70 139 32 -33 300 -68 513 -59 120 325 -359 173 351 -17 -152
8071 -152 -236 30 621 501 -123 -675 565 -505 163 297 10 146 451 39 79 -79 53 -586 -406 302
8091 302 183 -230 -243 -89 -487 -343 359 -572 -1027 -460 -661 -53 858 381 -502 -282 488 70 -229 291
8111 291 -213 459 155 268 241 -395 -102 133 135 -314 -284 287 124 -319 -17 -160 -885 75 1020 579 301
8132 301 91 -195 852 305 135 253 120 335 -376 -464 235 -200 -690 -497 -290 165 -446 -73 -61 -101 -212
8153 -212 260 665 -128 811 -90 -273 -385 231 -191 -9 -636 -335 269 -229 -101 236 -63 -386 -152 -6
8173 -6 -24 650 405 -154 -824 93 -394 -334 460 -537 398 -56 581 -798 -51 305 101 -245
8191b45
##END NTUPLES=NMR FID
##END=
