##TITLE=1H_DE-28_oil/TFA
 CDCl3
 8 sc, 
 30.11.2023
##JCAMPDX= 6.0         $$ Bruker NMR JCAMP-DX V2.0
##DATA TYPE= NMR FID
##DATA CLASS= NTUPLES
##ORIGIN= UXNMR, Bruker Analytische Messtechnik GmbH
##OWNER= root
$$ XWIN-NMR		Version 3.5
$$ Thu Nov 30 16:32:54 2023 Russian Standard Time (UT+4h)  she@DPX200
##.OBSERVE FREQUENCY= 200.1313
##.OBSERVE NUCLEUS= ^1H
##.DELAY= (6, 6)
##.ACQUISITION MODE= SIMULTANEOUS
##.ACQUISITION SCHEME= undefined
##.AVERAGES= 8
##.DIGITISER RES= 18
##SPECTROMETER/DATA SYSTEM= spect
##.PULSE SEQUENCE= zg30
##.SOLVENT NAME= CDCl3
##.SHIFT REFERENCE= (INTERNAL, CDCl3, 0, 15.7039)
##AUDIT TRAIL= $$ (NUMBER, WHEN, WHO, WHERE, WHAT)
$$ ##TITLE= Audit trail, XWIN-NMR		Version 3.5
$$ ##JCAMPDX= 5.01
$$ ##ORIGIN= Bruker BioSpin GmbH
$$ ##OWNER= she
$$ F:/spectra/data/she/nmr/H-F/1/audita.txt
$$ ##AUDIT TRAIL=  $$ (NUMBER, WHEN, WHO, WHERE, WHAT)
(   1,<2023-11-30 16:31:58.87 +0400>,<she>,<DPX200>,
      <created by zg, POWCHK disabled, PULCHK disabled
       configuration hash MD5:
       00 E9 B6 7A A2 85 ED C7 34 08 36 98 17 FE 4E 26
       data hash MD5: 16K
       62 73 B6 5A 57 91 9A A3 F1 4D EE FC 8B 1D 69 CB>)
$$ ##END=
$$ 
$$ hash MD5
$$ 03 4C 91 34 BD DE E5 B2 0E 2D 73 A4 D2 DF BC 0A
##$RELAX= 
##$RELAX= 
##$RELAX= 
##$RELAX= 
##$RELAX= 
##$RELAX= 
$$ Bruker specific parameters
$$ --------------------------
##$DU= <F:/spectra>
##$EXPNO= 1
##$NAME= <H-F>
##$PROCNO= 1
##$TYPE= <nmr>
##$USER= <she>
##$AMP= (0..31)
100 100 100 100 100 100 100 100 100 100 100 100 100 100 100 100 100 100 
100 100 100 100 100 100 100 100 100 100 100 100 100 100 
##$AQSEQ= 0
##$AQ_mod= 1
##$AUNM= <au_zg>
##$AUTOPOS= <>
##$BF1= 200.13
##$BF2= 200.13
##$BF3= 200.13
##$BF4= 200.13
##$BF5= 200.13
##$BF6= 200.13
##$BF7= 200.13
##$BF8= 200.13
##$BYTORDA= 1
##$CFDGTYP= 0
##$CFRGTYP= 5
##$CHEMSTR= <none>
##$CNST= (0..31)
1 1 145 1 1 1 1 1 1 1 1 1 1 1 1 1 1 1 1 1 1 1 1 1 1 1 1 1 1 1 1 1 
##$CPDPRG= <>
##$CPDPRG1= <>
##$CPDPRG2= <>
##$CPDPRG3= <>
##$CPDPRG4= <mlev>
##$CPDPRG5= <mlev>
##$CPDPRG6= <mlev>
##$CPDPRG7= <mlev>
##$CPDPRG8= <mlev>
##$CPDPRGB= <>
##$CPDPRGT= <>
##$D= (0..31)
0 1.2 0 0 0 0 0 0 0 0.06 0 0.03 0 0 0 0 0.0002 0 0 0 0 0 0 0 0 0 0 0 0 
0 0 0 
##$DATE= 1701347518
##$DBL= (0..7)
120 120 120 120 120 120 120 120 
##$DBP= (0..7)
150 150 150 150 150 150 150 150 
##$DBP07= 0
##$DBPNAM0= <>
##$DBPNAM1= <>
##$DBPNAM2= <>
##$DBPNAM3= <>
##$DBPNAM4= <>
##$DBPNAM5= <>
##$DBPNAM6= <>
##$DBPNAM7= <>
##$DBPOAL= (0..7)
0.5 0.5 0.5 0.5 0.5 0.5 0.5 0.5 
##$DBPOFFS= (0..7)
0 0 0 0 0 0 0 0 
##$DE= 6
##$DECBNUC= <off>
##$DECIM= 32
##$DECNUC= <off>
##$DECSTAT= 4
##$DIGMOD= 1
##$DIGTYP= 9
##$DL= (0..7)
0 120 120 120 120 120 120 120 
##$DP= (0..7)
150 150 150 150 150 150 150 150 
##$DP07= 0
##$DPNAME0= <>
##$DPNAME1= <>
##$DPNAME2= <>
##$DPNAME3= <>
##$DPNAME4= <>
##$DPNAME5= <>
##$DPNAME6= <>
##$DPNAME7= <>
##$DPOAL= (0..7)
0.5 0.5 0.5 0.5 0.5 0.5 0.5 0.5 
##$DPOFFS= (0..7)
0 0 0 0 0 0 0 0 
##$DQDMODE= 0
##$DR= 18
##$DS= 0
##$DSLIST= <SSSSSSSSSSSSSSS>
$$ [...]
##$SUBNAM2= <"">
##$SUBNAM3= <"">
##$SUBNAM4= <"">
##$SUBNAM5= <"">
##$SUBNAM6= <"">
##$SUBNAM7= <"">
##$SUBNAM8= <"">
##$SUBNAM9= <"">
##$SW= 18.0517328524113
##$SWIBOX= (0..15)
0 0 2 0 0 0 0 0 0 0 0 0 0 0 0 0 
##$SW_h= 3612.71676300578
##$TD= 16384
##$TD0= 1
##$TE= 0
##$TE2= 300
##$TE3= 300
##$TEG= 300
##$TL= (0..7)
0 120 120 120 120 120 120 120 
##$TP= (0..7)
150 150 150 150 150 150 150 150 
##$TP07= 0
##$TPNAME0= <>
##$TPNAME1= <>
##$TPNAME2= <>
##$TPNAME3= <>
##$TPNAME4= <>
##$TPNAME5= <>
##$TPNAME6= <>
##$TPNAME7= <>
##$TPOAL= (0..7)
0.5 0.5 0.5 0.5 0.5 0.5 0.5 0.5 
##$TPOFFS= (0..7)
0 0 0 0 0 0 0 0 
##$TUNHIN= 0
##$TUNHOUT= 0
##$TUNXOUT= 0
##$USERA1= <user>
##$USERA2= <user>
##$USERA3= <user>
##$USERA4= <user>
##$USERA5= <user>
##$V9= 5
##$VALIST= <valist>
##$VCLIST= <CCCCCCCCCCCCCCC>
##$VD= 0
##$VDLIST= <DDDDDDDDDDDDDDD>
##$VPLIST= <PPPPPPPPPPPPPPP>
##$VTLIST= <TTTTTTTTTTTTTTT>
##$WBST= 1024
##$WBSW= 4
##$XGAIN= (0..3)
0 0 0 0 
##$XL= 0
##$YL= 0
##$YMAX_a= 64897
##$YMIN_a= -87471
##$ZGOPTNS= <>
##$ZL1= 120
##$ZL2= 120
##$ZL3= 120
##$ZL4= 120
##$ABSF1= 10
##$ABSF2= 0
##$ABSG= 5
##$ABSL= 3
##$ALPHA= 0
##$AQORDER= 0
##$ASSFAC= 0
##$ASSFACI= 0
##$ASSFACX= 0
##$ASSWID= 0
##$AUNMP= <proc_1d>
##$AZFE= 0.1
##$AZFW= 0.1
##$BCFW= 1
##$BC_mod= 2
##$BYTORDP= 1
##$COROFFS= 0
##$CY= 11.3945322036743
##$DATMOD= 1
##$DC= 2
##$DFILT= <>
##$DTYPP= 0
##$F1P= 15.7292609196834
##$F2P= 12.9074282941183
##$FCOR= 0.5
##$FTSIZE= 0
##$FT_mod= 4
##$GAMMA= 1
##$GB= 0.15
##$INTBC= 1
##$INTSCL= 1
##$ISEN= 128
##$LB= 0.24
##$LEV0= 0
##$LPBIN= 0
##$MAXI= 10000
##$MC2= 0
##$MEAN= 0
##$ME_mod= 0
##$MI= 1.114404
##$NCOEF= 0
##$NC_proc= 0
##$NLEV= 6
##$NOISF1= 3.799351
##$NOISF2= 2.8
##$NSP= 1
##$NTH_PI= 0
##$NZP= 0
##$OFFSET= 15.70392
##$PC= 1
##$PHC0= -24591.01
##$PHC1= 5.652706
##$PH_mod= 1
##$PKNL= yes
##$PPARMOD= 0
##$PSCAL= 0
##$PSIGN= 0
##$REVERSE= no
##$SF= 200.130013532006
##$SI= 16384
##$SIGF1= 3
##$SIGF2= 2
##$SINO= 400
##$SIOLD= 16384
##$SREGLST= <1H.CDCl3>
##$SSB= 0
##$STSI= 0
##$STSR= 0
##$SW_p= 3612.71676300578
##$SYMM= 0
##$S_DEV= 0
##$TDeff= 0
##$TDoff= 0
##$TI= <>
##$TILT= no
##$TM1= 0
##$TM2= 0
##$TOPLEV= 0
##$USERP1= <user>
##$USERP2= <user>
##$USERP3= <user>
##$USERP4= <user>
##$USERP5= <user>
##$WDW= 1
##$XDIM= 8192
##$YMAX_p= 0
##$YMIN_p= 0
$$ End of Bruker specific parameters
$$ ---------------------------------
##NTUPLES= NMR FID
##VAR_NAME=  TIME,          FID/REAL,        FID/IMAG
##SYMBOL=    X,             R,               I
##VAR_TYPE=  INDEPENDENT,   DEPENDENT,       DEPENDENT
##VAR_FORM=  AFFN,          ASDF,            ASDF
##VAR_DIM=   8192,          8192,            8192
##UNITS=     SECONDS,       ARBITRARY UNITS, ARBITRARY UNITS
##FACTOR=    0.0002768,     1,               1
##FIRST=     0,             0,               0
##LAST=      2.2672688,     0,               0
##MIN=       0,             -87471,          0
##MAX=       2.2672688,     64897,           0
$$ Real data points
##PAGE= N=1
##DATA TABLE= (X++(R..R)), XYDATA
$$ [...]
1728h3j47L74o9j08K32j06k22N6K04L6m44K3L03k26M92k62j00NJ41n9J23r8L9
$$ -83 -230 144 75 -33 199 93 -129 -73 131 167 -277 -254 49 -177 315 53 -47 -42 99 40 163 65 104
1751A04k11Q4K19J1k39j83J73j17N0k6K88p8k1j3K6o2j42J6lL90O2o27M57N0K0
$$ 104 -107 -23 196 207 -32 -215 -42 -159 -109 -135 153 75 54 41 67 5 -137 -121 -124 266 328 -299 158 208 228
1776B28k9j05k0Onj58J18J67k94p7Q7J73j87lK29L8q3k72J85J53M2n23J61L19
$$ 228 199 94 74 80 75 -83 35 202 -92 -169 -82 91 -96 -99 130 168 85 -187 -2 151 193 -330 -169 150
1800A50J57l76m9J69J68k55j53k07O57l12o9Q1lj46J71J14k2K24j97j92P1J74
$$ 150 307 -69 -118 51 219 -36 -189 -396 261 -51 -120 -39 -42 -188 -17 97 75 299 102 -90 -19 155
1822A55k02J35j9Lj29j79N2L42k11j5j86L35j52q5O5L12J8o9k92M1J07j10K2J14
$$ 155 -47 88 69 72 -57 -236 -184 158 -53 -68 -254 81 -71 -156 -91 221 239 170 -122 -81 26 -84 -62 52
1846E2N7o7J30m52R1K23j82j0J54J07r6p8N0K32Pr9P4o7j0k19K72J57m30Q7K5
$$ 52 109 42 172 -280 -189 34 -148 -158 -4 103 7 -71 -21 211 218 119 193 126 116 -103 169 326 -104 -17 8
1871Hk58Q6K87j06L1p4k24K94K74l88K06j41lj55K65n4J28l30K82J23m8k83J04
$$ 8 -250 -164 123 17 48 -26 -250 44 318 -70 136 -5 -8 -163 102 48 176 -154 128 251 203 -80 24
1894B4r8L09Pl51L53k75K65l5l07J65j13j60K15K9R6pQ9O8j59r2q0r3O9n6j61
$$ 24 -74 235 242 -109 244 -31 234 199 -108 57 -56 -216 -1 28 124 117 206 274 115 23 -57 -150 -81 -137 -298
1919b98K30j16m1k1R4K94j68L4l3J58M5j86R1J87j41j80r8j4Q5k91K45j06L8K19
$$ -298 -68 -184 -225 -246 -152 142 -26 8 -25 133 178 -8 83 270 129 -51 -149 -163 -78 -369 -124 -230 -192 27
1943B7l71J61N72j99k22J38J7k13L5pJ91j9P0m06L70L5k86J35l8K84k77k63O8
$$ 27 -344 -183 389 190 -32 106 123 -90 -55 -62 129 110 180 -226 144 179 -107 28 -10 274 -3 -266 -198
1966a98L48k46j79J48K15r3R6j72L1J52j35J48p7N8j93k6O0J00j53Q1j81L06n0
$$ -198 150 -96 -275 -127 88 -5 91 -81 -50 102 -33 115 38 96 -97 -123 -63 37 -116 -35 -216 90 40
1989D0k42J2L34j11j9k1%K63k80N6o6M8J18k14L02n1k28J67j39j30K06J41k66
$$ 40 -202 -190 144 33 14 -7 -7 256 -24 32 -34 14 132 -82 220 169 -59 108 -31 -161 45 186 -80
2012h0K8J01k85K91J16l40J86L2Jj33l9J54N0k41J10R6pk5r2K6l3R0J94m96M98
$$ -80 -52 49 -236 55 171 -169 17 49 50 -83 -122 32 82 -159 -49 47 40 15 -77 -51 -84 6 200 -296 202
2037B02o5j62K3j4N9J20j54J72j85J36m8O3j67N5J11j21l3J45j57j16K40j4j69
$$ 202 137 -25 -2 -16 43 163 9 181 -4 132 84 147 -20 35 146 25 -8 137 -20 -136 104 90 -79
2060g9l4J2J94k8JK35l24N0k86K76l0k6N4n8j71J61M0j00K08n7q5p1J06L99m61
$$ -79 -113 -101 93 65 66 301 -23 27 -259 17 -13 -39 15 -43 -214 -53 -13 -113 95 38 -47 -118 -12 387 -74
2085g4J58j54J52J88k56K8l4L6j85k8K8J37Rk25J60O4q6K17j75J66m7j98L17j31
$$ -74 84 -70 82 270 14 42 8 44 -141 -169 -141 -4 5 -220 -60 4 -82 135 -40 126 79 -119 198 67
2109F7R9j76J13k65L14J86l95NK36m71L4N15k18L4R5j60N2nj58N6j46N33l75J04
$$ 67 166 -10 103 -162 152 338 -57 -52 184 -287 -253 262 44 78 173 13 65 60 -98 -42 -188 345 -30 74
2133G4k11O4K9lo3K70j4m43K99k3j28J41r1J49l7K6n1J30j68J53o9L9P2j31j00
$$ 74 -137 -73 -44 -47 -110 160 146 -297 2 -21 -149 -8 -99 50 13 39 -12 118 -50 103 34 73 145 14 -86
2158h6K47j70O3j85J82K23m77r2L62k6q5l7O1K99l15J16k20K45j2l5J66m2j57
$$ -86 161 -9 54 -131 51 274 -203 -295 67 41 -44 -81 -20 279 -36 80 -140 105 93 58 224 182 25
2181B5J05k74R5o8K1K05q1n0l22L68L47k38j23m2R1J64m48L88m6lR4j39l12K13
$$ 25 130 -144 -49 -117 -96 109 28 -22 -344 24 371 133 10 -32 59 223 -225 163 117 114 208 69 -243 -30
2205c0M4N1j09m2J13k8n9K80j85j71j06L00P5j99j0k8Nr0q8L73j97J12j39J14
$$ -30 14 65 -44 -86 27 -1 -60 220 35 -136 -242 58 133 -66 -76 -104 -99 -189 -277 96 -101 11 -128 -14
2229a4j62J41q5q5O3R8R5j45K90j36J4j25J32K40o9l53K39k10L62l33J55o4l22
$$ -14 -176 -35 -120 -205 -142 -44 51 -94 196 60 74 -51 81 321 252 -101 138 -72 290 -43 112 48 -274
2252b74J43J06K64j71j39N5j31l4J85J60k43J35m0j46M12k10j61R2j8Pm6j6lJ58
$$ -274 -131 -25 239 68 -71 -16 -147 -181 4 164 -79 56 16 -130 282 72 -89 3 -15 -8 -54 -70 -73 85
2276H5j18r8j09K77j7n7r1J20J65j32lj45J98%j54J49J65j85j66K56r4r8O8m7
$$ 85 -33 -131 -240 37 20 -37 -128 -8 157 25 22 -123 75 75 -79 70 235 50 -116 140 46 -52 16 -31
2300c1n4j56L90m65L46P7k10j86P1J78J61oJj45J6L2j83K35l3mj26r5M92l68K66
$$ -31 -85 -241 149 -316 30 107 -103 -289 -218 -40 121 115 116 -29 -13 19 -164 71 38 34 -92 -187 305 -63 203
2325B03k77N2l5J09R7p5j79N3m7J05R4k65L59j25J79j79q4L21l05j96K39J88j66
$$ 203 -74 -22 -57 52 149 74 -105 -52 -99 6 100 -165 194 69 248 69 -15 306 1 -195 44 232 66
2348F6m0P7N8l25K62j2j17J4P7k00j2K12k48l9K06J15K19l35P8l01L3J63J08j63
$$ 66 26 103 161 -164 98 86 -31 -17 60 -140 -152 60 -188 -227 -21 94 313 -22 56 -245 -212 -49 59 -104
2372a04J00j43q2J94M7L31m08K24j8j28r6j18R7N1j3m7l0J11j57L95J4k45j55
$$ -104 -4 -147 -229 -35 12 343 -65 159 141 13 -83 -201 -104 -53 -66 -113 -143 -32 -189 206 220 -25 -180
2395a80K75p0l08J22J00J06k77K83nl6J43m59J04M8L0L28l99L45j41L6K04m20
$$ -180 95 25 -283 -161 -61 45 -232 51 46 10 153 -306 -202 -154 -124 204 -195 150 9 45 249 -171
2417a71L42j68K23l73J0p7R3Ml1K10j84J14Q9l18L71k56j03J00m6p8M9J99k51
$$ -171 171 3 226 -147 -137 -214 -121 -117 -148 62 -122 -8 81 -237 134 -122 -225 -125 -171 -249 -200 -1 -252
2440b52J24K40J99k0m18J87j57j7j27K18j51L1N4n0K7K73j17o9Q0r4K03k28L39
$$ -252 -128 112 311 291 -127 60 -97 -114 -241 -23 -174 -143 -89 -139 -112 161 44 -25 55 -39 164 -64 275
2463B75k36J2K02r4n4P3k22j9j59K22m63N37R3j88NJ40l94L36n3m00L61J72j45
$$ 275 39 51 253 159 105 178 -44 -63 -222 0 -463 74 167 -21 -16 124 -270 66 13 -387 -26 146 1
2486Ap7j15J92n5k94K83k04K97o9J38k02Q7J2k9k0j05K78l08K42J18k90n1K64
$$ 1 -76 -191 1 -54 -348 -65 -269 28 -41 97 -105 -18 -6 -35 -55 -160 118 -190 52 170 -120 -171 93
2509I3j31K63l51l9J12K26j8R4l57J24J51l73L25n0L0r5j3O7k80M45j16pl0r8
$$ 93 -38 225 -126 -165 -53 173 155 249 -108 16 167 -206 119 69 99 4 -9 58 -222 223 107 100 70 -28
2533b8j33J74J47j0J68p4m7k28J9NJ96k49q0J29K74k74j53K08N7Q1k29J44mk9
$$ -28 -161 13 160 150 318 244 197 -31 -12 -7 189 -60 -140 -11 263 -11 -164 44 101 182 -47 97 93 64
2557F4M7k51K55J40k59J4l02K17J54m6J56k9j01o7j17L78J52m86k09L14j07J66
$$ 64 111 -140 115 255 -4 10 -292 -75 79 33 189 160 59 -8 -125 253 405 -81 -290 24 -83 83
2579H3N9l45J31k6J75k6j11M6P3k86L34l31M04J2j35k14r4L48j11J8r1l59K81
$$ 83 142 -203 -72 -98 77 51 -60 -14 59 -227 107 -224 180 192 57 -157 -251 97 -14 4 -87 -446 -165
2602a65O7J18rQk6N2p3J29P8j94J22l22J28O7M9J45k65J72k50J81R5k87J02k67
$$ -165 -98 20 11 19 -7 45 -28 101 179 -15 107 -215 -87 -20 29 174 -91 81 -169 12 107 -180 -78 -345
2626c45L40J12j62K62m1k98J88k24J25J60q8j08o1k5L14J81k78nj44J68L9P7k45
$$ -345 -5 107 -55 207 166 -132 56 -168 -43 117 29 -79 -140 -165 149 330 52 47 -97 71 110 187 -58
2649e8P8J37k99L5P0m5p7p6J29l8PJ41j81J01J27K56m4k95M85o89M45l70QL93
$$ -58 20 157 -142 -107 -37 -82 -159 -235 -106 -144 -137 4 -177 -76 51 307 263 -32 453 -236 209 -161 -153 240
2673B40k75N8k8J24k31K30J22n01Q8OJ77k48J62q2K01nk0K4j34k06PJ16O2j24
$$ 240 -35 23 -5 119 -112 118 240 -261 -173 -167 10 -238 -76 -158 43 38 18 42 -92 -298 -291 -175 -113 -237
2697b37P2K15k0p9r2N5J88k45R3P0K8p3o2M0j42QJ29Jl1J64p6k38M28jl04R4r
$$ -237 -165 50 30 -49 -141 -86 102 -143 -50 20 48 -25 -87 -47 -189 -181 -52 -51 -82 82 6 -232 196 195 -109 -15 -24
2724b4K46o6P8k08L1m6J82k41o3N1R3q4OR9j89J76j89L37j37k5k34k5Q3J21j40
$$ -24 222 156 234 26 57 11 193 -48 -111 -60 33 -51 -45 54 -135 41 -148 189 52 27 -207 -232 -149 -28 -168
2749a68M5K38l0j83j01L86k18K27l64lN13l07k07jL26j09j61L2N1Q2J44lk43j32
$$ -168 -123 115 85 -98 -199 187 -31 196 -168 -171 342 35 -172 -173 153 44 -117 -85 -34 48 192 189 -54 -186
2773a86j1R6J06r5rJ54Q3N1k44N8M2M3o6P3k90M43l83K56P4p1j4k13J74K71n75
$$ -186 -197 -101 5 -90 -99 55 138 189 -55 3 45 88 22 95 -195 248 -135 121 195 124 110 -103 71 342 -233
2798b33K68J4N0l5J79kl34M34n09K92k27k6K70k04K3j22m3J31j21J58L8r5J16
$$ -233 35 49 99 64 243 241 -93 341 -168 124 -103 -129 141 -63 -40 -162 -205 -74 -195 -37 1 -94 22
2821B2O2k17J77k34J19N54m90j04K21j33l1l4P4J05J4o6j32M7J02j04L81l13N3
$$ 22 84 -133 44 -190 -71 483 -7 -111 110 -23 -54 -88 -14 91 105 39 -93 -46 56 -48 333 20 73
2844G3j73j17L40k06q0L8N1O1R7L2j93L05k57Q9k32o7L42k59M37p5mm40J84J4
$$ 73 -100 -217 123 -83 -163 -125 -74 -13 84 116 -77 228 -29 60 -172 -239 103 -156 281 206 202 -238 -54 -40
2868d0l8J7J34r1j24K2L46l06M4K14m29p9K23n3Q6K70j85j86J20O2K2j75R8l11
$$ -40 -78 -61 73 -18 -142 -120 226 -80 -36 178 -251 -330 -107 -160 -74 196 11 -175 -55 7 29 -146 -48 -359
2892c59N59k76J30l2j1k29R7K0L8k04K11K22j30k8J11J66l63M9P3O9j19j35j8
$$ -359 200 -76 54 22 11 -218 -121 -101 -63 -267 -56 166 36 8 119 285 -78 -29 44 113 -6 -141 -159
2915a59R0O0rQ5j61J76j44RR9j6m1pn8J18r8L42l79q3K85k97L01k68L19j26n5
$$ -159 -69 -9 -18 67 -94 82 -62 -53 46 30 -11 -18 -76 42 -56 286 -93 -176 109 -188 113 -155 164 38 -17
2940a7J02j8j3j30J31m4Jq2j50L35j58K01l8j48j16K49m1P6j49j76J69Q0o3p5
$$ -17 85 67 54 -76 55 11 12 -70 -220 115 -43 158 120 -28 -144 105 64 140 -9 -185 -16 64 1 -74
2964g4n6J13j79K07K7R4n5k72K59Q9q1J5j28L50l82L9j40J67jJ44j79Nl42M19
$$ -74 -130 -17 -196 11 38 132 77 -195 64 153 72 87 -41 309 -73 -34 -174 -7 -8 136 -43 -38 -380 39
2988C9Q3j30k1J99l5K6o7o1J0j51K59k20J0j58L25q5Kk19J41P0M4j60J83R5k86
$$ 39 122 -8 -29 170 135 161 94 33 43 -108 151 -69 -59 -217 108 23 25 -194 -53 17 61 -99 84 179 -107
3013a07J91J25k30Q4J68j65j24Kj8J53R9r3o5J02o0j60J7J16j13l0k59K08K73
$$ -107 84 209 -21 63 231 66 -58 -56 -74 79 178 85 20 122 62 -98 -81 35 -78 -108 -367 -159 114
3036A14m2j8j13J78l6J43k45j29J15pm1P6P8j48J16l0K51m00J71O6j58L1J37k09
$$ 114 72 54 -59 119 83 226 -19 -148 -33 -40 -81 -5 73 -75 41 11 262 -138 33 99 -59 -28 109 -100
3060a00K18n6k9o9O1N5o8M7lK25k99J41KL2k0q6m2N3k4L9j79k4J31J79k17j3L84
$$ -100 118 62 33 -36 25 80 12 59 56 281 -18 123 125 157 137 51 9 62 38 77 -102 -126 5 184 -33 -46 338
3087C38m75K23k64L3o7J50q9J28J44k99K52n7j80P5P3K03j43O2N5p6p2Pk6J58
$$ 338 -137 86 -178 -145 -212 -62 -151 -23 121 -178 74 17 -163 -88 -15 188 45 107 162 86 14 21 -5 153
3111A53M2k28j7l1K70k83N3L4q1J79K4k00J29j18j13k2J77j30J27L5J8M8J33j52
$$ 153 195 -33 -50 -81 189 -94 -41 -7 -88 91 115 -85 44 -74 -187 -209 -32 -162 -35 0 18 66 199 47
3135D7k1j08j52J84j1Q3J29j00j19K85l66J26k34L92j00J9j77N6k00J80NN7L8
$$ 47 26 -82 -234 -50 -61 22 151 51 -68 217 -149 -23 -257 135 35 54 -123 -67 -267 -87 -82 -25 13
3158A3J29k20J08P3j43J04r4o5j23J68J33J08j72r1P1k48M02j06J41j68k92K00
$$ 13 142 -78 30 103 -40 64 -30 -95 -218 -50 83 191 19 -72 -1 -249 153 47 188 20 -272 -72
3180g2K76l25Q5j90K59L7l6K2Kj10q2L06k24J68j26no8L94l91o4J44j4M1oPj53
$$ -72 204 -121 -36 -226 33 70 34 56 58 -52 -134 172 -52 116 -10 -15 -83 311 -80 -144 0 -14 27 21 28 -125
3206a25K19Kj49J97m2k07j27L42j80J71l45L37Nj13J85k54L2j6J09k47kK05m8
$$ -125 94 96 -53 144 102 -105 -232 110 -70 101 -244 93 98 -15 170 -84 -52 -68 41 -206 -208 -3 -51
3229e1qj14R3J19K42l73K95j17k22K40l08K81R4%m3m4R4j18p2o1M2R5q7J51L9
$$ -51 -59 -173 -80 39 281 -92 203 86 -136 104 -204 77 171 171 128 84 178 60 -12 -73 -31 64 -23 128 167
3254A67j69M2N3j17KJ25J27l79P9P7j8j73J03OR6o1K08j45K11k77j11K67p9J44
$$ 167 -2 40 93 -24 -22 103 230 -149 -70 7 -11 -184 -81 -75 21 -40 168 23 234 -43 -154 113 34 178
3278A78L3l6j28k28K73j64J69M9k15K33j19N6j23J70k45N9K33k06R6K34l69J31
$$ 178 211 175 47 -181 92 -72 97 146 -69 164 45 101 -22 148 -97 -38 195 -11 85 319 -50 81
3300H1j04L5j6K13k45J53J40j78k04K00j50J32k85J12J14j38J56j61J84J19j70
$$ 81 -23 12 -4 209 -36 117 257 79 -125 75 -75 57 -228 -116 -2 -140 16 -145 39 158 -12
3321a2K34k54J12J48l09J96n7j69J37L4j90k10M05j28J5q6l4n5R0J96o1j26R0
$$ -12 222 -32 80 228 -81 115 58 -111 26 60 -130 -340 65 -63 -48 -134 -168 -223 -133 63 2 -124 -34
3344c4k13K60j14J84j68j44K17p5Q9J79k58K13j09o3L35j44j93J29J59k37p5q7
$$ -34 -247 13 -101 83 -85 -229 -12 -87 2 181 -77 136 27 -36 299 155 -38 91 250 13 -62 -149
3366a49K43N8l76K81j8l52N40j77k52Q6L31m02N8M3m5J39n3K10j20On4J34o9j71
$$ -149 94 152 -224 57 39 -313 227 50 -202 -116 215 -187 -129 -86 -131 8 -45 165 45 51 -3 131 62 -109
3390a09OLK32k48M00l18J47k3j40j3L63j36j86J25k53n1M57k22j87J86p5L56l05
$$ -109 -103 -100 132 -116 284 -34 113 90 -50 -63 300 164 -22 103 -150 -201 256 34 -153 33 -42 314 9
3413Ij33O2O1k5j16K29k98M52r2k59n9j5q2J01J91r3J71p9k54J59j32J49r8lJ77
$$ 9 -124 -62 -1 -26 -142 87 -211 241 149 -110 -169 -184 -266 -165 26 -67 104 25 -229 -70 -202 -53 -151 -154 23
3438B3j89J77j77Q3J07q5r1K59J50l47K18j51K07o2k35J80l50M47l85M87l40r5
$$ 23 -166 11 -166 -83 24 -61 -152 107 257 -90 128 -23 184 122 -113 67 -283 164 -221 266 -74 -169
3460a69L11k10K24n2j38k7J26r4J27k95J22J18J2j23j14K60k9K67l85Q2J32j42
$$ -169 142 -68 156 104 -34 -61 65 -29 98 -197 -75 43 55 -68 -182 78 49 316 -69 13 145 3
3482CK55k93J39J0j66j9M98k66j46r1J04k43Q1K9J67m1r1j00K0L2K87j15p5J36
$$ 3 258 -35 104 114 -52 -71 427 161 15 -76 28 -215 -134 -105 62 21 -70 -170 -150 -118 169 54 -21 115
3506A15l27J27L49k04j34L8J65l92L51P6j41j2j08Q1R5J10k12LJ13K53m67Q0L00
$$ 115 -212 -85 264 60 -74 -36 129 -263 88 164 23 11 -97 -16 79 189 -23 -20 93 346 -121 -41 259
3529B59k22j46L56k71j0J03o7O0j4k80K74Nn0Q2O5k30L59l68J99j48j01K44k22
$$ 259 37 -109 247 -24 -34 69 2 62 48 -232 42 47 -3 79 144 -86 273 -95 104 -44 -145 99 -123
3552a23J47R4m%N3k26J3j6J90l24J44M7j70J50K48k63K25l1l15K06NJ4M2p1l7
$$ -123 24 118 114 114 167 -59 -46 -62 128 -196 -52 -5 -175 -25 223 -40 185 154 -161 45 50 64 106 35 -2
3577bR1j80J5M53l78l0P7j54O1L1M5K66k58j29K67m7jo7j99Q9K02p5Q0m57L85
$$ -2 89 -91 -76 377 -1 -31 46 -108 -47 -16 29 295 37 -92 175 128 127 60 -139 -50 152 77 157 -300 85
3602H5J37j39j22K42q1j66m7J48j04O9J65l29O9K5M5j2K62j61o7N7j06p6O1J84
$$ 85 222 83 -39 203 122 -44 -91 57 -47 22 187 -142 -73 -48 -3 -15 247 86 19 76 -30 -106 -45 139
3626A39k13J73o0P6J03q0k12m4j81M75Q3k37l9J20j54J35k78J10J03P0N2k11R7
$$ 139 -74 99 39 115 218 138 -74 -118 -299 176 259 22 -17 103 -51 84 -194 -84 19 89 141 -70 27
3649B7k32J32L39j91k22K41m63L35k43K42j54K32j29K17p9P7j86R1J48p5k7j00
$$ 27 -205 -73 266 75 -147 94 -369 -34 -277 -35 -189 43 -86 131 52 129 -57 34 182 107 80 -20
3671b0m1K9K85o7J6k70PK44k21jo1J92j3j27N5J5l4r9Q2KM1l60K90k3m19L57K35
$$ -20 -61 -32 253 186 202 -68 -61 183 -38 -39 -100 92 79 -48 7 22 -12 -111 -29 -27 14 -346 -56 -79 -498 -141 94
3698I4r5R3j00K81j58j1j19j35K26r4j32J87j04L9J1j94p4J63K27Nj41o9J12J2
$$ 94 -1 92 -8 273 115 104 -15 -150 76 -18 -150 37 -67 -28 -17 -211 -285 -122 105 110 -31 -100 12 24
3722B4j21K90j73j77J53j96K06q4k5M2J4K37J47l16J19l48q1N20j79j44K83j67
$$ 24 -97 193 20 -157 -4 -200 6 -78 -103 -61 -47 190 337 21 140 -208 -289 231 52 -92 191 24
3744B4N0j55N8r5K06j57K5m3J98r6N6m6j00M7J98r5J9k58J13J49l03R4K48l7k74
$$ 24 74 -81 -23 -118 88 -69 -44 -87 111 15 71 25 -75 -28 170 75 94 -164 -51 98 -205 -111 137 100 -174
3769a74R6k7J33R7m8J0lk83R0L62n7k32kJ82O3m36K84K74m54K56r0M5rK14k50
$$ -174 -78 -105 28 125 77 87 84 -199 -109 253 196 -36 -38 144 207 -229 55 329 -125 131 41 86 77 291 41
3794D1r6L2R1j37J52J85k27p9l1k77M99Pj23J07r8o4N7j14K26j36L4r0K61J6j18
$$ 41 -55 -23 68 -69 83 268 41 -38 -69 -346 153 160 37 144 46 -18 39 -75 151 15 49 -41 220 236 118
3819A18k61k22M84J00l11k0P5L4K02O4l87J2J82j22J05k38L1L0L61j94j41P5K14
$$ 118 -143 -365 119 219 -92 -112 -37 -3 199 263 -124 -112 70 -52 53 -185 -154 -124 237 43 -98 -23 191
3842A91K6j71o8r0J54O3p3J78k83J80R1m14L38l1k29L20j99M5j23L0j36L70R1
$$ 191 217 46 -22 -112 42 105 32 210 -73 107 198 -216 122 91 -138 182 -17 28 -95 -65 -201 169 260
3865B60k51k21L77j2m21L41L06l47l22M46q8j85j3J95j7jQ3p2K29j68k41L38l93
$$ 260 9 -212 165 153 -268 73 379 32 -290 156 68 -117 -130 65 48 47 130 58 287 119 -122 216 -177
3888a77M25k38J70k55M7Q7k84J04J52L7j15j59K44j03j43K65L34m29o7J34R7o
$$ -177 248 10 180 -75 -28 59 -225 -121 31 68 -47 -206 38 -65 -208 57 391 -38 -105 29 126 120
3910A20j81J51n3j7j13L06q0K09l36O5l0Q0N6k93j2K4J96l7j29K22l37L45o9r1
$$ 120 -61 90 37 20 -93 213 133 342 6 71 41 121 177 -116 -128 -104 92 55 -74 148 -189 156 87 -4
3934dp5L2J42J29l20R1J18j57o5M1P8j51K6K1J62o6l24L39J73p0O6k00J24j46
$$ -4 -79 -47 95 224 -96 -5 113 -44 -109 -68 10 -141 -115 -94 68 2 -322 17 190 120 186 -14 110 -36
3958c6J80n3M0k05o4K37o2j12m9K36j51k64M04j46l1R9j49J10k23J68L15m35K45
$$ -36 144 91 131 -74 -138 99 37 -75 -124 112 -39 -303 101 -45 -76 23 -126 -16 -239 -71 244 -191 54
3981E4k18k2R4j3l9K97k71J14K56j50J20m79J9M35k39J78j41l5j71M39N5k73p8
$$ 54 -164 -186 -92 -105 -144 153 -118 -4 252 102 222 -257 -238 197 -42 136 -5 -40 -211 228 283 10 -68
4004f8K89o5j10J93l01o2K53l54L43k24J55O5j89O2J5l8QJ9K02Q4l00J51j28j48
$$ -68 221 156 46 239 -62 -124 129 -225 118 -106 49 114 -75 -13 2 -36 -28 -9 193 277 -23 128 0 -148
4028a48J72k2k8j8O3Q7P8j96J1j11J67k44K53n1J91k60K1K32k85LN5K72j1k47
$$ -148 24 2 -26 -44 19 106 184 -12 -1 -112 55 -189 64 13 204 -56 -35 197 -88 -85 -30 242 231 -16
4052a6j58R6M2r4J24j07M0k19K01L31p4j72J61l60L31j00K44j16k0J65m85K24
$$ -16 -174 -78 -36 -130 -6 -113 -73 -292 -91 240 166 -6 155 -205 126 26 270 154 134 299 -186 38
4074C8m9k0q2N4J93j54k04L60m8p2L1J61m37J49O9j33K26L8l9O6j72lK48k85R7
$$ 38 -11 -31 -113 -59 134 -20 -224 136 88 16 47 208 -229 -80 -11 -144 82 120 81 147 -25 -28 220 -65 32
4099C2j12j27K09qk1R9M1j38K28k18J15k48N3k2L55j10r1l81M89p5J26k24j56
$$ 32 -80 -207 2 -6 -27 72 113 -25 203 -15 100 -148 -95 -117 238 128 37 -344 145 70 196 -28 -184
4122a84m3K11J73l5M9q3p6Qj62J58K66k97J24n5j20N4J43k68K85k56K88P0o0l75
$$ -184 -227 -16 157 122 171 88 12 20 -142 16 282 -15 109 54 -66 -12 131 -137 148 -108 180 250 190 -185
4146a85K98j44j83K14j00K27r9j49O3J57o4m0J06m8l60M89l47J94j55k70J34M33
$$ -185 113 -31 -214 0 -100 127 28 -121 -58 99 35 -5 101 53 -307 182 -165 29 -126 -396 -262 171
4168A71j54Q8j95j7m8J06K62k05k9k28qK86L07m60J40r3J64o2l7K53j49l23O1
$$ 171 17 105 -90 -107 -155 -49 213 8 -21 -249 -257 29 336 -124 16 -77 87 25 -12 241 92 -231 -170
4191a70N4Q1O3r4J91K9j46pM8k92K06p4J09P9k43K8k01J33M53r6l60L93l38P8
$$ -170 -116 -35 28 -66 125 154 8 1 49 -243 -37 -111 -2 77 -166 -138 -339 -206 247 151 -209 184 -154 -76
4215g6J87P2K5l63k5K31k52L34j12Nj07l0N7J3Q8oJ08o1j9k4J84j91J38k29J67
$$ -76 111 183 208 -155 -180 51 -201 133 21 26 -81 -111 -54 -41 47 41 149 88 69 45 229 38 176 -53 114
4240A14j54L02l74K18j58R0j3n6l0J46j46L98k30j82J84Q3j23Q1k71J37J75k88
$$ 114 -40 262 -112 106 -52 38 25 -31 -61 85 -61 337 107 -75 109 192 69 150 -121 16 191 -97
4262i7P3q5P0j32O8K54K00k76L9p6p9O8N7M1J68m47q2N3J90j97K13K1l06M51l87
$$ -97 -24 -109 -39 -171 -103 151 351 75 114 38 -41 27 84 125 293 -154 -236 -183 7 -190 23 44 -262 189 -198
4287a98K32j85L43j48J77j24lJ34k99j0J16k13M09m55J79L00j57Q0J92l79J22
$$ -198 34 -151 192 44 221 97 94 228 -71 -81 35 -178 231 -224 -45 255 98 178 370 -9 113
4308A13o3R1j60nK16k49J83k66L25j17p4k4j9n4J12Nj58K05l13N15k32lK2k22
$$ 113 50 141 -19 -24 192 -57 126 -140 185 68 -6 -30 -49 -103 9 14 -144 61 -252 263 31 28 50 -172
4332a72J65k2j68K86m2R5j02j7j48K73n38L67l8j98K30L7oo7J46k51j15M02r8
$$ -172 -7 -29 -197 89 47 142 40 23 -125 148 -390 -23 -61 -259 -29 8 2 -65 81 -170 -285 117 19
4355A9L09j68j62j84L90l12K17n1k10J70n4J35j23K44k50L43m36K35k85J37P8
$$ 19 328 160 -2 -186 204 -108 109 58 -152 18 -36 99 -24 220 -30 313 -123 112 -173 -36 42
4376D2m9K6pl10K01P9l1j35K12l56L65j05k0Q7J29O2m62J44R9J3K26p5J49k43
$$ 42 -7 19 12 -298 -97 -18 -49 -184 28 -328 37 -68 -88 -1 128 190 -272 -128 -29 -16 210 135 284 41
4400D1J92k60j17J30Q4J58o1j47K44J9o9l53J12n4N9JR1j24j02J54K00l13J21
$$ 41 233 -27 -144 -14 70 228 167 20 264 283 214 -139 -27 -81 -22 -21 70 -54 -156 -2 198 -115 6
4423FQ8l10J63J22m8mN9J75j6m99K16n3L6Q1K33j67J77m14j30L47k1J45j95n0
$$ 6 94 -216 -53 69 21 17 76 251 235 -264 -48 -101 -65 16 249 82 259 -155 -285 62 41 186 -9 -59
4447e9N5R3p9K63l82k4N9L4Q3J0l71L52N6L1j95l4L44k94k34K77q4n1O3N8m6J37
$$ -59 -4 89 10 273 -109 -133 -74 -40 43 53 -318 34 90 121 -74 -108 236 -58 -292 -15 -99 -150 -87 -29 -75 62
4473F2k9O3nJ4j75Q6K7J33m1j90O4R8J00K7k54j68K63n3K05j54K43p64N52j7j27
$$ 62 33 96 91 105 -70 16 43 176 135 -55 9 107 207 234 -20 -188 75 22 227 73 316 -448 104 87 -40
4498d0J00j48J02R5j84K2j55O7J30L6j8R7J02k57J3o2R7j22p6K13j19J21j36J05
$$ -40 60 -88 14 109 -75 -53 -208 -141 -11 25 7 104 206 -51 -38 -100 -3 -125 -201 12 -107 14 -122 -17
4522a7P8j18J0j8p2K48o3j73N0op2L2j2R6O9j30J51k06K65j44Kj16K30J35k30
$$ -17 61 -57 -47 -65 -137 111 48 -125 -75 -81 -153 -121 -133 -37 32 -98 53 -153 112 -32 -30 -146 84 219 -11
4547a1K4k59K82k38J70j37K97Pj74K32k33j60R2j44J18R2J55l4N0k8j72p7K18
$$ -11 13 -246 36 -202 -32 -169 128 135 -39 193 -40 -200 -108 -252 -134 -42 113 79 129 101 -71 -148 70
4570G0Ok10PJ60j50P2j20l1r0L07Jo8QJ06M9j52J12j49J51n8KL3l24L70l07L60
$$ 70 76 -134 -127 33 -117 -45 -165 -196 -286 21 22 -46 -38 68 117 -35 77 -72 79 21 23 56 -268 102 -205 155
4596A55j86j79M03j40O3r5j41L17p4k31L04j80l0K51j36k43j07K40J62j69K47
$$ 155 -31 -210 193 53 116 21 -120 197 123 -108 196 16 -14 237 101 -142 -249 -9 153 -16 231
4617B31j88M3J4q3k76L87j78L9O3K03j92J65l72j26J06K39j52Q7k30J00J53j13
$$ 231 43 86 100 17 -259 128 -50 -11 52 255 63 228 -144 -270 -164 75 -77 10 -220 -120 33 -80
4639h0J64p5J94m44O0K26k6J4j13K35j20l14M43j43k25J83n9J03K3p0KJ33p1o2
$$ -80 84 9 203 -241 -181 45 19 33 -80 155 35 -279 164 21 -204 -21 -80 23 46 -24 -22 111 40 -22
4663b2j62J38q9J56Q0k82L24o9k37J42O7K23m9k18k51K34Q5J52k38J32J25j92
$$ -22 -184 -46 -135 21 101 -181 143 74 -163 -21 46 269 220 2 -249 -15 70 222 -16 116 241 49
4685D9q8J32K7l09K87q4K7j00J81j52N8J22p5n2J9J46l30J97j70K25j41p9K26
$$ 49 -39 93 120 -189 98 14 41 -59 122 -30 28 150 75 23 42 188 -142 55 -115 110 -31 -110 116
4708A16j03M6J14j04k14jJ72k68K71j46J57L7p6L81l27l01K73J34j6q1k01J31
$$ 116 13 59 173 69 -145 -146 26 -242 29 -117 40 77 1 382 55 -246 27 161 145 64 -137 -6
4730fj42K50jr3K16j25mP3l85L80k39J4M5Jo8R3J03k7k69M13l48J80J86m94L95
$$ -6 -148 102 101 8 224 99 95 168 -217 163 -76 -62 -17 -16 -84 9 112 85 -184 229 -119 61 247 -247 148
4755A48O1k03k1K46l31J11N2k22J68LJ02j18k70L92O8r7k31L20k49Q0k09K69j83
$$ 148 209 6 -15 231 -100 11 63 -159 9 12 114 -4 -274 118 186 89 -142 178 -71 9 -200 69 -114
4778a14J95p3K3MK95k77J06k13J05n3j88K57J99k42J19j13k6Q6k0J24k28M39l14
$$ -114 81 8 31 35 330 53 159 -54 51 -2 -190 67 266 24 143 30 4 90 70 194 -34 405 91
4801I1K17k32k88K98J10j34j79J90J02N7l02J85q0k9j0r4P6K07k38R6J74l04K38
$$ 91 308 76 -212 86 196 62 -117 73 175 232 -70 115 35 6 -4 -98 -22 185 -53 43 217 -87 151
4824A51R0l5l14J50q8p4L12l35J08j46L30k39k2rO3L8J38q8j05J64q3k16Q7Q4
$$ 151 241 206 -108 42 -46 -120 192 -143 -35 -181 149 -90 -112 -121 -58 -20 118 30 -75 89 6 -210 -123 -39
4848c9j64K64R3j00P2l2k50K83k82K22l9l5M8p0N6J4kJ81k75L9J16j61K6O6j42
$$ -39 -203 61 154 54 126 94 -156 127 -155 67 28 -7 41 -29 27 41 39 220 -55 -16 100 -61 -35 31 -111
4873a11l2pJ62k4L8j56R9MK37k47m8j03RN8k03R5J84%pJ99j53J9L0J21j36p9J
$$ -111 -143 -150 12 -12 26 -130 -31 -27 210 -37 -85 -188 -179 -121 -324 -229 -45 -45 -52 147 -6 13 43 164 28 -51 -50
4900e0P9N2k10K25l16nK37J65k88P8M7K61m43K56k49O5J5q9K70M0j91p3P6N5K28
$$ -50 29 81 -129 96 -220 -225 12 177 -111 -33 14 275 -168 88 -161 -96 -81 -170 100 140 -51 -124 -48 7 235
4925B35j55j48J00k68L33P3m06K50k8lj08J06j9J56p3n6m6J51j09J07k92M15j61
$$ 235 80 -68 32 -236 97 170 -236 14 -14 -17 -125 -19 -38 118 45 -11 -57 94 -15 92 -200 215 54
4948E4j22J50qj83K81j74n5J9J04j39j29K39L08l00kK79l41K39o8l48M0K03M5
$$ 54 -68 82 74 -109 172 -2 -57 -38 66 -73 -202 37 345 45 43 322 -19 220 152 -196 -156 47 92
4971I2m27L08k53J70K58j24j25K09j62J23k15L44j72k23K23K59k95p4l2J16j4
$$ 92 -335 -27 -280 -110 148 24 -101 108 -54 69 -146 198 26 -197 26 285 -10 -84 -116 0 -14
4992a4m1R1J14l14K5K87Q2l53J51j06o8J64J0j76J59k32K94r9J02j0o9Q4J9j83
$$ -14 -55 36 150 -164 -139 148 230 -123 28 -78 -146 18 28 -148 11 -221 73 -26 76 66 -3 81 100 -83
5016h3m3O1k4L41l34J93J5p6j7j47M2L2J14j27l3R6j23K94j72N1k10K45p1l38
$$ -83 -126 -65 -89 252 -82 111 126 50 33 -114 -72 -40 74 -53 -86 10 -113 181 9 60 -150 95 24 -314
5040c14L20j7R5j63L06m26K51O7j70J90k30K26L7Nk82Q3k17J41L8Q9J12k58J62
$$ -314 6 -11 84 -79 227 -199 52 119 -51 139 -91 135 172 177 -105 -22 -239 -98 -60 29 141 -117 45
5063D5j12K7k3J28k23K62M0j16M6n1M1k05K38N1m6l7j25L0m4J24k35K3J08O6r
$$ 45 -67 -40 -63 65 -158 104 144 28 74 23 64 -141 97 148 102 65 -60 -30 -74 50 -185 -162 -54 12 3
5088CO1J7j88J70l6j11K75r6j4k66R5J70j16J60J45j73k03N3K04j96J99o8r4J62
$$ 3 64 81 -107 63 27 -84 191 95 81 -185 -90 80 -36 124 269 96 -107 -54 150 -46 153 85 -9 153
5112A53l15J48J47j40l8jK2K04l38K20j59J58o7M8k3J67k07R6j51K19j51O4k20
$$ 153 -162 -14 133 -7 -45 -46 -24 180 -158 62 -97 61 -6 42 19 186 -21 75 -76 143 -8 56 -164
5135a64Q2K60k44J98r8K9J69j64Q6k72K36j06o3Q2k6k6R4j12J19l8N9J78l55J57
$$ -164 -82 178 -66 132 34 63 232 68 154 -118 118 12 -51 31 5 -21 73 -39 80 42 101 279 -76 81
5159H1pM5Kn2O9k77J96N1j40l8K84j32k88M74n12K06J31k45L23J08j36k17j56
$$ 81 74 119 121 69 138 -139 57 108 -32 -70 214 82 -206 268 -244 -38 93 -152 171 279 143 -74 -230
5182b30K65r2k14J82J46j99J08L7J9J56m83L04j01l4O8l4N0j37j0K75N3j27R9
$$ -230 35 -57 -271 -89 57 -142 -34 3 22 178 -305 -1 -102 -136 -68 -102 -52 -189 -199 76 129 2 101
5205A01l7j15RK16j5q4jj83J33j09K28j88K7J55K25l00k91M37l44j02K13J45k13
$$ 101 64 -51 -42 174 159 75 74 -109 24 -85 143 -45 -18 137 362 62 -229 208 -136 -238 -25 120 -93
5228i3J97j36J3K07j35k53L14m37N15L0l35K96j34R0k11O1k09L15kk14L66k98
$$ -93 104 -32 -19 188 53 -200 114 -323 192 222 -113 183 49 139 -72 -11 -220 95 93 -121 245 -53
5250e3j4O5j7O6KR4j26j76K72o7j93M1M8J51o5k7M1N2j98J35k48K76p3l63N41
$$ -53 -67 -2 -19 47 49 143 17 -159 113 46 -147 -106 -58 93 28 1 42 94 -104 31 -217 59 -14 -377 164
5275A64j70O1P8q0J68k41l9J15J9j54J59j25M2P3l01J83K92o2l2k27N1J27mm1
$$ 164 -6 55 133 53 221 -20 -59 56 75 -79 80 -45 -3 70 -231 -48 244 182 150 -77 -26 101 97 56
5299E6J1k32M7J15j0j09J57l98L91n1MN1j06r3J81r1L1O9L7K46m17J90l04L69
$$ 56 67 -165 -118 -3 -13 -122 35 -363 28 -23 -19 32 -74 -167 14 -77 -46 23 60 306 -111 79 -225 144
5323A44l43K12k77M58L6k94P5N7j14J30j14Rk69P8M18r2n06K63M07l29k6K41o7
$$ 144 -199 13 -264 194 230 -64 11 68 -46 84 -30 -21 -290 -212 206 114 -392 -129 278 -51 -77 164 97
5346I7Qj35K43j35n7J56k38r9k15M33m18L13J04O5%q3J71j99K6j17p5K84j39n5
$$ 97 105 -30 213 78 21 177 -61 -160 -375 58 -360 -47 57 122 122 39 210 11 37 -80 -155 129 -10 -65
5370f5j29J51j06K39Q6p8j62K05j23k11P8K53k31r6JJ68j27J34J14k33O1n6J76
$$ -65 -194 -43 -149 90 176 98 -64 141 18 -193 -115 138 -93 -189 -188 -20 -147 -13 101 -132 -71 -127 49
5393D9N5m17M41j84K56j05j0l4k2K0p4K12l12K8Q6J3%NJ0O5j27l0j2j2K68r3j59
$$ 49 104 -313 128 -56 200 95 85 51 29 49 -25 187 -125 -97 -11 2 2 7 17 82 -45 -75 -87 -99 169 76 -83
5420h3K52j91J03J6R1r1o8k8m0l4J10N1k4j69R0o0n8p4J13L11l92J64k49J86K01
$$ -83 169 -22 81 97 188 97 29 1 -39 -73 37 88 64 -105 -15 -75 -133 -207 -94 217 -175 -11 -260 -74 127
5445A27j94L3J18j92L0M31n08L45l27J08NMJ17l46J58K72k46K5j75K66Q7rk97
$$ 127 -67 -34 84 -108 -78 353 -155 190 -137 -29 -24 -20 97 -249 -91 181 -65 -40 -215 51 138 129 -168
5468a68J35lJ4k9K17j95J1K32k42p7N2J40m5j03K5q5LK53l44L14j07K72l17J1
$$ -168 -33 -36 -22 -51 166 -29 -18 214 -28 -105 -53 87 42 -61 -36 -121 -118 135 -209 105 -2 270 -47 -36
5492c6q5M4o3k6L31j86J37j83O8j38kK15k03J96l08J26J00OJ53j12J24k6k73M8
$$ -36 -121 -77 -140 -166 165 -21 116 -67 1 -137 -139 76 -127 69 -239 -113 -13 -7 146 34 158 132 -141 -93
5516i3l2o6L19j90K09j6j56R7J49m19L05j63j74L64l86J55R9J62j49j90L54q1
$$ -93 -125 -191 128 -62 147 131 -25 72 221 -198 107 -56 -230 134 -252 -97 2 164 15 -175 179 98
5538I8l88M39j91O5J35q0n9j08J5K20k01k6L26q2l93K90k6j78J04l33L59M0P2
$$ 98 -290 149 -42 23 158 78 19 -89 -74 146 -55 -81 245 163 -230 60 34 -144 -40 -373 -14 26 98
5561I8J08N1k59k9J39k10K3N4Q1k9P6K1l33r1J90J4j0J68k40J31l9L8J50j39n8
$$ 98 206 257 -2 -31 108 -102 -79 -25 56 27 103 124 -209 -300 -110 -96 -106 62 -178 -47 -86 -48 102 -37 -95
5586i5L12l21n0L31l85j01L13O0l72L67Lo6j2o5J86J8j24J63l46K87k11K03JO1
$$ -95 217 -104 -154 177 -208 -309 4 64 -308 59 62 -4 -16 -81 105 123 -1 162 -184 103 -108 95 96 157
5610A57P4j13Q6k33K35m16N66m20k59P5K93j43R8R6n6j03N5J98l18K20j81O3O5
$$ 157 231 118 204 -29 206 -210 356 -64 -323 -248 45 -98 0 96 40 -63 -8 190 -128 92 -89 -26 39
5633C9K0N3j47L26m01J82j04j35L4P2J08L5j52J78J13j66P8K2k18k05M08l87K49
$$ 39 59 112 -35 291 -110 72 -32 -167 -133 -61 47 82 -70 108 221 55 133 155 -63 -268 140 -247 2
5656BR6n4j40L28k51JJ67j94N9l8j38K03Q3q8J7P6r2L25n80J53k16M05k57K56
$$ 2 98 44 -96 232 -19 -18 149 -45 14 -24 -162 41 124 36 53 129 37 362 -218 -65 -281 124 -133 123
5680A23l1j20oK90n69J21J84j18j35J99J38l30L02J55j71L18k58L2K8l96L93j89
$$ 123 92 -28 -34 256 -313 -192 -8 -126 -261 -62 76 -254 48 203 32 350 92 124 152 -244 149 -40
5702d0M6K31j58m1J09k36J32l5n5J20K9j25L3L8k1J85k33J67L1k77m8J08J67j05
$$ -40 6 237 79 38 147 -89 43 8 -47 73 102 -23 10 48 27 212 -21 146 177 -100 -148 -40 127 22
5726B2k00j23M19j35rK5Nj5j60K12J12j02J64l08L0o4K57k27L53k22j13J84K8
$$ 22 -178 -301 118 -17 -26 -1 4 -11 -171 41 153 51 215 -93 -63 -127 130 -97 256 34 -79 105 133
5749A33J73m34K72n9n0q4k9n4k22J97k5L11r5m6k60L86n0J9j72K97j84j40J13
$$ 133 306 -128 144 85 35 -49 -78 -132 -354 -157 -182 129 34 -12 -272 114 64 83 -89 208 24 -116 -3
5772cM2j05K40k31o4K07o3k54J65j92M12j04r5J73k75M51k70N1j66K86j63k1%
$$ -3 39 -66 174 -57 -121 86 23 -231 -66 -258 154 50 -45 128 -147 304 34 85 -81 205 42 21 21
5795B1l6M8K5j95j65L00M85n10NL7J0O1m12K22K09M2K3j86J39l95J90J32j39K77
$$ 21 -15 33 58 -137 -302 -2 483 -27 -22 15 25 86 -326 -104 105 147 170 -16 123 -272 -82 50 -89 188
5819A88l19Q8j41QJ85j88L51k17J5p8L11j17k78m5l6K44J4J19k86k19M37J76l28
$$ 188 -131 -43 -184 -176 9 -179 172 -45 -30 -108 203 86 -192 -237 -273 -29 -15 104 -182 -401 36 212 -116
5842a16K0j69L52j7k24K35j39J27p2p0J37K83l98J42r7K44n78J63M26k89J85L
$$ -116 -96 -265 87 70 -154 81 -58 69 -3 -73 64 347 -51 91 -6 238 -340 -177 249 -40 145 148
5864A48l51J61J75l32J70qK44q9k56M4M79m12l15L20N8J2M3j64k47M08q6l8JJ29
$$ 148 -203 -42 133 -199 -29 -37 207 118 -138 -94 385 -27 -342 -22 36 48 91 -73 -320 88 2 -36 -35 94
5888I4m6J54k97J28n0N2p9J86j21N6j23M7J5j29L48o3j91k42M37j21j92J67Q3
$$ 94 48 202 -95 33 -17 35 -44 142 21 77 -46 1 16 -113 235 172 -19 -261 176 55 -137 30 113
5911A13l05J76R1j20P1q9J8N1M8l3M1J38j6l05J34r7j7J89j94P6M6j95J59o7Q3
$$ 113 -192 -16 75 -45 26 -63 -45 6 54 21 62 200 184 -121 13 -84 -101 88 -106 -30 16 -179 -20 -87 -4
5936dk58J17N1K95m37PK37j00J10k39K97K00m37M68k8l18k42M47J6l16%k5K89
$$ -4 -262 -145 -94 201 -236 -229 8 -92 18 -221 76 276 -161 307 279 -39 -281 166 182 -134 -134 -159 130
5959A30o5k52M26k43p8J73q1K88j33j01J03j26k27K17j4j02p6J96j3l95K21j43
$$ 130 65 -187 239 -4 -82 91 10 298 165 64 167 41 -186 31 17 -85 -161 35 22 -373 -152 -295
5981b95M25o6j44R4q4m0J86N1k25J7J26l9k40K73N8k78K39j35k0K41j74L32l72
$$ -295 130 64 -80 14 -70 -110 76 127 -98 -81 45 6 -234 39 97 -181 58 -77 -97 144 -30 302 -70
6004g0Rj59J12K92l35L19j33%J0m2J25k22o0pJ14n4L5J12k80P0K80o2L7j51J48
$$ -70 -61 -220 -108 184 -151 168 35 35 45 3 128 -94 -154 -161 -47 -101 -66 46 -234 -164 116 54 91 -60 88
6029H8K00j06l20K13K59k47m1J3l5R6o5j27J6J00K7P7j79m0J25r2n2P0j01J36
$$ 88 288 182 -138 75 334 87 46 59 24 120 55 -72 -56 44 71 148 -31 -71 54 -38 -90 -20 -121 15
6053A5J0JJ52m39J16J58j46j35L38j42K32r7j07l1K22l9j39K31j45MO3k68j5J06
$$ 15 25 26 178 -261 -145 13 -133 -268 70 -72 160 63 -44 -75 147 108 -31 200 55 59 122 -146 -161 -55
6077e5J40j7J49j27j9Q2l15l2L35l10J62m1J68j39J27L6R2j81j59J17J61p8j33
$$ -55 85 68 217 90 71 153 -162 -194 141 -169 -7 -48 120 -19 108 144 236 55 -104 13 174 96 -37
6100c7k12M68k68K27n4r8P2K4k79J37Qn9J17j24J68n8J35l47P4K37r0m5n8m5K47
$$ -37 -249 219 -49 178 124 26 98 122 -157 -20 -12 -71 46 -78 90 32 167 -180 -106 131 41 -4 -62 -107 140
6125A40J75j46j63o3n7K42k80J84L5k48K54j44K2m6N3R6j06l2n9K23J28j0m38
$$ 140 315 169 6 -57 -114 128 -152 32 67 -181 73 -71 -49 -95 -42 54 -52 -84 -143 80 208 198 -240
6148b40K11j13J22j4j09o2P4L0J87j99K6r6O22j61n65L94J72m61P9J04Q3O4nj77
$$ -240 -29 -142 -20 -34 -143 -205 -131 -101 86 -113 -87 -183 439 278 -287 107 279 -182 -103 1 84 148 143 -34
6172c4j05J18J1l70K81K23j63k0Q4k53J35K80L4m59J81K2k7l7K24j59R5K2L9k50
$$ -34 -139 -21 -10 -380 -99 124 -39 -59 25 -228 -93 187 221 -238 -57 -35 -62 -99 125 -34 61 83 122 -128
6196a28j12K72J66l01o0K85k67J74M9o8nM1L57m38j90L66j16j57K87k31k8K86
$$ -128 -240 32 198 -103 -163 122 -145 29 78 10 5 46 403 -35 -225 141 25 -132 155 -76 -104 182
6218A82k41j37O5l6L67k14K0r1R5n5L3j6R2k22K74M0j43K15m20J31L81j73k01
$$ 182 -59 -196 -131 -167 200 -14 6 -85 10 -45 -12 -28 64 -158 116 156 13 228 -192 -61 320 147 -54
6241e4J01R7J12k73lj54K24q0J57l14L86k98K96R3n72K19q9K1j02Q1l8K61m8J29
$$ -54 47 144 256 -17 -20 -174 50 -30 127 -187 199 -99 197 290 -282 -63 -152 -131 -233 -152 -190 71 23 152
6265A52j28q7J47J22k84P6mk8Q9l8Q5op7M2K97l48J32j47P0j2J8PP0k09k8J4j08
$$ 152 24 -63 84 206 -78 -2 -6 -34 55 17 102 96 19 61 358 10 142 -5 65 53 71 78 148 -61 -89 -75 -183
6292a83K73j52LJ26m5j34p6K28Q5j40M1k34J84j01P7M3J62j83J52J44k37j0J87
$$ -183 90 -62 -59 67 22 -112 -188 40 125 -15 26 -208 -24 -125 -48 -5 157 -26 126 270 33 23 210
6315B10k33n2O2j72m9K17j43J31p1k9K11j99L9p1J40K19k35R8r2j3J5K12m13J83
$$ 210 -23 -75 -13 -185 -234 -17 -160 -29 -100 -129 82 -117 -78 -149 -9 210 -25 73 -19 -32 -17 195 -218 -35
6339c5L12m43n1O4K15j88J11n0J72M4j49J73l32K34J09n86M24j22P2J20m5N2q6
$$ -35 277 -166 -217 -153 62 -126 -15 -65 107 151 2 175 -157 77 186 -400 24 -98 -26 94 49 101 15
6362A5Q1J68n45M32k29K11r6R5j2J48k26j84K98j43o6nJ12r8K6k99L35nrM4Kl9
$$ 15 96 264 -281 151 -78 133 37 132 120 268 42 -142 156 13 -53 -58 54 -44 -18 -317 18 13 4 48 50 11
6388A1k69R6K00j3R7l08K35M4k04j3K12K09j78k43q9M1J81nK69m01K05p0P2j11
$$ 11 -258 -162 38 25 122 -186 49 93 -111 -124 88 297 119 -124 -213 -172 9 4 273 -128 77 7 79 -32
6412c2q2K80l48J37N6J9R7p6q7o1J12o1n8O0K10m16K33J2K13k50K80k42p8L35
$$ -32 -114 166 -182 -45 11 30 127 51 -36 -97 15 -46 -104 -44 166 -250 -17 -5 208 -42 238 -4 -82 253
6436B53q2k46%q9P5K16p2j00Q7K1j34P8K7j17j56L05Q6M5J02l44L09l07Q5J03
$$ 253 171 -75 -75 -164 -89 127 55 -45 42 63 -71 7 34 -83 -239 66 152 197 299 -45 264 -43 42 145
6460A45l06N9J04jk1K19l0j66l11K80J53P0l63L67j97K03n0j0j99J79j33o9j09
$$ 145 -161 -102 2 1 -20 199 169 3 -308 -28 125 195 -168 199 2 205 155 145 -54 125 -8 -77 -186
6483a86L67j14j74J56J22K4Q8k45k91L82m02L80j32J75j33j13J13j10j18K98k51
$$ -186 181 67 -107 49 171 195 283 38 -253 129 -273 107 -25 150 17 -96 17 -93 -211 87 -164
6504a64M07j83k34K24j8l1Q2j5Q1p9N6j47k13pL93P3l10J93j96K30j66q1K1j39
$$ -164 243 60 -174 50 32 1 83 68 149 70 126 -21 -234 -241 152 225 -85 108 -88 142 -24 -105 -84 -223
6528b23L15j21l9krJ20j0j9r6j22J52K32k62r7k00L61J06j16R3q6j0J12m3l03
$$ -223 92 -29 -68 -70 -79 41 31 12 -84 -206 -54 178 -84 -181 -381 -20 86 -30 63 -23 -33 79 36 -267
6552b67L56k9k50K18p6J23q8M7p7j17J37L03l40L8k3J48Q3k84L31k63K32k92J42
$$ -267 89 60 -190 28 -48 75 -13 34 -43 -160 -23 280 -60 -22 -45 103 186 -98 233 -30 202 -90 52
6575E2j27n8O8L7J73j82L85k73j02M6o6N0j5nJ88k68J25Rj77J03K72o5K3j31l01
$$ 52 -75 -133 -65 -28 145 -37 348 75 -27 19 -47 3 -12 -17 171 -97 28 37 -140 -37 235 170 193 62 -239
6600b39K18J84j92j61Q0Q1j95N2L14M1j60r9k9k7M64q4l63J98R6j95N9J00j77
$$ -239 -21 163 -29 -190 -110 -29 -224 -172 142 183 23 -76 -105 -132 332 248 -115 83 179 -16 43 143 -34
6623c4J99j34j6r2K18l44K93k9o8j7l6R6j75J56m3o7Q6O7j75P4K22k76J92j14
$$ -34 165 31 15 -77 141 -203 90 61 -7 -24 -60 36 -139 17 -26 -93 -7 60 -115 -41 181 -95 97 -17
6647a7O2lj83L62q5l92L43j04j66M20l17n7J60j31Q9j21L78k13j82L31r8k56L7
$$ -17 45 42 -141 221 136 -256 87 -17 -183 237 -80 -137 23 -108 -19 -140 238 25 -157 174 76 -180 -143
6670a43Q3M5k05M72r7k33J07J15l38J64P1p9m1p7M66o36L93Q2j27J73k72q0K72
$$ -143 -60 -15 -220 252 155 -78 29 144 -194 -30 41 -38 -79 -156 310 -326 67 149 22 195 -77 -157 115
6693A15j71J31J67k04o3M2l4m5l78L76J45k7k09L13j08p1m0J4K02r2j11j37M27
$$ 115 -56 75 242 38 -25 17 -17 -62 -440 -64 81 54 -155 158 50 -21 -61 -47 155 63 -48 -185 242
6716B42j31k7q7Q9ko8k56L20j33K75k92j71M36k00l0j3rj75K32j18K72j10q1K4
$$ 242 111 84 -3 86 84 16 -240 80 -53 222 -70 -241 195 -5 -35 -48 -57 -232 0 -118 154 44 -37 -13
6740a3M5O4j81J27M0l06L62p2n4o3J96o1q0J41j90J25k04L65q5O1K0n2j61k00
$$ -13 32 96 -85 42 82 -224 138 66 12 -51 145 84 4 145 -45 80 -124 241 156 217 237 185 24 -176
6764a76L22j96j44K43J19k56l9q0n3K38q1K7j05K88N9k77K15j16k71L95k15J19
$$ -176 146 -50 -194 49 168 -88 -127 -207 -260 -22 -103 -76 -181 107 166 -111 104 -12 -283 112 -103 16
6786A6m8J77p7M2m76N04k52j35J73J5J95k01K78m49J05R0J54j97j30J47p0L69
$$ 16 -32 145 68 110 -366 138 -114 -249 -76 -61 134 -67 211 -238 -133 -43 111 -86 -216 -69 -139 230
6808B30o4j71K2l9O4q8L14l61J20J18K43l36J02j91J48r4kKk56K8O4K06j25J66
$$ 230 166 -5 17 -22 42 -46 268 -93 27 145 388 52 154 -37 111 17 15 17 -239 -211 -147 59 -66 100
6832A00j47o8J06R6p2o1r7J43J2p2M3j07L58l4j71J39Prl09L11q1lJ01j58k72
$$ 100 -47 -115 -9 87 15 -46 -143 0 12 -60 -17 -124 234 200 29 168 175 166 -143 168 87 84 185 27 -245
6857b45M25k1j17k5k27K87m5j8K2R0P3k12O7J07k01K08l94K77j1J13k95J48K88
$$ -245 180 159 42 17 -210 77 32 14 36 126 199 -13 54 161 -40 168 -226 51 40 153 -142 6 294
6880B94k93j9l6j5O3j98J98N6p6j67l4j29L49P4p5O4k59L15m9Q5j08j0j06J58
$$ 294 1 -18 -54 -69 -6 -204 -6 50 -26 -193 -227 -356 -7 67 -8 56 -203 112 63 148 40 30 -76 82
6904H2K8j33k5K49j45k58K47j53J67r3N0j02r0K70k18rJ51p3L6n7j04J80O8J69
$$ 82 110 -23 -48 201 56 -202 45 -108 59 -34 16 -86 -176 94 -124 -133 18 -55 -19 -76 -180 0 68 237
6928B37l23O5L5RN2l36K14Q9n7k36L91j56J9M6p4L6j86Q1L8j42MJ65q7%J44j5
$$ 237 -86 -21 14 23 75 -261 -47 42 -15 -251 140 -16 3 49 -25 11 -175 -94 -56 -198 -194 -29 -116 -116 28 13
6954A3k19M23j90n7j6l3L22l27P0j66Q0K60l23J55K58l63R2mPJ44r6j39K12J26
$$ 13 -206 217 27 -30 -46 -79 243 -84 -14 -180 -100 160 -163 -8 250 -113 -21 -25 -18 126 30 -109 103 229
6978B29j52r2J04l4o1K1j72K48J8Q8j42l2K31j41L6k55K08R0j51j48M56l28oj42
$$ 229 77 -15 89 55 -6 15 -157 91 109 197 55 23 254 113 149 -106 102 192 41 -107 349 21 15 -127
7002a27L4L15l70J86j74J20l5K4J67j29l12K89J56j78m7L23l81R3m1k8K99j65
$$ -127 -93 222 -148 38 -136 -16 -51 -27 140 11 -301 -12 144 -34 -81 242 -139 -46 -87 -115 184 19
7024A9j33L9O1J19Q4j71jk65K04J42n5k22K61j03L2k46M6j13J42M49k94j84Q0
$$ 19 -114 -75 -14 105 189 18 17 -248 -44 98 43 -179 82 -21 11 -235 -189 -302 -160 289 -5 -189 -109
7047a09M26k90l3J00o4j32P3J74k92O7J43k4j45J50J52l12q8K77r2K11j69R6j15
$$ -109 317 27 -6 94 30 -102 -29 145 -147 -80 63 39 -106 44 196 -116 -204 73 -19 192 23 119 4
7070Dk03K06K4N9j92l0J90%j9J24j70J89l97M98k88j35K88k66K08j26K6J68m12
$$ 4 -199 7 31 90 -102 -132 58 58 39 163 -7 182 -215 283 -5 -140 148 -118 90 -36 -10 158 -254
7093b54K73q4k0K87k80O4L3K25k76q4JJ36j15r6O6J22LJ61o8l21M44O8k02Rn06
$$ -254 19 -65 -85 202 -78 -14 19 244 -32 -116 -115 21 -94 -190 -124 -2 1 162 94 -227 217 285 83 92 -414
7118d14M24O0Q8j47l6L42l38l1R0m9j17K12j23k5J0L81k99j06J66L9o9J7r1J40
$$ -414 10 70 158 11 -25 317 -21 -52 38 -11 -128 84 -39 -64 -54 327 28 -78 88 127 58 75 -16 124
7142A24j80K9K22k35LO7q2j63N51l53O9j6kL39k47J2j14r7o1R2N5l4j17Q9j53
$$ 124 -56 -27 195 -40 -37 30 -52 -215 336 -17 52 36 34 373 126 138 24 -73 -134 -42 13 -21 -138 -49 -202
7167b02L28k0p8j5q3J20l96N28k52J86j49k24K89J41j93j7Pl0j7J67J6j52o0K01
$$ -202 126 106 28 13 -70 50 -346 182 -70 116 -33 -257 32 173 -20 -37 -30 -60 -77 90 106 -46 -106 95
7191I5K0k30L12k57r0J66J20J41j51j55J86k56J22j33J15q8J33l36L31J9r0J74
$$ 95 115 -115 197 -60 -150 16 136 277 126 -29 157 -99 23 -110 5 -83 50 -286 45 64 -26 148
7213A48Q7j89p7K6N9r2J43J00k33m2J81j11o4K00Q3J93l97J4j17J79J46l44Jj82
$$ 148 235 46 -31 -5 54 -38 105 205 -28 -70 111 0 -64 136 219 412 15 29 -88 91 237 -107 -106 -288
7237b88K29l7O0R5P0j61j84M48m84J79K45j23J68m52J58N5J25j34LqK47n02M20
$$ -288 -59 -96 -36 59 129 -32 -216 232 -252 -73 172 49 217 -235 -77 -22 103 -31 -28 -36 211 -291 129
7260A29j08j61p4J62o0j55M43j75M0N7j0j33J05M02m75J70m6j79K35j84k17K29
$$ 129 21 -140 -214 -52 -112 -267 176 1 41 98 88 -45 60 462 -13 157 111 -68 167 -17 -234 -5
7282eJ20l13J51J09j26K13k7j47M9K7l01J80J31K3j06j40M8J29P4m61N48l92J2
$$ -5 115 -198 -47 62 -64 149 122 -25 24 51 -250 -70 61 84 -22 -162 -114 15 89 -372 176 -216 -204
7305b04L21j30k3k88L94j46j12J32J9Q3j30N4j06M24o85K51J7P1J45j93J11J1
$$ -204 117 -13 -36 -324 70 -76 -188 -56 -37 46 -84 -30 -136 288 -397 -146 -129 -58 87 -106 5 16
7327A6j19Q2j58K76k81K8M82m69N2j30L06k29L0M5R3J92m23K25k66K19J23q2m8
$$ 16 -103 -21 -179 97 -184 -156 326 -143 -91 -221 85 -144 -114 -69 24 216 -207 18 -248 -29 94 12 -36
7350c6k4k4k2j2O8N5j40J50k6o2j22p9O19k51j54j14k6K36j15j0J94j73N2l1j22
$$ -36 -60 -84 -106 -118 -50 5 -135 15 -11 -73 -195 -274 345 94 -60 -174 -200 36 -79 -89 105 -68 -16 -47 -169
7375a69L62r7n2n0j77M08k27po2j61J14j92M06k40J8K83j46j11O5K3o4R7J54q5
$$ -169 193 96 44 -6 -183 225 -2 -9 -71 -232 -118 -310 96 -144 -126 157 11 -100 -35 -12 -76 21 175 90
7399I0k2K6j20Q2L03l89J1J3n3L09j97l9J07P3k56K5J95k05l7j73K31P4n0J7j09
$$ 90 68 94 -26 56 359 -30 -19 -6 -59 250 53 14 121 194 -62 -37 158 -47 -84 -257 -26 48 -2 15 -94
7424i4O7K4L4r1J10N8k17j39l9J68j57K43Q0P4m11J42J05N8qQ2rP0M9m2k43K63
$$ -94 -27 -3 31 -60 50 108 -109 -248 -287 -119 -276 -33 47 121 -290 -148 -43 15 7 89 80 150 199 157 -86 177
7450A77n9k37K92j27j38L71k16k40L13o0k33K41k62K14%k02L62k93K08j09j27
$$ 177 118 -119 173 46 -92 279 63 -177 136 76 -157 84 -178 36 36 -166 196 -97 111 2 -125
7471a25J17O1k31K65j04k6J76j54J69j70k3l2N6P6N9j72NJ23Qk33L22rj62r6K86
$$ -125 -8 53 -178 87 -17 -43 133 -21 148 -22 -45 -77 -21 55 114 -58 -53 70 78 -155 167 158 -4 -100 186
7496A86k76J84k2n7m0p0m9K35J0P1j62j71L35p0L46m33l9K01k09J1q5L9k40J75
$$ 186 -90 94 72 15 -25 -95 -144 91 101 172 10 -161 174 104 450 17 -22 179 -30 -19 -104 -65 -305 -130
7520a30J85o7J50J52l45J17j88Mj83K89K09l25K51k37PJ35J4j39J03l54K25J26
$$ -130 55 -12 138 290 -55 62 -126 -122 -305 -16 193 -132 119 -118 -111 24 38 -101 2 -352 -127 -1
7542aJ36n2J97j31k68L76k95Q2j16K21j18J49j81j3j8J98j43j52K15k2l0%j24
$$ -1 135 83 280 149 -119 257 -38 44 -72 149 31 180 -1 -14 -32 166 23 -129 86 64 34 34 -90
7565i0J38m7m3J26q5J56m0M3l13L32j55K96l58R1k44pJ81p2K03l20R2L28k67q3
$$ -90 48 1 -42 84 -1 155 115 158 -155 177 22 318 -40 51 -193 -200 -19 -91 112 -208 -116 212 -55 -138
7589a38K2j05r3K10N6K92k06j54J28oJ45o7k43N1J26k42J29j17K8K44J4k33J85
$$ -138 -116 -221 -314 -104 -48 244 38 -116 12 6 151 84 -159 -108 18 -224 -95 -212 -184 60 74 -159 26
7612B6j33J33j91J09P1M1o3j4o9k59L18r5O0K69p8l59K27J02l56R6J18M3J26R9
$$ 26 -107 26 -165 -56 15 56 -7 -21 -90 -349 -31 -126 -66 203 125 -234 -7 95 -261 -165 -47 -4 122 221
7636B21l53J12j64K69j9j9J76k40P9j28j30M67l22R6j42k11K74j70N29m36J78
$$ 221 -132 -20 -184 85 66 47 223 -17 62 -66 -196 271 -51 45 -97 -308 -34 -204 325 -111 67
7657F7j53m4M8M2L06k22m4J74k74J61j04%L6l7o3K96k65K46k50J32o5L50j72j46
$$ 67 -86 -130 -82 -40 266 44 0 174 -100 61 -43 -43 -7 -44 -107 189 -76 170 -80 52 -13 337 165 19
7681A9j64r2K59L2l5rJ09j91j0m5M6K5NR8j37m4P1j5M1L04j56q5j38j74L47q7
$$ 19 -145 -237 22 54 19 10 119 -72 -82 -127 -81 -56 -51 47 -90 -134 -63 -78 -37 267 111 26 -112 -286 61 -26
7707b6Rj5K29j52j51j07N11k30r4Pq4K4K20M3j37K99l77j64Q0N1k01L28r2p5L52
$$ -26 -17 -32 197 45 -106 -213 298 68 -26 -19 -103 -79 141 184 47 346 -31 -195 -115 -64 -265 63 -29 -104 248
7732B48k75J8j76J79o5P6oK0K2j25J26O0k12J54j65R3pj57J74r2J81J7J9m6Mp7
$$ 248 -27 -9 -185 -6 -71 5 -1 19 41 -84 42 102 -110 44 -121 -28 -35 -192 -18 -110 71 88 107 61 65 -12
7758a2K07K1j35m2j07O1j12r4J95j7p9lJ67M7k10K75l97K16K93l62rq2K29kJ38
$$ -12 195 216 81 39 -68 -7 -119 -213 -18 -35 -114 -117 50 97 -113 162 -235 -19 274 -88 -97 -179 50 48 186
7783A86k62j29K10j20J49l1q2K82l34K17j52K01r3m7K15J76l76o1k47L70l30L98
$$ 186 -76 -205 5 -115 34 3 -79 203 -131 86 -66 135 42 -5 210 386 10 -51 -298 72 -258 140
7805A40j58Q0k5oR1q7J94r6j59J24r3L9K8P1k73Q0J55p0Q0q6K1j27k17K47p8L02
$$ 140 -18 62 37 31 122 35 229 133 -26 98 5 44 72 143 -130 -50 105 35 115 29 50 -77 -294 -47 -125 177
7831A77j70O4j13o4K28j19QL9Jk4Jk86L34J26M2j89r9j91L43r7o5J43m23K63n1
$$ 177 7 71 -42 -106 122 3 11 50 51 27 28 -258 76 202 244 55 -44 -235 108 11 -54 89 -334 -71 -122
7856a22L29k60j35K79r0J36q8N7k67J49knn3M8N3n3j10K87l9j02J19k18P4J77
$$ -122 207 -53 -188 91 1 137 49 106 -161 -12 -14 -19 -72 -24 29 -24 -134 153 114 12 131 -87 -13 164
7880A64k32n1K45j58o1J42O9m4p5l22K72N6J0J3k18J89m3o6J35N7K5n4P5j37q5
$$ 164 -68 -119 126 -32 -93 49 118 74 -1 -323 -51 5 15 28 -190 -1 -44 -110 25 82 107 53 128 -9 -94
7905i4R6jK3r7K72n6o3J52k83J65o6J12n6m6n6j20r4L53q3R4J52m56K29j35j69
$$ -94 2 1 24 -73 199 143 80 232 -51 114 48 160 104 58 2 -118 -212 141 58 152 304 -152 77 -58 -227
7930b27R8NM9JJ67L2p1J23m16L79m03J76J04j82K45J6l07J76J27k41qj01J38P7
$$ -227 -129 -124 -75 -74 93 125 54 177 -239 140 -263 -87 17 -165 80 96 -211 -35 92 -149 -157 -258 -120 -43
7954d3J80j98L03k14j24J89j00p5K16j98M0j14J77k6N2j31J16j62J63l42M25l30
$$ -43 137 -61 242 28 -96 93 -7 -82 134 -64 -24 -138 39 13 65 -66 50 -112 51 -291 134 -196
7976a96K84K1n43L97O6k18Q7K7K18m9k41K52k94K70k31K14J2L15m05l9O3M13n48
$$ -196 88 109 -434 -37 29 -189 -102 -75 143 94 -147 105 -189 81 -150 64 76 391 -14 -53 10 423 -125
7999a25J07K15j88O0j45K01n8m8n8J8j51J05L23j22k71J84k31P6k8R4k61K41N5
$$ -125 -18 197 9 69 -76 125 67 19 -39 -21 -172 -67 256 134 -137 47 -184 -108 -136 -42 -303 -62 -7
8022gR2L2l53%K03j54L79l20R1l5j38L77j5m54J54N3K55L5j14L6k73J06j65J32
$$ -7 85 117 -236 -236 -33 -187 192 -128 -37 -72 -210 167 152 -302 -148 -95 160 195 81 117 -156 -50 -215 -83
8046h3K8J38L2l87K86R3o0k43K27k31J50Q2l26L60M5l6q3j02P4N9k33k4M80j90
$$ -83 -55 83 115 -272 14 107 47 -196 31 -200 -50 32 -294 66 111 75 -8 -110 -36 23 -210 -234 246 56
8070E6p9L7J29l20J72J39oq5k10J71N6R2k01j3M7n9J69j45J19R9j7j15m3j20K65
$$ 56 -23 14 143 -177 -5 134 128 43 -167 4 60 152 -49 -62 -15 -74 95 -50 69 168 151 36 -7 -127 138
8095A38l6k0j73q5K90j9l7m0j54K44l2l1J8k5J83j21J1l18K75k18K65j11p9K86
$$ 138 102 82 -91 -176 114 95 58 18 -136 108 76 45 63 38 221 100 111 -207 68 -150 115 4 -75 211
8119B11m49O42k55j7J08k53q1J86j42k8P6j22J32J90k97K04J63j89j60J30j86
$$ 211 -238 404 149 132 240 -13 -94 92 -50 -78 -2 -124 8 198 -99 105 268 79 -81 49 -137
8140a37o2L08k49L32l09k53N83K7l28J70k88J11m0j3K86m6J54l82K19l12K55k6
$$ -137 -199 109 -140 192 -117 -370 213 240 -88 82 -206 -95 -135 -148 138 92 246 -136 83 -229 26 0
8162@m9P1j13J86j74K4L55k85j36R5k5l2L06j96p8Q8Q1k31N6%Q7o7J26m7J33Q1
$$ 0 -49 22 -91 95 -79 -55 300 15 -121 -26 -51 -83 223 27 -51 37 118 -113 -57 -57 30 -37 89 42 175 256
8188B56j94j55R5
$$ 256 62 -93 2
8191B
$$ Imaginary data points
##PAGE= N=2
##DATA TABLE= (X++(I..I)), XYDATA
0@%%%%%%%%%%%%%%Lj1J6j6J6j6K4l2L3m1M8n6P0p8Q8j04J20j36J54j76J99k25
$$ 0 0 0 0 0 0 0 0 0 0 0 0 0 0 0 3 -8 8 -8 8 -8 16 -16 17 -24 24 -32 38 -40 48 -56 64 -72 82 -94 105 -120
36a20K54k84L17l53L94m40M88n39N96o58P29q04Q85r78J076j182J304j440J590
$$ -120 134 -150 167 -186 208 -232 256 -283 313 -345 384 -420 465 -513 563 -619 685 -755 835
55H35j759J950k168K420k717L071l501M036m724N649o962Q994j2595K0904p9711
$$ 835 -924 1026 -1142 1278 -1439 1632 -1869 2167 -2557 3092 -3870 5124 -7471 13433 -66278
70f6278k1193R1777k1622k1073M509L8076J9658R968j6437j198K2837K3502k4089
$$ -66278 -87471 4306 -17316 -38389 -33880 4196 23854 33822 17385 16187 39024 62526 38437
83C8437k9681m519P939n545k187j4678k4454l32K7692l609l4955l780M3847K5636
$$ 38437 8756 4237 12176 6631 4444 -10234 -34688 -35020 -7328 -10937 -45892 -49672 -5825 19811
97A9811j6226j5056J8015K5923P852k0116k3851Q738K8615p184m0477j5091J9485
$$ 19811 3585 -11471 6544 32467 40319 20203 -3648 5090 33705 26521 -13956 -29047 -9562
110i562R674j0250p842M03K235J0131R070j0598j0617J7482K1860k730j6661p035
$$ -9562 112 -10138 -17980 -17577 -15342 -5211 3859 -6739 -17356 126 21986 19256 2595 -4440
124d440Q565J3133j106j8373j1962J4415J4554j5306k2292O592K2912M417j3251
$$ -4440 4125 17258 16152 -2221 -14183 232 14786 -520 -22812 -16220 6692 11109 -2142
137b142p204O056J1075K635j0915j0562O768J4358N28j3844o507P420Q389l60
$$ -2142 -9346 -3290 7785 10420 -495 -11057 -4289 10069 10597 -3247 -9754 -2334 6055 5695
151E695r081p456O135J1983k714j5502l444J4269J1811m187j1043j269R497N859
$$ 5695 -3386 -10842 -4707 7276 4562 -10940 -14384 -115 11696 7509 -3534 -4803 4694 10553
165A0553o956j1455j074J0947O453p101r697J309J0355O024o010r954J102J0142
$$ 10553 3597 -7858 -8932 2015 8468 1367 -8330 -7021 3334 9358 3348 -6606 -5504 4638
179D638K023j0146q481O119J2045J527j0007n064P134Q752k332r280k748P148
$$ 4638 6661 -3485 -11966 -5847 6198 7725 -2282 -7346 -212 8540 6208 -3072 -5820 1328
193A328N631l796p072j633N183O822p71q469m863N497P472l785j0328k416R975
$$ 1328 6959 3163 -3909 -5542 -359 6463 5692 -2777 -7640 -2143 5329 1544 -8784 -11200 -1225
208a225Q882l815r756N97J2584N978r667r998N163J0391j814j1378m611N757O940
$$ -1225 7657 3842 -5914 -5317 7267 13245 3578 -6420 -1257 9134 7320 -4058 -8669 -2912 4028
223D028j838o759k514M588N114j343m807j713M054N613J459n278m105M428Q031
$$ 4028 2190 -4569 -7083 -2495 2619 1276 -3531 -5244 -1190 4423 5882 604 -3501 927 8958
238H958j109r339m331P447N268o254r789J521Q265L456o551n759L897P979P35
$$ 8958 7849 -1490 -5821 1626 6894 640 -9149 -7628 637 4093 -2458 -8217 -4320 3659 4394
253D394n746k747M240N039L0l994k757J389L982J256m818n217J466N641J330o069
$$ 4394 -1352 -4099 141 5180 5210 1216 -1541 -152 3830 5086 268 -4949 -3483 2158 3488 -2581
269b581n122M096P136K05p393k692O318O239l334o447J85O914L228m315n232R29
$$ -2581 -7703 -3607 3529 3734 -3659 -6351 -33 6206 2872 -3575 -3390 3524 6752 2437 -2795 -1866
285a866N143J394m773m586Q19M612J165m061l818K151N915J361m615l618L043
$$ -1866 3277 4671 -102 -4688 -3869 743 1908 -2153 -5971 -3820 2095 3456 -1159 -4777 -1734
300a734N750k01n812j927M477M202j110n039j049L649L535k132m955r97L035K586
$$ -1734 4016 3815 -1997 -3924 553 4755 3645 -1394 -2443 1206 4741 2609 -2346 -3343 -308 2278
316B278j609m651p17M313L827k417m723P59O405K373m410m386K015M876O6m789
$$ 2278 669 -3982 -4699 -386 3441 1024 -3699 -2940 3465 5838 1428 -2958 -943 3933 3999 -790
332g90l258K486L726j224l555j109K393K087o02k028j439J404L485J557k773k983
$$ -790 -4048 -1562 2164 940 -2615 -3724 -1331 756 154 -1874 -3313 -1909 1576 3133 360 -2623
348b623K230N466N66n318l197L970M152l003o616p08O073K372n453n190L090N690
$$ -2623 -393 5073 5639 321 -2876 1094 5246 2243 -4373 -5081 992 3364 -2089 -7279 -4189 1501
364A501P10m022p68L265K734l55k222n04R45P58l52j911k079j17L029J248l091
$$ 1501 2211 -1811 -2579 686 3420 3065 843 339 1284 2042 1690 -221 -2300 -2417 612 1860 -1231
381a231l681J964M918N20m902k368M698L952k643m219J150N690J400m431k970
$$ -1231 -4912 -2948 1970 2490 -2412 -4780 -82 3870 1227 -2992 -1842 3848 5248 817 -2153
396b153K331K551j301k880j015R25N55M05L96p00o24J337J895k91k660q28L391
$$ -2153 178 2729 1428 -1452 -2467 -1542 -987 -582 -186 -886 -1510 -173 1722 1431 -1229 -2057 1334
413A334K324l065m065J296N570K25m860j998L567L258k620l772L19L313J697l213
$$ 1334 3658 593 -3472 -2176 3394 3619 -1241 -3239 328 3586 966 -2806 -2487 826 2523 -690
429f90k333J562K367O04j480q07k09J231Q78l76j852q12K900K084j524l096N07
$$ -690 -3023 -1461 906 1510 30 -777 -986 245 1123 747 -1105 -1917 983 3067 1543 -1553 -1046
446a046L071N83l176k974K150L066p03l634r03L263J932j288j637L11J925J086
$$ -1046 2025 2608 -568 -3542 -1392 1674 971 -2663 -3566 -303 1629 341 -1296 -985 940 2026
462B026q01j695q1J873J431j232k071n97P01Q63o86k333o01K621J751k260k086
$$ 2026 1225 -470 -551 1322 2753 1521 -550 -1147 -446 417 -269 -2602 -3203 -582 1169 -1091 -3177
479c177J828L629L30j677l95P05O81l03j472j507R42J785j92k766j005Q40J222
$$ -3177 -1349 2280 2610 933 538 1243 1924 1621 149 -1358 -416 1369 1177 -1589 -2594 -1754 -532
496e32P97j015j628Q49L161l2l194l26L956K054k536j825Q06R20n0k072j511n5
$$ -532 265 -750 -2378 -1529 1632 1600 -1594 -1920 2036 4090 1554 -271 535 1455 1405 -667 -2178 -2233
514b233K485L21k455j008J954J521n79N45n2q79J065J733j709k786J965L645j017
$$ -2233 252 573 -1882 -2890 -936 585 6 551 499 -380 685 2418 709 -2077 -112 3533 2516
531B516k777l49Q83o5o64j569j023K279J863k115k450K210L316o36j130J577K22
$$ 2516 -261 -610 273 208 -456 -2025 -3048 -769 1094 -1021 -3471 -1261 2055 1419 289 1866 2088
548B088j559J23M1j312j232K541J007j853j317L06J44J015P17j622j028K980J325
$$ 2088 529 652 693 -619 -1851 690 1697 -156 -1473 -1167 -1023 -8 709 -913 -1941 1039 2364
565B364l586j738L427K310j788j146J472n91o27J53j407m53K068J315j856j513
$$ 2364 -1222 -2960 467 2777 989 -157 1315 724 97 250 -1157 -1610 458 1773 -83 -1596
581a596Q71P45m54P29M5j213K26K434j252k748J134L529l42k028n17N77J69J53
$$ -1596 -725 20 -434 295 340 -873 -647 1787 535 -2213 -1079 2450 2108 80 -437 140 309 462
599D62q06j248J332K106j029k062J74J690l54m70O19o15r22Q72K63j615p4K636
$$ 462 -344 -1592 -260 1846 817 -1245 -1071 619 265 -205 414 -201 -1123 -251 12 -1603 -1677 959
617I59J351j093p93J33J6L64l69j631n1J682j07k071n57J462Q09j77M74l2p10
$$ 959 2310 1217 424 557 573 937 568 -1063 -1114 568 461 -1610 -2167 -705 104 -73 401 369 -341
636c41J25J409r16j207J024J410L3p43q11m38Q38M28j694j105J237J961j844j549
$$ -341 -216 1193 277 -930 94 1504 1537 794 -17 -455 383 811 -883 -1988 -751 1210 -634 -2183
654b183J112J610J55l79L44J26j13R2m67m32p1N72L04m91o51q43N94J253p59j597
$$ -2183 -1071 539 694 315 659 785 672 764 297 -135 -206 366 670 179 -472 -1315 -721 532 -227 -1824
674a824J91K028N11k001o03K296J326p45j181K43J057L20j322j500R83J269j131
$$ -1824 -1633 395 906 -1095 -1698 598 1924 1179 -2 241 1298 1618 296 -1204 -221 1048 -83
691h3r02M54O14r04k8R31M75j124l73J564p7r05k85J086J308p06j504k12J321
$$ -83 -985 -531 83 -821 -849 82 557 -567 -940 624 547 -358 -643 443 1751 1045 -459 -671 650
710F50M67j727j009J096Q60r52p97O66J189k02n06KN20M2k04K34k9l26q5O12O07
$$ 650 1117 -610 -1619 -523 337 -615 -1412 -746 443 241 -265 -263 257 299 95 329 300 -26 -111 501 1108
731A108m70j211L48J050l11j578l61J636M82j599o56J310J240k70j221K12Q44
$$ 1108 638 -573 -225 825 514 -1064 -1425 211 693 -906 -1562 -252 988 718 -503 -291 553
748E53K14p24o91O30K80j10j48J2J28l80R9L97k59q16K87O40K4k43k96R94K57
$$ 553 767 43 -648 -18 262 152 4 16 144 -236 -137 260 1 -815 -528 112 136 -107 -403 591 848
769H48n67l48j57J289j18j143k37Q27J25m84n47L53J01M7P4o9j37n91M24L95J08
$$ 848 281 -67 -224 1065 947 -196 -433 394 519 35 -512 -159 -58 -11 63 -6 -143 -734 -310 85 193
790A93p38J5J046N61r21n12P10P15n03j306J5P39N23r56l55N64N34m01l6p5J4
$$ 193 -545 -530 516 1077 156 -356 354 1069 566 -740 -725 14 537 -419 -774 -210 324 -77 -113 -188 -174
811a74J3L8L71Km11j9R70j59p63J4O08M66q77q58K00R06j1j290M8R85K44n32n78
$$ -174 -161 -123 248 250 -161 -180 790 631 -132 -118 490 956 79 -779 -579 327 316 -974 -926 59 303 -229 -807
834h07Q01O51m65j67L19L18l00j78N6M99o83m69M45J76m63p21M70J023m45n94
$$ -807 -6 645 180 13 332 650 350 172 228 727 44 -425 20 196 -267 -988 -518 505 60 -534
854e34k6O16P92j156n81Q34O35k26l66Q1N21pn38K3r9M60n26M5j93k08j14J25
$$ -534 -560 56 848 -308 -889 -55 580 354 -12 69 590 583 45 68 -31 429 -97 -52 -245 -453 -567 -442
876d42L20j11k69M35O69P4m87l38Q13L25p58o15K19O49J56r34k03N02K37m92j46
$$ -442 -122 -233 -502 -67 602 676 189 -149 664 989 231 -384 -165 484 640 -294 -497 5 242 -250 -396
897c96Q7J69J89k69Q8K83q7J61mJ66k44J34K92K82o21n90M07M87n71l83l26O46
$$ -396 -309 -140 49 -220 -132 151 64 225 221 387 143 277 569 851 230 -360 47 534 -37 -420 -746 -100
919a00k16L3j95K0Q08q0K8j73J27J67q4R2l14l80J54L54j42o49J09L22K29n03
$$ -100 -316 -283 -478 -458 350 270 298 125 252 419 335 427 113 -267 -113 241 99 -550 -441 -119 110 -393
941c93J39L46j72M6k45k97P05L15o7k97J17L79l55J37p4j46j36M6j2k51m22M06
$$ -393 -254 92 -80 -34 -279 -576 129 444 377 80 197 576 221 358 284 138 2 48 36 -215 -637 -231
963b31N57k79k12j6J87M19l70m70L35O02j36j065J71J205l75n17l3P19l7p89J07
$$ -231 326 47 -165 -181 6 425 55 -415 -80 522 386 -679 -508 697 322 -195 -228 491 454 -335 -228
984b28K53j30M9k00M30j36Q9j58JK73p2m13J82Q80k69j096L07Q86l35o96m2P10
$$ -228 25 -105 -56 -256 174 38 127 -31 -30 243 171 -242 -60 820 551 -545 -238 648 313 -383 -425 285
1006B85k56k21l80L41NL29r1j06L24om21J96L15J17p55lJ277q46o37O03O05k95
$$ 285 29 -192 -572 -231 -226 103 12 -94 230 224 -197 -1 314 431 -324 -327 950 104 -533 70 675 380
1028C80o52j31L33l01Q9l78k54J202J68o29k24Q79M20j088j04Q68m15l41J1K31
$$ 380 -272 -403 -70 -371 -282 -660 -914 288 456 -173 -397 482 902 -186 -290 578 163 -178 -167 64
1048F4o57J09L46j6J39M4k91k53N95p0l55O68M89l43l42k58P56j61o47L12M19
$$ 64 -593 -484 -138 -154 -15 29 -262 -515 80 10 -345 323 812 469 127 -131 625 464 -183 129 548
1069E48j021N17l11m3k81L73M27k92j1m9j84M2N01J02l30K23Q69r41o76O09M83
$$ 548 -473 44 -267 -310 -591 -218 209 -83 -94 -143 -327 -285 216 318 -12 211 1080 139 -537 72 555
1090E55l97l96K93j70j97Q8m04L5N83K78l99l45Q08J06n93O63J60o52N7O07n6
$$ 555 158 -238 55 -115 -312 -224 -628 -593 -10 268 -131 -476 332 438 -155 508 668 16 73 680 624
1111F24j049j10O76J94n17J8J21K9j98o2l48O41N67o69n85J033J65m93r8O27N1
$$ 624 -425 -535 141 335 -182 -164 -43 -14 -212 -274 -622 19 586 -83 -668 365 530 37 -61 566 617
1132F17n67r9M30l24l37J34m1N1J37m10m8J86K83j0o14R96l1k70l07K36L35j36
$$ 617 50 -49 381 57 -280 -146 -187 -136 1 -409 -457 -271 12 2 -612 384 353 83 -224 12 347 211
1154B11k19L91m0m79k13Q2K37R6m63K83K56J42q47j7O84K95q75J44N70L38q23
$$ 211 -8 383 343 -136 -349 -267 -30 66 -397 -114 142 284 -563 -580 104 399 -476 -332 238 576 -247
1175b47j77O86M37n21k44m0K69l1n69m6L31N23n18k82L78M47l83l86L66N26l71
$$ -247 -424 262 699 178 -66 -106 163 132 -437 -483 -152 371 -147 -429 -51 396 13 -373 -7 519 148
1196A48O4k63L95k80j27J00j2J27k39l38L13J71m39P7L88j27k69J04L04J54l35
$$ 148 212 -51 344 64 -63 37 25 152 -87 -425 -112 59 -380 -303 85 -42 -311 -207 97 251 -84
1217h4M36N1k20j82j6j10N3J02j82n6M9J02j47p2K66O3k95J86K51r5k19j17M60
$$ -84 352 403 183 1 -15 -125 -72 30 -152 -208 -159 -57 -204 -276 -10 53 -242 -56 195 100 -119 -236 224
1240B24K18m08J98k73j4J59l14K99l66J10R0K6j57Q3J01k76L37j34k39K76L75
$$ 224 442 34 232 -41 -55 104 -210 89 -277 -167 -77 -51 -208 -125 -24 -300 37 -97 -336 -60 315
1261C15M7o71L38J53Lj39N8j3J42n35O4J62j18l5Q1m3L82l31j51N04k57j5j5J49
$$ 315 362 -309 29 182 185 46 104 91 233 -302 -238 -76 -194 -229 -148 -191 191 -140 -291 213 -44 -59 -74 75
1285G5k7n3q9L20NM3j94j03K69r2k74Ok5N6l93J99J57J01j75J53R0J56l48LM32
$$ 75 48 -5 -94 226 231 274 80 -23 246 154 -120 -114 -139 -83 -476 -277 -120 -19 -194 -41 49 205 -143 -140 292
1310B92J31l96l7k29N21j38j80l44N42j45l42j51K60K08q1k34K79M33m22p3K52
$$ 292 423 27 -10 -239 282 144 -36 -380 162 17 -325 -476 -216 -8 -89 -323 -44 389 -33 -106 146
1331A46L58j68m14L74j61J83m71M3J74k9k82j0J80K0j36J8m8K47r4K14J86J43
$$ 146 504 336 -78 296 135 318 -153 -110 64 35 -247 -257 -77 -57 -193 -175 -223 24 -70 144 330 473
1353D73j46k77L52Rj29n09L4J%J8k12J69J94j09j27K55M7o9%j7J91j03j4J65j6
$$ 473 327 50 402 411 282 -227 -193 -192 -192 -174 -386 -217 -23 -132 -259 -4 43 -26 -26 -43 148 45 31 196 180
1378A80Mk63J20q2q9P8k38K04J94l37J90O4k8k29J12L78r4l14J55K43k22J68K8
$$ 180 184 -79 41 -41 -130 -52 -290 -86 108 -229 -39 25 -3 -232 -120 258 164 -150 5 248 26 194 222
1401B22j94K55k57m89L79k7l9j58J12M68m47J13L2L04k78j61J05p5J30K5j40J53
$$ 222 28 283 26 -463 -84 -111 -150 -308 -196 272 -175 -62 -30 274 -4 -165 -60 -135 -5 20 -120 33
1423C3j20L0r7K99Q5l81J23n3K31l1m88L90n1j23J17RL92k07q8k42L83m6j12k54
$$ 33 -87 -57 -154 145 230 -151 -28 -81 150 119 -369 21 -30 -153 -36 -27 365 158 70 -172 211 165 53 -201
1447b01K02J26l70r4L94L64l60k12J28J22k75j47L22Q7j23R4l28J04M72j64l62
$$ -201 1 127 -243 -337 57 421 61 -151 -23 99 -176 -323 -1 86 -37 57 -271 -167 305 141 -221
1468b21K81K68j88j84nJ76Km05J51Q2O4r5K3Qk1k0K80k11K55j56j90J70K57l03
$$ -221 60 328 140 -44 -49 127 129 -276 -125 -43 21 -74 -51 -43 -64 -84 196 -15 240 84 -106 64 321 18
1492A8L3j21L33j28o11M64q1O6k65k7L09J97j37P5k28%L80l2O4P1l36l59L22R3
$$ 18 51 -70 263 135 -476 -12 -93 -27 -292 -319 -10 187 50 125 -103 -103 277 245 309 380 44 -315 7 100
1516A00P9m57J69P9j00j76L12J07m38J89J3K24j4J37m69K37L47n4l29j03N15m18
$$ 100 179 -278 -109 -30 -130 -306 6 113 -325 -136 -123 101 87 224 -245 -8 339 285 -44 -147 368 -50
1538e0JLL75o54L57j62j44L0K50j35m8K27K4j4k40L37j30q1K76q9j39kR2l08K5
$$ -50 -49 -46 329 -325 32 -130 -274 -244 6 -129 -177 50 74 60 -180 157 27 -54 222 133 -6 -8 84 -224 -199
1563a99J37L10j68lj25L3j14J54J78j60N1K4k66l8M63m30K03n2K55p0m17K15p5
$$ -199 -62 248 80 77 -48 -15 -129 25 203 43 94 118 -148 -186 277 -153 50 -2 253 183 -234 -19 -94
1586i4J05k88J53L8k8q0Pk23K37K33J3k10K68J11k22R9L81k47k84L21m2k28l85
$$ -94 11 -277 -124 -86 -114 -194 -187 -410 -173 60 73 -137 131 242 20 119 500 253 -31 290 248 20 -365
1609c65L11N4j74P5j65K94p5j58j3J21K48r0r3L15k19j14k07N10J93l98j89L22
$$ -365 -54 0 -174 -99 -264 30 -45 -203 -216 -95 153 63 -30 285 66 -48 -255 255 448 50 -139 183
1631A83j69q5k07P3M8K25j36j07J13J25J0j79J34M73n42M2m1L98m12k01Q8J73
$$ 183 14 -71 -278 -205 -157 68 -68 -175 -62 63 73 -106 28 501 -41 1 -40 358 -54 -255 -167 6
1653Fn3j24J60j06p9R3l7M9L35j68k16Q5L66j98j77M23J1k38m42M57r0M9k5k21
$$ 6 -47 -171 -11 -117 -196 -103 -140 -91 244 76 -140 -55 311 113 -64 359 370 132 -310 147 57 106 81 -140
1677a40J86l49J95j28OK42K25j36j25R2R8jj3J39k21k36K32L31o23J05J70j8j46
$$ -140 46 -303 -108 -236 -230 12 237 101 -24 68 166 165 152 291 70 -166 66 397 -226 -121 49 31 -115
1700a15j64J46L9K01m41J76R8J70R2j31r6J35k09o2K0M55j72m6j68KJ39j19k02
$$ -115 -279 -133 -94 107 -334 -158 -60 110 202 71 -25 110 -99 -161 -141 314 142 96 -72 -70 69 -50 -252
1723b52J76J2J1l2L81l07j27Q0j59L50n7K7J13k12j71q2N55k51l73K70q4K72R
$$ -252 -76 -64 -53 -85 296 -11 -138 -58 -217 133 76 103 216 4 -167 -249 306 55 -318 -48 -132 140 149
1746A49l72L24L05m15j19J00J67q4j33j72M91r5m81K76J33Q3l04P3j38N3K02l63
$$ 149 -223 101 406 -9 -128 -28 139 55 -78 -250 241 146 -335 -59 74 157 -147 -74 -212 -159 43 -320
1768c20L51p3J92j14l00K51R3J30m02K75L42m39j78L6L52k01k18J29J55j8k91
$$ -320 31 -42 150 36 -264 -13 80 210 -192 83 425 -14 -192 -156 196 -5 -223 -94 61 43 -248
1789b48K55pQ2l70J29O3J58j07j70K66J38j30j93L03J62l23J14J13j67r2j44M6
$$ -248 7 0 82 -288 -159 -96 62 -45 -215 51 189 59 -134 169 331 8 122 235 68 -24 -168 -122
1811a22P9o9Qj85L49j75j64K23K52q3J80l85J76j32K03M6k99K29j91k18R7L18
$$ -122 -43 -112 -104 -289 60 -115 -279 -56 196 113 293 -92 84 -48 155 201 -98 131 -60 -278 -181 137
1833A37m17J89J07J43j54o1j07O6K86N9p4j46k40J84K12k14J19p0k12J48j5J83
$$ 137 -280 -91 16 159 5 -56 -163 -97 189 248 174 28 -212 -28 184 -30 89 19 -193 -45 -60 123
1855A23n2j16lO8k29P5J27j4j20L34j65l50O68l92K31l5O8k80j7N8J04p1N2n7
$$ 123 71 -45 -48 20 -209 -134 -7 -21 -141 193 28 -322 346 -46 185 150 218 -62 -79 -21 83 12 64 7
1879Gq6o9k9lP4j18L57qk03J5K3J46j69M13j38m8n2j78P4j10K05k46J34j95K53
$$ 7 -79 -148 -177 -180 -106 -224 133 125 -78 -63 -40 106 -63 350 212 164 112 -66 8 -102 103 -143 -9 -204 49
1904D9k28Q1Q7Q3k4n8J72K2j29j73L91l23P6M9pJ7j33M2j57l3P3k2J10j26P6L3
$$ 49 -179 -98 -11 72 48 -10 162 184 55 -118 273 -50 26 75 68 85 -48 -6 -163 -196 -123 -145 -35 -161 -85 -52
1930e2k8L72j69J44k17J60k73L51k55k2q2L7n9L3k1M6k60LK92K6M2j0j46M15l20
$$ -52 -80 292 123 267 50 210 -63 288 33 11 -71 -34 -93 -60 -81 -35 -295 -292 0 26 68 58 -88 327 7
1955GM2q9K86k03r2R0J62k17K6J7Q0p8M3l36M14P4o00N07p7J49l78P9L98l46k
$$ 7 49 -40 246 43 -49 41 203 -14 12 29 109 31 74 -262 152 226 -374 133 56 205 -173 -94 304 -42 -44
1980d4J62r2q8K42m9l07K64k28q8K10J09O4n65M91j21J01R3l96M18j2k58K0J63
$$ -44 118 26 -62 180 131 -176 88 -140 -228 -18 91 155 -410 81 -40 61 154 -242 176 164 -94 -74 89
2003H9j65%P6l28L63J22j04j26J94j41r3j02L05l57K4K34O4k54L7M53k78k8Q2
$$ 89 -76 -76 0 -328 35 157 53 -73 121 -20 -113 -215 90 -267 -243 -9 55 -199 -162 291 13 -15 67
2026F7k86k2M95J33m04j50J86k12M0m4J20j62L13j41P7K86l18J85k85q3K86l44
$$ 67 -219 -241 254 387 -17 -167 19 -193 -153 -197 -77 -239 74 -67 10 296 -22 163 -122 -205 81 -263
2048b63K81j7p9J07n8J05m44P8M08j37K24m30K49K67m60J60P3m7%k06K39j7K60
$$ -263 18 1 -78 29 -29 76 -368 -290 118 -19 205 -225 24 291 -169 -9 64 17 17 -189 50 33 293
2071B93p2k49Q9j78m2k0J98Qj00K16m66L15r0k07K80nM3o3M3J39O3m03K41JM5
$$ 293 221 -28 61 -117 -159 -179 19 27 -73 143 -323 -8 -98 -305 -25 -30 13 -50 -7 132 195 -208 33 34 79
2096G9k6k79J55J17M5j70J13P0k88J32n2J33P8J28m11N2L3K96l9n9k28J7J27l5
$$ 79 53 -226 -71 46 91 -79 34 104 -184 -52 -104 29 107 235 -176 -124 -91 205 166 107 -121 -104 23 -12
2120a2Q8j1n0q9J62N8k04n8Q8J17j08J05L5m5r3m12J89M53k77K58j59n9J12j27
$$ -12 76 65 15 -74 88 146 -58 -116 -28 89 -19 86 121 76 -17 -429 -240 213 -64 194 35 -24 88 -39
2144c9Oj53J32P0Q3j39J93l08j1P3K24j6r5j7q7m9M3K2l2J70j65j20K12Q4j40
$$ -39 -33 -186 -54 16 99 -40 153 -155 -166 -93 131 115 20 3 -84 -133 -90 -68 -100 70 -95 -215 -3 81 -59
2169e9n8l5k6J47J78O1l04o7L65j31k48L11k22L43j73J86n09L02r2o0j88R7L1
$$ -59 -117 -152 -178 -31 147 208 -96 -163 202 71 -177 134 -88 255 82 268 -241 61 -31 -91 -279 -182 -151
2192a51K25k47J53j20M43l32p9P2J69j04n7J4j33J56o4K74k52r4O6J92l5n0k4
$$ -151 74 -173 -20 -140 303 -29 -108 -36 133 29 -28 -14 -147 9 -55 219 -33 -127 -61 131 96 46 22
2215B2j30q2J89J42j17J02k82L68k19J97k22J06M6j98J89q0m1j85K03L5Nk51M3
$$ 22 -108 -190 -1 141 24 126 -156 212 -7 190 -32 74 120 -78 111 31 -10 -195 8 43 48 -203 -160
2238a60P0QL91o6k78L66j31k8J20n39J54J10j76J55L9J50j60k60M28k24l3J16
$$ -160 -90 -82 309 243 -35 331 200 172 292 -247 -93 17 -159 -4 35 185 25 -235 193 -31 -64 52
2260E2l3o9p1J49k45K76k15oJ14K24j20L1j42QJ69j74J58J40k04Q5r0m86P08j87
$$ 52 19 -50 -121 28 -217 59 -156 -162 -48 176 56 87 -55 -47 122 -52 106 246 42 127 37 -449 259 72
2284G2J30k23m8K11j7j70o3M63m05n4O0J98p8k08J08J79n9k49J88k27J31m3J58
$$ 72 202 -21 -69 142 125 -45 -108 355 -50 -104 -44 154 76 -132 -24 155 96 -153 35 -192 -61 -104 54
2307E4J46J14m27k8J29L8J27l5j10k0J43j20J52k17nj18J5J46O9oL3j65R3p3J67
$$ 54 200 314 -113 -141 -12 26 153 118 8 -12 131 11 163 -54 -59 -177 -162 -16 53 47 80 -85 8 -65 102
2332A02l41K74p8P1n0J25m2OJ28l08J04o3N7j57L01pl51K71k91L54l7M7M0l31
$$ 102 -239 35 -43 28 -22 103 61 67 195 -113 -9 -72 -15 -172 129 122 -229 42 -249 105 68 115 155 -176
2356a76L50L7k54J35j2N0jj98m0k37M85j43k9j35K07Oj96P9P9k6j32KN9L48k81
$$ -176 174 211 -43 92 80 130 129 -69 -109 -346 139 -4 -33 -168 39 45 -151 -72 7 -19 -151 -149 -90 258 -23
2381b3J88M1l98K05j28J64p4p4L7N2k30O13k14n7M2Q1j38J1j4q4Q7%j5k14O4J06
$$ -23 165 206 -192 13 -115 49 -25 -99 -62 -10 -240 373 159 102 144 225 87 98 84 0 87 87 72 -142 -78 28
2407B8J56j77R1k03n5K14k89J96K8n0J14J68k85P3J79j98J93J00l42p1P3J99P2
$$ 28 184 7 98 -105 -160 54 -235 -39 -11 -61 53 221 -64 9 188 -10 183 283 -59 -130 -57 142 214
2430B14k48R4N7k15k8J35j50K09J61m56K49j65K57p6P3J32j93k10K43j95K01o7
$$ 214 -34 60 117 -98 -126 9 -141 68 229 -227 22 -143 114 38 111 243 50 -160 83 -112 89 22
2452B2j76J24j30O3P9K1M2j42J03K9k28J75J19J6J28j57k37J66PJJ17k97J85K7
$$ 22 -154 -30 -160 -97 -18 3 45 -97 6 35 -193 -18 101 117 245 88 -149 17 24 25 142 -155 30 57
2476E7R0l62J23J30m20J24L05k95K24j0jL19j97P2m3k27J3Q8K66j57M0k1J51k67
$$ 57 147 -215 -92 38 -382 -258 47 -248 -24 -34 -35 284 87 159 116 -111 -98 -10 256 99 139 118 269 2
2500BJ54k35M7J34m3l17K94k3L0r5o3K13k55J09j69M06k43l1j52J29M8Q3J15k71
$$ 2 156 -79 -32 102 59 -258 36 13 43 -52 -115 98 -157 -48 -217 189 -54 -85 -237 -108 -60 23 138 -133
2524a33p8J62J61k67K10J75j77KO0k12Q3K27l48K65k53K42j0r4l07K58L0kK07
$$ -133 -211 -49 112 -155 55 230 53 55 115 -97 -14 213 -135 130 -123 119 109 15 -292 -34 -4 -6 201
2547B01k07q5q0M04k25j73K10m2N2r9J49k49K51N7lk33J16j02M2J82Mk00N8K05
$$ 201 -6 -91 -171 233 8 -165 45 3 55 -44 105 -144 107 164 161 -72 44 -58 -16 166 170 -30 28 233
2571B33m5m4l01J69k32L18l19L13r1j9m3L18j25j59J03P2m06L69j15j82J21j05
$$ 233 188 144 -157 12 -220 98 -221 92 1 -18 -61 257 132 -27 76 148 -258 111 -4 -186 -65 -170
2593a70P7J32J80k13L3J57l84J32k1j54J31J56J60k64J01Q9k8r0nl1j56Q6R9o8
$$ -170 -93 39 219 6 39 196 -188 -56 -77 -231 -100 56 216 -48 53 142 114 24 19 -12 -168 -82 17 -51
2617e1J91r6j69O6N8j64K57l40N5M51l12N9M2M0j70K8j62J73K8P5n7J81l08K94
$$ -51 140 44 -125 -59 -1 -165 92 -248 -193 258 -54 5 47 87 -83 -55 -217 -44 -16 59 2 183 -125 169
2641A69r8j64J3K97l55J62J17m0k34J59n2N5j2J10k93J76l2K21k99q6L27j05P0
$$ 169 71 -93 -80 217 -138 24 141 101 -133 26 -26 29 17 127 -166 10 -22 199 -100 -186 141 36 106
2664A06j92J21J87O8k04j09j64n6K76J03l73J88J17k52L81j09k55K39n6Q6k59
$$ 106 -86 35 222 290 86 -23 -187 -243 33 136 -237 -49 68 -184 197 88 -167 72 16 102 -157
2685a57n0K67l7oJ60o5j6k47K58k64P7K17l61L31j48J40J4l3K6p9k30p5M62l07
$$ -157 -207 60 23 17 177 112 96 -151 107 -157 -80 137 -224 107 -41 99 113 80 106 27 -203 -278 184 -123
2709a23O8L51j57j47l9j18M29j67j26pP3j17M6Q4k57N2K99j1j11j27J6m6Q8k79
$$ -123 -55 296 139 -8 -47 -165 264 97 -29 -36 37 -80 -34 50 -207 -155 144 133 22 -105 -89 -135 -47 -326
2733c26L89l1r7L09j65o7J53q8o8L4qj59K59J52m53n1N5N2P6q3k72N39k19J22
$$ -326 63 32 -65 244 79 12 165 77 9 43 35 -124 135 287 -166 -217 -162 -110 -34 -117 -389 150 -69 53
2757E3m03M67NO7r9L6M0m79N19q6k72J25r1j14L14k71L37nj49j2j90J69R0%J7
$$ 53 -350 117 122 189 90 126 166 -313 206 120 -152 -27 -118 -232 82 -189 148 143 -6 -18 -208 -39 51 51 68
2782F8m88L75J36J45m56L58j57l43K73P9Q7k18K81mj54P7j97K37k04M1J69j53
$$ 68 -420 -45 91 236 -220 138 -19 -362 -89 -10 77 -141 140 136 -18 59 -138 99 -105 -64 105 -48
2804d8ql0LN6n5J45N8k57J93o0j47K41k83K41j17j82N23m2j88l3K03Kk89K6j20
$$ -48 -56 -86 -83 -27 -82 63 121 -136 57 -3 -150 91 -192 49 -68 -250 273 231 43 10 213 215 -74 -48 -168
2829a68K27K2K3Rm1l08L76k45L03k36N5o8J74j18j68P9j26r3m3L18k20K31Q0K21
$$ -168 59 81 104 113 72 -236 140 -105 198 -38 17 -51 123 5 -163 -84 -210 -303 -346 -28 -248 -17 63 284
2853B84k71j81j24M57k84P8j74M13j54j20L44m34qL15j4l23J71r8Q7L2nO5j14
$$ 284 13 -168 -292 165 -119 -41 -215 198 44 -76 268 -166 -174 141 127 -196 -25 -123 -36 -4 -9 56 -58
2876e8K51k49J34k25mn5J51K78m81J42K95k89K08M8j91q0qL09j85M8p9j1kk16
$$ -58 193 -56 78 -147 -151 -206 -55 223 -258 -116 179 -110 98 146 -45 -125 -133 176 -9 39 -40 -51 -53 -269
2900b69K56j3L08j55l65L48k75J29K6J37r6r3J0K05j95P5j29J3M1Qm6J18J01k10
$$ -269 -13 -26 282 127 -238 110 -165 -36 -10 127 31 -62 -52 153 -42 33 -96 -83 -42 -34 -80 38 139 -71
2924g1L21l02j08pR0J97l18K77R3j74m7Q0Mrj51J54P9k85L77J0m99L43J39m1l0
$$ -71 250 -52 -160 -167 -77 120 -198 79 172 -2 -49 31 35 26 -125 29 108 -177 200 210 -289 54 193 152 122
2949A22J48l43J77k2k8L30m58q6K45KK65m79K98J1m3k0j65K24j55l18O01l22J0
$$ 122 270 -73 104 82 54 384 -74 -160 85 87 352 -127 171 182 139 119 -46 178 23 -295 306 -16 -6
2972fK2k96L43oj93R7j12O2M3j73K00J15K84n26L04j42J81j62j31J85J5q8k62
$$ -6 16 -280 63 57 -136 -39 -151 -89 -46 -219 -19 96 380 -146 158 16 197 35 -96 89 104 16 -246
2995b46K46j50J24K92k62R6k88J41j62M58l65J4K06j9M1j29J91k27j36L8k2J89
$$ -246 0 -150 -26 266 4 100 -188 -47 -209 249 -116 -102 104 85 126 -3 188 -39 -175 -137 -159 30
3017C0K01k54J18R4k83K31j37R3j73L2m7Q3p1J43m6Nl69L22K45k71J44n2p5j65
$$ 30 231 -23 95 189 -94 137 0 93 -80 -48 -95 -12 -83 60 14 19 -350 -28 217 -54 90 38 -37 -202
3041b02J58jK28j93O3k78J72Q8n1L09j30j21N5k89Jm5L81Q1j81Jk6R3qj56R4o8
$$ -202 -44 -45 183 -10 53 -225 -53 35 -16 293 163 42 97 -192 -191 -236 145 226 45 46 20 113 105 -51 43 -25
3067b5O4k31K47j88K44k83J75K06k34K13m56K25MM8o3J36K1r1r6K65l35J16k03
$$ -25 39 -192 55 -133 111 -172 3 209 -25 188 -268 -43 -39 9 -54 82 103 12 -84 181 -154 -38 -241
3090b41J11j30R6J79P8j73j44K61pk40L48j26l19L07L0L1n2J28k36J78j16O0q
$$ -241 -130 -260 -164 15 93 -80 -224 37 30 -210 138 12 -307 0 30 61 9 137 -99 79 -37 23 15
3113A5J58j78n8K65m20L0J17R8j84J69P3M1k12P6O1k20m6J08%J05L0j5K36k83
$$ 15 173 -5 -63 202 -218 -188 -71 27 -157 12 85 126 -86 -10 51 -169 -215 -107 -107 -2 28 13 249 -34
3137c4n6m0M1p8L2L61l24r2L67k15q3Q5J46k34j4J45K50l42J43j41L82l88M26
$$ -34 -90 -130 -89 -167 -135 226 -98 -190 177 -38 -121 -36 110 -124 -138 7 257 -85 58 -83 299 -89 337
3160C37l01j9p7l1k72K42M61m68j0k07M10j06p3l52P13l86j18pK43o5J57O2o3
$$ 337 36 17 -60 -91 -363 -121 340 -128 -138 -345 65 -41 -114 -466 247 -139 -257 -264 -21 -86 71 133 70
3183G0K7j1Lj83j7N4L04l5j51q5j19L85k74J85j96J44j59j2L66j86k36J59O0p4
$$ 70 97 86 89 -94 -111 -57 247 212 61 -24 -143 242 -32 153 -43 101 -58 -70 296 110 -126 33 93 19
3207A9J28j89L55n67K79q1k40K75L3r6L30o2p9r4o3J39r8K22k45j93N36k56j11
$$ 19 147 -42 313 -254 25 -56 -296 -21 12 -84 246 184 105 11 -52 87 -11 211 -34 -227 309 53 -58
3230e8J2K6K91n22N1J72N9l46K72J67p0m8k41K89j3j16K03k75j8L55l10K01j93
$$ -58 -46 -20 271 -251 -200 -28 31 -315 -43 124 54 6 -235 54 41 -75 128 -147 -165 190 -120 81 -112
3253a12Q7J37j20j05Q4P2L8J3R3l92L23k64J9K57j34P8m6p1J45k50K48m02K59
$$ -112 -25 112 -8 -113 -29 43 81 94 187 -205 118 -146 -127 130 -4 74 28 -43 102 -148 100 -302 -43
3276d3j8J30M6k61j9K2K1Q4K11r7j64J40m1j8K00j64J0J6L9k29j7K62jp1pJ6R0
$$ -43 -61 69 115 -146 -165 -143 -122 -38 173 76 -88 52 11 -7 193 29 39 55 94 -135 -152 110 109 38 31 47 137
3303A37j20L43m01j10L95l55Rk03K75R6m5Q4j57j1R2j22K08oj03j30J85k56L15
$$ 137 17 360 -41 -151 244 -111 -102 -305 -30 66 21 105 -52 -63 29 -93 115 109 6 -124 61 -195 120
3326A20Jj07l65K31L7O6k02Q9K48k3j08j25L95k02m8K68q1l86K66k62K93j22L0
$$ 120 121 14 -351 -120 -83 -17 -219 -130 118 95 -13 -138 257 55 7 275 194 -192 74 -188 105 -17 13
3349A3j86K43j18R5j55j61L83j78J68K5Kk61P7N0J8j17J30r7J44j23o4j3j09K13
$$ 13 -173 70 -48 47 -108 -269 114 -64 104 129 131 -130 -53 -3 15 -102 28 -69 75 -48 -112 -125 -234 -21
3373b1j56J40qO9j56Q9K00j19N0O7k42rP1L8Kn1J40k93N2K04M2PR3k98QQ3k1M8
$$ -21 -177 -37 -45 24 -132 -43 157 38 88 155 -87 -96 -25 13 15 -36 104 -189 -137 67 109 116 209 -89 -81 2 -19 29
3401B9r4J84L6m36J82j3Q7o2l8l6J66J8o0j7J95o5m3n2j42K02rk24L31k60L41
$$ 29 -65 119 155 -281 -99 -112 -25 -87 -125 -161 5 23 -37 -54 141 76 33 -19 -161 41 32 -192 139 -121 220
3426B20k44Q1M2q5J17k96J62J18q2j05j6K50k51J56m2j09R1J05l06J22M0k3j21
$$ 220 -24 57 99 14 131 -165 -3 115 33 -72 -88 162 -89 67 25 -84 7 112 -194 -72 -32 -55 -176
3449a76k0j92K69j1K84q2j18J65m17K61L1j56K25K4j89K15o1j78K06n3K6J3l80
$$ -176 -196 -388 -119 -130 154 72 -46 119 -298 -37 -6 -162 63 87 -102 113 52 -126 80 27 53 66 -314
3472c14L72j58O6R2O2k59J76J19k75l2K07j69j1p0Q9R0J09L33k73j30%j94K76
$$ -314 58 -100 -34 58 120 -139 37 156 -119 -151 56 -113 -124 -194 -105 -15 94 427 154 24 24 -170 106
3495A06mp1N3j11O0J4k19M60m22r2J81J08k4l49L32J12l77P3K9K00r1k32K74n1
$$ 106 102 31 84 -27 33 47 -172 288 -134 -226 -45 63 39 -310 22 134 -243 -170 -141 59 -32 -264 10 -41
3519d1O2j21J19o8J99j97k40N73j07l17M7J33O2J9n1J81l67N0K39k46K28j13r8
$$ -41 21 -100 19 -49 150 -47 -287 286 179 -138 -91 42 104 123 72 253 -114 -64 175 -71 157 44 -54
3542e4P9r7R8m3L6R8j58op0K50m7%j49j02K52r9o0J84j46j75L7Q5J02q5%m1J84
$$ -54 25 -72 26 -17 19 117 -41 -47 -117 133 86 86 -63 -165 87 -12 -72 112 -34 -209 -172 -87 15 -70 -70 -111 73
3569G3O2o5j55Q7J05q6k24K11o1Q7J33l54J22q1K86k03M5N0j18K51j81o2r1J43
$$ 73 135 70 -85 2 107 21 -203 8 -53 34 167 -187 -65 -146 140 -63 -18 32 -86 165 -16 -78 -169 -26
3593b6r1R0K21k60n9J42j84J61L9J59n3m9j17j07J21k9L03n37L94r1k55K32J56
$$ -26 -117 -27 194 -66 -125 17 -167 -6 33 192 139 90 -27 -134 -13 -42 261 -276 118 27 -228 4 160
3616A60J18j42k05K22k07J01j00JJ95Po0k04L7J15k73K20k2J5K2p3p3m6J16J23
$$ 160 278 136 -69 153 -54 47 -53 -52 143 150 90 -114 -77 38 -235 -15 -37 -22 0 -73 -146 -192 -76 47
3640D7q1R6j59J24k16M1K31n0j22N31n80J13K35l6M1j23o0K49k06j18O8k53J11
$$ 47 -34 62 -97 27 -189 -148 83 33 -89 442 -138 -25 210 174 215 92 32 281 75 -43 25 -228 -117
3663a17J43J38l31O0J17n7mK5OL6J37k01m1L7q7K23Mj54J17l4j54O7K67k11L9
$$ -117 26 164 -167 -107 10 -47 -51 -26 -20 16 153 -48 -89 -52 -139 84 88 -66 51 17 -137 -70 197 -14 25
3688B5O6j65J81r5j11J78j46J61j07O1k15K06K50m43m2L41j43J95k43J32K2Q5
$$ 25 91 -74 107 12 -99 79 -67 94 -13 48 -167 39 289 -154 -196 145 2 197 -46 86 108 193
3710A93l9j53L7k9N2j59L18j25Jj06j59J54N1o4R9q7R0j6j41J26J09J7j79j39
$$ 193 154 1 38 9 61 -98 220 95 96 -10 -169 -15 36 -28 71 -16 74 58 -83 43 152 169 -10 -149
3734a49P0J36J40j32O7j18q3K32k99L66j58k8j90K59l08j09N14j80PJ08j41j21
$$ -149 -79 57 197 65 132 14 -69 163 -136 230 72 44 -146 113 -195 -304 210 30 37 145 4 -117
3756a17K04l64J60L13k70J14j86J90J51m14L00q5J84n0p2r9rqlj25nJ49J20o9
$$ -117 87 -277 -117 196 -74 40 -146 44 195 -219 81 -4 180 130 58 -41 -50 -58 -61 -186 -191 -42 78 9
3780Ik39K16M5k85K96m5P7k10k5L74l73K01j81K62j36K52j26k11J73k75J90J71
$$ 9 -230 -14 31 -254 42 -3 74 -136 -161 213 -160 41 -140 122 -14 238 112 -99 74 -201 -11 160
3802A60j09l11J47J61j6R4o1J52n63M55Qj95RJ46l3r2K76k88R0J21r0P0j08J07
$$ 160 51 -260 -113 48 32 126 65 217 -346 109 117 -78 -69 77 44 -48 228 -60 30 151 61 131 23 130
3826A30J7j62j22K66l99K21O6j16M0p6m0J99l7q9Ol4N4J43q2J75l30J28J03j81
$$ 130 147 -15 -137 129 -270 -49 17 -99 -59 -135 -175 24 -13 -102 -96 -130 -76 67 -15 160 -170 -42 61 -120
3850a20L6K48Kj56k7J30l5J35j17J07l81J23J80j98Q8j00k26M15l60K83N3N7J83
$$ -120 -84 164 166 10 -17 113 78 213 96 203 -178 -55 125 -73 15 -85 -311 104 -256 27 80 137 320
3873C20l32R7j98K35j11K01m03J21p5J54J22r3l11M62k32J74j62M1kk6j02J21
$$ 320 -12 85 -113 122 11 212 -191 -70 -145 9 131 38 -273 189 -43 131 -31 10 8 -18 -120 1
3895AK07k24k1J01k47J72j26m5L92k56J57lM5j47j71K83L7k35K21j47n5K35l3
$$ 1 208 -16 -37 64 -183 -11 -137 -182 210 -46 111 108 153 6 -165 118 155 -80 141 -6 -61 174 141
3918A41m83K34o7J17o8K81k51J72J45l13k0J13k5l1J41J90j60k10P7K40Q7k60
$$ 141 -342 -108 -175 -58 -126 155 -96 76 221 -92 -112 1 -24 -55 86 276 116 -94 -17 223 310 50
3940E0L7j7M7k30K45j50K25k00K36r8l04K93l29o6M46l10K5P6r6J53k24J70J39
$$ 50 87 70 117 -113 132 -18 207 7 243 145 -159 134 -195 -261 185 -125 -100 -24 -120 33 -191 -21 118
3963A18k79K41j51K76j03K2J18l89n9K54m60M80l7o6Q7j58PJ10L27r7j87k51r4
$$ 118 -161 80 -71 205 102 124 242 -147 -206 48 -412 68 31 -35 52 -106 -99 11 338 241 54 -197 -291
3986b91L33J06k45J8k6k40L13j29jQ1K0PJ66k67K50k6R4k00J30p7P4Mk19o1J56
$$ -291 42 148 -97 -79 -105 -345 -32 -161 -162 -81 -61 -54 112 -155 95 69 163 -37 93 16 90 94 -125 -186 -30
4011c0K40j98j36L80j65K00k91J09j05o6J14r5j3k10K61j54J17k4j50L35j12J10
$$ -30 210 12 -124 256 91 291 0 109 4 -62 52 -43 -56 -266 -5 -159 -42 -66 -216 119 7 117
4033A17p9m6n5K58p6j74J95l20Q4K31l57j50N01j23Qj96N66m78k5K68l28m6K31
$$ 117 38 -8 -63 195 119 -55 140 -180 -96 135 -222 -372 129 6 14 -182 384 -94 -119 149 -179 -225 6
4056Fj82J37P7q5J34n9J1Mq7k7lJ64n7j2P5j66p1j5Q7N8j83L22k16Q3J55k53O2
$$ 6 -176 -39 38 -47 87 28 39 43 -44 -71 -74 90 33 21 96 -70 -141 -156 -69 -11 -194 128 -88 -5 150 -103 -41
4083d1k05J16O7J53o3RJ38m01q7K78o9R5k9J8j24k01L17m0J07O7j57K06k10J46
$$ -41 -246 -130 -63 90 27 36 174 -227 -314 -36 -105 -10 -39 -21 -145 -346 -29 -69 38 105 -52 154 -56 90
4107I0q0k16J03P6p3J03N3k03K36k72K60j23O0J53r9k35m5K66l9m3j9K1K6j1n6
$$ 90 10 -206 -103 -27 -100 3 56 -147 89 -183 77 -46 14 167 68 -167 -212 54 15 -28 -47 -26 0 -11 -67
4132f7K40k26p2k2L71l13N0K15k18K0k56L47%J5n2N2m0O2j01O0j02k7O2j73Q0
$$ -67 173 -53 -125 -147 224 -89 -39 176 -42 -22 -278 69 69 84 32 84 44 106 5 65 -37 -64 -2 -175 -95
4157i5r0M62j98L15j48m89L48j28J78k12J0j10J99j29O7j22J40p4p3M4M4j6K14
$$ -95 -185 277 79 394 246 -243 105 -23 155 -57 -47 -157 42 -87 -20 -142 -2 -76 -149 -105 -61 -77 137
4180A37oj05P0k85L34l27K08n0j42K36j11j82K60j47J83M3l81L33m2j88n8L68
$$ 137 131 26 96 -189 145 -182 26 -24 -166 70 -41 -223 37 -110 73 116 -265 68 26 -162 -220 148
4202A48p8Q7j11L6K67l13k32J62J79j87L0K04k26L9L2J11j45J85l32j4K43p6J1
$$ 148 70 157 46 82 349 36 -196 -34 145 -42 -12 192 -34 5 37 148 3 188 -144 -158 85 9 20
4225B0L9L3m1N0k81M2Q5J93K6J80j74o2J26k27p6K98q5M5m69J98K35j96MJ24j51
$$ 20 59 92 51 101 -180 -138 -53 140 166 346 172 110 236 9 -67 231 146 191 -278 -80 155 -41 -37 87 -64
4250f4j29J71n1l7K0J64J00m32L39k31K40j50r1L3j19K64j00J32k42K60L5K9m9
$$ -64 -193 -22 -73 -110 -90 74 174 -258 81 -150 90 -60 -151 -118 -237 27 -73 59 -183 77 112 141 92
4273I2J42j85j86L0J80k5m59P71l01l2j40J04J64r5r0J29J79j35M1m96K86K06
$$ 92 234 49 -137 -107 73 48 -411 360 59 27 -113 -9 155 60 -30 99 278 143 184 -312 -26 180
4295A80k62m6J05j33J08J44k05J41K1K23k19J05j99J87k91J91n0K9J57k63J7J73
$$ 180 -82 -128 -23 -156 -48 96 -109 32 53 276 57 162 -37 150 -141 50 0 29 186 -77 -60 113
4317A13o9j4k14L39J14j85j95NK42k18J63m15L30Q5J0k44K90j68N8p8J39Jj78
$$ 113 44 30 -184 155 269 84 -111 -106 136 -82 81 -334 -4 81 91 -153 137 -31 27 -51 88 89 -89
4340h9K83Lk48j43L90j94J30j43M5J3p2L4j9j4n7k0J22q4N8J31K3j9m37L00M8
$$ -89 194 197 -51 -194 196 2 132 -11 34 47 -25 9 -10 -24 -81 -101 21 -63 -5 126 149 130 -307 -7 41
4365D1k60J73R1J4l15K64n9r4J40L6O1Kk21O4LK18o8j64K38j5j45k01K98l24j35
$$ 41 -219 -46 45 59 -256 8 -51 -145 -5 31 92 94 -127 -63 -60 158 90 -74 164 149 4 -197 101 -223 -358
4390c58M71O0p5qn6j13J70K0k35L89j11Kj15j35R1k64L85M7m6j78Q8K7r9J02j87
$$ -358 113 173 98 90 34 -79 91 111 -124 265 154 156 41 -94 -3 -267 118 165 119 -59 29 56 -43 59 -128
4415a28J49J7l27K32J61n4l3N6j50Q7j71Q2N4j60J47q7K71k36Q4m0K22J30m30
$$ -128 21 38 -289 -57 104 50 17 73 -77 10 -161 -79 -25 -185 -38 -125 146 -90 -6 -46 176 306 -124
4438a24J79k23K32J4r4j8o4K07k50J12j16r4L90O3j99k83L11J5k87J15K43l12
$$ -124 55 -168 64 78 -16 -34 -98 109 -141 -29 -145 -239 151 214 15 -268 43 58 -229 -114 129 -183
4460a83J89j13j51L17r1r0J12Q9O2l97K60mO1K59o8k58k23K04jo0L3J17j6k15
$$ -183 6 -107 -258 59 -32 -122 -10 79 141 -256 4 0 61 320 252 -6 -229 -25 -26 -86 -53 64 48 -167
4484a67J42K04j88q0L79m8l26kRj21q9L46k0j35J13k5J14j15n0K5J43j4j12j04
$$ -167 -25 179 -9 -89 290 242 -84 -86 -77 -198 -287 59 39 -96 17 -8 106 -9 -59 -34 109 95 -17 -121
4508a21j7R4k38L00J4q0J07o2p8N1R3M4k16j96L30M5j52J53l19N8M71j72j66M7
$$ -121 -138 -44 -282 18 32 -48 59 -3 -81 -30 63 107 -109 -305 25 70 -82 71 -248 -190 281 109 -57 -10
4532a0j41J71R3k1k9K7N8j99J6P2j52J51q8l2L05Qj80j87L90j9l15J79j14J21
$$ -10 -151 20 113 92 63 90 148 -51 -35 37 -115 36 -52 -84 221 229 49 -138 252 233 -82 97 -17 104
4556A04K1k95J46L6Lj26K98l09K22j52k24L37P7k71P6Nm4Q1L28l36j09J11J06
$$ 104 125 -170 -24 12 15 -111 187 -122 100 -52 -276 61 138 -133 -57 -52 -96 -15 313 -23 -132 -21 85
4579H5o0k41K80n2J97m7r7k3L8O4k67L9J89k85L00k77P5J40j77K15l6j3k21J89
$$ 85 25 -216 64 12 209 162 65 42 80 144 -123 -84 105 -180 120 -157 -82 58 -119 96 60 47 -174 15
4603A5J61k93J0J01k75L42P8j23j65N9R9j07j15K24M4k71K48j45j0qJJ68L0N4
$$ 15 176 -117 -107 -6 -281 61 139 16 -149 -90 9 -98 -213 11 55 -216 32 -113 -123 -131 -130 38 68 122
4627A22L00l86j42J06j89P7J52n0O3j44J56k72L34N1j65K19j30j06J23j59k41
$$ 122 422 36 -106 0 -189 -112 40 -10 53 -91 65 -207 127 178 13 232 102 -4 119 -40 -281
4648b81L97J21k93Q8N5k6k65K25k41O8J50j39q8J37k7J09j09J40j26oK78k85J29
$$ -281 116 237 -56 32 87 61 -204 21 -220 -152 -2 -141 -229 -92 -119 -10 -119 21 -105 -111 167 -118 11
4671A1k2Jj20L0R2j24K27R2j42j11o9O6q1M1J52J6o8M7M1m6pM9K9r6j74L50j80
$$ 11 -11 -10 -130 -100 -8 -132 95 187 45 -66 -135 -69 -150 -109 43 59 -9 38 79 33 26 75 104 8 -166 184 4
4698DN8k19K3K38k79L94r6J95m50rK26K1k53O5J2K37k3j27k2ln6K47k81j17K90
$$ 4 62 -157 -134 104 -175 219 123 318 -132 -141 85 106 -147 -82 -70 167 144 17 -5 -8 -64 183 -98 -215 75
4723G5Q7j09j25K89m77M49j86l75Q2L30J8O9j57L05j11k68j34L63k16l15M30p7
$$ 75 162 53 -72 217 -260 189 3 -372 -290 40 58 127 -30 275 164 -104 -238 125 -91 -406 24 -53
4745e3o6K19M3k20J04r8r8J69j00P3J30J3l93J47K36k09J4L63j00J32l14j16J89
$$ -53 -119 100 143 -77 27 -71 -169 0 -100 -27 103 116 -277 -130 106 -103 -89 274 174 306 -8 -124 65
4768F5J51j25j58J93j08J8j26R8o6J59J83m44Q4L39k49K5K45j15p8k06J22K3r0
$$ 65 216 91 -67 126 18 36 -90 8 -58 101 284 -160 -76 263 14 39 284 169 91 -115 7 30 -60
4791f0K64k65l34L67m8L47m02p5K00J8j49L09J52m53r1J55L3j12N5J14j8m3J94
$$ -60 204 -61 -395 -28 -76 271 -131 -206 -6 12 -137 172 324 -129 -220 -65 -32 -144 -89 25 7 -36 158
4814A58l50Q8J27M7K1j53L3r0rJ12J09O6N7l79%K39n2q1K63j93K8j32J44j10J7
$$ 158 -192 -104 23 70 91 -62 -29 -119 -128 -16 93 159 216 -163 -163 76 24 -57 206 13 41 -91 53 -57 -40
4839d0j12K3K23k98L5l0J95l98M90q9k30L7K81k78J72R6K57l73M7O7j38k13J78
$$ -40 -152 -129 94 -204 -169 -199 -4 -402 88 -1 -231 -194 87 -191 -19 77 334 -39 8 75 -63 -276 -98
4862i8RL3m0rL27k62O5m7p9oJ4L1K21j16j73L5J41J48l5j68K00j35j88L2K05p1
$$ -98 -89 -56 -96 -105 222 -40 25 -22 -101 -107 -93 -62 159 43 -130 -95 46 194 159 -9 191 56 -132 -100 105 34
4888C4m0K21n8k66K04j43J94j14j98L23m97J30O01j72l56rJ11k8j87L46K8j05
$$ 34 -6 215 157 -109 95 -48 146 32 -166 157 -340 -210 391 219 -137 -146 -35 -63 -250 96 124 19
4910A9l07M05l1n2L11m58J42n2M4ML3j51K21l09l1J45J78j31J32k01m8P6J17j3
$$ 19 -288 117 86 34 345 -113 29 -23 21 25 58 -93 128 -181 -212 -67 111 -20 112 -89 -137 -61 56 43
4934D3n2R5l0L28l99mn5j12K62n9Q5q2l69M54k3j09R5j16o3J31j21n9M66l68K54
$$ 43 -9 86 56 384 -15 -19 -74 -186 76 17 102 20 -349 105 82 -27 68 -48 -111 20 -101 -160 306 -62 192
4959A92k39m0m5J28j9L2L6J49j56jJ44j58J28k1j32j15L91l86RJ21o8k0j3K00
$$ 192 -47 -87 -132 -4 -23 9 45 194 38 37 181 23 151 130 -2 -117 274 -112 -103 18 -50 -70 -83 117
4983A17r4j76K18k8K7L3k88J30j7PM09m85o1J82J04L3l7l09J29L84k13n5O8k58
$$ 117 23 -153 65 37 64 97 -191 -61 -78 -71 338 -147 -208 -26 78 111 74 -235 -106 278 65 10 78 -180
5007a80K24j76L9K86j38J42k60P4k14J6q4J29k5K65n8k53M5J47j27O7J1L41j64
$$ -180 44 -132 -93 193 55 197 -63 11 -203 -187 -271 -142 -167 98 40 -213 -168 -21 -148 -81 -70 271 107
5030A07k00m9j42L93o7J07j96j26Q0J9n6k3K50k06j78K12r5K08p2N7N0L1k61P2
$$ 107 -93 -142 -284 109 42 149 -47 -173 -93 -74 -130 -153 97 -109 -287 -75 -170 38 -34 23 73 104 -157 -85
5054h5L43k64J08j48R5J3n0N0L8o3k99K27K40k35q1K86N6L1l46j21L31j81K48
$$ -85 258 -6 102 -46 49 62 12 62 100 37 -262 -35 205 -30 -111 175 231 262 -84 -205 126 -55 193
5077A93k60l8K09k22N2j19K33lj82n7J81j12m1K73k24K20n7j9p9J62k49L67r3
$$ 193 -67 -105 104 -118 -66 -185 48 45 -137 -194 -13 -125 -166 107 -117 103 46 27 -52 110 -139 228 135
5100A35l21J74n8j5R8n1J44l28J56N2J0J63N1l35J47O8O5j49j12J29P7l65M58
$$ 135 -186 -12 -70 -85 13 -38 106 -222 -66 -14 -4 159 210 -125 22 90 155 6 -106 23 100 -265 193
5123A93l27Q6Q6J23k27k9J3j12K58k26K99l47K79l2P1j31J95m33L89k28J25R8
$$ 193 -134 -48 38 161 -66 -95 -82 -194 64 -162 137 -210 69 37 108 -23 172 -261 128 -100 25 123
5145A23j57q3j02K27j00N8L8k2J56R0k50J11k43K32j87J46Ll52K50J87O7l8%l06
$$ 123 -34 -117 -219 8 -92 -34 4 -18 138 228 -22 89 -154 78 -109 37 40 -312 -62 125 192 154 154 -152
5169a52L04k03J06n6O4L1j30J40J61m47J02K50M0m05m8N28l18o7m6J18n6l7M1
$$ -152 152 -51 55 -1 63 94 -36 104 265 -182 -80 170 210 -195 -243 285 -33 -100 -146 -28 -84 -121 -80
5192h0J37r4k1Q8J2qj24p9J72qq2L28k23k51J74j28K11Q7K7j38j17L62j16j27
$$ -80 57 -37 -58 30 42 34 -90 -169 3 -5 -87 241 18 -233 -59 -187 24 111 138 0 -117 245 129 2
5216BN4N3K3k20J40m3J2m5j23M8L64l05k30L14j22K29k34j04K80r5O3K94l78j59
$$ 2 56 109 132 -88 52 9 21 -24 -147 -99 265 -40 -270 44 -78 151 -83 -187 93 -2 61 355 -23 -182
5240a82L34J3r8j6k87L48np8j39J84kk10L79k00o6j79L59j22K7J06j84k24L72
$$ -182 152 165 67 51 -236 112 107 29 -110 74 72 -138 241 41 -25 -204 155 33 60 166 -18 -242 130
5263A30j41l10L98J83j25j14o2o0J89j43J83J11l31J14j36J95k7j79L10j60J19
$$ 130 -11 -321 77 260 135 21 -41 -101 88 -55 128 239 -92 22 -114 81 54 -125 185 25 144
5284A44P2l79J40l7L39k16k10K76m41L53J81q4J05l72o0K31j23P4j43l4J27L93
$$ 144 216 -163 -23 -60 279 63 -147 129 -312 41 222 138 243 -129 -189 42 -81 -7 -150 -184 -57 336
5306C36m30J03k22K87J07k93oK75r7J16k20o3K31j73M2J81q8j31K56k43J48k24
$$ 336 -94 9 -213 74 181 -112 -118 157 60 176 -44 -107 124 -49 -7 174 86 -45 211 -32 116 -108
5328a08J22J56l03K19r1O6j18J34q6J41j93j45P1M41k51j21j8J35m9k38N6P7o5
$$ -108 14 170 -133 86 -5 61 -57 77 -9 132 -61 -206 -135 306 55 -66 -84 51 2 -236 -180 -103 -168
5351a68Q2P4p7K19jk45L3k4o9P7J49M4J76n9j33n3k35J72j24J56J02j87J66j28
$$ -168 -86 -12 -89 130 129 -116 -83 -107 -176 -99 50 94 270 211 78 25 -210 -38 -162 -6 96 -91 75 -53
5375e3J14L3k11K73j40O9K05l02J04L2m92L90K44j10j33m45P68m05M7oo9MK33
$$ -53 61 94 -117 156 16 85 290 -12 92 124 -368 22 266 156 23 -422 346 -59 -12 -18 -87 -83 150
5398A50r5O3l4r6K0j3l1M3J29o3O7j01P1j16L76m94P7K58j22o1l69N8L05j84L29
$$ 150 55 118 84 -12 8 -5 -36 7 136 73 140 39 110 -6 370 -124 -47 211 89 28 -341 -283 22 -162 167
5423A67r8j39K01q8K72k87Qj68L66l73K47k02K66r5k60L97lk61j24M71k14j20
$$ 167 69 -70 131 43 315 28 36 -132 234 -139 108 -94 172 77 -183 214 211 -50 -174 297 83 -37
5445c7j45K35j0K25l12p9K84j98L12m37J53L5l7KO2O9k78R5Q2j78L58l17K03k55
$$ -37 -182 53 43 268 -44 -123 161 -37 275 -162 -9 26 -11 -9 53 122 -156 -61 21 -157 201 -116 87 -168
5469a68L27p0R3k15O6J37j90m0Om5P5n2J32j27j90L48j40o1j6R5q8J72K5k3P3
$$ -168 159 89 182 -33 33 170 -20 -60 -54 -99 -24 -76 56 -71 -261 87 -53 -114 -130 -35 -123 49 74 51 124
5494A24j19O1j53M8J86J5j92P7L5j21j55K22m4j7L4k76J58J07m0j6L07j38k12
$$ 124 5 66 -87 -39 147 162 -30 47 82 -39 -194 28 -16 -33 1 -275 -117 -10 -50 -66 241 103 -109
5517a09j75J6L55m2j42j29J07J39j16J22n2n7K42Mk78k9J26j08J8K26Q5n1k2q9
$$ -109 -284 -268 87 45 -97 -226 -119 20 -96 26 -26 -83 159 163 -115 -144 -18 -126 -108 118 203 152 130 41
5541D1Q3L4j03l81J70L11R0j88O1j34J8K56k87K35k54J69Q2l03L30l19OL30k37
$$ 41 124 158 55 -326 -156 155 245 57 118 -16 2 258 -29 206 -48 121 203 -100 230 -89 -83 247 10
5564A0J42j96M1P4m8q7J24j72j35J74n5J91j59P7J22j43qN0o2J91k13J25k21J67
$$ 10 152 -44 -3 71 23 -64 60 -112 -247 -73 -128 63 -96 -19 103 -40 -48 2 -60 131 -82 43 -178 -11
5588a1o3M6M02m58J47j42O2J49k09K13k87K82M0k26K36l21Q0Q5j5L1j73J48J72
$$ -11 -74 -28 374 -84 63 -79 -17 132 -77 136 -151 131 171 -55 181 -140 -60 25 10 41 -132 16 188
5611A88q2j7q5Oo4K89k76Nn2qK62p7j53r6P1J83k04J5p6j06K83M4k09J14j00l
$$ 188 106 89 4 10 -54 235 -41 -36 -88 -96 166 89 -64 -160 -89 94 -110 -95 -171 -277 6 50 -159 -45 -145 -148
5637a48LJ42N9QJ75l72j10K90j80J05l13M39o4J2p7j85J64m3M8MK15jk26j05J51
$$ -148 -145 -3 56 64 239 -133 -243 47 -133 -28 -341 98 34 46 -31 -216 -52 -95 -47 -43 172 171 -55 -160 -9
5662ij0j11J42J16M3l15L64p2o1op1j18K61j85k4K73n8j61L8l4R8p2j78L9K04
$$ -9 -19 -130 12 128 171 -144 220 148 87 81 10 -108 153 -32 -56 217 159 -2 36 2 100 28 -150 -111 93
5687I3K5J56k90k7k12O07l63p0n6L13l83K75k13J12J19l12L84j70o4K16j27lp3
$$ 93 118 274 -16 -43 -255 352 -11 -81 -137 176 -207 68 -145 -33 86 -226 158 -12 -76 140 13 10 -63
5710f3K15l52M24m5O5k34j52J45m6j0N4M1j06J71j23J29k05K29l03K41k13K91
$$ -63 152 -200 224 179 244 10 -142 3 -43 -53 1 42 -64 107 -16 113 -92 137 -166 75 -138 153
5732A53p6j55j33J14J97j28J0K6n6J31k7p4j87K93O0j22j83L64l40J28J34L0l51
$$ 153 77 -78 -211 -97 100 -28 -18 8 -48 83 56 -18 -205 88 148 26 -157 207 -133 -5 129 159 -192
5755a92J21J27J07j49J94k98J99L8o7j76K97k58J03l6k1P1k13K74k52K21k07J85
$$ -192 -71 56 163 14 208 -90 109 147 80 -96 201 -57 46 10 -11 60 -153 121 -131 90 -117 68
5777F8m45M08J10k45l2%K68k06J55k19P1J6k05J91k0J2q9R2o6J36M7K41k61j15
$$ 68 -377 31 141 -104 -136 -136 132 -74 81 -138 -67 -51 -256 -65 -85 -73 -162 -70 -136 0 47 288 27 -88
5801h8k01N2O6L15k75J39O5k9k2l4q3pJ89j87J64J32l29J04J98k13Jk9j92L33
$$ -88 -289 -237 -171 144 -131 8 73 44 22 -12 -95 -102 87 -100 64 196 -133 -29 169 -44 -43 -72 -264 69
5825F9m8j1k49J30N8k15L41r0JN6O8j36K58j28o4J31l65N7K14O3o7j65L44k08
$$ 69 21 10 -239 -109 -51 -266 75 -15 -14 42 110 -26 232 104 40 171 -194 -137 77 140 73 -92 252 44
5849D4l21K89M4K1k96K56j04N4j8J15M7J56k34l27M95j34p8J08k26Q2J23k43J17
$$ 44 -277 12 56 77 -219 37 -67 -13 -31 84 131 287 53 -274 221 87 9 117 -109 -27 96 -147 -30
5872c0m9J33j89J23k74M18L5k29J37k12o0M46m68J62J35k5k7J11k3k14K23l82
$$ -30 -79 54 -135 -12 -286 132 167 -62 75 -137 -197 249 -219 -57 78 53 26 137 114 -100 123 -259
5894b59J77N8J42J8j43k07J01J8J86K33l78J15J01r2j4%j22L27k29j65J26L67
$$ -259 -82 -24 118 136 -7 -214 -113 -95 91 324 -54 61 162 70 56 56 -66 261 32 -133 -7 360
5916C60l69j66L08j18k6j57J85m2Q4K7k96J43Q3n8R5j46J90n6k67J59N7r1J50
$$ 360 -9 -175 133 15 -11 -168 17 -25 59 86 -210 -67 16 -42 53 -93 97 41 -226 -67 -10 -101 49
5939D9Jk06M41j16j96n5J59m0j25RK00p7p0J94r5j57K42j42k12K14J27j27k9K25
$$ 49 50 -156 285 169 -27 -82 77 37 -88 -79 121 44 -26 168 73 -84 158 16 -196 18 145 18 -11 214
5963B14l56J51k21L47k73J79o5r6m6J50L4l70L38q0J22R7j67j19RL45j20j54J04
$$ 214 -142 9 -212 135 -138 41 -24 -120 -166 -16 18 -352 -14 -94 28 125 -42 -161 -152 193 73 -81 23
5986B3m6K19n8k13K26r8n8J38l71K48P4l0J62k79lq2M9M6J65J17l02O6J30m7K9
$$ 23 -23 196 138 -75 151 53 -5 133 -238 10 84 54 216 -63 -66 -148 -99 -53 112 229 -73 -7 123 76 105
6011A05J22j78l15L51j70q4J98j50L6K8P7k48K72k36K64Q7k12J15J16o9K06k80
$$ 105 227 49 -266 85 -85 -169 29 -121 -85 -57 20 -228 44 -192 72 159 -53 62 178 109 315 35
6033C5l37M05p1l22J81J17r3J33j0j89L03j28K48l10j26R2M2j55J17J95j92J53
$$ 35 -302 103 32 -290 -109 8 -85 48 38 -151 152 24 272 -38 -164 -72 -30 -185 -68 127 -65 88
6055H8M4j85J47l72K05J68l7M3l17J74j00L27l04R4J98N5k15j15P3j6L9N%p9R6
$$ 88 132 -53 94 -278 -73 95 58 101 -216 -42 -142 185 -119 -25 173 228 13 -102 -29 -45 -6 -1 -1 -80 16
6080A6RK2k97K09K15j76nj03L20K6j27l07L71j99K6k52L69l0l0j50J71j17K93
$$ 16 25 47 -250 -41 174 -2 -7 -110 210 236 109 -198 173 -26 0 -252 117 87 57 -93 78 -39 254
6103B54l20J52k15p9j38L76l50K97o7M8J61k95J99J69k9k68L3M8j33J4K73j41
$$ 254 -66 86 -129 -208 -346 30 -320 -23 -90 -42 119 -176 23 192 163 -105 -72 -24 -157 -143 130 -11
6125a1J40p1l7k37J16K6P5L10k06k21J14j9K74m59R0q6J44r9O6J33J41j29p0l4
$$ -11 129 58 21 -216 -100 -74 1 311 105 -116 -2 -21 253 -206 -116 -202 -58 -157 -91 42 183 54 -16 -50
6149e0N3j1j23J18n4J15pK41k50j40K03j64J4M1L5m8L6J32J01j54j1j10k51N13
$$ -50 3 -8 -131 -13 -67 48 41 282 32 -108 95 -69 -55 -14 21 -27 9 141 242 88 77 -33 -284 229
6173B29j97n2J99l36J95J9L9L9j02n1K79k57j10K05N2j44J14k02J12p8j71K53
$$ 229 32 -20 179 -157 38 57 96 135 33 -18 261 4 -106 99 151 7 121 -81 31 -47 -218 35
6195C5m5k56M11k98R7J30l0k75J69J58Q2l28L21j44l53M38r3q3K96k85J28k7L3
$$ 35 -10 -266 145 -153 -56 74 44 -231 -62 96 178 -150 171 27 -326 112 19 -64 232 -53 75 48 81
6218H1l34K22k9K93j35o1r8%J38L2j43J32J30l11J25j4O9k94J01J25J9L1j07K27
$$ 81 -253 -31 -60 233 98 37 -61 -61 77 109 -34 98 228 -83 42 28 97 -197 -96 29 48 79 -28 199
6242A99j34K9l74L95Lj01J36m56K83r4k2N2P6m7j49J25lm7J20j9K6k91J11K94
$$ 199 65 94 -280 115 118 17 153 -303 -20 -114 -136 -84 -8 -55 -204 -79 -82 -129 -9 -28 -2 -293 -182 112
6266A12o4r1L08j68k5k28M40l46K24j5o7J0k23J37O7k5j19O6oj49n2J87k0R6l2
$$ 112 48 -43 265 97 72 -156 284 -62 162 147 80 90 -133 4 71 46 -73 -7 -13 -162 -214 -27 -47 49 17
6291A7M7k99O5K35p3J42p1K21k11ln5j64J92l43M42q2j9j70l0K65r7m9J32R1j62
$$ 17 64 -235 -170 65 -8 134 63 284 73 70 15 -149 43 -300 142 60 41 -129 -159 106 9 -40 92 183 21
6316B1J48m17K01L0MM9J32l6p2j78J63j8k63J82K59o81K27L10K22n8K6m95K24
$$ 21 169 -248 -47 -17 -13 36 168 132 60 -118 45 27 -236 -54 205 -476 -249 61 283 225 251 -244 -20
$$ [...]
8191e1
##END NTUPLES=NMR FID
##END=
