##TITLE=1H_DE-27sr3
 D2O
 8 sc, 
 13.2.2024
##JCAMPDX= 6.0         $$ Bruker NMR JCAMP-DX V2.0
##DATA TYPE= NMR FID
##DATA CLASS= NTUPLES
##ORIGIN= UXNMR, Bruker Analytische Messtechnik GmbH
##OWNER= root
$$ XWIN-NMR		Version 3.5
$$ Tue Feb 13 16:13:03 2024 Russian Standard Time (UT+4h)  she@DPX200
##.OBSERVE FREQUENCY= 200.1313
##.OBSERVE NUCLEUS= ^1H
##.DELAY= (6, 6)
##.ACQUISITION MODE= SIMULTANEOUS
##.ACQUISITION SCHEME= undefined
##.AVERAGES= 8
##.DIGITISER RES= 18
##SPECTROMETER/DATA SYSTEM= spect
##.PULSE SEQUENCE= zg30
##.SOLVENT NAME= DMSO
##.SHIFT REFERENCE= (INTERNAL, DMSO, 0, 15.7039)
##AUDIT TRAIL= $$ (NUMBER, WHEN, WHO, WHERE, WHAT)
$$ ##TITLE= Audit trail, XWIN-NMR		Version 3.5
$$ ##JCAMPDX= 5.01
$$ ##ORIGIN= Bruker BioSpin GmbH
$$ ##OWNER= she
$$ F:/spectra/data/she/nmr/H-F/1/audita.txt
$$ ##AUDIT TRAIL=  $$ (NUMBER, WHEN, WHO, WHERE, WHAT)
(   1,<2024-02-13 16:11:56.78 +0400>,<she>,<DPX200>,
      <created by zg, POWCHK disabled, PULCHK disabled
       configuration hash MD5:
       00 E9 B6 7A A2 85 ED C7 34 08 36 98 17 FE 4E 26
       data hash MD5: 16K
       1E 7D 7C 2F 5D 83 24 EE 9D EE B3 76 78 FC E6 3E>)
$$ ##END=
$$ 
$$ hash MD5
$$ 85 67 31 12 F9 9E 8D 29 01 45 2D D7 79 E5 18 62
##$RELAX= 
##$RELAX= 
##$RELAX= 
##$RELAX= 
##$RELAX= 
##$RELAX= 
$$ Bruker specific parameters
$$ --------------------------
##$DU= <F:/spectra>
##$EXPNO= 1
##$NAME= <H-F>
##$PROCNO= 1
##$TYPE= <nmr>
##$USER= <she>
##$AMP= (0..31)
100 100 100 100 100 100 100 100 100 100 100 100 100 100 100 100 100 100 
100 100 100 100 100 100 100 100 100 100 100 100 100 100 
##$AQSEQ= 0
##$AQ_mod= 1
##$AUNM= <au_zg>
##$AUTOPOS= <>
##$BF1= 200.13
##$BF2= 200.13
##$BF3= 200.13
##$BF4= 200.13
##$BF5= 200.13
##$BF6= 200.13
##$BF7= 200.13
##$BF8= 200.13
##$BYTORDA= 1
##$CFDGTYP= 0
##$CFRGTYP= 5
##$CHEMSTR= <none>
##$CNST= (0..31)
1 1 145 1 1 1 1 1 1 1 1 1 1 1 1 1 1 1 1 1 1 1 1 1 1 1 1 1 1 1 1 1 
##$CPDPRG= <>
##$CPDPRG1= <>
##$CPDPRG2= <>
##$CPDPRG3= <>
##$CPDPRG4= <mlev>
##$CPDPRG5= <mlev>
##$CPDPRG6= <mlev>
##$CPDPRG7= <mlev>
##$CPDPRG8= <mlev>
##$CPDPRGB= <>
##$CPDPRGT= <>
##$D= (0..31)
0 1.2 0 0 0 0 0 0 0 0.06 0 0.03 0 0 0 0 0.0002 0 0 0 0 0 0 0 0 0 0 0 0 
0 0 0 
##$DATE= 1707826316
##$DBL= (0..7)
120 120 120 120 120 120 120 120 
##$DBP= (0..7)
150 150 150 150 150 150 150 150 
##$DBP07= 0
##$DBPNAM0= <>
##$DBPNAM1= <>
##$DBPNAM2= <>
##$DBPNAM3= <>
##$DBPNAM4= <>
##$DBPNAM5= <>
##$DBPNAM6= <>
##$DBPNAM7= <>
##$DBPOAL= (0..7)
0.5 0.5 0.5 0.5 0.5 0.5 0.5 0.5 
##$DBPOFFS= (0..7)
0 0 0 0 0 0 0 0 
##$DE= 6
##$DECBNUC= <off>
##$DECIM= 32
##$DECNUC= <off>
##$DECSTAT= 4
##$DIGMOD= 1
##$DIGTYP= 9
##$DL= (0..7)
0 120 120 120 120 120 120 120 
##$DP= (0..7)
150 150 150 150 150 150 150 150 
##$DP07= 0
##$DPNAME0= <>
##$DPNAME1= <>
##$DPNAME2= <>
##$DPNAME3= <>
##$DPNAME4= <>
##$DPNAME5= <>
##$DPNAME6= <>
##$DPNAME7= <>
##$DPOAL= (0..7)
0.5 0.5 0.5 0.5 0.5 0.5 0.5 0.5 
##$DPOFFS= (0..7)
0 0 0 0 0 0 0 0 
##$DQDMODE= 0
##$DR= 18
##$DS= 0
##$DSLIST= <SSSSSSSSSSSSSSS>
##$DSPFIRM= 0
$$ [...]
##$SUBNAM2= <"">
##$SUBNAM3= <"">
##$SUBNAM4= <"">
##$SUBNAM5= <"">
##$SUBNAM6= <"">
##$SUBNAM7= <"">
##$SUBNAM8= <"">
##$SUBNAM9= <"">
##$SW= 18.0517328524113
##$SWIBOX= (0..15)
0 0 2 0 0 0 0 0 0 0 0 0 0 0 0 0 
##$SW_h= 3612.71676300578
##$TD= 16384
##$TD0= 1
##$TE= 0
##$TE2= 300
##$TE3= 300
##$TEG= 300
##$TL= (0..7)
0 120 120 120 120 120 120 120 
##$TP= (0..7)
150 150 150 150 150 150 150 150 
##$TP07= 0
##$TPNAME0= <>
##$TPNAME1= <>
##$TPNAME2= <>
##$TPNAME3= <>
##$TPNAME4= <>
##$TPNAME5= <>
##$TPNAME6= <>
##$TPNAME7= <>
##$TPOAL= (0..7)
0.5 0.5 0.5 0.5 0.5 0.5 0.5 0.5 
##$TPOFFS= (0..7)
0 0 0 0 0 0 0 0 
##$TUNHIN= 0
##$TUNHOUT= 0
##$TUNXOUT= 0
##$USERA1= <user>
##$USERA2= <user>
##$USERA3= <user>
##$USERA4= <user>
##$USERA5= <user>
##$V9= 5
##$VALIST= <valist>
##$VCLIST= <CCCCCCCCCCCCCCC>
##$VD= 0
##$VDLIST= <DDDDDDDDDDDDDDD>
##$VPLIST= <PPPPPPPPPPPPPPP>
##$VTLIST= <TTTTTTTTTTTTTTT>
##$WBST= 1024
##$WBSW= 4
##$XGAIN= (0..3)
0 0 0 0 
##$XL= 0
##$YL= 0
##$YMAX_a= 38834
##$YMIN_a= -40751
##$ZGOPTNS= <>
##$ZL1= 120
##$ZL2= 120
##$ZL3= 120
##$ZL4= 120
##$ABSF1= 10
##$ABSF2= 0
##$ABSG= 5
##$ABSL= 3
##$ALPHA= 0
##$AQORDER= 0
##$ASSFAC= 0
##$ASSFACI= 0
##$ASSFACX= 0
##$ASSWID= 0
##$AUNMP= <proc_1d>
##$AZFE= 0.1
##$AZFW= 0.1
##$BCFW= 1
##$BC_mod= 2
##$BYTORDP= 1
##$COROFFS= 0
##$CY= 11.3945322036743
##$DATMOD= 1
##$DC= 2
##$DFILT= <>
##$DTYPP= 0
##$F1P= 15.7292609196834
##$F2P= 12.9074282941183
##$FCOR= 0.5
##$FTSIZE= 0
##$FT_mod= 4
##$GAMMA= 1
##$GB= 0.15
##$INTBC= 1
##$INTSCL= 1
##$ISEN= 128
##$LB= 0.24
##$LEV0= 0
##$LPBIN= 0
##$MAXI= 10000
##$MC2= 0
##$MEAN= 0
##$ME_mod= 0
##$MI= 1.114404
##$NCOEF= 0
##$NC_proc= 0
##$NLEV= 6
##$NOISF1= 3.799351
##$NOISF2= 2.8
##$NSP= 1
##$NTH_PI= 0
##$NZP= 0
##$OFFSET= 15.70392
##$PC= 1
##$PHC0= -24957.04
##$PHC1= 21.85265
##$PH_mod= 1
##$PKNL= yes
##$PPARMOD= 0
##$PSCAL= 0
##$PSIGN= 0
##$REVERSE= no
##$SF= 200.130013532006
##$SI= 16384
##$SIGF1= 3
##$SIGF2= 2
##$SINO= 400
##$SIOLD= 16384
##$SREGLST= <1H.CDCl3>
##$SSB= 0
##$STSI= 0
##$STSR= 0
##$SW_p= 3612.71676300578
##$SYMM= 0
##$S_DEV= 0
##$TDeff= 0
##$TDoff= 0
##$TI= <>
##$TILT= no
##$TM1= 0
##$TM2= 0
##$TOPLEV= 0
##$USERP1= <user>
##$USERP2= <user>
##$USERP3= <user>
##$USERP4= <user>
##$USERP5= <user>
##$WDW= 1
##$XDIM= 8192
##$YMAX_p= 0
##$YMIN_p= 0
$$ End of Bruker specific parameters
$$ ---------------------------------
##NTUPLES= NMR FID
##VAR_NAME=  TIME,          FID/REAL,        FID/IMAG
##SYMBOL=    X,             R,               I
##VAR_TYPE=  INDEPENDENT,   DEPENDENT,       DEPENDENT
##VAR_FORM=  AFFN,          ASDF,            ASDF
##VAR_DIM=   8192,          8192,            8192
##UNITS=     SECONDS,       ARBITRARY UNITS, ARBITRARY UNITS
##FACTOR=    0.0002768,     1,               1
##FIRST=     0,             0,               0
##LAST=      2.2672688,     0,               0
##MIN=       0,             -40751,          0
##MAX=       2.2672688,     38834,           0
$$ Real data points
##PAGE= N=1
##DATA TABLE= (X++(R..R)), XYDATA
$$ [...]
$$ plain form
2011 -512 -1103 -1727 -1128 -283 720 1100 1587 1382 499 -274 -1189 -1425 -1408 -759 236 1093 1386 1304 433 -123
2031 -123 -898 -1605 -1387 -720 236 1097 1485 1577 986 -211 -1030 -1730 -1562 -889 -411 714 1383 1297 755 -6
2051 -6 -880 -1838 -1404 -823 101 623 1404 1624 1077 369 -507 -1084 -1644 -1240 -318 652 1321 1471 1383 439 -493
2072 -493 -1359 -1583 -1179 -444 434 1087 1681 1408 324 -159 -909 -1512 -1456 -726 523 967 1255 1409 576 -180
2092 -180 -950 -1379 -1434 -613 172 893 1498 1338 807 88 -717 -1308 -1520 -797 -22 803 1327 1429 733 79
2112 79 -803 -1078 -1225 -896 -209 903 1293 1337 955 342 -581 -1196 -983 -1031 -290 324 911 1341 796 -96 -792
2133 -792 -993 -1154 -1065 -92 616 1289 1338 1132 401 -253 -1029 -1249 -1173 -359 163 607 937 809 301 -190 -1117
2154 -1117 -1156 -1054 -620 498 858 1475 1336 503 -67 -960 -1223 -1180 -477 268 899 1378 1368 611 170 -686
$$ packed form
2011e12n91o24N99Q45J003L80M87k05q83p73r15k36J7O49R95Q57K93q2q71n56
2031a23p75p07K18O67R56Q61L88R2n91j197q19p00J68O73M78J125O69q6n42p61
2051fq74r58M34N81R24N22P81K20n47p08q76n77n60M04R22R70O69J50q8r44r32
2072d93q66k24M04P35Q78O53N94k73j084m83p50o03N6P30J249M44K88J54q33p56
2092a80p70m29n5Q21P85P21O05j60n31p19q05n91k12P23P75Q25N24J02o96o54
2112G9q82k75j47L29O87J112L90M4l82o13r23o15K13m8P41O14N87M30n45q92o96
2133g92k01j61Q9R73P08O73M9k06p31o54p76k20P6Q14N22M44L30j28n08m91r27
2154a117l9J02M34J118L60O17j39q33n70q93k63M3P03P45O31M79j0p57m41q56
$$ plain form
2174 -686 -1248 -1149 -654 7 880 1266 1039 866 70 -615 -1126 -1051 -824 -397 579 1014 1228 853 175 -594 -1122
2195 -1122 -1311 -802 -287 393 935 1248 1001 233 -496 -903 -1162 -946 -466 426 791 864 702 47 -363 -861
2215 -861 -1113 -940 -362 301 936 1574 1061 561 -57 -858 -1079 -1312 -424 117 835 1254 863 619 -62 -864
2235 -864 -1285 -1193 -471 58 635 1122 929 844 -32 -483 -1090 -1368 -1135 -160 422 1185 909 882 -23 -352 -1177
2256 -1177 -1188 -740 -261 775 1273 1345 1185 259 -335 -935 -1348 -1014 -411 149 1077 1208 1189 467 -343 -871
2276 -871 -1279 -631 -368 189 1128 1103 987 743 -502 -923 -1149 -1078 -515 182 708 1261 1116 536 36 -832
2296 -832 -1347 -1303 -477 -38 859 1132 1401 889 25 -680 -1341 -1193 -789 -223 720 1034 971 582 181 -602 -1167
2317 -1167 -1113 -960 -144 514 1157 1212 1039 522 -200 -1003 -1109 -1073 -334 479 1005 1315 1009 349 -315 -1029 -1414
$$ packed form
2174f86n62R9M95O61Q73L86k27j73p96o85n11P5K27M27R76M35K14l75o78p69n28
2195a122j89N09N15O80N42L13k47p68p29m07k59K16M80Q92L65P3j62o55m10m98
2215h61k52J73N78O63O35O38n13n00o18q01k21k33Q88N41P18M19l91k44o81q02
2235h64m21R2P22N29N77M87j93q5q76m51o07k78K33R75N82P63k76k7r05l29q25
2256a177j1M48M79J036M98P2j60r26n94o00m13L34O03N60R28J31j9p22q10n28
2276h71m08O48K63N57R39k5j16k44j245m21k26P1N63O97N26N53j45n80n00q68
2296h32n15M4Q26M39Q97K73K69n12q64p05o61J48M04N66R43L14o3l89m01p83n65
2317a167N4J53Q16O58O43N5j73n17p22q03j06L6P39Q13N26L10l06o60o64p14l85
$$ plain form
2338 -1414 -853 -548 286 910 1245 1058 881 -42 -538 -1298 -1139 -609 161 862 969 957 682 -244 -728 -747
2358 -747 -1145 -750 147 485 1278 1084 578 357 -412 -994 -948 -757 -88 345 1037 1113 669 466 -572 -880
2378 -880 -1153 -959 -500 555 1060 1035 820 373 -247 -955 -1197 -516 -249 -3 706 1077 968 346 -353 -840
2398 -840 -1192 -885 -506 230 888 1146 762 718 28 -687 -1272 -1075 -723 -170 730 1071 840 430 49 -776
2418 -776 -885 -979 -560 49 428 1144 1151 591 259 -563 -602 -933 -971 -162 462 568 634 516 345 -495 -996 -902
2440 -902 -895 -115 336 938 1058 870 560 -259 -877 -1006 -786 -268 283 734 978 623 353 -295 -860 -855 -797 -576
2462 -576 319 769 992 911 255 -219 -523 -869 -678 -336 317 590 541 644 397 -267 -782 -786 -728 -698 308 748
2484 748 986 1078 318 -104 -504 -709 -1042 -334 113 339 635 772 686 264 -797 -805 -961 -609 -251 493 829
$$ packed form
2338a414N61L05Q34O24L35j87j77r23m96p60J59N30P70P01J07j2k75r26m84j9
2358g47l98L95Q97L38P93j94n06k21p69n82M6J91O69M33O92P6m44k03j038l08
2378h80k73J94M59J055N05k5k15m47o20p08k42O81K67K46P09L71j09o22o99m87
2398h40l52L07L79P36O58K58l84m4o90p15n85J97L52N53R00L41k31m10l81q25
2418g76j09r4M19O09L79P16Pn60l32q22l9l31l8Q09O24J06O6j18j71q40n01R4
2440i02PP80M51O02J20j88l10q19o18j29K20N18N51M51K44l55k70o48n65NN8K21
2462e76Q95M50K23q1o56m74l04l46J91L42O53K73m9J03k47o64n15mN8L0J006M40
2484G48K38R2p60m22m00k05l33P08M47K26K96J37q6m22j061qj56L52L58P44L36
$$ plain form
2505 829 965 669 163 -388 -549 -1030 -852 -224 468 788 957 624 283 -598 -751 -745 -870 -271 197 763 803
2526 803 719 302 -164 -1032 -913 -1051 -432 226 605 790 790 415 8 -820 -1100 -910 -455 -138 684 917 972
2547 972 522 170 -378 -879 -978 -425 -156 546 787 829 547 -202 -288 -991 -669 -370 102 566 966 1051 832
2568 832 131 -398 -769 -711 -512 -344 379 957 913 633 207 -273 -711 -747 -604 -301 380 861 976 841 304
2589 304 -352 -646 -860 -698 -642 71 730 943 877 150 82 -532 -785 -782 -498 289 673 1011 1344 497 -107 -487
2611 -487 -838 -939 -522 161 471 740 754 532 51 -785 -671 -717 -767 -318 394 995 826 843 285 -373 -634
2632 -634 -1086 -809 -329 411 628 758 857 214 -741 -791 -1179 -877 -166 543 868 1056 671 459 -166 -634 -686
2653 -686 -823 -368 162 457 958 745 429 -191 -565 -1014 -690 -679 -54 517 850 983 477 62 -549 -989
$$ packed form
2505H29J36k96n06n51j61m81J78O28O92L20J69l33l41q81j53Oj25N99M68N66M0
2526H03q4m17m66q68J19j38O19O58L79J85%l75m07q28k80J90M55L17Q22K33N5
2547I72m50l52n48n01r9N53K69P02K41M2k82p49q6p03L22K99M72M64M00Q5k19
2568H32p01n29l71N8J99J68P23N78m4k80m26m80m38l6J43L03O81M81J15j35n37
2589C04o56k94k14J62N6P13O59K13o6p27o8o14k53LK84P87L84L38L33q47o04l80
2611d87l51j01M17O83L10K69J4k22m81q36J14m6n0M49P12O01j69J7n58o58k61
2632f34m52K77M80P40K17J30R9o43r55n0l88L02P11P09L25J88l85k12o25m68n2
2653f86j37M55N30K95N01k13l16o20l74m49L24J1O25N71L33J33n06m15o11m40
$$ plain form
2673 -989 -736 -467 -72 433 844 849 434 -214 -191 -544 -959 -448 -234 266 889 960 642 63 -355 -737 -999
2694 -999 -706 84 487 458 687 662 48 -377 -724 -1092 -919 -332 202 542 843 876 326 32 -530 -921 -703
2715 -703 -581 138 636 694 491 455 -31 -458 -902 -839 -175 -240 484 734 801 637 -231 -531 -991 -630 -523 3
2737 3 705 766 588 460 254 -359 -698 -478 -435 -52 451 763 783 393 195 -311 -608 -1044 -411 15 143 434
2759 434 563 420 248 -398 -520 -589 -810 -342 230 743 629 517 508 -182 -608 -611 -613 -254 -66 386 326 650 273
2782 273 -281 -495 -831 -460 -175 365 545 743 601 438 -71 -457 -485 -932 -461 164 658 635 611 383 80
2803 80 -620 -678 -543 -700 -19 406 575 544 566 -83 -331 -940 -582 -517 -118 225 442 636 461 158 -279 -851
2825 -851 -852 -318 77 277 539 665 479 211 -211 -695 -703 -437 -577 248 601 815 710 231 -349 -526 -723
$$ packed form
2673i89K53K69L95N05M11Nm15o48K3l53m15N11K14N00O23P1l18n79m18l82k62
2694i99K93P90M03k9K29k5o14m25l47l68J73N87N34L40L01L3n50k94n62l91K18
2715g03J22P19M98N8k03l6m86m27m44O3O64o5P24K50O7j64q68l00m60L61J07N26
2737CP02O1j78j28k06o13l39K20M3L83N03L12K0l90j98n06k97m36O33M26J28K91
2759D34J29j43j72o46j22o9k21M68N72N13j14j12ro90m26lkL59J88M52o0L24l77
2782B73n54k14l36L71K85N40J80J98j42j63n09l86k8m47M71O25M94k3k4k28l03
2803H0p00n8J35j57O81M25J69l1K2o49k48o09L58O5L99L43K17J94j75l03m37n72
2825h51jN34L95K00K62J26j86k68m22m84qK66j40Q25L53K14j05m79n80j77j97
$$ plain form
2846 -723 -450 -235 247 695 784 815 418 -199 -410 -579 -748 -581 -147 549 657 751 493 -81 -473 -692 -680
2867 -680 -277 -188 579 619 691 354 5 -399 -564 -825 -441 -128 236 740 632 322 112 -559 -787 -803 -416
2888 -416 -309 577 694 769 641 256 -194 -661 -651 -627 -659 67 221 674 705 192 -3 -521 -461 -631 -292 116
2910 116 496 878 587 537 5 -451 -725 -778 -507 21 178 789 518 515 -353 -693 -621 -800 -532 -77 457 713
2932 713 860 456 155 -146 -729 -679 -588 -212 248 560 613 421 11 -99 -733 -899 -605 -182 338 480 879
2953 879 585 520 -95 -555 -634 -777 -44 63 370 717 458 208 -121 -513 -781 -619 -298 236 207 614 814
2974 814 416 41 -490 -581 -579 -582 -145 541 541 847 394 -114 -429 -742 -618 -198 -108 47 709 610 530 100 -93
2997 -93 -628 -652 -261 42 441 370 534 629 279 -352 -545 -451 -456 -38 67 643 908 855 112 -241 -270 -697 -582
$$ packed form
2846g23K73K15M82M48Q9L1l97o17k11j69j69J67M34O96J08R4k58n74l92k19J2
2867f80M03Q9P67M0P2l37l49m04j65k61L84L13L64N04j08l10k10o71k28j6L87
2888d16J07Q86J17P5j28l85m50m67J0K4l2P26J54M53L1n13j95n18O0j70L39M08
2910A16L80L82k91n0n32m56k74n3K71N28J57O11k71lq68l40P2j79K68M55N34K56
2932G13J47m04l01l01n83N0R1L76M60L12N3j92m10j10o34j66K94M23N20J42L99
2953H79k94o5o15m60p9j43P33J07L07L47k59k50l29l92k68J62L21N34k9M07K00
2974H14l98l75n31r1KlM37O86%L06m53n08l15l13J24M20R0J55O62r9q0m30j93
2997i3n35k4L91L03L99p1J64R5l50o31j93R4nM18J05N76K65n3p43l53k9m27J15
$$ plain form
3020 -582 -194 166 538 421 529 145 -217 -380 -547 -524 -410 48 343 651 475 394 -361 -268 -687 -474 -412
3041 -412 129 257 439 621 129 40 -494 -288 -570 -279 -102 560 697 710 525 25 -148 -310 -417 -404 -44
3062 -44 280 636 622 522 297 -448 -562 -736 -548 -37 172 568 600 273 167 -209 -461 -710 -397 -341 185
3083 185 417 339 582 -73 -217 -530 -696 -468 -255 82 445 586 636 450 -189 -170 -556 -601 -232 73 395
3104 395 481 344 398 -133 -456 -504 -737 -33 93 249 455 560 121 -126 -369 -584 -612 -508 172 25 557
3125 557 276 517 -138 -277 -800 -622 -130 -44 360 709 870 247 43 -249 -448 -732 -389 -144 141 580
3145 580 709 406 -184 -122 -479 -475 -537 -256 -39 668 560 582 323 -123 -162 -771 -586 -221 -55 180 523 463
3167 463 410 -245 -714 -684 -603 -192 -31 441 524 331 549 323 -566 -742 -532 -415 -281 238 393 497 437 -29
$$ packed form
3020e82L88L60L72j17J08l84l62j63j67K3J14M58K95L08j76q1p55R3m19K13O2
3041d12N41J28J82J82m92q9n34K06k82K91J77O62J37J3j85n00j73j62j07J3L60
3062d4L24L56j4j00k25p45j14j74J88N11K09L96L2l27j06l76k52k49L13N6N26
3083A85K32p8K43o55j44l13j66K28K13L37L63J41N0j86o39J9l86m5L69L05L22
3104C95Q6j37N4n31l23m8k33P04J26J56K06J05m39k47k43k15k8J04O80j47N32
3125E57k81K41o55j39n23J78M92Q6M04L49J61o23k04k92j99k84L43K45K85M39
3145E80J29l03n90O2l57Mo2K81K17P07j08K2k59m46l9o09J85L65J66K35L43o0
3167D63n3o55m69L0Q1M11J61M72Q3j93K18k26q89j76K10J17J34N19J55J04o0m66
$$ plain form
3189 -29 -250 -666 -709 -579 -105 270 665 732 501 73 -130 -570 -636 -457 -203 436 447 561 552 239 -3 -443
3211 -443 -534 -386 -208 122 494 662 715 284 -280 -515 -393 -644 -190 -119 379 443 590 200 58 -432 -468 -464
3233 -464 -297 -89 331 694 738 221 74 -449 -778 -384 -447 -75 297 467 518 450 24 -216 -373 -752 -550
3254 -550 5 342 680 789 244 468 -254 -468 -492 -547 -253 146 457 578 382 249 -251 -335 -590 -474 -124
3275 -124 258 285 559 516 371 -17 -455 -500 -594 -254 32 432 571 359 363 231 -436 -455 -620 -395 -105 272
3297 272 602 593 270 122 -170 -505 -364 -426 -194 48 335 684 400 193 -120 -351 -567 -556 -231 418 358 292
3319 292 494 179 -23 -324 -434 -312 -56 109 491 269 501 206 -235 -530 -500 -377 -237 199 134 328 268
3340 268 367 32 -299 -410 -499 -404 -48 370 365 310 196 15 -79 -535 -556 -230 200 243 559 497 326 5 -42 -414
$$ packed form
3189b9k21m16m3J30M74L75L95O7k31m28k03m40o6J79K54O39J1J14rl13k42m40
3211d43r1J48J78L30L72J68N3m31n64k35J22k51M54P1M98O4J47l90j42m90l6M
3233d64J67K08M20L63M4n17j47n23l29L94o3L72L72J70N1o8m26k40j57l79K02
3254e50N55L37L38J09n45K24p22k14k4n5K94L99L11J21j96j33n00q4k55J16L50
3275a24L82K7K74m3j45l88m38m5r4L40K86M00J39k12Mj32o67j9j65K25K90L77
3297B72L30rl23j48k92l35J41o2K32K42K87L49k84k07l13k31k16J1L25O49o0o6
3319B92K02l15k02l01j10J22K56J65L82k22K32k95m41k95L0J23J40M36o5J94o0
3340B68R9l35l31j11q9R5L56M18nn5j14j81r4m56k1L26M30M3L16o2j71l21m7l72
$$ plain form
3364 -414 -417 -172 72 228 335 345 125 -97 -470 -538 -270 -215 -248 13 314 553 317 69 -317 -257 -726 -465
3386 -465 -208 248 265 448 598 45 -39 -377 -581 -360 -243 -1 394 695 436 161 16 -152 -445 -477 -277
3407 -277 46 184 413 581 254 -26 -443 -435 -565 -330 54 599 340 433 381 -5 -140 -531 -331 -220 193
3428 193 384 546 232 248 28 -141 -282 -387 -458 -131 377 681 244 336 248 -350 -449 -278 -187 1 113 468
3450 468 268 424 174 -288 -140 -497 -204 18 127 364 395 365 362 -115 -443 -548 -370 -133 -4 470 786
3471 786 506 329 -113 -326 -411 -542 -248 21 160 356 455 478 104 -121 -439 -368 -281 -112 147 412 400 296
3493 296 -123 -176 -400 -634 -323 -46 479 120 463 264 274 -222 -524 -556 -640 42 63 288 469 421 71 -66
3515 -66 -501 -772 -506 -168 97 197 457 241 460 1 -323 -401 -447 -433 110 223 228 464 140 -402 -232 -437
$$ packed form
3364d14lK45K44J56J07J0k20k22l73o8K68N5l3K61L01K39k36k48l86O0m69K61
3386d65K57M56J7J83J50n53q4l38k04K21J17K42L95L01k59k75j45j68k93l2K00
3407b77L23J38K29J68l27k80m17Qj30K35L84N45k59R3n2l86j35l91K00J11M13
3428A93J91J62l14J6k20j69j41j05p1L27N08L04m37R2q8n98r9J71R1J88J12L55
3450D68k00J56k50m62J48l57K93K22J09K37L1l0lm77l28j05J78K37J29M74L16
3471G86k80j77m42k13q5j31K94K69J39J96R9K3l74k25l18P1Q7J69K59K65j2j04
3493B96m19n3k24k34L11K77N25l59L43j99J0m96l02l2q4O82K1K25J81m8l50j37
3515f6m35k71K66L38K65J00K60k16K19m59l24p8m6J4N43J13NK36l24n42J70k05
$$ plain form
3537 -437 -406 -270 247 256 476 385 107 148 -126 -249 -321 -337 50 35 215 440 162 -100 -323 -258 -414 -203 -99
3560 -99 210 656 272 332 273 -137 -259 -352 -383 107 104 475 385 269 154 -121 -264 -260 -494 20 177 356 325 175
3584 175 272 80 -431 -370 -344 -168 80 460 322 350 84 162 -334 -421 -177 -234 92 191 342 223 484 307 -237
3607 -237 -347 -306 -381 -214 134 428 546 152 50 87 -422 -340 -206 -244 -14 567 344 377 212 -39 -212 -369
3629 -369 -503 -534 251 35 408 234 165 141 -259 -138 -169 -191 7 199 274 308 273 94 140 -120 -267 -378 51
3652 51 77 316 335 470 -178 -162 -433 -249 -75 -123 154 491 425 229 -45 -20 -214 -165 -316 160 281 526 401
3675 401 245 62 -361 -133 -392 -427 -64 99 268 555 215 297 -3 -414 -373 -135 -120 347 451 512 461 271
3697 271 -61 -304 -351 -169 -247 42 130 413 218 86 84 -213 -321 -233 -91 -116 272 538 142 36 -20 -295 -382
$$ packed form
3537d37L1J36N17RK20r1k78M1k74j23p2j6L87j5J80K25k78k62k23O5j56K11J04
3560i9L09M46l84O0n9m10j22r3l1M90lL71r0j16j15k75j43Mk34N14J57J79l1j50
3584A75R7j92n11O1K6J76K48L80j38K8k66P8m96q7K44n7L26R9J51j19K61j77n44
3607b37j10M1p5J67L48K94J18l94j02L7n09Q2J34l8K30N81k23L3j65k51j73j57
3629c69j34l1P85k16L73j74o9k4m00J21l1k2J98J92P5L4l5j79M6k60j47j11M29
3652E1K6K39J9J35o48J6k71J84J74m8K77L37o6j96k74K5j94M9j51M76J21K45j25
3675D01j56j83m23K28k59l5L63J63J69K87l40Q2l00m11M1K38J5M67J04O1n1j90
3697B71l32k43m7J82p8K89Q8K83j95j32kk97j08Q8J42k5L88K66l96j06n6k75q7
$$ plain form
3720 -382 -212 -304 -84 130 296 340 71 -101 -232 -200 -314 64 -103 69 539 484 292 -77 -302 -269 -296 -76
3742 -76 -211 146 493 388 339 329 -41 -353 -306 -168 -106 172 271 157 299 -194 -223 -290 -327 -184 -419 43 255
3765 255 397 218 247 59 -214 -468 -229 -26 62 45 472 301 389 72 -399 -484 -275 -219 222 281 170 187 -23
3788 -23 -238 -192 -407 -539 -249 -219 406 154 380 80 57 -241 -381 -472 -450 -24 323 166 189 145 252 -168 -284
3811 -284 -268 -238 -200 119 85 390 157 -142 -395 -333 -309 -296 -168 50 324 430 252 316 2 -293 -312 -458 -157
3834 -157 223 357 307 176 146 -239 -139 -337 -346 -224 -174 396 377 410 96 211 -196 -423 -454 -377 -138 310 175
3857 175 440 220 -98 -251 -442 -204 -364 46 204 212 449 80 119 -89 -105 -300 -460 -240 25 337 307 289
3879 289 -67 -103 -462 -252 -352 -256 66 158 532 310 84 -184 -44 -224 -154 -228 70 280 178 420 139 34
$$ packed form
3720c82J70r2K20K14J66M4k69j72j31L2j14L78j67J72M70n5j92l69k25L3k7K20
3742g6j35L57L47j05m9j0l70l12M7J38O2K78R9j14J42m93k9o7l7J43k35M62K12
3765B55J42j79K9j88k73k54K39K03Q8j7M27j71Q8l17m71q5K09N6M41N9j11J7k10
3788b3k15M6k15j32K90L0O25k52K26l00k3k98j40r1K2M26L47j57K3m4J07m20j16
3811b84J6L0L8L19l4L05k33k99k53O2K4J3J28K18K74J06j78O4l14k95j9j46L01
3834a57L80J34n0j31l0l85J00j98rJ22N0N70j9L3l14J15m07k27l1P7K39M48j35
3857A75K65k20l18j53j91K38j60M10J58QK37l69L9k08j6j95j60K20K65L12l0j8
3879B89l56l6l59K10j00R6L22R2L74k22k26k68J40j80P0p4K98K10j02K42k81j05
$$ plain form
3901 34 -183 -96 -320 -407 169 182 155 319 129 -195 -224 -434 -226 -517 -76 282 246 288 209 -130 -348 -175 -292
3924 -292 -296 -164 48 288 390 246 132 -78 -533 -302 -99 -294 145 238 482 298 247 -278 -319 -160 -148 -146 133
3947 133 220 1 217 141 113 -259 -251 -347 -72 69 166 544 269 221 -17 -388 -129 -279 164 -57 516 450 269
3970 269 300 -2 -174 -364 -254 38 89 170 281 236 464 -161 -54 -412 -359 -432 -60 32 31 248 387 220 -199
3993 -199 -225 -343 -257 -146 83 317 156 129 89 -10 -256 -438 -411 -123 -32 149 312 20 120 -208 -5 -53 -424
4016 -424 -42 -71 184 243 299 39 -39 -195 -238 -279 -329 116 383 500 171 182 43 -215 -172 -336 -180 73 65 120
4040 120 124 138 81 -59 -377 -308 -225 -301 15 91 301 394 52 80 35 -319 -254 -230 113 121 184 206 -5 -200 -165 -398
4066 -398 -317 -122 135 468 262 444 112 -150 115 -380 -393 -19 13 144 188 453 19 78 -122 -281 -164 -213
$$ packed form
3901C4k17Q7k24q7N76J3k7J64j90l24k9k10K08k91M41L58l6M2p9l39k18J73j17
3924b92mJ32K12K40J02j44j14k10m55K31K03j95M39R3K44j84n1n25m1J59J2KK79
3947A33Q7k19K16p6k8l72Qr6K75J41R7L78k75m8k38l71K59j50M43k21N73o6j81
3970B69L1l02j72j90J10K92N1Q1J11m5K28o25J07l58N3p3L72R2jK17J39j67m19
3993a99k6j18Q6J11K29K34j61k7m0r9k46j82K7K88R1J81J63k92J00l28K03m8l71
4016d24L82k9K55N9N6k60p8j56m3m1n0M45K67J17l29J1j39k58M3j64J56K53qN5
4040A20MJ4n7j40l18O9Q3p6L16P6K10R3l42K8m5l54O5K4L43QO3K2k11j95L5k33
4066c98Q1J95K57L33k06J82l32k62K65m95j3L74L2J31M4K65m34N9k00j59J17m9
$$ plain form
4088 -213 245 304 196 392 222 18 23 -102 -174 -406 -33 342 147 218 -149 -89 -247 -185 -364 -342 -34 234 95
4111 95 239 298 18 -209 -209 -579 -290 42 132 190 186 281 38 -233 -411 -173 -346 123 229 247 173 76 327 -229
4135 -229 -137 -174 -268 -169 -82 207 525 193 179 106 -14 -350 -107 -353 127 191 -3 319 286 -155 215 -389 -128
4158 -128 -133 -22 319 205 591 451 -38 -34 -350 -215 -340 -135 212 147 162 83 239 -31 -228 -264 -219 135 250
4181 250 149 431 184 373 -17 -405 -266 -237 -327 189 274 364 226 -114 26 198 -305 -359 -71 103 48 444
4203 444 195 211 41 66 -529 -280 -183 221 177 -4 275 70 39 -276 -164 6 -99 -163 131 271 254 -89
4225 -89 23 -164 -239 -17 -126 -298 296 14 388 267 -341 -160 -221 -25 -318 137 -19 137 253 135 219
4246 219 84 -352 -179 -193 61 244 220 234 331 192 124 -110 -203 -190 197 -5 245 289 433 212 -11 -152 -131
$$ packed form
4088b13M58N9j08J96j70k04Nj25p2k32L73L75j95P1l67O0j58O2j79K2L08K68j39
4111I5J44N9k80k27%l70K89L32R0N8mR5k43k71j78K38j73M69J06J8p4r7K51n56
4135b29R2l7r4R9Q7K89L18l32j4p3j20l36K43k46M80O4j94L22l3m41L70o04K61
4158a28nJ11L41j14L86j40m89Ml16J35j25K05L47o5J5p9J56k70j97l6M5L54J15
4181B50j01K82k47J89l90l88J39K9r0N16Q5R0j38l40J40J72n03n4K88J74n5L96
4203D44k49J6j70K5n95K49R7M04m4j81K79k05l1l15J12J70j05o4K94J40j7l43
4225h9J12j87p5K22j09j72N94k82L74j21o08J81o1J96k93M55j56J56J16j18Q4
4246B19j35m36J73j4K54J83k4J4R7j39o8k34r3J3L87k02K50M4J44k21k23j41K1
$$ plain form
4269 -131 -422 -62 102 -22 151 235 267 -124 47 114 -199 -290 137 97 19 165 64 138 -361 -205 -249 -3 43
4292 43 -195 291 60 264 82 -64 -180 -198 -29 -6 -100 182 299 290 101 -459 -316 -173 -13 -130 -36 148
4314 148 264 -18 100 38 -129 -469 -231 -86 -31 245 44 200 188 -127 35 27 -354 41 62 -40 195 159
4336 159 5 28 -206 -307 -161 -15 -252 -57 372 182 139 88 63 -450 -280 -333 120 -36 111 2 -142 68
4358 68 -75 1 -445 -312 -20 82 43 13 278 -174 -102 -72 -162 72 -25 91 171 233 357 273 331 -200 -217 -220 -190
4383 -190 257 181 187 156 28 -217 -97 -221 -87 -212 -3 27 435 304 90 -62 -74 -302 -206 -357 154 57 119
4406 119 557 163 44 -148 -7 -163 -144 121 -179 325 288 -16 69 5 -6 -187 -136 -135 75 95 192 -51 23 -357
4430 -357 -128 161 -452 -232 35 300 329 337 194 131 -116 110 -345 146 69 247 365 6 200 117 -222 -359
$$ packed form
4269a31k91L60J64j24J73Q4L2l91J71O7l13r1M27m0p8J46j01P4m99J56m4K46M6
4292D3k38M86k31K04j82j46j16j8J69K3r4K82J17rj89n60J43J43J60j17R4J84
4314A48J16k82J18o2j67l40K38J45N5K76k01J56j2l15J62ql81L95K1j02K35l6
4336A59j54K3k34j01J46J46k37J95M29j90m3n1k5n13J70n3M53j56J47j09j44K10
4358F8j43P6m46J33K92J02l9l0K65m52P2L0r0K34r7J16Q0O2J24q4N8n31j7lL0
4383a90M47p6Ol1j28k45J20j24J34j25K09L0M08j31k14j52j2k28R6j51N11r7O2
4406A19M38l94j19j92J41j56J9K65l00N04l7l04Q5o4j1j81N1JK10K0R7k43P4l80
4430c57K29K89o13K20K67K65K9Qj43o3k47K26m55M91p7J78J18l59J94q3l39j37
$$ plain form
4452 -359 -198 -136 8 217 -23 557 239 93 -166 -407 -157 -290 168 184 161 485 102 97 -210 -365 -219 -155
4474 -155 20 95 233 210 99 79 -66 -288 -343 -441 -136 404 220 181 45 65 -76 -159 -148 -353 -214 -121 94
4497 94 239 75 166 140 -202 -12 -288 52 21 -20 146 270 -6 133 -242 -169 0 -328 142 171 252 129 -32
4520 -32 194 55 -233 -294 -287 122 -104 269 180 -32 40 -195 -196 -336 -245 55 101 -4 210 186 47 -274 170 -96
4544 -96 -2 -92 64 58 72 339 -237 -338 -261 -184 -297 -198 2 136 205 190 90 131 -86 -5 -77 -276 217 9 264
4569 264 56 42 167 -70 -415 -293 -122 -90 33 198 164 -18 115 -76 -211 -234 -204 -16 168 260 266 78 -311
4592 -311 -106 -231 -19 -165 -195 59 85 260 347 123 -300 -315 -156 -145 -51 207 101 32 -118 -59 -191 68 -252
4615 -252 -75 -175 34 188 9 257 279 -168 -171 -391 -73 196 110 111 271 169 211 -153 -201 -166 -137 -416 -175
$$ packed form
4452c59J61O2J44K09k40N80l18j46k59k41K50j33M58J6k3L24l83nl07j55J46O4
4474a55J75P5J38k3j11k0j45k22n5r8L05N40j84l9j36K0j41q3J1k05J39R3K15
4497I4J45j64R1k6l42J90k76L40l1m1J66J24k76J39l75P3J69l28M70K9Q1j23j61
4520c2K26j39k88o1PM09k26L73q9k12P2k35jj40R1L00M6j05K14k4j39l21M44k66
4544i6R4r0J56oJ4K67n76j01P7P7j13R9K00J34O9j5j00M1k17Q1p2j99M93k08K55
4569B64k08j4J25k37l45J22J71L2J23J65l4j82J33j91j35k3L0J88J84R2Oj88l89
4592c11K05j25K12j46l0K54K6J75Q7k24m23j5J59J1R4K58j06o9j50N9j32K59l20
4615b52J77j00K09J54j79K48K2m47lk20L18K69q6JJ60j02M2l64m8L5K9k79K41
$$ plain form
4638 -175 393 44 92 122 104 -202 -17 145 -438 -221 42 241 198 154 181 -138 -91 -267 -18 -70 7 353 147
4661 147 176 234 208 -41 -202 -320 83 32 49 65 238 180 -56 -90 -245 -391 129 221 196 431 289 120 -185
4684 -185 -3 30 -405 -59 -69 -11 -178 371 67 -83 0 -265 -285 20 84 132 179 19 64 -279 51 158 -148
4707 -148 -157 144 -64 325 223 241 -142 -95 -31 15 -16 -156 363 62 318 56 22 177 -23 -206 29 -124 112
4730 112 229 382 454 -115 83 -64 -97 -357 -296 118 84 298 77 41 347 -168 -256 -172 259 194 74 199 103
4753 103 226 25 -67 -192 -27 47 20 109 -80 218 -16 -32 -53 -215 -249 -181 357 201 128 81 136 113 49 -98
4777 -98 -461 -86 59 20 134 358 137 118 -131 -134 -48 -30 -125 -21 -32 -16 52 28 44 -45 -121 -272 -104 -35 17 -63
4803 -63 29 191 174 110 -201 -87 152 222 90 276 288 261 176 -82 59 24 -7 -301 51 393 118 -41 -160
$$ packed form
4638a75N68l49M8L0j8l06J85J62n83K17K63J99m3m4K7l19M7j76K49n2P7L46k06
4661A47K9N8k6k49j61j18M03n1J7J6J73n8k36l4j55j46N20R2k5K35j42j69l05
4684a85J82L3m35L46j0N8j67N49l04j50Q3k65k0L05O4M8M7j60M5l43L30J07l06
4707a48rL01k08L89j02J8l83M7O4M6l1j40N19l01K56k62l4J55k00j83K35j53K36
4730A12J17J53P2n69J98j47l3k60O1M14l4K14k21l6L06n15q8Q4M31o5j20J25r6
4753A03J23k01r2j25J65P4k7Q9j89K98k34j6k1j62l4O8N38j56p3m7N5k3o4j47
4777i8l63L75J45l9J14K24k21j9k49lQ6J8r5J04j1J6O8k4J6q9p6j51J68O9N2q0
4803f3R2J62j7o4l11J14K39P0j32J86J2k7q5k58J41l5l1k94L52L42k75j59j19
$$ plain form
4826 -160 125 88 -268 -49 -23 115 80 303 137 299 43 -164 58 -191 33 -187 160 276 -1 208 13
4847 13 -121 -186 -147 -42 -68 324 266 106 137 192 46 -295 -99 -224 -84 374 264 243 62 -134 9 -196 -260
4870 -260 -102 236 -220 16 217 -202 141 -180 -183 -339 -166 237 -49 -94 38 31 141 30 -127 119 -216 -65
4892 -65 -5 -79 60 23 -146 -5 31 -211 -58 -175 -125 360 160 210 209 1 -152 -121 -159 -178 -23 299 233 128
4916 128 220 -202 -83 -265 57 121 -246 119 155 100 -237 123 15 -41 -111 -5 -90 151 289 21 -114 -24 -3
4939 -3 -180 -64 -49 -32 166 260 171 123 -69 -120 -366 -111 -242 -96 166 304 77 29 -142 66 6 -100 14
4962 14 132 -40 116 283 58 49 -45 -248 -89 -118 -149 -56 34 114 175 -204 -159 -92 -218 93 -103 155 176 166 131
4987 131 -86 -51 -399 -68 -73 -105 90 255 135 105 149 -38 -200 -179 -153 -195 -167 18 5 -29 148 -96 55 -224
$$ packed form
4826a60K85l7l56K19K6J38l5K23j66J62k56k07K22k49K24k20L47J16k77K09j95
4847A3j34o5L9J05k6L92n8j60L1N5j46l41J96j25J40M58j10k1j81j96J43k05o4
4870b60J58L38m56K36K01m19L43l21lj56J73M03k86m5J32pJ10j11j57K46l35J51
4892f5O0p4J39l7j69J41L6k42J53j17N0M85k00N0jk08j53L1l8j9J55L22o6j05
4916A28R2m22J19j82L22O4l67L65L6n5l37L60j08n6p0J06q5K41J38k68j35R0K1
4939cj77J16J5J7J98R4q9m8j92n1k46K55j31J46K62J38k27m8j71K08o0j06J14
4962A4J18j72J56J67k25rr4k03J59k9l1R3R0Q0O1l79M5O7j26L11j96K58K1j0l5
4987A31k17L5l48L31nl2J95J65j20l0M4j87j62K1K6m2K8J85j3l4J77k44J51k79
$$ plain form
5011 -224 107 12 -86 -215 90 -17 186 96 -141 -317 -79 42 -213 -90 0 96 122 42 16 -120 71 -5 -69
5034 -69 -174 124 13 32 35 32 -96 -241 22 -114 -43 51 -18 -108 126 -74 -108 -170 -117 -149 -25 104 -12 -50 -11
5059 -11 210 69 58 -247 86 107 170 109 91 173 -140 -131 -119 -334 -251 45 -60 244 47 -3 -34 -90 -127 -246 96
5084 96 49 -86 53 268 160 100 -37 -253 -241 -3 97 -12 136 137 93 201 -9 -162 -320 -43 -318 -6
5106 -6 15 -15 -232 -22 20 149 -162 -399 -101 134 -37 265 36 37 -181 58 -241 -424 -118 -131 169 -29 167
5129 167 37 23 -58 -128 -313 66 -55 -210 156 245 338 224 20 -225 -351 -177 -27 41 -146 -8 259 279
5151 279 -49 -57 -143 -213 170 28 -110 265 14 54 -63 77 93 -284 -37 -67 650 -68 83 134 261 94 -97
5174 -97 43 -26 -151 144 109 90 43 -125 -120 -202 -309 -33 -55 -53 173 273 139 58 -93 -229 -85 -74 5 -235 88
$$ packed form
5011b24L31r5r8j29L05j07K03r0k37j76K38J21k55J23R0R6K6q0k6j36J91p6o4
5034f9j05K98j11J9Llj28j45K63j36P1R4o9r0K34k00l4o2N3l2J24J29j16l8L9
5059a1K21j41j1l05L33K1O3o1j8Q2l13RJ2k15Q3K96j05L04j97n0l1n6l7j19L42
5084I6m7j35J39K15j08o0j37k16J2K38J00j09J48Jm4J08k10j53j58K77k75L12
5106fK1l0k17K10M2J29l11k37K98K35j71L02k29Jk18K39k99j83L06j3L00j98J96
5129A67j30j4q1p0j85L79j21j55L66Q9R3j14k04k45j26J74J50O8j87J38K67K0
5151B79l28qq6p0L83j42j38L75k51M0j17J40J6l77K47l0P17p18J51N1J27j67j91
5174i7J40o9j25K95l5j9m7j68Nq2j07K76k2KK26J00j34q1j51j36J44J1P9k40L23
$$ plain form
5199 88 -68 271 57 -35 -209 -130 -187 141 214 234 101 124 -244 175 -55 68 -153 37 169 112 165 83 94 146
5223 146 -191 -527 15 143 77 163 188 -167 144 -18 -247 208 -180 12 -15 -66 -175 109 184 -49 -29 160
5245 160 -257 -140 109 -86 102 112 170 215 -91 109 278 -42 -77 -98 67 41 71 -21 -22 -160 74 -85 -113 62
5269 62 14 298 258 269 -51 -167 -231 -186 -210 -183 176 57 265 11 -266 -112 -184 -285 -78 59 75 301 77
5292 77 242 -222 -171 33 -74 -165 -214 -1 -117 194 15 -31 76 -173 3 -55 50 235 -1 134 3 146
5314 146 -38 -211 -87 72 78 -27 -15 178 125 -53 158 29 -189 -124 104 138 -69 -65 399 41 130 -6 -66
5337 -66 -53 -115 77 -66 327 67 234 133 -263 -182 -41 -201 11 -209 153 253 -78 137 -21 58 -130 -16
5359 -16 -65 -140 450 14 6 -73 -23 62 -80 -161 -190 72 -153 207 -9 85 -54 -201 -152 -170 -162 288 -23 28 451
$$ packed form
5199H8j56L39k14r2j74P9n7L28P3K0j33K3l68M19k30J23k21J90J32n7N3q2J1N2
5223A46l37l36N42J28o6Q6K5l55L11j62k29M55l88J92k7n1j09K84P5k33K0J89
5245A60m17J17K49j95J88J0N8M5l06K00J69l20l5k1J65k6L0r2jj38K34j59k8J75
5269F2m8K84m0J1l20j16o4M5k4K7L59j19K08k54k77J54p2j01K07J37J6K26k24
5292G7J65m64N1K04j07r1m9K13j16L11j79m6J07k49J76n8J05J85k36J35j31J43
5314A46j84j73J24J59Oj05J2J93n3j78K11j29k18O5K28L4k07MM64l58Q9j36o0
5337f6J3o2J92j43L93k60J67j01l96Q1J41j60K12k20L62J00l31K15j58P9j88J14
5359a6m9p5N90m36qp9N0Q5j42q1k9K62k25L60k16R4j39j47M9j8QM50l11N1M23
$$ plain form
5384 451 136 105 -82 -78 -57 132 84 39 9 -61 40 -166 -93 -34 -252 39 245 268 161 172 265 -150 -330 -285 -270
5409 -270 -118 176 29 253 328 11 83 133 -131 140 94 205 -185 43 330 173 117 74 75 -148 -343 -121 119
5432 119 -10 53 -57 228 201 -209 37 -28 -301 -146 59 57 93 -38 -201 -176 -248 -32 36 -242 125 91 169 -52
5456 -52 -95 -136 62 -263 -107 40 -142 102 -24 128 169 -94 -216 -9 -404 -84 112 323 53 86 -31 -135
5478 -135 97 153 -137 73 72 11 232 131 26 -20 136 24 176 179 99 -158 255 -28 75 28 -226 23 -127
5501 -127 -283 14 27 -151 -74 291 241 -96 -295 -43 -111 166 288 125 26 262 50 -163 -104 -55 -74 58 -11
5524 -11 248 216 -160 -21 -151 -175 -54 -243 17 57 95 137 206 117 69 -284 -144 -196 -230 -2 -78 130 86 55 -12
5549 -12 -56 -42 -170 1 67 140 -44 58 174 48 -103 -247 41 -322 57 -155 -76 32 163 90 114 -389 -33
$$ packed form
5384D51l15l1j87MK1J89m8m5l0p0J01k06P3N9k18K91K06K3j07J1R3m15j80M5J5
5409b70J52K94j47K24P5l17P2N0k64K71m6J11l90K28K87j57n6m3Jk23j95K22K40
5432A19j29O3j10K85k7m10K46o5k73J55K05kL6j31j63K5p2K16O8k78L67l4P8k21
5456e2m3m1J98l25J56J47j82K44j26J52M1k63j22K07l95L20J96K11k70L3j17j04
5478a35K32N6k90K10jo1K21j01j05m6J56j12J52Lq0k57M13k83J03m7k54K49j50
5501a27j56K97J3j78P7L65n0l37j99K52o8K77J22j63r9K36k12k13N9M9j9J32o9
5524a1K59l2l76J39j30k4J21j89K60M0L8M2O9q9m8l53J40n2l4K28p6K08m4l1o7
5549a2m4J4j28J71O6P3j84J02J16j26j51j44K88l63L79k12P9J08J31p3K4n03L56
$$ plain form
5572 -33 -125 94 83 220 77 144 -105 175 -104 -203 -153 -108 138 109 20 -38 56 -77 99 69 -44 -70 -19 -223 123
5597 123 154 53 -190 -119 -145 60 -203 -188 112 -64 -85 77 -276 -263 10 115 63 104 101 79 4 194 -27 111
5621 111 -6 -162 -255 -27 66 166 -226 40 229 -307 -27 -52 27 -111 82 160 154 124 -156 -99 209 -232 -294
5644 -294 86 2 4 310 74 113 11 -8 -304 14 -13 216 225 -24 -114 172 -16 -138 -361 -221 -46 -125 87
5667 87 294 28 -88 -53 -302 -193 -94 62 -139 123 180 205 117 137 -76 103 43 136 -66 290 -100 79 -97
5690 -97 -167 -87 -21 -136 -99 -94 -136 67 86 154 175 146 -249 9 6 -20 17 72 299 -125 -120 258 -233 -193 149 116 -107
5717 -107 119 127 239 260 -49 -118 -165 -2 -126 -129 -60 125 164 73 -5 -167 -19 -105 -212 -303 237 30 88 -73 312
5742 312 -116 135 -318 118 58 220 299 130 41 -161 -45 -56 -250 -205 60 128 190 70 -27 10 60 32 79 12
$$ packed form
5572c3r2K19j1J37j43O7k49K80k79r9N0M5K46k9q9n8R4j33J76l0j13k6N1k04L46
5597A23L1j01k43P1k6K05k63J5L00j76k1J62l53J3K73J05n2M1lk2p5J90k21J38
5621A11j17j56r3K28R3J00l92K66J89n36K80k5P9j38J93P8ol0k80N7L08m41o2
5644b94L80q4KL06k36L9j02j9k96L18k7K29Rk49r0K86j88j22k23J40J75p9K12
5667H7K07k66j16L5k49J09R9J56k01K62N7K5q8K0k13J79o0R3k02L56l90J79j76
5690i7p0Q0O6j15L7Nm2K03J9O8K1k9l95K58lk6L7N5K27m24NL78m91M0L42l3k23
5717a07K26QJ12K1l09o9m7J63j24lO9J85L9r1p8j62J48q6j07r1N40k07N8j61L85
5742C12m28K51m53M36o0J62P9j69q9k02J16j1j94M5K65O8O2j20r7L7N0k8M7o7
$$ plain form
5766 12 39 86 -15 64 285 -54 -24 -134 -89 -5 90 32 144 113 31 63 147 -181 146 -60 -198 -147 130 355 33
5791 33 38 8 38 -31 92 -216 273 118 156 279 -124 54 -223 -20 -266 -95 23 -53 -29 52 135 131 -22 -266
5815 -266 25 -85 -19 19 47 -91 -33 -22 -5 29 -56 -46 160 175 2 136 138 -127 -110 -56 -256 -117 -56 49 -104
5840 -104 57 68 -120 -35 -8 -196 -7 123 -146 278 59 42 -72 176 147 -37 40 -126 -14 -25 -113 56 -37
5863 -37 -69 -56 -136 -56 65 137 -12 143 40 146 -145 -217 -126 33 146 -49 -265 173 -21 57 -274 -501 -57
5886 -57 -124 -48 -68 270 118 210 -55 -32 116 -293 -165 -233 119 -118 15 142 3 1 -57 -212 -198 -30 5 42
5910 42 170 115 123 9 189 -142 37 59 -116 -41 98 188 25 -82 101 -61 -41 -88 -28 -183 132 115 -27 121
5934 121 -36 -228 -234 -160 -81 61 134 161 31 237 218 -179 181 153 -114 -84 283 372 175 192 8 -89 18 -23
$$ packed form
5766A2K7M7j01P9K21l39L0j10M5Q4R5n8J12l1q2L2Q4l28L27k06j38N1K77K25l22
5791C3Nl0L0o9J23l08M89j55L8J23m03J78k77K03k46J71J18p6K4Q1Q3mj53k44
5815b66K91j10O6L8K8j38N8J1J7L4q5J0K06J5j73J34Kk65J7N4k00J39O1J05j53
5840a04J61J1j88Q5K7j88J89J30k69M24k19j7j14K48k9j84P7j66J12j1q8J69r3
5863c7l2J3q0Q0J21P2j49J55j03J06k91p2R1J59J13j95k16M38j94P8l31k27M44
5886e7o7P6k0L38j52R2k65K3J48m09J28o8L52k37J33J27j39kn8j55J4J68L5L7
5910D2J28n5Qj14J80l31J79K2j75P5J39R0j63j07J83j62K0m7O0j55L15j7j42J48
5934A21j57j92oP4P9J42P3K7j30K06j9l97L60k8k67L0L67Q9j97J7j84r7J07m1
$$ plain form
5958 -23 -191 59 195 84 267 144 121 -54 -87 30 -199 -110 226 120 175 -13 30 78 25 -263 -133 -162 143
5981 143 177 195 -354 195 106 75 64 38 62 -282 142 29 96 -103 85 155 -175 -356 129 25 -99 165 -70
6004 -70 -8 160 4 -134 122 114 -142 117 44 44 -13 -18 -66 -209 -291 -283 -185 77 85 148 -151 156 -88 -49 -298 -116
6030 -116 106 266 -51 12 179 189 70 -230 150 38 81 313 6 -14 51 -31 -200 -3 117 -329 -93 83
6052 83 237 283 31 186 -60 -76 34 -131 -84 -175 227 170 284 15 -156 -112 22 51 29 -168 37 51 119 -73
6076 -73 86 -122 -114 -264 -214 -129 -63 287 164 -53 74 -99 7 -38 -130 25 -76 21 -105 -34 -10 10 136 32
6100 32 -149 -68 -146 -100 37 144 279 54 -74 6 -303 -103 137 183 118 59 -108 -51 28 -37 -126 -50 -59 -189 188
6125 188 27 67 110 79 -84 -134 -200 98 120 201 169 78 19 80 -5 -285 117 -49 -209 88 278 -135 131 83
$$ packed form
5958b3j68K50J36j11J83j23k3j75l3J17k29Q9L36j06N5j88M3M8n3k88J30k9L05
5981A43L4J8n49N49q9l1j1k6K4l44M24j13O7j99J88P0l30j81M85j04j24K64k35
6004g0O2J68j56j38K56qk56K59p3%n7nm8j43q2QR8K62QO3k99L07k44L9k49J82
6030a16K22J60l17O3J67J0j19l00L80j12M3K32l07k0O5q2j69J97J20m46K36J76
6052H3J54M6k52J55k46j6J10j65M7r1M02n7J14k69j71M4J34K9k2j97K05J4O8j92
6076g3J59k08Qj50N0Q5O6L50j23k17J27j73J06m5r2J55j01R7j26P1K4K0J26j04
6100C2j81Q1p8M6J37J07J35k25j28Q0l09K00K40M6o5n9j67N7P9o5q9P6rj30L77
6125A88j61M0M3l1j63n0o6K98K2Q1l2r1n9O1q5k80M02j66j60K97J90m13K66m8
$$ plain form
6149 83 7 -85 -73 -249 241 216 322 2 -142 109 -127 -38 -165 -118 1 137 164 -25 -150 209 -108 -90 -180
6172 -180 100 215 -35 21 167 223 94 -108 7 -293 44 137 -257 56 117 -121 121 126 -155 17 -219 -74
6194 -74 34 163 131 197 -17 -82 -132 -100 -57 107 -15 -40 89 8 -251 69 -35 -33 -224 192 -30 30 153 117
6218 117 138 71 -169 -206 -53 -40 -132 -150 -37 122 98 39 27 -129 -237 -108 -205 -92 270 -11 -110 -173 -80 -164 -53
6243 -53 -17 -202 54 -84 221 -58 178 -122 -168 84 -48 37 -16 -68 65 141 75 37 -157 -35 -164 -123 20
6266 20 331 123 249 159 -20 40 -51 -54 115 -169 47 227 -31 -242 -33 -26 -136 -217 126 -105 -66 94 164 -90
6290 -90 -175 -202 -117 106 -29 57 90 -47 51 186 -267 -146 -224 -251 -45 -83 199 -115 -108 -89 -42 -144 138 -120 -101
6315 -101 123 -105 167 -4 -28 13 -142 -38 -19 -88 -17 10 106 15 -37 87 75 108 -75 -221 -66 -111 84 94
$$ packed form
6149H3p6r2J2j76M90k5J06l20j44K51k36Q9j27M7J19J36K7j89j25L59l17J8r0
6172a80K80J15k50N6J46N6j29k02J15l00L37R3l94L13O1k38K42Nk81J72k36J45
6194g4J08J29l2O6k14o5n0L2M3J64j22k5J29q1k59L20j04Kj91M16k22O0J23l6
6218A17K1o7k40l7J53J3r2j8J13J59k4n9j2j56j08J29r7J13L62k81r9o3R3q4J11
6243e3L6j85K56j38L05k79K36l00m6K52j32Q5n3n2J33P6o6l8j94J22j29M1J43
6266B0L11k08J26r0j79O0r1lJ69k84K16J80k58k11K09Pj10q1L43k31L9J60P0k54
6290i0q5k7Q5K23j35Q6L3j37R8J35m53J21p8k7K06l8K82l14PJ9M7j02K82k58J9
6315a01K24k28K72j71k4M1j55J04J9o9P1K7R6r1n2J24j2L3j83j46J55m5J95J0
$$ plain form
6339 94 111 58 129 111 -102 2 18 124 -140 62 116 -120 50 -102 29 28 106 -55 202 121 144 59 -25 12 -357
6364 -357 58 -62 6 -201 10 8 -81 49 12 153 -207 -136 8 -87 325 128 38 -84 -111 88 -194 40 197
6387 197 64 105 238 80 -131 98 -23 -207 161 -10 -146 231 -23 206 46 43 37 -221 -3 -277 -83 3
6409 3 106 89 183 76 -43 -219 -145 81 103 171 174 113 -31 -2 -46 -237 -200 -186 -57 -48 2 180 60 199 -40 -48
6435 -48 36 -143 -128 75 146 -59 58 2 -82 60 -197 -8 -82 129 -51 -80 257 107 -107 -478 50 156 -112
6458 -112 -114 156 -28 -127 37 186 -201 -174 32 46 -124 82 36 30 -15 -26 33 4 -87 -144 -149 -59 204 146 -69 153
6484 153 -32 50 -109 -283 93 -168 -93 -67 185 158 -75 -252 -232 -177 131 -59 115 39 -69 -58 -264 -175 -178 102
6508 102 -224 -124 -167 131 109 6 235 -81 32 -96 -114 2 120 -3 -89 -112 -105 -35 -184 -121 -94 -3 267 71
$$ packed form
6339I4J7n3P1j8k13J04J6J06k64K02N4k36J70j52J31jP8j61K57q1K3q5q4L7l69
6364c57M15j20O8k07K11kq9J30l7J41l60P1J44r5M12j97r0j22k7J99k82K34J57
6387A97j33M1J33j58k11K29j21j84L68j71j36L77k54K29j60lok58K18k74J94Q6
6409CJ03j7R4j07j19j76P4K26K2O8Lo1j44K9m4j91L7J4J29RN0J78j20J39k39q
6435d8Q4j79J5K03P1k05J17n6q4J42k57J89p4K11j80k9L37j50k14l71N28J06k68
6458a12kK70j84r9J64J49l87K7K06J4j70K06m6om5j1N9k9r1n7nR0K63n8k15K22
6484A53j85Q2j59j74L76k61P5K6K52k7k33j77K0N5L08j90J74p6j08J1k06Q9lK80
6508A02l26J00m3K98k2j03K29l16J13j28j8J16J18j23q6k3PP0j49O3K7R1K70j96
$$ plain form
6532 71 84 90 -15 -45 37 -175 -115 -4 209 72 -81 57 26 28 -296 -276 -203 -194 176 -9 126 268 67 -27 -127
6557 -127 16 -223 25 237 -102 170 -78 -305 -240 -16 -63 -151 143 225 -15 159 34 -50 -421 -25 -54 180
6579 180 -35 17 161 -14 170 214 -19 -49 142 -116 -34 244 144 83 -55 165 -248 193 -118 147 -5 -122
6601 -122 71 -34 -228 124 67 -293 -78 195 -6 69 193 -244 191 -109 128 -76 -95 -282 -185 70 18 76
6623 76 85 30 13 -88 -10 171 -1 69 -135 -2 165 152 53 -132 -344 159 47 -152 -76 184 121 229 50 -19
6647 -19 88 48 190 -5 -33 124 -100 -148 79 47 -179 -141 -66 263 285 28 -29 12 -38 185 60 80 -91 80
6671 80 252 72 -30 48 185 -9 -95 105 -149 -70 1 219 181 266 81 -168 -27 -27 -28 -314 97 -20 162 174
6695 174 93 143 77 -163 -29 -66 -401 266 24 68 86 -248 -81 23 -44 -274 -34 16 -46 248 282 95 -182
$$ packed form
6532G1J3Oj05l0Q2k12O0J11K13j37j53J38l1Kl24K0P3RL70j85J35J42k01r4j00
6557a27J43k39K48K12l39K72k48k27O5K24m7q8K94Q2k40J74j25q4l71L96k9K34
6579A80k15N2J44j75J84M4k33l0J91k58Q2K78j00o1j38K20m13M41l11K65j52j17
6601a22J93j05j94L52n7l60K15K73k01P5J24m37M35l00K37k04j9j87R7K55n2N8
6623G6Rn5j7j01P8J81j72P0k04J33J67j3r9j85k12N03j12j99P6K60o3J08j79o9
6647a9J07m0J42j95k8J57k24m8K27l2k26L8P5L29K2k57n7M1n0K23j25K0j71J71
6671H0J72j80j02P8J37j94q6K00k54P9P1K18l8Q5j85k49J41%jk86M11j17J82J2
6695A74q1N0o6k40J34l7l35O67k42M4J8l34J67J04o7k30K40N0o2K94L4j87k77
$$ plain form
6718 -182 -269 -54 92 56 164 33 -41 235 -88 -2 35 3 140 -30 48 129 125 41 235 6 5 -24 -24 -187 148
6743 148 -47 41 100 -187 -85 129 -155 -304 -150 -89 -49 100 51 104 89 8 168 -66 143 -84 280 58 163
6766 163 -182 -180 -149 128 153 117 -26 -37 138 105 191 57 -27 38 -14 -97 231 -50 -111 139 -1 -124 119 -9
6790 -9 -179 -44 -309 -146 41 1 -14 138 57 -234 -81 -159 91 85 73 -274 -20 139 170 -166 -35 54 -143 -256
6814 -256 -176 -37 214 190 67 -5 90 -7 -206 72 161 67 100 168 82 143 -67 -30 -116 -87 -92 -79 143 -4 393 82
6840 82 -22 104 -84 -188 120 -94 32 120 66 -174 3 -124 -172 16 -38 -160 -72 -109 -11 -159 -183 -337 198
6863 198 5 -49 -47 180 219 19 -41 -165 -50 -59 -50 102 214 183 29 -66 24 41 130 -107 203 -225 304 54 284
6888 284 119 -58 16 -76 -196 115 -75 117 -155 -181 112 -40 -58 -121 -214 136 181 201 23 203 85 1 -155
$$ packed form
6718a82q7K15J46l6J08j31p4K76l23Q6L7l2J37j70P8Q1mq4J94k29jk9%j63L35
6743A48j95Q8N9k87J02K14k84j49J54O1M0J49m9N3j5q1J60k34K09k27L64k22J05
6766A63l45KL1K77K5l6j43j1J75l3Q6j34q4O5n2q3L28k81o1K50j40j23K43j28
6790ij70J35k65J63J87m0j5J52q1k91J53p8K50oj2l47K54J59L1l36J31Q9j97j13
6814b56Q0J39K51k4j23p2R5r7j99K78Q9r4L3O8q6O1k10L7q6K9nJ3K22j47L97l11
6840H2j04J26j88j04L08k14J26Q8n4k40J77j27m8J88n4j22Q8l7R8j48k4j54N35
6863A98j93n4KK27L9k00o0j24J15rRJ52J12l1j54r5R0J7Q9k37L10m28N29k50K30
6888B84j65j77P4r2j20L11j90J92k72k6K93j52j8o3r3L50M5K0j78J80j18q4j56
$$ plain form
6911 -155 -91 -132 49 -189 -15 203 220 -46 48 226 -182 -75 -94 -190 -61 33 102 -181 59 -8 -41 -186 -173 213
6935 213 28 23 40 74 71 -96 17 41 107 105 7 -39 47 127 140 61 -151 -65 -200 -45 116 224 56 256 162 113
6961 113 -210 -58 103 -146 180 215 204 49 -200 161 -55 -185 -134 -80 -48 33 -35 -61 175 73 171 -15 -53
6984 -53 -228 -67 -279 219 8 68 -226 -2 -109 -35 199 1 89 -108 -114 -85 -116 -190 -22 -78 3 -184 -77 -118
7008 -118 20 172 310 286 43 -150 -134 -36 -5 190 9 280 -101 121 -44 -180 63 -25 -113 20 386 -32
7030 -32 -77 284 49 78 -85 -119 -16 140 203 138 122 144 137 22 -65 -188 133 -14 -125 127 153 -128 85 36
7054 36 -52 -67 -58 -141 41 120 -49 28 146 106 -6 -85 36 69 85 -48 54 111 64 121 -183 -51 -204 -155 102
7079 102 124 172 133 140 -79 43 275 -31 195 -3 86 127 134 -64 59 -57 -152 108 16 -69 103 101 -90 196 -43
$$ packed form
6911a55O4m1J81k38J74K18J7k66R4J78m08J07j9r6J29R4O9k83K40o7l3j45J3L86
6935B13j85nJ7L4lj67J13K4O6kr8m6Q6Q0J3p9k12Q6j35J55J61J08j68K00r4m9
6961A13l23J52J61k49L26L5j1j55k49L61k16j30N1N4L2Q1o8k6K36j02R8j86l8
6984e3j75J61k12M98k11O0k94K24j07P4K34j98Q8j97oK9l1p4J68n6Q1j87J07m1
7008a18J38J52J38k4k43j93J6R8L1J95j81K71l81K22j65j36K43q8q8J33L66m18
7030c2m5L61k35K9j63l4J03J56O3o5j6K2pj15q7j23L21j47j11K52K6k81K13m9
7054C6q8j5Rq3J82P9j69P7J18m0j12p9J21L3J6j33J02N7m7N7l04J32j53M9K57
7079A02K2M8l9Pk19J22K32l06K26j98Q9M1Pj98J23j16r5K60r2q5J72kj91K86k39
$$ plain form
7104 -43 -30 76 -187 -91 109 -32 71 173 -20 -97 139 -118 -257 -347 -357 -123 298 32 -35 180 100 103 148 16
7128 16 -104 48 140 215 71 114 28 -90 202 -215 241 -256 -21 -63 -37 222 -310 -33 -131 -308 16 88 94 83
7152 83 -87 58 -90 -12 -137 -326 190 137 -30 -54 -71 73 167 196 49 -7 18 -171 -117 -42 -13 -98 -167 162 -222
7177 -222 -69 122 -60 -104 143 200 -49 70 -256 -100 -133 -182 -179 -64 -82 -7 -154 260 5 -167 -56 -136 -43
7200 -43 0 -59 69 34 24 12 114 13 80 52 158 327 -7 -51 111 37 15 -20 6 -192 -18 67 73 50 -3 82
7226 82 -168 -233 -49 176 83 -136 90 193 -38 -57 -92 -56 -45 -2 89 -19 131 12 162 70 152 -17 133 -161
7250 -161 -90 236 215 103 103 131 -188 -227 65 42 -2 -16 -5 -17 -22 157 130 -21 34 -163 -150 -43 178 294 112
7275 112 116 65 -4 40 56 0 131 309 253 -87 134 -124 30 90 65 34 -231 40 168 -10 205 30 -188 -319
$$ packed form
7104d3J3J06k63R6K00j41J03J02j93p7K36k57j39r0j0K34M21k66o7K15q0LM5j32
7128A6j20J52R2P5j44M3q6j18K92m17M56m97K35m2K6K59n32K77r8j77L24P2Oj1
7152H3j70J45j48P8j25j89N16n3j67k4j7J44R4K9j47n6K5j89N4P5K9q5o9L29l84
7177b22J53J91j82m4K47N7k49J19l26J56l3m9LJ15j8P5j47M14k55j72J11q0R3
7200d3M3n9J28l5j0j2J02j01O7k8J06J69l34m4J62p4k2l5K6j98J74Q5Ok3n3Q5
7226H2k50o5J84K25r3k19K26J03k31j9l5L6J1M3R1j08J50j19J50r2Q2j69J50k94
7250a61P1L26k1j12%K8l19l9K92k3m4j4J1j2nJ79k7j51N5j97J3J07K21J16j82
7275A12Mn1o9M4J6n6J31J78n6l40K21k58J54O0k5l1k65K71J28j78K15j75k18j31
$$ plain form
7299 -319 -285 -80 -2 6 236 -47 14 -55 -27 143 -92 0 240 -41 197 28 -7 58 66 -73 67 -84 -107 136
7323 136 169 282 -10 -20 -3 9 107 -180 68 194 -43 113 -156 -161 108 -76 -8 0 8 -157 -2 -9 -90 36 -6
7348 -6 -147 13 51 -81 -79 151 -80 -4 272 23 133 -70 1 104 -25 -118 176 -181 179 46 -1 78 103 -10
7372 -10 277 -60 108 127 59 -50 229 140 -184 -164 37 73 26 50 -158 -35 -34 -217 -104 -70 -187 69 120 55
7396 55 58 12 -117 108 85 -62 -133 66 -63 -212 163 39 123 -57 -307 144 -133 42 -1 65 -65 187 -134
7419 -134 -131 148 -145 -68 -17 257 100 11 159 -5 -127 -117 -11 -105 185 -244 207 -83 -43 121 -27 56 154
7442 154 76 -83 106 -183 166 -43 -111 59 -199 78 -176 -35 -51 114 -15 -57 -53 47 -71 -13 16 -256 91
7465 91 160 11 118 62 -51 -35 -186 15 -364 -62 106 -29 -79 230 85 -15 -279 -41 24 174 -36 222
$$ packed form
7299c19L4K05P8QK30k83O1o9K8J70k35R2K40k81K38j69l5O5Qj39J40j51k3K43
7323A36L3J13k92j0J7J2R8k87K48J26k37J56k69nK69j84O8QQj65J55pq1J26m2
7348fj41J60L8j32KK30k31P6K76k49J10k03P1J03j29r3K94l57L60j33m7P9K5j13
7372a0K87l37J68J9o8j09K79q9l24K0K01L6m7K4k08J23Jj83J13L4j17K56N1o5
7396E5Lm6j29K25k3j47p1J99j29j49L75j24Q4j80k50M51k77J75m3O6j30K52l21
7419a34LK79k93P7N1K74j57q9J48j64j22J0J06r4K90m29M51k90M0J64j48Q3R8
7442A54p8j59J89k89L49k09o8J70k58K77k54J41j6J65j29m2MJ00j18N8K9k72L47
7465I1O9j49J07n6j13J6j51K01l79L02J68j35n0L09j45j00k64K38O5J50k10K58
$$ plain form
7487 222 44 173 54 -120 -135 -15 -102 64 -112 -170 187 19 -15 -70 -29 -27 21 138 134 91 134 8 -129 161
7511 161 155 -410 -111 -192 -12 101 -21 32 31 -262 -120 78 -206 -227 -156 -37 42 -25 85 34 163 -50 -12 14
7535 14 -19 222 71 -3 -166 1 105 -26 256 -33 -13 -262 260 29 -116 -24 -98 -53 -65 46 56 -128 -11
7558 -11 275 215 286 -91 -346 -205 -8 -33 -220 -90 -33 -163 -30 -44 165 -95 19 -198 346 89 169 184 27
7581 27 45 22 -247 59 132 264 187 -16 -64 -64 9 -15 55 97 88 83 -4 169 48 108 -53 -207 -17 -60 51 37 99
7608 99 176 66 220 246 205 -157 -181 278 39 -78 -88 -48 115 -123 -228 109 -351 74 -43 -48 58 81 107 30
7632 30 -84 16 -4 -32 -227 -172 127 -242 211 55 -105 -73 -91 -309 -170 -15 -146 -35 72 -3 -206 128
7654 128 -166 -166 -181 -217 138 182 36 -45 23 -125 -115 -66 -131 20 132 10 41 159 -151 55 -37 -12 3 36 -29
$$ packed form
7487B22j78J29j19j74j5J20q7J66j76n8L57j68l4n5M1KM8J17mm3M3j26j37K90
7511A61on65K99q1J80J13j22N3jk93J42J98k84k1P1J19P9o7J10n1J29k13L8K6
7535A4l3K41j51p4j63J67J04j31K82k89K0k49N22k31j45R2p4M5j2J11J0j84J17
7558a1K86o0P1l77k55J41J97k5j87J30N7j30J33j4K09k60J14k17N44k57Q0J5j57
7581B7J8k3k69L06P3J32p7k03m8%P3k4P0M2rnq7J73j21O0j61j54J90m3J11j4O2
7608I9P7j10J54K6m1l62k4M59k39j17j0M0J63k38j05L37m60M25j17nJ06K3K6p7
7632C0j14J00k0k8j95N5K99l69M53j56j60L2j8k18J39J55j31J11J07p5k03L34
7654A28k94%j5l6L55M4j46q1O8j48J0M9o5J51J12j22L1J18l10K06r2K5J5L3o5
$$ plain form
7679 -29 83 106 99 213 82 -103 -21 -57 -54 -38 -54 231 221 -117 -50 -106 -175 1 -277 60 44 -23 189 293 -81
7704 -81 -67 -103 -19 121 -215 38 -81 145 117 -69 -143 94 -176 -251 71 199 216 11 -209 174 69 -28 141
7727 141 -44 107 236 -46 -47 10 97 -182 -79 34 -25 -282 46 208 -126 79 105 71 -214 6 -41 -221 5
7750 5 288 170 -19 220 -159 -253 -268 -153 1 -29 37 126 184 -52 -13 -45 -44 -100 -130 -74 -98 61 11 64 -24 -123 -237
7777 -237 -106 -44 -206 21 -13 248 -26 155 4 104 78 -50 -37 298 -25 -9 33 -112 -149 -36 -57 -226 -100
7800 -100 161 -161 210 195 49 -34 43 -5 20 -33 -108 302 304 183 -161 -4 213 80 -287 -39 -109 28 -267
7823 -267 94 95 170 41 -59 -74 -75 -102 -21 -47 267 258 -92 -106 -138 -152 137 -23 19 22 124 214 -224 -69 37 -160
7849 -160 -110 156 74 -176 155 -122 8 52 204 296 124 -131 131 31 101 260 107 -53 -148 24 -250 -199
$$ packed form
7679b9J12K3pJ14j31j85Q2l6LJ6j6K85j0l38O7n6o9J76k78L37j6o7K12J04l74
7704h1J4l6Q4J40l36K53j19K26k8j86p4K37k70p5L22J28J7k05k20L83j05r7J69
7727A41j85J51J29k82jN7Q7k79J03J13n9k57L28J62l34K05K6l4k85K20m7j80K26
7750EK83j18j89K39l79r4j5J15J54l0O6Q9N8k36L9l2Jn6l0N6k4J59n0N3q8r9j14
7777b37J31O2j62K27l4K61k74J81j51J00k6j28J3L35l23J6M2j45l7J13k1j69J26
7800a00K61l22L71j5j46q3P7m8K5n3p5M10Kj21l44J57K17j33l67K48p0J37k95
7823b67L61JP5j29j00j5jk7Q1k6L14rl50j4l2j4K89j60M2LJ02R0m38J55J06j97
7849a60N0K66q2k50L31k77J30M4J52R2j72k55K62j00P0J59j53j60r5J72k74N1
$$ plain form
7871 -199 -62 96 97 160 67 -6 -256 135 48 54 -61 239 108 -215 41 -55 98 -45 -127 112 178 -172 -67 -131
7895 -131 -57 -50 -78 -69 -235 -184 16 95 -47 122 -64 -71 -139 -1 -84 -184 81 -122 447 -166 195 -2 -208 -296
7919 -296 13 -128 -120 188 19 158 156 90 264 77 -152 250 115 88 -11 -137 27 70 -214 49 -81 -62 -58 -52
7943 -52 -13 58 23 12 -65 -268 32 58 -17 166 151 -109 -32 26 -8 -141 137 29 98 189 23 166 26 61 26
7968 26 64 67 -105 -296 -65 -27 129 199 92 -90 7 55 -53 -89 -2 163 -56 420 248 -21 -89 101 -180 -60
7992 -60 -48 120 213 80 249 31 -181 45 -58 -150 163 -36 -7 -225 -19 -101 -65 -50 -53 -105 66 -26 55 126 -211
8017 -211 196 -200 -145 57 124 60 91 274 272 86 -123 71 -197 -20 160 -1 14 292 106 -33 76 107 135
8040 135 -40 66 29 62 16 -26 267 99 26 -188 -163 -6 -60 -59 98 99 113 39 124 -148 66 114 -233 -95 34
$$ packed form
7871a99J37J58JO3r3p3k50L91q7Oj15L00j31l23K56r6J53j43q2K39O6l50J05o4
7895a31P4Pk8Rj66N1K00P9j42J69j86po8J38q3j00K65k03N69o13L61j97k06q8
7919b96L09j41QL08j69J39ko6J74j87k29M02j35k7r9j26J64M3k84K63j30J9MO
7943e2L9P1l5j1p7k03L00K6p5J83j5k60P7N8l4j33K78j08O9R1j66J43j40L5l5
7968B6L8Lj72j91K31L8J56P0j07j82R7M8j08l6Q7J65k19M76j72k69o8J90k81J20
7992f0J2J68R3j33J69k18k12K26j03r2L13j99K9k18K06q2L6J5ln2J71r2Q1P1l37
8017b11M07l96N5K02O7o4L1J83kj86k09J94k68J77J80j61J5K78j86j39J09L1K8
8040A35j75J06l7L3m6m2K93j68p3k14K5J57n4JJ57JJ4p4Q5k72K14M8l47J38J29
$$ plain form
8065 34 63 -47 347 -131 87 -58 105 -60 -81 -21 -4 40 16 -54 216 -212 44 205 35 -222 162 180 80
8088 80 134 -16 -159 -89 21 -49 218 -5 -181 136 -139 -38 -203 -21 -64 -120 -30 -172 265 208 93 -90 63
8111 63 32 -26 -123 107 40 51 79 -96 130 -183 -4 25 -52 -33 -37 271 -68 125 -143 36 103 -108 -83 46 -69
8136 -69 -91 187 206 76 54 -200 -5 238 -177 295 -5 56 115 47 207 -340 64 170 98 39 -41 207 14
8159 14 -67 -107 -152 108 -75 200 119 49 148 157 96 211 -123 -179 -29 92 -46 190 89 -122 -95 -32 -22 -268 -85
8184 -85 24 -125 1 143 -24 10 -61
$$ packed form
8065C4K9j10L94m78K18j45J63j65k1O0J7M4k4p0K70m28K56J61j70k57L84J8j00
8088H0N4j50j43P0J10p0K67k23j76L17k75J01j65J82m3n6R0j42M37n7j15j83J53
8111F3l1n8r7K30o7J1K8j75K26l13J79K9p7J9mL08l39J93k68J79O7k11K5J29j15
8136f9k2K78J9j30k2k54J95K43m15M72l00O1N9o8J60n47M04J06p2n9q0K48j93
8159A4q1m0m5K60j83K75q1p0R9Ro1J15l34n6J50J21j38K36j01k11K7O3J0k46J83
8184h5J09j49J26J42j67L4p1
8191f1
$$ Imaginary data points
##PAGE= N=2
##DATA TABLE= (X++(I..I)), XYDATA
$$ plain form
0 0 0 0 0 0 0 0 0 0 0 0 0 0 0 0 0 0 0 0 8 -8 8 -8 8 -8 14 -16 16 -18 24 -25 31 -33 39 -43 49 -56 62 -69 77 -86
40 -86 96 -108 118 -131 147 -161 177 -196 216 -238 262 -288 318 -349 389 -430 478 -531 594 -668
60 -668 757 -866 1004 -1184 1429 -1789 2359 -3434 6171 -32312 -37578 2991 9852 26810 38834
75 38834 36593 6799 -14738 -24690 -26081 -27128 -11685 13607 33315 31334 21425 10883 -4693
88 -4693 -29950 -40751 -28822 -10607 -87 16331 34589 34037 13150 -4571 -13443 -23156 -28612
101 -28612 -16217 6281 21757 25106 23880 17906 1184 -21463 -32332 -26670 -16830 -8225 9382
114 9382 28485 29994 16491 4660 -4721 -19774 -28483 -18596 -732 12014 19724 25973 22330 5692
128 5692 -14289 -25073 -25316 -21496 -12316 6009 23186 25265 16786 9162 -1228 -16703 -24547 -16296
$$ packed form
0@%%%%%%%%%%%%%%%%%%Qj6J6j6J6j6K2l0L2l4M2m9N6o4P2q2R2j05J18j31J46j63
40h6J82k04K26k49K78l08L38l73M12m54N00n50O06o67P38q19R08j009J125j262
60f68J425j623J870k188K613l218M148n793R605l8483n266M0569O861J6958J2024
75C8834k241k9794k1537r952j391j047J5443K5292J9708j981r909j0542j5576
88d693k5257j0801J1929J8215J0520J6418J8258n52k0887j7721q872r713n456
101b8612J2395K2498J5476L349j226n974j6722k2647j0869N662R840Q605J7607
114I382J9103J509j3503j1831r381j5053q709R887J7864J2746P710O249l643j6638
128E692j9981j0784k43L820R180J8325J7177K079q479p624j0390j5475p844Q251
$$ plain form
142 -16296 -3368 5631 15187 23609 21404 6620 -8140 -17210 -22053 -22700 -14012 2578 16305 20036
156 20036 17740 12610 1873 -12904 -20057 -15143 -6805 586 11337 21502 19656 7717 -2684
169 -2684 -10890 -19331 -22270 -14725 -686 10200 15223 17391 14857 4272 -9266 -15875 -13936 -9683
183 -9683 -2831 8585 19104 18194 9165 1123 -7593 -17656 -21755 -14283 -2744 6222 12723 17486
197 17486 15355 4935 -6563 -12214 -13213 -11334 -5131 6809 16112 16162 10537 4584 -4357 -15550 -20253
212 -20253 -14509 -5127 2039 10287 17118 15490 6140 -3698 -9195 -12622 -12900 -6437 5020 13388 14499
227 14499 11866 7104 -2452 -14004 -18559 -14133 -7541 -811 8903 16748 15482 7215 -861 -6648 -12474
242 -12474 -14339 -7847 3077 10771 13393 13588 10103 -237 -11914 -16688 -14517 -10340 -3690 6954
$$ packed form
142a6296J2928Q999R556Q422k205j4784j4760r070m843o47Q688J6590J3727L731
156B0036k296n130j0737j4777p153M914Q338P391J0751J0165j846j1939j0401
169b684q206q441k939P545J4039J0886N023K168k534j0585j3538o609J939M253
183i683O852J1416J0519r10r029q042q716j0063m099P472J1539Q966O501M763
197A7486k131j0420j1498n651r99J879O203J1940R303N0n625n953q941j1193m703
212b0253N744R382P166Q248O831j628r350r838n497l427k78O463J1457Q368J111
227A4499k633m762r556j1552m555M426O592O730R714P845j266q267q076n787n826
242a2474j865O492J0924P694K622J95l485j0340j1677m774K171M177O650J0644
$$ plain form
256 6954 15536 15163 8644 2339 -4335 -12074 -14997 -8908 1006 7820 11984 15086 12073 1813 -8987
271 -8987 -14497 -14508 -12945 -6232 4890 13958 14492 10518 5295 -2024 -11107 -15106 -10428 -2212 4389 10776
287 10776 15686 13728 4111 -5774 -11610 -15047 -15575 -9158 2409 11179 13569 12111 8882 677 -9597
302 -9597 -13988 -11029 -5422 896 8836 15526 14394 6741 -2225 -8555 -14208 -16444 -11097 -465 7800
317 7800 11941 13749 11334 3179 -7337 -12344 -11492 -8315 -2719 6572 14487 14656 8801 2038 -5397
332 -5397 -13262 -16974 -12309 -3572 4151 10021 14225 13285 5125 -4413 -9781 -11485 -10862 -5666 4414
347 4414 12182 13538 10168 5624 -2257 -11299 -15844 -12862 -6232 336 7616 13647 13500 7005 -1206
362 -1206 -6700 -10815 -12140 -7570 1964 9305 11999 11751 8418 904 -8944 -14205 -13149 -8982 -3302
$$ packed form
256F954Q582l73o519o305o674p739k923O089R914O814M164L102l013j0260j0800
271h987n510j1J563O713J1122R068N34l974n223p319r083l999M678Q216O601O387
287A0776M910j958r617r885n836l437n28O417J1567Q770K390j458l229q205j0274
302i597m391K959N607O318P940O690j132p653q966o330n653k236N347J0632Q265
317G800M141J808k415q155j0516n007Q52L177N596R291P915J69n855o763p435
332e397p865l712M665Q737P723N870M204r40q160r538n368j704O23N196J0080
347D414P768J356l370m544p881r042m545K982O630O568P280O031j47o495q211
362a206n494m115j325M570R534P341K694k48l333p514r848n261J056M167N680
$$ plain form
377 -3302 5215 12514 13435 8160 2191 -3576 -9516 -12565 -8903 -664 6143 9910 11979 10378 3022
392 3022 -6111 -11530 -12159 -10784 -6134 2701 10425 11796 9076 5449 -808 -8239 -11880 -9172 -3080
407 -3080 2646 8174 11982 11099 4657 -3413 -8335 -11368 -11931 -8231 719 7824 10045 10133 7353 1537
423 1537 -6531 -10359 -9108 -5115 -313 5720 11245 11203 5934 -513 -5771 -10433 -12541 -9090 -1400 5522
439 5522 8356 9891 8633 2773 -4755 -8496 -8103 -6200 -2389 4192 9944 10337 6505 1906 -3359 -8935
455 -8935 -11720 -9354 -3069 2706 6639 9933 9273 4225 -3167 -6820 -7912 -7464 -4154 2950 8691 9403
471 9403 7227 4095 -1532 -8225 -10938 -8851 -4504 77 5025 9026 9480 4779 -794 -4943 -7083
486 -7083 -8287 -5189 1784 6773 8377 7945 5477 22 -6844 -10135 -8854 -5790 -1760 4056 8728
$$ packed form
377c302Q517P299R21n275n969n767n940l049L662Q239O807L767K069j601p356
392C022r133n419o29J375M650Q835P724J371k720l627o257p431l641K708O092
407c080N726N528L808q83o442q070m922l033n63L700Q950P105K221Q8k780n816
423A537q068l828J251L993M802O033N525m2n269o447n258m662k108L451P690O922
439E522K834J535j258n860p528l741L93J903L811O581N752L93l832m599n265n576
455h935k785K366O285N775L933L294o60n048p392l653j092M48L310P104N741P12
471I403k176l132n627o693k713K087M347M581M948M001M54m701n573m149k140
486g083j204L098O973M989J604m32k468n455o866l291J281L064M030N816M672
$$ plain form
501 8728 9082 5490 768 -3321 -6724 -8386 -5675 521 5354 7077 8214 7244 1565 -5655 -8896 -8750
517 -8750 -7294 -3889 2887 8389 8926 6319 2733 -2132 -6588 -8695 -6206 -652 3794 6523 8594
532 8594 7710 2154 -4406 -7613 -8241 -8331 -4976 1871 7288 8133 6778 4291 -711 -5948 -8313 -6392
548 -6392 -2240 1850 5687 9061 8478 3553 -2558 -6457 -8115 -9167 -6220 830 5948 7261 7009 5619
564 5619 836 -5030 -7633 -6621 -4373 -479 5003 8394 8962 4914 -282 -4531 -7963 -10094 -7413
579 -7413 -1143 4333 6829 8266 7465 2333 -4378 -7281 -7090 -5627 -1998 3733 8574 8686 5963 2360
595 2360 -2824 -7550 -9940 -8052 -2752 2083 5894 8458 8446 3406 -2433 -6109 -7453 -7336 -3760 2330
611 2330 7198 8395 7187 4163 -1124 -6794 -9461 -8382 -4782 -31 4132 8084 8527 4752 -372
$$ packed form
501H728L54l592m722m089l403j662K711O196M833J723J137r70n679p220l241J46
517h750J456L405O776N502N37k607l586m865m456k107K489N554M446K729K071
532H594q84n556o560l207o28r0L355O847N417Q45j355k487n002n237k365J921
548f392M152M090L837L374n83m925o111l899j658j052K947P050N118J313k52j390
564E619m783n866k603J012K248L894N482L391N68m048n196m249l432k131K681
579g413O270N476K496J437q01n132o711k903J91J463L629N731M841J12k723l603
595B360n184m726k390J888N300M835L811K564j2n040n839l676j344J17L576O090
611B330M868J197j208l024n287n670k667J079L600M751M163L952M43l775n124
$$ plain form
626 -372 -4046 -6521 -8021 -5382 592 5562 7723 7827 6426 1041 -5129 -8513 -8843 -6610 -2438 3205
642 3205 7712 8643 5979 1922 -2281 -5785 -8187 -6232 -1144 3519 6505 8381 7564 2744 -3544 -7096
658 -7096 -8109 -7686 -4318 1303 6488 7789 6761 3825 -549 -4828 -8035 -6568 -2686 1337 5050
673 5050 8208 8202 3816 -1594 -5273 -7865 -8291 -6048 -89 4749 6868 7015 5446 1241 -4126 -7174
689 -7174 -6813 -4151 -746 3661 7391 8266 4739 530 -3363 -6550 -8659 -6756 -1498 2857 5704 7103
705 7103 6278 2639 -2610 -5802 -6126 -5053 -2400 2264 6400 7618 5484 2313 -1354 -5607 -8023 -7057
721 -7057 -3045 1219 4036 6638 6664 3753 -1116 -4157 -5813 -5522 -3456 940 5269 6859 5735 3658
737 3658 151 -4430 -7368 -6731 -4005 -620 2671 6188 6846 4238 248 -2572 -4956 -5865 -4061 -59
$$ packed form
626c72l674k475j500K639N974M970K161J04j401n385o170l384l30K233M172N643
642C205M507R31k664m057m203l504k402J955N088M663K986J876q17m820o288l552
658g096j013M23L368N621N185J301j028k936m374m279l207J467L882M023L713
673E050L158om386n410l679k592m26K243N959M838K119J47j569m205n367l048
689g174L61K662L405M407L730Q75l527m209l893l187k109J903N258M355K847J399
705G103q25l639n249l192l24J073K653M664M136J218k134l171l667m253k416R66
721g057M012M264K817K602K6k911m869l041j656K91K066M396M329J590j124k077
737C658l507m581k938O37K726L385L291L517O58k608l990k820k384r09J804M002
$$ plain form
753 -59 3890 5569 5698 4569 1106 -3662 -6509 -6421 -4776 -1982 1670 5396 6521 4512 1419 -1204
769 -1204 -4174 -5816 -4626 -882 2574 4677 5737 5298 2089 -2621 -5681 -6152 -5403 -3339 702 4680
785 4680 6062 4903 2562 -407 -3316 -5726 -4929 -1630 1423 3948 5491 5877 2656 -1455 -4039 -5764
801 -5764 -5722 -3755 166 3711 5107 4650 3225 415 -3454 -5483 -4953 -2320 352 2827 5482 5834
817 5834 2983 -643 -3202 -5231 -6122 -4447 -592 2652 4511 4997 4034 1492 -2499 -4676 -4582 -3093
833 -3093 -1088 2419 5443 5885 3753 779 -1937 -4704 -6298 -5115 -1610 1907 3956 5161 4966 2030
849 2030 -1636 -4250 -4812 -3945 -1881 1886 5009 5812 4280 2065 -1264 -4457 -6472 -5446 -2644 641
865 641 3551 5581 5372 2726 -824 -3485 -4656 -4713 -2846 826 4359 5137 4615 3054 -14 -3898 -5908
$$ packed form
753e9L949J679J29j129l463m768k847Q8J645K794L652L726J125k009l093k623
769a204k970j642J190L744L456K103J060m39l209m710l060m71P49K064M041L978
785D680J382j159k341k969k909k410P97L299L053K525J543L86l221m111k584j725
801e764M2J967L921L545J396m57j425k810l869k029N30K633K672K475K655L52
817E834k851l626k559k029q91J675L855L244J859M86r63k542l991k177R4J489
833c093K005L507L024M42k132k974k716k767j594J183L505L517K049J205j95k936
849B030l666k614n62Q67K064L767L123Q03j532k215l329l193k015J026K802L285
865F41K910K030k09k646l550k661j171n7J867L672L533P78n22j561l068l884k010
$$ plain form
882 -5908 -5403 -3406 -665 2315 4994 5685 3401 310 -2252 -4443 -5111 -3446 -147 3233 5054 5408
898 5408 4219 1300 -3059 -5520 -5675 -4469 -2085 1442 4653 5772 4021 1590 -905 -3900 -5530
913 -5530 -4375 -1220 1787 4169 5549 5053 2250 -2023 -4512 -5618 -5232 -3148 608 4276 5375 4462
929 4462 2881 -41 -3429 -5314 -4508 -2252 475 3086 5641 5642 3235 -490 -3453 -5418 -5816 -4236
945 -4236 -459 2794 4752 4979 4075 1313 -2303 -4900 -4812 -3205 -870 2204 5188 5834 3687 931
961 931 -1930 -4251 -5654 -4943 -1844 1731 3922 5169 4767 2255 -1510 -3765 -4857 -4011 -2081 1204
977 1204 4599 5594 4155 1920 -947 -3822 -6082 -5163 -2639 93 2835 4801 5135 2778 -182 -2673
993 -2673 -4267 -4500 -3085 -47 3490 4989 4743 3370 527 -3027 -5182 -5009 -3419 -982 1744 4419
$$ packed form
882e908N05J997K741K980K679O91k284l091k562k191o68J665L299L380J821L54
898E408j189k919m359k461j55J206K384L527L211J119j751k431k495k995j630
913e530J155L155L007K382J380m96k803m273k489j106L86K084L756L668J099r13
929D462j581k922l388j885Q06K256K727K611K555Jk407l725k963j965l98J580
945d236L777L253J958K27r04k762l616k597Q8J607K335L074K984O46k147k756
961I31k861k321j403P11L099L575K191J247m02k512l765k255j092Q46J930L285
977A204L395R95j439k235k867k875k260R19K524K732K742J966L34k357k960k491
993b673j594k33J415L038L537J499k46j373k843l554k155J73J590K437K726K675
$$ plain form
1009 4419 5117 3170 763 -1746 -3577 -4706 -3248 -659 2150 3980 4376 3817 1480 -1787 -4347 -4951
1025 -4951 -3965 -2086 807 3804 4835 3436 1721 -535 -2831 -4326 -3530 -1410 1390 3182 4508
1040 4508 4244 2083 -893 -3348 -4434 -4060 -2825 -56 2835 4277 3827 2327 235 -2075 -3968 -3701
1056 -3701 -2092 60 2432 3994 4248 2668 -277 -2400 -4101 -4351 -3479 -672 2029 3838 3568 2817
1072 2817 1141 -1445 -3700 -3515 -2305 -485 1464 3696 4030 2723 386 -1627 -3133 -4254 -3665 -1571
1088 -1571 1334 2956 3600 3395 1428 -1027 -3023 -3588 -2628 -1078 1086 3409 3799 2754 1140 -616
1104 -616 -3137 -4264 -3695 -1843 359 2398 3586 3515 2098 -438 -2613 -3289 -3148 -1950 309 2686
1120 2686 3998 2960 1958 -64 -2591 -4208 -3828 -2053 -170 1525 3196 3582 2422 103 -1966
$$ packed form
1009D419O98j947k407k509j831j129J458K589K809J830L96n59k337l267k560o04
1025d951R86J879K893K997J031j399j715k256k296j495P96K120K800J792J326
1040D508k64k161k976k455j086L74J235K769K891J442m50j500k092k310j893K67
1056c701J609K152K372J562K54j580k945k123j701k50Q72K807K701J809k70p51
1072B817j676k586k255J85J210J820J949K232L34j307k337k013j506j121N89K094
1088a571K905J622O44k05j967k455j996n65R60J550K164K323L90j045j614j756
1104f16k521j127N69J852K202K039J188p1j417k536k175o76J41J198K259K377
1120B686J312j038j002k022k527j617L80J775J883J695J671L86j160k319k069
$$ plain form
1135 -1966 -2896 -3371 -2451 -114 2239 3516 3241 2148 748 -1782 -3723 -4135 -2506 -874 1153 3293
1151 3293 3680 2648 565 -1329 -2819 -3787 -2846 -739 2188 3139 3505 3009 1103 -1702 -3577 -3820 -3210
1168 -3210 -1810 667 2967 3623 2789 1346 -446 -2560 -3844 -3187 -942 1119 2724 3913 3417 1772
1184 1772 -748 -2987 -3599 -3389 -2225 -153 2482 3565 3145 2269 184 -2054 -3642 -3379 -1846 225
1200 225 2050 3826 4017 2519 -55 -2322 -3711 -4026 -3022 -557 1667 3338 3475 2806 978 -1557
1216 -1557 -3304 -3418 -2513 -899 1476 3657 4110 2806 766 -1323 -3292 -4214 -3435 -1330 1169 2732
1232 2732 3342 3403 1494 -877 -2750 -3182 -2987 -1801 931 3124 4047 2938 1722 -270 -2585 -4054
1248 -4054 -3636 -2033 -66 1746 3407 3531 2454 -99 -1879 -3057 -3213 -2194 -99 2494 3652 3296
$$ packed form
1135a966r30m75R20K337K353J277k75j093j400k530j941m12J629J632K027K140
1151C293L87j032k083j894j490r68R41K107K927R51L66m96j906k805j875k43O10
1168c210J400K477K300O56q34j443j792k114j284O57K245K061J605J189m96j645
1184A772k520k239o12K10J164K072K635J083m20q76k085k238j588K63J533K071
1200B25J825J776J91j498k574k267j389l15J004K465K224J671J37o69j828k535
1216a557j747j14R05J614K375K181M53j304k040k089j969r22P79K105K499J563
1232B732O10O1j909k371j873m32J95J186K732K193R23j109j216j992k315j469
1248d054M18J603J967J812J661J24j077k553j780j178j56J019K095K593J158l56
$$ plain form
1264 3296 2426 792 -2095 -3824 -3735 -2525 -881 1204 3164 3666 2605 691 -1173 -2724 -3393 -2941
1280 -2941 -637 1534 2923 3486 3415 1448 -1168 -3017 -3647 -2843 -1826 510 2627 3661 3105 1487
1296 1487 -325 -2172 -3561 -3283 -1315 547 2413 3385 3305 1968 -411 -2152 -3256 -3241 -2430 -470 1865
1313 1865 3139 2987 2248 578 -1312 -2960 -3234 -1779 -24 1733 2952 3386 2349 113 -1724 -2788
1329 -2788 -3603 -2457 -794 1043 2472 3046 2281 963 -1153 -2722 -2787 -2034 -840 1182 2851 3285 2357
1346 2357 689 -700 -2716 -3208 -2854 -1423 628 1919 2612 2831 1659 -706 -2041 -2425 -2272 -1240
1362 -1240 455 2330 2878 2671 1513 -173 -2083 -3247 -2845 -1823 215 1525 2758 2784 1612 -35
1378 -35 -1781 -2109 -2137 -1716 22 1774 2778 2554 1672 318 -1678 -2755 -2959 -2018 -574 1011 2516
$$ packed form
1264C296q70j634k887j729Q9J210J644K085J960N02j061j914j864j551o69M52
1280b941K304K171J389N63p1j967k616j849o30Q04J017K336K117J034n56j618
1296A487j812j847j389K78J968J862J866R72q0j337k379j741j104J5Q11J960K335
1313A865J274j52p39j670j890j648k74J455J755J757J219M34j037k236j837j064
1329b788q15J146J663J837J429N74p65j318k116j569o5P53J194K022J669M34r28
1346B357j668j389k016m92L54J431K051J291O93K19j172k365j335l84J53J032
1362a240J695J875N48k07j158j686j910j164M02J022K038J310J233K6j172j647
1378c5j746l28k8M21J738J752J004k24q82j354j996j077k04R41J444J585J505
$$ plain form
1395 2516 2684 2191 356 -1187 -2226 -2570 -2050 -193 1243 2355 2737 1973 999 -1073 -2526 -2879 -2243
1412 -2243 -842 676 2152 2488 2081 664 -773 -1669 -2479 -1951 -699 1177 2202 2598 2322 936 -659
1429 -659 -2396 -2839 -2476 -1507 530 1902 2556 2366 1211 29 -1547 -2417 -2140 -886 699 1643 2696
1446 2696 2773 1594 -141 -1753 -2682 -2627 -2139 -430 1442 2389 2317 1687 277 -1424 -2334 -2198 -1425 -176
1464 -176 1418 2208 2825 2094 131 -1142 -2446 -2924 -2283 -677 1089 1983 2663 2041 715 -835 -2216
1481 -2216 -2443 -2023 -765 756 2265 2875 2181 686 -711 -1814 -3155 -2477 -1208 690 1773 2441
1497 2441 2427 1177 -506 -1790 -2602 -2347 -1154 661 2174 2859 2550 1125 -227 -1780 -3014 -2883 -1711
1514 -1711 7 1288 2352 2599 1605 2 -1382 -2092 -2477 -1878 -214 1436 2692 2791 1935 503 -1358
$$ packed form
1395B516J68m93j835j543j039l44N20J857J436J112L82p64r74k072j453l53O36
1412b243J401J518J476L36m07j417j437q96q10N28J252J876J025L96k76j386j595
1429f59j737m43L63R69K037J372O54j90j155j182j576q70K77J254J585R44J053
1446B696P7j179j735j612r29N5M88J709J872R47p2o30j410j701r10J36P73J249
1464a76J594P90O17p31j963j273j304m78O41J606J766Q94O80o22j326j550j381
1481b216k27M20J258J521J509O10o94j495j397j103j341O78J269J898J083O68
1497B441j4j250j683j284q12K55J193J815J513O85l09j425j352j553j234J31J172
1514a711J718J281J064K47r94j603j384p10l85N99J664J650J256R9q56j432j861
$$ plain form
1531 -1358 -2881 -2769 -1918 -677 749 2248 2773 1978 304 -919 -2177 -2337 -2280 -538 954 2116 2650
1548 2650 2370 1240 -864 -2242 -2868 -2493 -1269 253 1890 2615 2232 1270 -474 -1577 -2619 -2306 -1104
1565 -1104 451 1882 2684 2669 1626 -70 -1602 -2240 -2608 -1964 -433 1370 2486 2776 1429 424 -1106
1582 -1106 -2133 -2493 -1232 -52 1079 2234 2596 1938 206 -1309 -2239 -2565 -2340 -776 776 1924
1598 1924 2432 1885 992 -598 -2036 -2333 -1752 -753 600 2216 2804 2140 922 -564 -1776 -2332 -2190
1615 -2190 -1226 130 1573 2212 2011 1386 -136 -1386 -1995 -1993 -1298 180 1786 2183 2244 1335 405 -1297
1633 -1297 -2394 -2475 -1441 -273 936 1835 2026 1387 95 -1030 -1523 -2040 -1275 -316 1147 2129 2248 1736
1651 1736 411 -859 -2146 -2348 -1991 -795 569 1634 2271 1636 576 -763 -1685 -2194 -1464 -530 753
$$ packed form
1531a358j523J12Q51J241J426J499N25p95j674j223j258j60N7J742J492J162N34
1548B650k80j130k104j378o26L75J224J522J637P25l83r62j744j103j042L13J202
1565a104J555J431Q02j5j043j696j532o38l68O44J531J803J116K90j347j005j530
1582a106j027l60J261J180J131J155L62o58j732j515r30l26K25J564J552J148
1598A924N08n47q93j590j438k97N81R99J353J616N88o64j218j486j212n56J42
1615b190R64J356J443O39k01o25j522j250o09KO95J478J606L97O1r09r30j702
1633a297j097q1J034J168J209Q99J91o39j292j125m93n17P65R59J463R82J19n12
1651A736j325j270j287k02L57J196J364J065O37o35j060j339r22n09P30R34J283
$$ plain form
1668 753 1700 1981 1737 969 -593 -1602 -2158 -1776 -830 244 1395 2036 1747 743 -66 -1097 -1991 -1736
1686 -1736 -885 364 1544 2017 1766 1116 -533 -1319 -2180 -1650 -1475 -487 1144 1873 1866 1090 176 -830 -1866
1705 -1866 -1723 -860 -182 1168 1877 2167 1435 161 -974 -1950 -1910 -1404 -369 869 1793 1897 1198 413
1723 413 -615 -1592 -2027 -1140 -364 734 1715 2000 1538 433 -708 -1353 -2082 -1885 -900 592 1551 1918
1741 1918 1384 817 -581 -1499 -1879 -1270 -550 454 1683 2075 1644 720 -463 -1137 -2138 -1701 -786 23
1759 23 1268 1783 1819 1210 -244 -1373 -1709 -1708 -880 19 1248 1783 1882 1298 260 -1071 -2194 -2090 -1135
1778 -1135 -624 785 1648 1796 1469 198 -879 -1549 -1854 -1105 -277 841 1779 2307 1611 540 -768 -1790
1796 -1790 -2021 -1669 -699 551 1292 2129 1665 490 -213 -1503 -1805 -1802 -720 559 1341 2006 1867 951 -367
$$ packed form
1668G53R47K81k44p68j562j009n56L82R46J074J151O41k89j004q09j031q94K55
1686a736Q51J249J180M73k51o50j649p86q61N30J75R88J631P29pp76r14j006j036
1705a866J43Q63O78J350P09K90p32j274j135r76M0N06J035J238R24J04o99p85
1723D13j028r77m35Q87P76J098R81K85m62j105j141o45p29J97R85J492R59L67
1741A918n34n67j398r18l80O09P20J004J229L92m31r24j183o74j001M37R15Q09
1759B3J245N15L6o09j454j129l36JQ28Q99J229N35R9n84j038j331j123J04R55
1778a135N11J409Q63J48l27j271j077o70l05P49Q28J118R38N28o96j071j308j022
1796a790k31L52R70J250P41Q37m64j175p03j290l02LJ082J279P82O65j39r16j318
$$ plain form
1815 -367 -1420 -1750 -2195 -919 94 1343 2024 1584 871 -98 -1153 -1673 -1776 -508 224 1180 1898 1882
1833 1882 1236 118 -1411 -1839 -2135 -1401 -173 1139 1900 1610 1093 323 -680 -1960 -1625 -1342 -314
1850 -314 716 1482 2359 1600 153 -894 -1486 -2075 -1711 -806 667 1243 1695 1548 707 -217 -1304 -1725
1868 -1725 -1703 -639 231 1283 1780 1714 768 -348 -1282 -2015 -2054 -1362 42 952 1657 1657 1260 -197 -1082 -1638
1888 -1638 -1237 -942 -51 1265 1946 1737 981 44 -1007 -1705 -1586 -1092 -357 480 1504 1939 1435 438 -511
1907 -511 -1167 -1706 -1300 -313 780 1343 1904 1301 412 -135 -1524 -1648 -1777 -501 358 1177 1572 1333 622
1926 622 -488 -1098 -1495 -1636 -495 499 1294 1750 1421 697 -89 -1282 -1593 -1503 -901 -86 851 1641 1358
1945 1358 866 165 -713 -1245 -1336 -792 255 962 1581 1741 1113 173 -1060 -1685 -1459 -1242 -273 710 1214
$$ packed form
1815c67j053l30m45J276J013J249O81m40p13r69j055n20j03J268P32R56P18j6
1833A882o46j118j529m28k96P34J228J312P61k90n17p70j003j280L35K83J028
1850c14J030P66Q77p59j447j047n92n89L64R05J473N76M52j47q41r24j087m21
1868a725K2J064Q70J052M97o6r46j116r34p33l9O92J404R10P05%l97j457q85n56
1888a638M01K95Q91J316O81k09p56r37j051o98J19M94P35Q37J024M35n04r97r49
1907e11o56n39M06R87J093N63N61o03q89n47j389j24j29J276Q59Q19L95k39p11
1926F22j110o10l97j41J141R94P95M56l29p24p86j193l11R0O02Q15R37P90k83
1945A358m92p01q78n32r1N44J047P07O19J60o28r40j233o25K26K17R69R83N04
$$ plain form
1964 1214 1349 1029 187 -350 -1196 -1193 -1140 -58 724 1407 1635 1136 360 -691 -1088 -1372 -1245 -647 514 1349
1984 1349 1137 1311 493 -127 -992 -1387 -1214 -528 490 1242 1475 1282 514 -430 -1206 -1384 -1484 -753 138
2003 138 933 1187 1063 795 -77 -1008 -1326 -1317 -671 62 801 1377 1077 983 42 -926 -1696 -1292 -812 -90 878
2024 878 1209 1288 1004 37 -586 -1194 -1275 -855 -338 764 1349 1251 724 276 -874 -1056 -1754 -943 -207 501
2044 501 1279 1414 1245 487 -392 -1061 -1323 -962 -270 705 1341 1364 850 545 -287 -1405 -1359 -1264 -506 68 929
2065 929 1306 1259 783 -255 -956 -1368 -1206 -471 419 1031 1336 1407 852 17 -804 -1336 -1412 -578 -128 982
2085 982 1391 1193 709 17 -797 -1287 -1323 -932 121 803 1434 1538 1061 -23 -990 -1274 -1657 -1400 -329
2104 -329 455 1265 1227 1053 424 -353 -1213 -1567 -1003 -8 438 1124 1406 1261 666 -496 -1009 -1269 -1221 -728
$$ packed form
1964A214J35l20q42n37q46LN3J082P82O83K28m99p76j051l97k84J27N98J161Q35
1984A349k12J74q18o20q65l95J73O86J018P52K33j93p68r44p76j78j00P31Q91
2003A38P95K54j24k68q72r31l18RO46P33P39N76l00r4r41r68p70M04M80P22R68
2024H78L31P9k84r67o23o08q1M20N17J102N85r8n27m48j150j82o98Q11P36P08
2044E01P78J35j69p58q79o69k62L61O92R75O36K3n14l05q32j118M6R5P58N74Q61
2065I29L77m7m76j038p01m12J62P35Q90O12L05P1n55q35q21n32p6Q34M50J110
2085I82M09j98m84o92q14m90l6L91J053O82O31J04m77j084r67k84l83K57J071
2104c29P84Q10l8j74o29p77q60l54N64R95M46O86K82j45n95j162n13k60M8M93
$$ plain form
2124 -728 62 1120 1204 1478 387 -429 -1010 -1297 -950 -357 84 1125 1471 1253 900 -322 -921 -1460 -1353
2143 -1353 -877 -75 652 1291 1475 997 40 -699 -1217 -1002 -899 26 728 974 1373 1002 258 -502 -1231 -1476
2163 -1476 -1125 -451 454 1183 1122 871 501 -429 -1073 -1299 -1108 -628 425 1234 1429 1325 365 -347 -989 -1386
2183 -1386 -1173 -756 204 812 1243 1369 710 -254 -577 -867 -1251 -856 317 1006 1106 1450 799 -124 -658
2202 -658 -1365 -1201 -935 -8 548 855 1303 750 41 -565 -1048 -1056 -941 53 729 1063 1476 1167 346 -563 -1415
2223 -1415 -1353 -1125 -681 475 1038 1250 911 365 -42 -980 -920 -607 -234 454 885 1314 967 388 -453 -1066
2243 -1066 -1108 -1005 -481 133 675 1180 961 521 -127 -558 -993 -1110 -601 363 877 889 1102 582 119 -778
2263 -778 -986 -1311 -799 153 538 1204 639 653 127 -350 -929 -1055 -597 -180 565 989 1064 867 -66 -308 -906
$$ packed form
2124g28P90J058Q4K74j091q16n81k87L47N93M41J041L46k18l53j222n99n39J07
2143a353M76Q02P27O39J84m78r57p39n18K15J03R25P02K46L99l71p44p60p29k45
2163a476L51O74R05P29o1k51l70r30o44k26J91M80J053Q09J95j04r60p12o42l97
2183a386K13M17R60O08M31J26o59r64l23k90l84L95J173O89J00L44o51r23n34
2202f58p07J64K66R27N56L07M48n53p09o06m83qJ15R94O76L34M13l09q21r09q52
2223a415O2K28M44J156N63K12l39n46m07r38O0L13L73O88M31M29l47n79q41o13
2243a066m2J03N24O14N42N05k19m40o48m31m35j17N09R64N14J2K13n20m63q97
2263g78k08l25N12R52L85O66n65J4n26m77n79j26M58M17P45M24P5j97r33k42n98
$$ plain form
2284 -906 -1208 -1033 -118 464 917 966 824 173 -456 -827 -1050 -620 -223 504 796 1302 883 306 -350 -813
2304 -813 -1338 -1123 -243 139 768 932 1076 437 -209 -455 -1039 -901 -448 556 783 987 1009 667 -278 -634
2324 -634 -1156 -1127 -395 -19 409 811 950 687 113 -484 -931 -1054 -548 241 607 1082 901 703 11 -541
2344 -541 -868 -916 -887 -497 496 525 1002 867 183 -332 -824 -1141 -627 -86 671 987 955 606 330 -799 -684
2365 -684 -1078 -850 -240 376 1135 929 888 466 -310 -517 -1141 -1021 -363 328 695 1039 1026 467 -119 -712 -1060
2386 -1060 -882 -635 -183 656 890 931 506 113 -711 -1235 -867 -498 -70 942 1333 939 749 -289 -659
2405 -659 -976 -1106 -633 -130 639 788 1177 526 34 -281 -641 -1177 -719 -136 529 1024 1090 1084 226 -182 -1186
2426 -1186 -1338 -991 -323 210 748 1223 1101 310 -259 -542 -992 -870 -179 384 830 1122 891 698 -42 -725
$$ packed form
2284i06l02J75R15N82M53M9j42o51o29l71k23M30L97P27K92N06m19n77o56m63
2304h13n25K15Q80L82O29J64J44o39o46k46n84J38M53J004K27K04K2l42r45l56
2324f34n22K9P32L76M28M02J39k63n74n97m47j23N06P89L66M75j81j98o92n52
2344e41l27m8K9L90R93K9M77j35o84n15m92l17N14N41P57L16l2l49k76j129J15
2365f84l94K28O10O16P59k06m1m22p76k07o24J20O58O91L67L44j3n59n86n93l48
2386a060J78K47M52Q39K34M1m25l93q24n24L68L69M28J012L91l94j90j038l70
2405f59l17j30M73N03P69J49L89o51m92l15l60n36M58N83O65M95O6oq58m08j004
2426a186j52L47O68N33N38M75j22p91n69k83m50J22O91N63M46K92k31j93p40o83
$$ plain form
2446 -725 -966 -841 -574 151 547 1541 932 483 -38 -721 -947 -958 -504 -25 719 1057 1103 683 17 -413 -1077
2467 -1077 -1069 -876 -447 639 777 882 750 -28 -430 -1144 -975 -905 -78 312 946 1055 1023 221 -651 -696 -1122
2488 -1122 -901 -569 -105 571 1144 536 475 -291 -883 -1142 -765 -321 335 605 885 1134 450 71 -857 -1122
2508 -1122 -926 -415 92 728 948 917 731 10 -461 -962 -876 -523 45 306 862 1002 789 46 -400 -788
2528 -788 -979 -741 -391 438 719 965 781 189 -416 -634 -742 -646 -292 329 906 1122 913 367 -199 -834
2548 -834 -1066 -768 -529 265 599 842 647 394 -164 -798 -801 -726 -247 315 726 931 848 724 -229 -343 -927
2569 -927 -888 -699 0 554 659 797 396 -221 -499 -650 -754 -406 -139 590 869 867 648 -194 -528 -831 -956
2590 -956 -604 -104 464 657 850 840 289 -327 -874 -831 -716 -213 436 652 846 641 157 -285 -713 -895 -650
$$ packed form
2446g25k41J25K67P25L96R94o09m49n21o83k26j1M54M79P44L38M6m20o66m30o64
2467a077QJ93M29J086J38J05j32p78m02p14J69P0Q27L90O34J09l2q02q72m5m26
2488a122K21L32M64O76N73o08o1p66n92k59L77M44O56K70K80K49o84l79r28k65
2508a122J96N11N07O36K20l1j86p21m71n01Q6L53N68K61N56J40k13p43m46l88
2528g88j91K38L50Q29K81K46j84n92o05k18j08R6L54O21N77K16k09n46n66o35
2548h34k32K98K39P94L34K43j95k53n58o34lP5M79N62M11K05q3j24r53j14n84
2569i27L9J89O99N54J05J38m01o17k78j51j04L48K67P29K79kk19q42l34l03j25
2590i56L52N00N68J93J93j0n51o16n47M3J15N03O49K16J94k05m84m42m28j82K45
$$ plain form
2611 -650 -52 32 601 602 617 129 -165 -724 -476 -657 -415 316 738 767 820 218 -172 -681 -698 -725 -638 -62 401
2634 401 737 792 699 -2 -538 -938 -560 -372 97 598 1078 1038 471 -55 -534 -772 -863 -561 -58 153 613
2655 613 818 396 284 -533 -759 -676 -696 -12 305 925 941 748 51 -378 -737 -792 -754 -450 365 604 762 809
2677 809 163 -260 -543 -934 -711 -322 433 848 793 457 253 -21 -474 -985 -926 -205 73 373 727 801 413
2698 413 -183 -794 -556 -634 -728 329 546 719 680 503 -8 -444 -731 -948 -865 -152 467 754 756 222 -42 -420
2720 -420 -814 -725 -448 -275 515 722 698 582 87 -298 -754 -880 -703 -394 210 679 944 642 419 -186 -802
2741 -802 -768 -735 -283 -14 728 748 864 466 -154 -629 -922 -733 -435 152 554 806 653 462 119 -555 -589
2762 -589 -772 -657 101 477 795 889 587 337 -455 -682 -827 -607 -273 290 848 814 439 201 -361 -917 -903
$$ packed form
2611f50N98Q4N69JJ5m88k94n59K48j81K42P31M22K9N3o02l90n09j7k7Q7N76M63
2634D01L36N5r3p01n36m00L78J88M69N01M80m0n67n26m79k38r1L02N03K11M60
2655F13K05m22j12q17k26Q3k0O84L17O20J6j93o97m29l59n5L8L04Q15K39J58M7
2677H09o46m23k83l91K23L89P55M15n5l36k04k74m53n11N9P21K78L00L54P4l88
2698D13n96o11K38p8r4J057K17J73l9j77n11m36k87k17Q3P13O19K87Kn34k64l78
2720d20l94Q9K77J73P90K07k4j16m95l85m56j26J77L09O04M69K65l02k23o05o16
2741h02L4L3M52K69P42K0J16l98o20m75k93J89K98N87M02K52j53j91l43o74l4
2762e89j83J15P58L76L18R4l02k50p92k27j45K20L34N63N58l4l75k38n62n56J4
$$ plain form
2783 -903 -457 -63 492 827 1034 318 258 -262 -721 -933 -758 -278 208 734 564 730 285 -143 -741 -667 -501
2804 -501 -340 107 556 676 802 357 -82 -581 -915 -610 -410 77 452 506 488 429 -127 -282 -820 -613 -449
2825 -449 61 456 754 643 598 67 -305 -753 -928 -598 -362 631 557 743 517 176 -252 -427 -849 -340 -212
2846 -212 498 502 599 523 253 -150 -276 -1000 -521 -427 193 529 628 573 96 -241 -503 -727 -565 -318 228 469
2868 469 542 511 326 -172 -337 -752 -621 -536 -104 423 465 717 382 -81 -243 -647 -631 -535 -112 428 809 752
2890 752 577 126 -343 -526 -856 -782 43 360 453 575 529 94 -438 -687 -745 -567 -139 392 554 666 805
2911 805 61 -382 -492 -625 -382 -219 110 648 911 562 32 -360 -653 -476 -401 -221 230 710 901 483
2931 483 265 -258 -289 -525 -777 -370 96 240 539 623 258 -141 -432 -672 -427 -426 69 474 773 464 462 -45
$$ packed form
2783i03M46L94N55L35K07p16o0n20m59k12J75M80M86N26j70J66m45m28n98P4J66
2804e01J61M47M49J20J26m45m39m99l34L05K00M87L75N4j8n9n56j55n38K07J64
2825d49N10L95K98j11m5n31l72m48j75L30K36R93p4J86k26l41m28j75m22N09J28
2846b12P10MR7p6k70m03j26p24M79R4O20L36R9n5m77l37k62k24J62K47N46K41
2868D69P3l1j85m98j65m15J31Q5M32N27M2K52l35m63j62m04J6R6M23N40L81n7
2890G52j75m51m69j83l30P4Q25L17R3J22m6m35n32k49n8J78M28N31J62J12J39
2911H05p44m43j10j33K43J63L29N38K63l49n30l92k93J77P5J80M51M80J91m18
2931D83k18n23l1k36k52M07M66J44K99Q4l65l99k91k40K45JM95M05K99l09kn07
$$ plain form
2953 -45 -457 -491 -590 -328 112 516 651 428 424 109 -266 -611 -492 -305 -76 288 531 587 515 119 -373 -690
2975 -690 -601 -506 -48 292 678 590 262 174 -87 -715 -410 -234 -13 155 334 685 689 364 -226 -357 -853 -745
2997 -745 -287 246 337 591 513 211 -112 -627 -755 -626 -260 272 445 534 559 330 -75 -373 -657 -453 -371 -37
3019 -37 253 605 614 293 -129 -408 -729 -675 -198 -4 374 727 848 551 32 -477 -548 -1018 -505 73 203 596
3041 596 493 583 -95 -526 -787 -773 -478 -208 145 493 885 633 129 66 -725 -472 -723 -559 67 497 562
3062 562 469 338 -236 -461 -827 -425 -226 -1 514 550 624 375 115 -495 -767 -565 -366 45 171 563 554 441
3084 441 -136 -151 -757 -532 -177 78 623 790 727 474 372 -168 -572 -851 -384 -424 288 584 584 316 122 -138
3106 -138 -621 -656 -536 -84 144 579 924 653 131 -159 -461 -733 -683 -458 43 441 731 649 380 168 -492
$$ packed form
2953d5m12l4r9K62M40M04J35k23ml15l75l45J19J87K29L64K43N6p2l96m92l17
2975f90Q9R5M58L40L86q8l28q8k61o28L05J76K21J68J79L51Ml25n90j31m96J08
2997g45M58N33R1K54p8l02l23n15j28J29L66N32J73Q9K5k29m05k98k84K04Q2L34
3019c7K90L52Rl21m22k79l21N4M77J94L78L53J21k97n19n09p1m70N13N78J30L93
3041E96j03R0o78m31k61J4K95K70L53L48L92k52n04o3p91K53k51J64O26M30O5
3062E62r3j31n74k25l66M02J99K25N15L6P4k49k60o10k72K02J99M11J26L92rj13
3084D41n77j5o06K25L55K55N45J67o3k53j02n40m04k79M67m0P12K96%k68j94k60
3106a38m83l5J20M52K28M35L45k71n22k90l02k72N0K25N01L98K90q2k69k12o60
$$ plain form
3127 -492 -815 -704 -149 51 398 790 569 405 -352 -401 -600 -409 -440 -85 305 312 371 564 88 -177 -617 -729
3149 -729 -302 -76 420 822 533 390 115 -2 -642 -625 -432 -234 222 664 533 485 165 -189 -520 -686 -530
3170 -530 -124 -6 350 833 371 14 -184 -428 -758 -637 -316 29 468 486 498 187 -92 -466 -420 -354 -327 18
3192 18 244 481 395 462 37 -152 -460 -838 -525 244 454 479 663 206 117 -147 -640 -546 -473 -8 543 634 707
3215 707 248 99 -220 -419 -723 -384 -189 109 549 559 505 141 -223 -411 -448 -482 -92 304 408 439 244 51
3237 51 -51 -605 -679 -286 -79 -104 800 427 495 245 -165 -298 -552 -384 -198 112 698 573 741 152 -178
3258 -178 -162 -803 -351 -455 -101 117 288 275 76 78 -220 -298 -499 -195 -90 162 426 600 298 146 -190 -713
3280 -713 -742 -362 -357 229 510 339 338 223 -390 -416 -600 -123 -224 314 327 534 516 -82 5 -451 -474 -458 124 -60
$$ packed form
3127d92l23J11N55K00L47L92k21j64p57m9j99J91l1L55L90PN9J93m76k65m40j12
3149g29M27K26M96M02k89j43k75j17o40J7J93J98M56M42j31m8l20l54l31j66J56
3170e30M06J18L56M83m62l57j98k44l30J21L21L45M39J8J2l11k79l74M6O6K7L45
3192A8K26K37q6O7m25j89l08l78L13P69K10K5J84m57q9k64m93R4P3M65N51R1P3
3215G07m59j49l19j99l04L39J95K98M40J0n4l64l64j88l7l4L90L96J04L1j95j93
3237E1j02n54p4L93K07k5R04l73O8k50m10j33k54J68J86L10N86j25J68n89l30
3258a78J6o41M52j04L54K18J71j3j99Kk98p8k01L04J05K52K64J74l02j52l36n23
3280g13k9L80NN86K81j71jj15o13k6j84M77j01N38J3K07j8n98Q7m56k3J6N82j84
$$ plain form
3304 -60 248 266 34 309 -217 -474 -354 -186 -281 51 506 384 430 -31 -36 -229 -276 -472 -378 61 235 678 521
3327 521 469 147 -319 -627 -219 -324 202 431 610 538 61 -118 -473 -386 -640 -353 -1 401 291 520 362
3348 362 221 -317 -520 -426 -369 -56 289 237 510 603 117 -147 -451 -930 -457 -46 61 288 372 472 192 -309
3370 -309 -301 -470 -802 50 12 323 520 450 43 -51 -305 -429 -511 -661 -165 151 533 284 289 -224 -294 -424 -304
3393 -304 -325 96 434 657 626 475 88 -79 -408 -513 -378 -174 110 465 764 504 133 -77 -489 -399 -663
3414 -663 -194 390 492 468 348 71 -158 -532 -478 -469 -158 102 529 315 255 188 5 -501 -432 -385 -155 -16 564
3437 564 545 558 326 -116 -181 -585 -601 -404 184 93 383 362 263 133 -28 -309 -592 -88 136 216 305 391 280
3460 280 95 -170 -344 -646 -191 -166 171 433 477 454 -153 -249 -387 -577 -285 -265 174 388 439 143 107 -157
$$ packed form
3304f0L08J8k32K75n26k57J20J68r5L32M55j22M6m61nj93m7j96R4M39J74M43j57
3327E21n2l22m66l08M08j05N26K29J79p2m77j79l55Q7k54K87L52M02j10K29j58
3348C62j41n38k03R4N7L13L45n2K73R3m86k64l04m79M73M11J07K27Q4J00k80n01
3370c09Qj69l32Q52l8L11J97p0m07r4k54j24q2j50M96L16L82k49Nn13p0j30J20
3393c04k1M21L38K23l1j51l87j67l29j05J35K04K84L55K99k60l71k10m12R0k64
3414f63M69N84J02k4j20k77k29l74N4RL11K60M27k14o0o7j83n06O9M7K30J39N80
3437E64j9J3k32m42o5m04j6J97N88r1K90k1r9j30j61k81k83N04K24Q0Q9Q6j11
3460B80j85k65j74l02M55K5L37K62M4k3o07r6j38j90K92K0M39K14N1k96l6k64
$$ plain form
3482 -157 -379 -332 -339 -133 118 316 290 422 227 -40 -216 -239 -256 -442 206 350 357 394 328 211 13 -586 -182
3505 -182 -335 22 166 397 628 61 -157 -294 -249 -608 -430 32 346 359 529 310 -17 -107 -481 -438 -341 -289
3527 -289 182 257 371 418 187 -198 -597 -493 -93 -95 408 353 542 636 196 -170 -289 -540 -632 -388 119 447
3549 447 374 366 121 102 -398 -400 -293 -220 184 428 681 452 200 -99 -353 -219 -332 -159 -242 377 349 338 83
3572 83 -50 -191 -341 -299 -331 -12 380 380 557 312 147 -162 -462 -475 -265 66 291 103 286 545 116 -273
3594 -273 -264 -273 -330 -210 79 416 447 264 171 -294 -361 -400 -391 -88 20 465 269 173 149 -53 -522 -131 -249 -104
3618 -104 -83 443 370 374 141 -9 -359 -447 -538 -302 197 402 714 507 -202 20 -177 -308 -362 -320 71 466 443
3641 443 479 247 81 -105 -456 -569 -152 -84 208 256 375 560 48 115 -305 -295 -263 10 103 185 493 350 249
$$ packed form
3482a57k22M7pK06K51J98k6J32j95k67j76k3j7j86O48J44PL7o6j17j98n99M04
3505a82j53L57J44K31K31n67k18j37M5l59J78M62L14J3J70k19l27r0l74M3R7N2
3527b89M71P5J14M7k31l85l99J04M00kN03n5J89R4m40l66j19k51r2K44N07L28
3549D47p3qk45j9n00kJ07P3M04K44K53k29k52k99k54J34j13J73q3O19k8j1k55
3572H3j33j41j50M2l2L19L92%J77k45j65l09l00j3K10L31K25j88J83K59m29l89
3594b73Rrn7J20K89L37L1j83r3m65o7l9RL03J08M45j96r6k4k02m69L91j18J45
3618a04K1N26p3Mk33j50l50q8r1K36M99K05L12k07p09K22j97j31n4M2L91L95k3
3641D43L6k32j66j86l51j13M17O8K92M8J19J85n12O7m20J0L2K73R3Q2L08j43j01
$$ plain form
3664 249 -148 -269 -271 -200 -56 -22 595 523 274 30 -169 -281 -472 -348 -120 -82 339 569 512 178 -175 -209 -522
3687 -522 -225 118 -21 236 336 438 343 80 -266 -351 -368 -313 -112 71 365 485 241 169 -122 -466 -521 -350
3709 -350 -105 171 268 412 493 152 -220 -250 4 -179 -371 101 124 448 396 355 -295 -299 -230 -535 17 -72 148
3732 148 632 297 316 -189 -223 -484 -347 -275 150 498 303 345 198 151 -426 -495 -109 -269 53 223 508 270
3754 270 216 52 -59 -157 -378 -279 -80 257 98 478 411 -62 -97 -347 -345 -587 21 165 469 256 261 33 37 -260
3778 -260 -567 -309 -106 63 214 342 279 300 164 49 -436 -527 -53 -17 314 256 -60 -17 55 -347 -289 -339 -94
3801 -94 218 199 504 356 277 -144 -369 -401 -157 -127 65 34 322 274 162 -144 -232 -365 -307 12 51 435 425 173
3825 173 409 50 -177 -83 -492 -475 -67 86 157 306 114 112 -136 -536 -174 -265 -13 590 492 407 357 9 -120
$$ packed form
3664B49l97j21kP1J44L4O17p2k49k44j99j12j91J24K28L8M21K30n7l34l53l4l13
3687e22K97L43j39K57J00J02r5k63l46q5j7N5K01J83K94J20k44p2k91l44n5J71
3709c50K45K76R7J44Q1l41l72l0K54j83j92M72K3L24n2m1o50mO9l05N52q9K20
3732A48M84l35J9n05l4k61J37P2M25L48j95M2j47m7n77o9L86j60L22J70K85k38
3754B70n4j64j11r8k21R9J99L37j59L80o7m73l5k50Kk42O08J44L04k13Nk28Mk97
3778b60l07K58K03J69J51J28o3K1j36j15m85r1M74L6L31n8l16M3P2m02N8n0K45
3801i4L12j9L05j48p9m21k25l2K44L0J92l1K88m8j12l06q8j33N8L19L9L84j0k52
3825A73K36l59k27R4m09J7M08J53P1J49j92kk48m00L62r1K52O03r8q5n0l48j29
$$ plain form
3848 -120 -394 -483 -240 -73 117 483 156 243 37 -190 -472 -376 -457 -228 346 417 67 302 13 -178 -338 -280
3870 -280 -168 -264 11 0 335 160 -184 174 -196 -248 -117 -216 134 155 318 282 210 36 -284 -317 -438 -95 -184
3893 -184 124 227 358 173 -158 -397 -244 -189 -228 -7 163 212 184 202 281 -94 -257 75 -187 -406 6 293
3915 293 273 226 -64 9 -213 -132 -514 -410 -6 560 267 421 27 -94 -30 -343 -137 -298 -56 167 201 405
3937 405 221 37 -133 -221 -276 -339 72 229 319 391 147 58 181 -492 -329 -223 -23 85 444 348 31 -186
3959 -186 -157 -347 -188 -400 92 212 238 76 568 288 -88 -369 -432 -298 -101 95 58 429 96 310 -256
3980 -256 -340 -140 -274 -47 -49 445 256 401 90 -285 -234 -221 -292 -240 111 130 441 370 163 -69 -308 -565 -82
4003 -82 -210 106 335 458 669 343 -77 -333 -404 -374 -246 -144 185 75 334 524 238 -178 -214 -338 -372 71
$$ packed form
3848a20k74q9K43J67J90L66l27Q7k06k27k82R6q1K29N74P1l50K35k89j91j60N8
3870b80J12r6K75j1L35j75l44L58l70n2J31r9L50K1J63l6p2j74l20l3j21L43q9
3893a84L08J03J31j85l31k39J53N5l9K21J70M9k8J8P9l75j63L32k62k19M12K87
3915B93k0m7k90P3k22Q1l82J04M04N66k93J54l94j21O4l13K06j61K42K23L4K04
3937D05j84j84j70q8n5o3M11J57R0P2k44q9J23o73J63J06K00J08L59r6l17k17
3959a86K9j90J59k12M92J20K6j62M92k80l76k81o3J34J97J96l7L71l33K14n66
3980b56q4K00j34K27kM94j89J45l11l75N1J3p1N2L51J9L11p1k07k32k39k57M83
4003h2j28L16K29J23K11l26m20k56p1L0J28J02L29j10K59J90k86m16l6j24l4M43
$$ plain form
4025 71 170 356 288 139 138 -34 -133 -687 -88 -12 77 328 578 356 280 -55 -282 -196 -350 -47 94 266 305 198
4049 198 281 68 -336 -340 -554 -131 -165 22 323 305 112 24 -179 -336 -510 -152 222 291 551 352 90 -78
4071 -78 -99 -316 -355 -116 -277 158 229 317 -57 98 -139 -178 -328 -198 66 -40 225 107 297 -51 13 -416
4093 -416 -378 -4 -117 -29 304 416 290 67 -1 -268 -68 -379 89 218 401 458 194 -34 214 -185 -209 -342
4115 -342 -168 -306 112 356 452 -20 0 -211 -322 -196 -437 -223 276 293 291 106 137 -68 -242 -223 -136 -37 159
4138 159 309 182 166 51 -246 25 -138 -176 -180 71 345 234 230 100 -70 -138 -216 -273 -164 -8 152 267 152
4161 152 28 -66 -218 -404 -339 -187 106 51 301 350 26 -27 -116 -187 -134 -144 -41 -27 427 130 185 118 -297 -281
4185 -281 -117 -90 93 -66 4 289 190 154 -253 -222 -179 -255 57 14 250 248 49 -158 -166 -339 -269 -66 75 224
$$ packed form
4025G1R9J86o8j49jj72r9n54N99P6Q9K51K50k22p6l35k27Q6j54L03J41J72L9j07
4049A98Q3k13m04mk14M23l4J87L01j8j93q8k03j57j74L58L74O9K60j99k62j68
4071g8k1k17l9K39j61M35P1Q8l74J55k37l9j50J30K64j06K65j18J90l48O4m29
4093d16L8L74j13Q8L33J12j26k23o8k67K00l11M68J29J83N7k64k28K48l99k4j33
4115c42J74j38M18K44R6m72K0k11j11J26k41K14M99J7kj85L1k05j74J9Q7R9J96
4138A59J50j27j6j15k97K71j63l8mK51K74j11mj30j70o8p8n7J09J56J60J15j15
4161A52j24r4j52j86O5J52K93n5K50M9l24n3q9p1N3j0J03J4M54k97N5o7m15J6
4185b81J64K7J83j59P0K85r9l6m07L1M3p6L12m3K36kj99k07qj73P0K03J41J49
$$ plain form
4209 224 -100 284 -70 -10 45 -156 -376 -477 -181 -63 183 385 89 -176 -142 -203 -173 -300 -198 -52 182 124
4231 124 260 88 164 -337 -105 31 -301 -62 121 366 414 -83 88 -370 -154 -189 -296 35 645 221 229 -55
4253 -55 -77 -131 -195 -155 -83 34 -14 333 204 62 117 -196 -118 -221 -280 10 126 314 244 215 -36 -47 -348 -287 -114
4278 -114 83 -59 153 86 248 70 -55 -165 -500 -203 130 -261 371 485 275 154 -165 -471 -439 -394 -61
4299 -61 51 236 123 391 266 45 -17 -117 -239 -326 12 107 27 314 37 23 -198 -135 -278 -253 -187 -61 61
4322 61 280 154 28 -117 -240 14 -247 97 10 306 175 12 136 -131 -25 -94 -182 -37 102 377 455 130
4344 130 230 110 -320 -238 -318 -433 38 106 59 -44 46 161 -107 -185 -55 4 -113 2 -5 219 95 -18 96
4367 96 -298 -155 -317 -164 396 73 395 106 114 -200 -1 -52 -77 -81 104 232 27 555 -30 -236 -420 -331 -339
$$ packed form
4209B24l24L84l54O0N5k01k20j01K96J18K46K02k96k65L4o1L0j27J02J46K34n8
4231A24J36j72P6n01K32J36l32K39J83K45M8m97J71m58K16l5j07L31O10m24Qk84
4253e5k2n4o4M0P2J17m8L47j29j42N5l13P8j03n9K90J16J88p0k9k51j1l01O1J73
4278a14J97j42K12o7J62j78j25j10l35K97L33l91O32J14k10j21l19l06L2M5L33
4299f1J12J85j13K68j25k21o2j00j22q7L38R5q0K87k77j4k21O3j43K5O6J26J22
4322F1K19j26j26j45j23K54k61L44q7K96j31j63J24k67J06o9q8J45J39K75P8l25
4344A30J00j20m30Q2q0j15M71O8m7j03R0J15k68p8J30N9j17J15pK24j24j13J14
4367I6l94J43j62J53N60l23L22k89Ql14J99n1k5mJ85J28k05N28n85k06j84Q9q
$$ plain form
4390 -339 -93 -55 233 239 221 127 -122 -6 -292 -165 -60 -128 22 63 139 121 -162 -84 -246 -98 12 -88 -26 275
4414 275 107 242 172 -147 -220 -107 -322 65 126 183 283 127 -74 -295 -312 -18 -137 -172 -4 284 111 93
4436 93 152 64 -307 -162 -10 -94 122 191 1 253 35 -99 -44 -206 -169 -387 -134 118 228 362 42 188
4458 188 -92 12 -354 -21 23 -11 346 -82 161 16 -88 -154 1 86 28 269 248 78 137 -70 -304 131
4480 131 128 240 36 -112 49 310 29 -183 -153 -220 -56 -23 -4 308 209 -3 146 -9 -189 -184 -94 -21 257 -1
4504 -1 263 282 -48 168 0 51 -52 -303 -5 222 225 193 278 27 -125 -145 -450 -215 -111 193 96 166 -15 115
4528 115 40 -154 -242 -89 -94 -240 59 238 277 -47 -108 -112 -470 -125 35 59 15 203 143 155 356 44 -317 -271
4552 -271 -272 -60 -33 143 369 121 -2 -353 -151 -468 -278 94 42 90 102 240 14 7 -264 -209 128 9 -103
$$ packed form
4390c39K46L8K88Oj8r4k49J16k86J27J05o8J50M1P6j8k83P8j62J48J10j00O2L01
4414B75j68J35p0l19p3J13k15L87O1N7J00j56k01k21j7K94j19l5J68K88j73j8
4436I3N9q8l71J45J52q4K16O9j90K52k18j34N5j62L7k18K53K52J10J34l20J46
4458A88k80J04l66L33M4l4L57m28K43j45j04o6J55Q5n8K41k1j70N9k07k34M35
4480A31lJ12k04j48J61K61k81k12L0o7J64L3J9L12r9k12J49j55j80NR0P3K78k58
4504aK64J9l30K16j68N1j03k51K98K27Ll2Q5k51j52k0l05K35J04L04r7P0j81J30
4528A15p5j94q8J53nj46K99J79L9l24o1ml58L45J60K4m4J88o0J2K01l12l61M6
4552b71jK12K7J76K26k48j23l51K02l17J90L72n2M8J2J38k26pk71N5L37j19j12
$$ plain form
4575 -103 326 57 170 -39 -112 -105 -34 -88 -7 65 352 386 109 171 135 -336 -208 -176 -64 -33 197 243 359 -11
4599 -11 -181 -228 -61 -14 -148 71 77 87 281 303 -249 -152 -255 -292 -116 -127 -15 78 253 -17 -192 50 -228 -92
4623 -92 -92 -49 81 451 296 166 150 73 -380 -163 -289 -64 214 126 9 276 387 -216 14 -406 17 -307
4645 -307 70 129 90 213 -168 -21 -210 -100 52 -1 182 170 354 218 6 -104 64 54 -212 -15 90 22
4667 22 6 74 284 -20 -128 -16 142 -218 22 66 3 217 188 421 93 -79 -69 -74 50 197 -23 293 6
4690 6 -2 -78 -130 -124 -248 57 10 328 105 197 -34 23 -186 -211 -178 -22 24 61 160 113 131 -142 29 -296 -268 -29
4716 -29 -117 325 108 313 214 112 47 -347 -205 -29 -248 122 321 179 -20 100 -33 -18 -116 6 57 -141
4738 -141 -43 369 99 -65 -111 155 -356 -216 -74 100 28 194 117 56 -22 -226 83 -17 -94 121 234 209 208
$$ packed form
4575a03M29k69J13k09p3PP1n4Q1P2K87L4k77O2l6m71J28L2J12L1K30M6J16l70
4599a1j70m7J67M7j34K19OJ0J94K2n52R7j03l7J76j1J12R3J75k70j75K42k78J36
4623i2%M3J30L70j55j30j6p7m53K17j26K25K78q8j17K67J11o03K30m20M23l24
4645c07L77N9l9J23l81J47j89J10J52n3J83j2J84j36k12j10J68j0k66J97J05o8
4667B2j6O8K10l04j08J12J58l60K40M4o3K14k9K33l28j72J0nJ24J47k20L16k87
4690Fqp6n2Oj24L05m7L18k23R2k31N7k09k5L3J56M6L7R9m7J8k73J71l25K8K39
4716b9q8M42k17K05r9j02o5l94J42J76k19L70J99j42j99J20j33J5r8J22N1j98
4738a41R8M12k70j64m6K66n11J40J42J74p2J66p7o1p8k04L09j00p7K15J13k5j
$$ plain form
4761 208 136 -90 -62 -144 -165 -77 105 53 199 107 138 -43 -235 -196 -294 -270 13 183 -211 68 -2 65 -96 -132 -275
4786 -275 -322 -47 378 346 -54 157 -224 -21 -339 -166 -21 28 186 310 178 94 -87 -21 -9 -257 -173 -222 182
4809 182 225 212 251 -209 15 -255 -28 -134 -79 348 -28 34 183 48 -205 -10 -54 142 -316 -71 96 67
4831 67 149 248 -82 -151 -69 -116 -190 46 108 32 376 136 16 -29 -136 -267 -190 201 205 239 235 251 40 -290 -73 -122
4857 -122 -64 -40 120 165 2 38 34 -129 -228 -199 -45 11 115 -22 66 75 -146 -22 -202 -47 13 -139 -118 73 -97
4882 -97 254 59 49 -177 55 -8 -171 3 62 146 56 -16 -207 -277 33 -508 -73 65 6 270 -131 -27 -61
4905 -61 -248 -51 -236 -240 -2 -74 -105 17 -184 10 -106 -159 -178 6 86 -167 413 108 223 86 143 -140 21
4928 21 -159 -6 -176 76 14 177 140 -205 -243 -119 -62 8 -3 134 296 80 275 213 -283 -212 -397 -55 200
$$ packed form
4761B08p2k26K8q2k1Q8J82n2J46r2L1j81j92L9r8K4K83J70l94K79p0O7j61l6j43
4786b75m7K75M25l2m00K11l81K03l18J73J45M9J58J24j32q4j81O6J2k48Q4m9M04
4809A82M3j3L9m60K24k70K27j06N5M27l76O2J49j35k53J95m4J96m58K45J67k9
4831F7Q2R9l30o9Q2m7p4K36O2p6L44k40j20m5j07j31P7L91ML4mJ6k11l30K17m9
4857a22N8K4J60M5j63L6mj63r9K9J54N6J04j37Q8Rk21J24j80J55O0j52K1J91j70
4882i7L51j95j0k26K32o3j63J74N9Q4r0p2j91p0L10n41M35J38n9K64m01J04l4
4905f1j87J97j85mK38p2l1J22k01J94j16n3j9J84Q0k53N80l05J15j37N7k83J61
4928B1j80J53j70K52o2J63l7l45l8J24N7P0j1J37J62k16J95o2m96P1j85L42K55
$$ plain form
4951 200 -142 -140 59 38 -240 12 -208 -389 -25 168 333 318 240 142 -123 -17 -93 -86 -218 -311 22 13 243 299
4975 299 -117 -180 -362 -207 -151 -297 68 172 421 170 86 -202 -375 -55 -68 -93 100 169 435 405 73 -60
4997 -60 -238 131 -121 -67 189 250 505 129 60 157 35 -124 -159 1 -9 205 25 111 -103 -1 -362 -27 -144
5020 -144 -92 127 226 132 131 -39 148 125 -376 -311 -184 -314 -51 103 -139 121 68 -82 -38 -242 -270 -57 203
5043 203 80 -96 10 -61 267 37 -90 -91 33 154 144 153 333 -85 -166 -45 -163 -274 -233 279 68 123 236
5066 236 -74 140 -137 -303 -330 -136 6 -9 186 160 -155 117 -70 87 99 -1 -56 149 244 188 88 -73
5088 -73 49 210 -248 12 -10 -157 399 354 39 -13 -300 -174 -215 -248 27 67 -197 96 16 -39 8 -241 -242 4
5112 4 -250 61 85 43 210 7 157 -407 -244 -47 73 -64 265 44 -1 76 -93 104 140 -159 -5 25 209
$$ packed form
4951B00l42KJ99k1k78K52k20j81L64J93J65j5p8r8k65J06p6Pj32r3L33rK30N6
4975B99m16o3j82J55N6j46L65J04K49k51q4k88j73L20j3k5J93O9K66l0l32j33
4997f0j78L69k52N4K56O1K55l76o9R7j22j59l5J60j0K14j80Q6k14J02l61L35j17
5020a44N2K19R9r4jj70J87k3n01O5J27j30K63J54k42K60n3j50M4k04k8K13K60
5043B03j23j76J06p1L28k30j27jJ24J21j0RJ80m18q1J21j18j11M1N12k11N5J13
5066B36l10K14k77j66k7J94J42j5J95k6l15K72j87J57J2j00n5K05R5n6j00j61
5088g3J22J61m58K60k2j47N56m5l15n2k87J26m1l3K75M0k64K93q0n5M7k49jK46
5112Dk54L11K4m2J67k03J50n64J63J97J20j37L29k21m5P7j69J97L6k99J54L0J84
$$ plain form
5135 209 221 247 140 -96 49 -38 -13 96 43 366 53 241 -4 67 -125 -267 -194 4 -115 141 35 -140
5157 -140 -71 -32 -330 -561 -267 127 -71 24 92 278 165 90 72 17 -53 -115 -70 -207 -32 -169 80 27 92 111
5181 111 191 -114 -111 -38 -36 323 108 12 133 -97 -64 -72 -27 -5 -5 -39 71 229 96 0 100 -255 -4 167 90 199
5207 199 82 -51 -199 53 96 -32 -151 160 94 263 133 -23 -18 -148 -136 -320 -34 31 156 14 -135 370
5229 370 41 -182 -112 -149 -109 -218 184 137 256 57 -48 80 -306 -225 -209 -93 66 140 220 126 9 186 48
5252 48 -175 -279 -251 -22 247 136 168 283 -80 -111 -4 -55 -272 -23 227 219 303 119 -39 -94 -92 -24 -86 52
5276 52 -58 62 52 -92 140 42 17 -358 -153 -202 -184 255 -37 16 -126 34 -214 11 -194 -80 -65 190 275
5299 275 216 -144 74 -198 -213 55 -89 -22 260 -8 2 131 181 81 -91 -147 75 -24 -174 58 -51 147
$$ packed form
5135B09J2K6j07k36J45q7K5J09n3L23l13J88k45P1j92j42P3J98j19K56j06j75
5157a40O9L9k98k31K94L94j98R5O8J86j13p5j8n5p0o2M5j37J75j37K49n3O5J9
5181A11Q0l05LP3KL59k15r6J21k30L3qM5K2%l4J10J58j33r6J00l55K51J71p7J09
5207A99j17j33j48K52M3j28j19L11o6J69j30j56Nj30J2j84K86O5J25j42j49N05
5229C70l29k23P0l7M0j09M02m7J19j99j05J28l86Q1J6J16J59P4Q0r4j17J77j38
5252D8k23j04K8K29K69j11L2J15l63l1J07n1k17K49K50qQ4j84j58n5KO8o2J38
5276E2j10J20j0j44K32r8k5l75K05m9J8M39k92N3j42J60k48K25k05J14J5K55Q5
5299B75n9l60K18k72j5K68j44O7K82k68J0J29N0j00j72n6K22r9j50K32j09J98
$$ plain form
5321 147 48 -303 7 -32 -174 39 -156 67 106 136 176 -33 51 -157 -64 -76 -1 -128 113 209 -11 -31 -122 53
5345 53 79 -56 -80 142 425 127 173 -72 -280 -271 -234 -14 32 127 257 -32 215 141 -46 -14 -78 -94 -25 -143 -138
5370 -138 -88 133 -98 129 -315 -201 47 -48 193 13 186 48 -14 -177 -140 -137 269 -30 -37 225 -72 -81 249
5393 249 -106 -67 -8 -119 -71 -101 143 390 -44 -150 60 -174 -100 -378 -39 409 98 -105 -25 65 64 -40 -138
5416 -138 -2 122 66 -27 112 121 -76 -44 7 -84 112 -245 128 275 -94 143 -112 279 -112 127 -48 -43 -42 182
5440 182 76 21 0 97 73 -59 142 22 23 254 143 98 139 -29 131 -113 -344 26 -168 -236 67 -109 107
5463 107 155 60 141 15 -218 -40 -175 -23 102 134 36 -124 -124 -190 52 -48 92 -187 70 46 36 -113 -243
5486 -243 -86 -13 40 -227 21 103 -326 -31 -169 27 37 -302 -66 -92 35 -73 165 131 156 -66 -120 -100 36
$$ packed form
5321A47r9l51L10l9j42K13j95K23L9L0M0k09Q4k08R3j2P5j27K41R6k20k0r1J75
5345E3K6j35k4K22K83k98M6k45k08RL7K20M6R5J30k89K47p4j87L2o4j6O9j18N
5370a38N0K21k31K27m44J14K48r5K41j80J73j38o2j63L7LM06k99pK62k97rL30
5393B49l55L9N9j11M8l0K44K47m34j06K10k34P4k78L39M48l11k03Q0R0jj04r8
5416a38J36J24n6r3J39Rj97L2N1r1J96l57L73J47l69K37k55L91l91K39j75NJK24
5440A82j06n5k1R7k4j32K01j20JK31j11m5M1j68J60k44k31L70j94o8L03j76K16
5463A07M8r5Q1j26k33J78j35J52J25L2r8j60%o6K42j00J40k79K57k4j0j49j30
5486b43J57P3N3k67K48Q2m29K95j38J96J0l39K36k6J27j08K38l4K5k22n4K0J36
$$ plain form
5509 36 -27 -11 60 -26 158 -185 -110 -86 338 -29 32 269 20 90 271 87 55 -7 -111 -16 -185 98 156 202 141
$$ packed form
5509C6o3J6P1q6J84l43P5K4M24l67O1K37k49P0J81j84l2o2j04R5j69K83N8M6o1
$$ [...]
8191A54
##END NTUPLES=NMR FID
##END=
