##TITLE=1H_DE-27sr2
 D2O
 8 sc, 
 13.2.2024
##JCAMPDX= 6.0         $$ Bruker NMR JCAMP-DX V2.0
##DATA TYPE= NMR FID
##DATA CLASS= NTUPLES
##ORIGIN= UXNMR, Bruker Analytische Messtechnik GmbH
##OWNER= root
$$ XWIN-NMR		Version 3.5
$$ Tue Feb 13 14:02:59 2024 Russian Standard Time (UT+4h)  she@DPX200
##.OBSERVE FREQUENCY= 200.1313
##.OBSERVE NUCLEUS= ^1H
##.DELAY= (6, 6)
##.ACQUISITION MODE= SIMULTANEOUS
##.ACQUISITION SCHEME= undefined
##.AVERAGES= 8
##.DIGITISER RES= 18
##SPECTROMETER/DATA SYSTEM= spect
##.PULSE SEQUENCE= zg30
##.SOLVENT NAME= D2O
##.SHIFT REFERENCE= (INTERNAL, D2O, 0, 15.7039)
##AUDIT TRAIL= $$ (NUMBER, WHEN, WHO, WHERE, WHAT)
$$ ##TITLE= Audit trail, XWIN-NMR		Version 3.5
$$ ##JCAMPDX= 5.01
$$ ##ORIGIN= Bruker BioSpin GmbH
$$ ##OWNER= she
$$ F:/spectra/data/she/nmr/H-F/1/audita.txt
$$ ##AUDIT TRAIL=  $$ (NUMBER, WHEN, WHO, WHERE, WHAT)
(   1,<2024-02-13 14:01:52.96 +0400>,<she>,<DPX200>,
      <created by zg, POWCHK disabled, PULCHK disabled
       configuration hash MD5:
       00 E9 B6 7A A2 85 ED C7 34 08 36 98 17 FE 4E 26
       data hash MD5: 16K
       A9 92 A0 E7 ED D5 BB F8 C5 9B 36 C6 A0 5E E5 37>)
$$ ##END=
$$ 
$$ hash MD5
$$ 12 55 F3 1B 23 6A FA 6C FD 35 0B 57 B8 A7 D9 0A
##$RELAX= 
##$RELAX= 
##$RELAX= 
##$RELAX= 
##$RELAX= 
##$RELAX= 
$$ Bruker specific parameters
$$ --------------------------
##$DU= <F:/spectra>
##$EXPNO= 1
##$NAME= <H-F>
##$PROCNO= 1
##$TYPE= <nmr>
##$USER= <she>
##$AMP= (0..31)
100 100 100 100 100 100 100 100 100 100 100 100 100 100 100 100 100 100 
100 100 100 100 100 100 100 100 100 100 100 100 100 100 
##$AQSEQ= 0
##$AQ_mod= 1
##$AUNM= <au_zg>
##$AUTOPOS= <>
##$BF1= 200.13
##$BF2= 200.13
##$BF3= 200.13
##$BF4= 200.13
##$BF5= 200.13
##$BF6= 200.13
##$BF7= 200.13
##$BF8= 200.13
##$BYTORDA= 1
##$CFDGTYP= 0
##$CFRGTYP= 5
##$CHEMSTR= <none>
##$CNST= (0..31)
1 1 145 1 1 1 1 1 1 1 1 1 1 1 1 1 1 1 1 1 1 1 1 1 1 1 1 1 1 1 1 1 
##$CPDPRG= <>
##$CPDPRG1= <>
##$CPDPRG2= <>
##$CPDPRG3= <>
##$CPDPRG4= <mlev>
##$CPDPRG5= <mlev>
##$CPDPRG6= <mlev>
##$CPDPRG7= <mlev>
##$CPDPRG8= <mlev>
##$CPDPRGB= <>
##$CPDPRGT= <>
##$D= (0..31)
0 1.2 0 0 0 0 0 0 0 0.06 0 0.03 0 0 0 0 0.0002 0 0 0 0 0 0 0 0 0 0 0 0 
0 0 0 
##$DATE= 1707818512
##$DBL= (0..7)
120 120 120 120 120 120 120 120 
##$DBP= (0..7)
150 150 150 150 150 150 150 150 
##$DBP07= 0
##$DBPNAM0= <>
##$DBPNAM1= <>
##$DBPNAM2= <>
##$DBPNAM3= <>
##$DBPNAM4= <>
##$DBPNAM5= <>
##$DBPNAM6= <>
##$DBPNAM7= <>
##$DBPOAL= (0..7)
0.5 0.5 0.5 0.5 0.5 0.5 0.5 0.5 
##$DBPOFFS= (0..7)
0 0 0 0 0 0 0 0 
##$DE= 6
##$DECBNUC= <off>
##$DECIM= 32
##$DECNUC= <off>
##$DECSTAT= 4
##$DIGMOD= 1
##$DIGTYP= 9
##$DL= (0..7)
0 120 120 120 120 120 120 120 
##$DP= (0..7)
150 150 150 150 150 150 150 150 
##$DP07= 0
##$DPNAME0= <>
##$DPNAME1= <>
##$DPNAME2= <>
##$DPNAME3= <>
##$DPNAME4= <>
##$DPNAME5= <>
##$DPNAME6= <>
##$DPNAME7= <>
##$DPOAL= (0..7)
0.5 0.5 0.5 0.5 0.5 0.5 0.5 0.5 
##$DPOFFS= (0..7)
0 0 0 0 0 0 0 0 
##$DQDMODE= 0
##$DR= 18
##$DS= 0
##$DSLIST= <SSSSSSSSSSSSSSS>
##$DSPFIRM= 0
$$ [...]
##$SUBNAM2= <"">
##$SUBNAM3= <"">
##$SUBNAM4= <"">
##$SUBNAM5= <"">
##$SUBNAM6= <"">
##$SUBNAM7= <"">
##$SUBNAM8= <"">
##$SUBNAM9= <"">
##$SW= 18.0517328524113
##$SWIBOX= (0..15)
0 0 2 0 0 0 0 0 0 0 0 0 0 0 0 0 
##$SW_h= 3612.71676300578
##$TD= 16384
##$TD0= 1
##$TE= 0
##$TE2= 300
##$TE3= 300
##$TEG= 300
##$TL= (0..7)
0 120 120 120 120 120 120 120 
##$TP= (0..7)
150 150 150 150 150 150 150 150 
##$TP07= 0
##$TPNAME0= <>
##$TPNAME1= <>
##$TPNAME2= <>
##$TPNAME3= <>
##$TPNAME4= <>
##$TPNAME5= <>
##$TPNAME6= <>
##$TPNAME7= <>
##$TPOAL= (0..7)
0.5 0.5 0.5 0.5 0.5 0.5 0.5 0.5 
##$TPOFFS= (0..7)
0 0 0 0 0 0 0 0 
##$TUNHIN= 0
##$TUNHOUT= 0
##$TUNXOUT= 0
##$USERA1= <user>
##$USERA2= <user>
##$USERA3= <user>
##$USERA4= <user>
##$USERA5= <user>
##$V9= 5
##$VALIST= <valist>
##$VCLIST= <CCCCCCCCCCCCCCC>
##$VD= 0
##$VDLIST= <DDDDDDDDDDDDDDD>
##$VPLIST= <PPPPPPPPPPPPPPP>
##$VTLIST= <TTTTTTTTTTTTTTT>
##$WBST= 1024
##$WBSW= 4
##$XGAIN= (0..3)
0 0 0 0 
##$XL= 0
##$YL= 0
##$YMAX_a= 81400
##$YMIN_a= -85092
##$ZGOPTNS= <>
##$ZL1= 120
##$ZL2= 120
##$ZL3= 120
##$ZL4= 120
##$ABSF1= 10
##$ABSF2= 0
##$ABSG= 5
##$ABSL= 3
##$ALPHA= 0
##$AQORDER= 0
##$ASSFAC= 0
##$ASSFACI= 0
##$ASSFACX= 0
##$ASSWID= 0
##$AUNMP= <proc_1d>
##$AZFE= 0.1
##$AZFW= 0.1
##$BCFW= 1
##$BC_mod= 2
##$BYTORDP= 1
##$COROFFS= 0
##$CY= 11.3945322036743
##$DATMOD= 1
##$DC= 2
##$DFILT= <>
##$DTYPP= 0
##$F1P= 15.7292609196834
##$F2P= 12.9074282941183
##$FCOR= 0.5
##$FTSIZE= 0
##$FT_mod= 4
##$GAMMA= 1
##$GB= 0.15
##$INTBC= 1
##$INTSCL= 1
##$ISEN= 128
##$LB= 0.24
##$LEV0= 0
##$LPBIN= 0
##$MAXI= 10000
##$MC2= 0
##$MEAN= 0
##$ME_mod= 0
##$MI= 1.114404
##$NCOEF= 0
##$NC_proc= 0
##$NLEV= 6
##$NOISF1= 3.799351
##$NOISF2= 2.8
##$NSP= 1
##$NTH_PI= 0
##$NZP= 0
##$OFFSET= 15.70392
##$PC= 1
##$PHC0= -24957.42
##$PHC1= 20.8527
##$PH_mod= 1
##$PKNL= yes
##$PPARMOD= 0
##$PSCAL= 0
##$PSIGN= 0
##$REVERSE= no
##$SF= 200.130013532006
##$SI= 16384
##$SIGF1= 3
##$SIGF2= 2
##$SINO= 400
##$SIOLD= 16384
##$SREGLST= <1H.CDCl3>
##$SSB= 0
##$STSI= 0
##$STSR= 0
##$SW_p= 3612.71676300578
##$SYMM= 0
##$S_DEV= 0
##$TDeff= 0
##$TDoff= 0
##$TI= <>
##$TILT= no
##$TM1= 0
##$TM2= 0
##$TOPLEV= 0
##$USERP1= <user>
##$USERP2= <user>
##$USERP3= <user>
##$USERP4= <user>
##$USERP5= <user>
##$WDW= 1
##$XDIM= 8192
##$YMAX_p= 0
##$YMIN_p= 0
$$ End of Bruker specific parameters
$$ ---------------------------------
##NTUPLES= NMR FID
##VAR_NAME=  TIME,          FID/REAL,        FID/IMAG
##SYMBOL=    X,             R,               I
##VAR_TYPE=  INDEPENDENT,   DEPENDENT,       DEPENDENT
##VAR_FORM=  AFFN,          ASDF,            ASDF
##VAR_DIM=   8192,          8192,            8192
##UNITS=     SECONDS,       ARBITRARY UNITS, ARBITRARY UNITS
##FACTOR=    0.0002768,     1,               1
##FIRST=     0,             0,               0
##LAST=      2.2672688,     0,               0
##MIN=       0,             -85092,          0
##MAX=       2.2672688,     81400,           0
$$ Real data points
##PAGE= N=1
##DATA TABLE= (X++(R..R)), XYDATA
$$ [...]
2123G91j322j226r43O78J282R64J159Q64k11r30j271j277r45L51J041R97J555
$$ 791 -531 -1757 -2700 -2022 -740 224 1383 2247 2036 1106 -165 -1442 -2387 -2036 -995 2 1557
2140A557O51q6q20j207j574j222L66J004Q55J527J156J35j070j121r59j071m71
$$ 1557 2208 2122 1302 95 -1479 -2701 -2335 -1331 -476 1051 2207 2342 1272 151 -808 -1879 -2350
2157b350P11J002J858N56L29o10j199j348j272K4Q71Q43J325J094O42p21j089
$$ -2350 -1639 -637 1221 1777 2106 1496 297 -1051 -2323 -2299 -1428 -585 740 1834 2476 1755 666
2174F66j137j443m05O12J161J274J245L12k77j100j479j394l64K91J017J289J470
$$ 666 -471 -1914 -2319 -1707 -546 728 1973 2285 2008 908 -571 -1965 -2329 -2038 -1021 268 1738
2191A738N06k09j029j028j743m14M23Q39J018J163Q91j57p93j384j024r24j95
$$ 1738 2244 2035 1006 -22 -1765 -2179 -1756 -917 101 1264 2155 1998 1205 -179 -1203 -2127 -2322
2208b322P62J035J708Q45M04j128r73j507q49j38Q92R68J442Q64L84p22j265j029
$$ -2322 -1560 -525 1183 2028 2432 1304 331 -1176 -2025 -2163 -1271 -303 1139 2003 2387 1665 400 -629
2226f29j350k75L41R55J648J115N15k86j244j582j077j98K76R77J214J613L64
$$ -629 -1979 -2254 -1913 -958 690 1805 2320 2034 790 -792 -1869 -2067 -1791 -814 400 2013 2377
2243B377n93q39j118j428q76N51P54J462Q73R21k50n01j360j364m27j89O40J685
$$ 2377 1784 945 -173 -1601 -2477 -1926 -1172 290 1163 2084 1834 1333 -27 -1391 -1818 -2007 -1367 318
2261C18J351O27l04o78j344j211j089K34O18J237J243Q98M24r45j078j234p21
$$ 318 1669 2296 1992 1314 -30 -1241 -2330 -2096 -1478 -241 1002 1900 2324 1379 301 -933 -1654
2278a654m41N49J164J382R24K38n63r11j546j123j40L46R84J391J232L57m20j111
$$ -1654 -2095 -1546 -382 1000 1924 2162 1599 688 -858 -1981 -2121 -1775 -791 600 1832 2189 1769 658
2296F58q84j359o41L27J280J071Q05N77o4q11j513j070k35o6P50J084J497K74
$$ 658 -226 -1585 -2226 -1899 -619 452 1257 1834 1770 959 -554 -1624 -1859 -1925 -1175 -91 1406 1680
2314A680R5q67o35j264j023K13P90J156J042N56J47p51r90j271n70k10M73J146
$$ 1680 1775 908 273 -991 -2014 -1801 -1011 145 1187 1743 1890 1139 149 -1122 -1692 -1902 -1429 -283
2332b83J274Q97P1n54q90j180r48k65M48J055Q74J168K84o29r63j127r36r2J11
$$ -283 991 1888 1959 1405 515 -665 -1613 -1878 -1430 -375 499 1667 1951 1322 359 -768 -1704 -1796 -1685
2351a685J037J268R06L21P7r56j114j248k58J26P08J237R08M85k95q20q70j009
$$ -1685 -648 620 1526 1847 1924 968 -146 -1394 -1652 -1526 -818 419 1327 1812 1517 697 -173 -1182
2369a182r86K52R29P63J202O73L37n73j428q62p01J01M70Q84J059P94p5l89r96
$$ -1182 -2168 -1916 -987 -224 978 1651 1988 1415 -13 -875 -1576 -1475 -1005 -121 938 1732 1657 1268 272
2388B72j298o87k00Q66P50R23R23K32n90r97q93p63L2J76J094P97Q37J38k14r02
$$ 272 -1026 -1713 -1913 -1047 -297 626 1549 1781 1191 194 -699 -1462 -1430 -1254 -160 637 1474 1612 1398 496
2408D96j331q67j55M71O11R20J258M56m00r72m68j054o94K62P95J055P25N69r4
$$ 496 -835 -1702 -1857 -1386 -775 145 1403 1859 1459 487 19 -1035 -1729 -1467 -672 383 1108 1677 1583
2427A583r99q30q90l31m33J079R60P14N53J83o92o62j109p99K11O68Q86O80R16
$$ 1583 584 -246 -1136 -1467 -1900 -821 139 853 1406 1589 897 235 -874 -1673 -1462 -794 92 772 1688
2446A688O6n38j417o95l96l63M63J044R54P34k13l22o17j030q37M0O02M06Q15
$$ 1688 1754 1216 -201 -896 -1292 -1655 -1192 -148 806 1540 1327 1005 388 -642 -1479 -1439 -837 -431 384
2465C84J069Ll48o38j111p43n25O99Q53P88R25J08L2r17q34j129j64L28P09Q06
$$ 384 1453 1456 1108 470 -641 -1384 -1909 -1210 -357 431 1356 1464 1496 579 -255 -1384 -1548 -1220 -511 295
2485B95R90K9J50q05r64q71n20K8R59Q46R49L38J27n18j270p32n49K55K34J034
$$ 295 1285 1314 1464 659 -305 -1176 -1696 -1668 -709 137 1086 1424 1551 1033 -237 -969 -1518 -1263 -1029 5
2505EQ26M85O2q19n19j032o85L74K05R92P93N42N11m03j203n39r80j91J13R57
$$ 5 831 1316 1378 559 40 -992 -1677 -1303 -1098 -106 687 1229 1740 1337 134 -405 -1385 -1576 -1463 -506
2525e06J138Q79J30o99n03r61q32l43N16P01Q59R07M30l60o23j055p68n82L40
$$ -506 632 1511 1641 942 439 -522 -1354 -1697 -1181 -480 379 1286 1716 1356 733 -322 -1090 -1672 -1332
2544a332R39R74N96L32k3o27j154r79q8r2N76J008R50N16k76n45p57r31m59R0
$$ -1332 -393 581 1177 1509 1486 859 -295 -1274 -1362 -1454 -878 130 1080 1596 1320 775 18 -913 -1372 -1282
2564a282M50Q81O81O74j03m21j083o55p22j0P05Q45O83O64J67m19p03q71p20m31
$$ -1282 -832 49 730 1404 1301 880 -203 -858 -1580 -1590 -885 -40 643 1307 1474 1055 352 -519 -1239 -1670
2584a670P23M84J068N77N24p48q63n23q79l05J72Q43J099O41N57k53r26p43p82
$$ -1670 -947 -463 605 1182 1706 958 95 -428 -1307 -1612 -1440 -597 502 1143 1700 1447 521 -222 -1004
2603a004n31L54O29P21O78M76j25q82m65p74n85n7Q86Q88R21J15K75o04p77r62
$$ -1004 -1535 -1181 -552 169 847 1323 1198 316 -149 -923 -1508 -1565 -679 209 1130 1245 1520 916 139 -823
2623h23l36k97J84R98Q79Q89j81o39m68r94o51n3M68J008N74N70O68q21o40j150
$$ -823 -1159 -1456 -1272 -274 605 1494 1313 674 206 -788 -1439 -1492 -1024 -16 558 1128 1796 975 335 -815
2643h15l37m45M46O00Q92N90M19k05p06q50n99n09P14L33O87J232J47m18o46p28
$$ -815 -1152 -1597 -1151 -551 341 931 1350 1145 439 -411 -1010 -1519 -805 -472 215 1447 1594 1176 530 -198
2663a98o41m93L2O04O88R86K58O4m80r53p02n89k3N65J080M60P75k39m18o34q02
$$ -198 -839 -1332 -1300 -696 -8 978 1236 1300 820 -133 -835 -1424 -1447 -882 198 658 1433 1194 776 142 -660
2684f60o51J30M13N32P49N52M46n73p18p94n79P8L10L87J061O05k8l27n03o11
$$ -660 -1311 -1181 -768 -236 513 1065 1511 938 220 -574 -1153 -1075 -765 -378 683 1288 1260 933 430 -181
2704a81q95n4M6N47O98O83N06n05m96p25k99n87J4Q83K98R52L71j06l88q84j006
$$ -181 -1076 -1130 -1084 -537 161 844 1350 845 349 -376 -675 -1262 -1248 -365 -67 885 1256 1150 762 -122 -1128
2725a128K44k89O15N39Q31L83j93k71j047l98m85J24M87P01N64K32K16m02q33
$$ -1128 -884 -1173 -558 -19 812 1195 1002 731 -316 -714 -1199 -1075 -588 113 677 909 1125 723 -110
2744a10p41K9k49j2P34J007K92R1j57p10o61n53l94Q32L77P26M09L26k48m89r46
$$ -110 -851 -822 -1071 -1083 -349 658 950 1041 884 174 -487 -1040 -1434 -602 -225 501 910 1236 988 499 -447
2765d47m32l3rO20N12P63Q8j89p22m05o71l26L98N66O87M01M97p5r40k39p32l96
$$ -447 -879 -912 -921 -301 211 974 1062 873 151 -254 -925 -1251 -853 -287 400 801 1298 1223 283 44 -688 -1084
2787a084k67N49R75N30K48j17k44r45l86k06OL95N44O50M14j91k57p99n10m74
$$ -1084 -1351 -802 173 703 951 834 590 -355 -741 -947 -941 -546 -2 648 1062 871 614 -185 -695 -1169
2807a169R3L89N15O61K83L65l70p32o70k26j56L71N71N61N48J91k62q50p18o24
$$ -1169 -1076 -687 -172 489 772 1137 767 35 -635 -861 -1017 -646 -75 486 1034 1225 963 113 -605 -1229
2827a229k34O38M95Q03J94L35M0r26m78l82l44J01N20P39N46J14M8l86r09m03
$$ -1229 -1463 -825 -330 473 667 1002 1042 116 -362 -744 -1088 -987 -467 272 818 932 980 594 -315 -718
2847g18m49L51M00M18O00M25k29m08m46p39j49j33N28N96P57L06K01n79r74k43
$$ -718 -1167 -816 -416 2 602 1027 798 390 -56 -795 -944 -1077 -549 47 804 1110 1311 732 -242 -485
2867d85o30K20J39P45M88O47o1m82m19p50m95J13M39K73N90Q05p8k24n14q21n05
$$ -485 -1115 -895 -756 -11 477 1124 1063 581 162 -588 -1083 -970 -531 -258 332 1137 1059 835 321 -500 -1005
2888a005k32M39O16O58O82q8k94m93o89o66K1J76M40P28P59J2k35j88p66n50m97
$$ -1005 -1237 -798 -182 476 1158 1070 776 283 -406 -1072 -1051 -875 -435 293 1052 1064 829 641 -125 -675 -1172
2909a172L11K00O87N98N71j43k63j021m84m08J04M57N96R07K00l03k82n85n80
$$ -1172 -861 -661 26 624 1195 1052 789 -232 -716 -1124 -1020 -563 33 940 1140 837 555 -30 -610
2928f10l14l12M33R13L77N25P0m87o28m50l11l02L36N47N11L96L73j70n63p34
$$ -610 -924 -1236 -803 110 487 1012 1082 595 -33 -483 -794 -1096 -760 -213 298 694 1067 897 334 -400
2948d00p73rK82P49L66N28L21j85o18n62l30l58OP39M57N29L19j69m19o00p18
$$ -400 -1173 -1182 -900 -151 215 743 1064 879 261 -301 -631 -989 -983 -244 213 742 1061 892 473 -127 -845
2969h45m51L37K67P89P04K36j39n83m03n56l12J74K79M84O17L05K26l41q36o00
$$ -845 -1296 -959 -692 97 801 1037 898 315 -88 -644 -956 -782 -503 -19 598 903 1129 788 -48 -648
2989f48l55j71N64N34N25M55j32j15m38n71n52J28j14Q00M86L80J94k12m72m67
$$ -648 -1003 -1174 -610 -76 449 904 772 657 219 -352 -904 -776 -890 -90 396 776 970 758 286 -181
3009a81o50k42M24K3Q63N40K31k65k21p23k68l76J41L85O57M25M21k07o85m30
$$ -181 -831 -1073 -649 -626 237 777 1008 743 522 -201 -469 -845 -704 -319 338 763 1184 977 292 -138
3029a38m49m35K72K90N59L37J86J64j59n28p12l85K12L80N13M79L01n6l26p91
$$ -138 -587 -1022 -750 -460 99 436 622 786 627 99 -613 -998 -786 -406 107 586 887 831 505 -286
3049b86j07m48j26L40N61N05M8L79m44k47m05n40j80L92L22N87L92M4l7o67k91
$$ -286 -393 -841 -967 -627 -66 439 487 866 422 175 -230 -770 -950 -558 -236 351 743 787 750 83 -208
3070b08n31K6J84K64N37K85L22l40l78k71m68m73L75J86N81M94J86j18k71o95
$$ -208 -739 -713 -529 -265 272 557 879 539 161 -110 -578 -1051 -676 -490 91 585 771 653 382 -313
3090c13l97k92K50M98K7P74K73j91m31j63m88m42M1M08M96N65R1K60n85l96m22
$$ -313 -710 -1002 -752 -254 -227 547 820 629 198 35 -453 -895 -854 -446 50 615 706 966 381 -15 -437
3111d37j19m3P5K74P22K06j78k6k99n69k94J73R5M99K15N88j92K41r50k60k09
$$ -437 -556 -599 -524 -250 472 678 500 474 175 -394 -688 -515 -420 79 294 882 690 931 -19 -279 -488
3132d88n54K95M23O50J12L56m4n37k53n08j40L35q5N00M77M39m63k28m62n44q4
$$ -488 -1042 -747 -324 326 438 794 750 213 -40 -548 -688 -353 -438 62 539 978 515 287 -175 -719 -803
3153h03O3L83N62J39L49m8k64m11o99PNM45p0P98J56K03m47n2m62n55q0M17L09
$$ -803 -740 -357 205 344 693 645 381 -30 -729 -722 -717 -272 -342 456 612 815 368 316 -146 -701 -781 -364 -55
3176e5O45j2L22k41o39n42k79O4R6Q69J18J72L10j16m42k57n47l05N5N71M83N20
$$ -55 590 578 900 659 20 -522 -801 -737 -641 228 346 518 828 712 270 13 -534 -839 -784 -213 270 790
3198G90K06l88l53m08m19q4J0L27O73K32J2k14j07n94k04j84O5J10M48P58J34
$$ 790 996 608 255 -153 -572 -656 -646 -319 354 586 598 384 277 -317 -521 -705 -640 -530 -82 676 810
3219H10k18m13l33j12n05J48L24L29L38L44J5M3p28j75m19k81L79M42K51N74k27
$$ 810 592 179 -154 -266 -771 -623 -299 30 368 712 727 770 42 -133 -552 -833 -454 -12 239 813 586
3240E86j38l84k44l48l65L18L83K43O02K39l86k35n42l67j77M1N33N05J85K63
$$ 586 448 64 -180 -528 -893 -575 -192 51 653 892 506 271 -271 -638 -815 -774 -241 264 449 712
3260G12o4l54o40j61l16K02J54O29K90L72j05l69n16l58o1j76K56N79M32J98j30
$$ 712 648 294 -346 -507 -823 -621 -467 162 452 824 719 350 -166 -524 -585 -761 -505 74 506 704 574
3281E74l44l76j73l26J00K72M42J18M54l6m00j75o93p9r0K46L66K86M69K41l57
$$ 574 230 -146 -319 -645 -545 -273 169 287 741 705 305 130 -563 -642 -732 -486 -120 166 635 876 519
3302E19l38m85Kl48L37K6L56O30P2k25m51l05n88O0K75K30L67N86o2j44j86o93
$$ 519 181 -304 -302 -650 -313 -287 69 699 771 546 95 -210 -798 -738 -463 -233 134 720 658 514 328 -365
3324c65j05j54M22jN56K48R0R7m39n80k78J21l44M28K74L91L48k44k20k39l87
$$ -365 -470 -624 -202 -203 353 601 691 788 349 -231 -509 -388 -732 -304 -30 361 709 465 245 6 -381
3345c81j86j18J54M42N11R1J58k40k29o22k54K20n3L57M27M28Q0l15m1n09m89
$$ -381 -567 -685 -531 -89 422 513 671 431 202 -420 -674 -454 -507 -150 277 705 785 470 429 -80 -569
3366e69l06N14L20L32K32J66l29m57k33j47J2J8M99J25J86OJ80k85o9n07j60q8
$$ -569 -875 -361 -41 291 523 689 360 -97 -330 -477 -465 -447 52 177 363 369 549 264 195 -312 -472 -560
3388e60O18J94J3L64j03k24n96l25j63J93J04N83K17J02K23j92k49l18m60J77
$$ -560 58 252 265 629 526 302 -294 -619 -782 -589 -485 98 315 417 640 448 199 -119 -579 -402
3408d02Q6K02K70N70j97m03j33k46k54K6L7M53K93P0J98j47l38o31l1J24Q5L21
$$ -402 -316 -114 156 726 529 126 -7 -253 -507 -481 -444 9 302 372 570 423 85 -546 -577 -453 -368 -47
3430d7J58M85ql92J69n08l84l7J39L52K48L38j2j10o2k68m60l3j68M49L09L89
$$ -47 111 596 588 196 365 -143 -527 -564 -425 -73 175 513 501 391 329 61 -399 -432 -600 -151 158 547
3452E47Jl5n58P0n35N5j41L28L93L29k8Q7k58l19j32J3m39K12L39L20O9k24L85
$$ 547 548 513 -45 25 -510 -455 -596 -268 125 454 426 513 255 -64 -196 -183 -622 -410 -71 249 318 94 479
3475D79m54k96l07P8J36J82L09M15k7j01m67j35l51l7J27L68K85L02M2j96j72
$$ 479 25 -271 -578 -500 -364 -182 127 542 515 414 -53 -188 -539 -576 -449 -81 204 506 548 352 180
3496A80m04k93Q0q0K05N52J32J64%k73l61j17m45R2M06L44O8L74j89o7n04l12
$$ 180 -224 -517 -437 -517 -312 240 372 536 536 263 -98 -215 -660 -568 -162 182 250 624 435 368 -136 -448
3518d48j82J47K10K14N62n9R4j53n93k35j52M3L77R2M91J58N6m44K6o21j35M8
$$ -448 -630 -483 -273 -59 503 444 538 385 -208 -443 -595 -552 -175 -83 408 566 622 178 204 -417 -552 -504
3540e04L9N81K24K85j76O8l55n37n4j8j06N66J35J77J89j63j99m55k13j10K74
$$ -504 -465 116 340 625 449 517 162 -375 -429 -447 -553 13 148 325 514 351 152 -303 -516 -626 -352
3561c52J56L21L46j7l5l68k90k5l6k5J96K53O1J27J55j60n55q2j92J17R7L43l2
$$ -352 -196 125 471 454 419 51 -239 -264 -300 -325 -129 124 185 312 467 307 -248 -330 -522 -405 -308 35 3
3584CM75O7l24j01m25m06J32L47L19J01J42k9J70l76k31k70r7JK71K95M81o9r4
$$ 3 478 545 221 120 -305 -711 -579 -232 87 188 330 301 471 95 -136 -406 -503 -502 -231 64 545 476 382
3607C82J1n46k22j51K13L27L45j15K27M9m54Mm06j46M2J07P40j19L05p9m56l29
$$ 382 393 -153 -375 -526 -313 14 359 244 471 520 66 70 -336 -482 -440 -333 407 288 593 514 58 -271
3629b71j10P6J61j75L77K66K84l57j20l42l30l3Q9J72K85M64J30L4k08m34p4l41
$$ -271 -381 -305 -144 -319 58 324 608 251 131 -211 -541 -574 -485 -313 -28 436 566 600 392 -42 -116 -457
3651d57J0QK44K64M24K2l91l17j82q8j3O3K18M04M32k01K1m02m14l0R0k04K00
$$ -457 -447 -439 -195 69 493 515 124 -193 -375 -463 -476 -413 -195 209 641 440 461 59 -355 -385 -295 -499 -299
3674b99M96L5K50o6q0m31l42j24K41J20L66J62K03j52k47k03k2k73m9M1L95K73
$$ -299 197 232 482 416 336 -95 -437 -561 -320 -200 166 328 531 379 132 -71 -93 -366 -415 -374 21 294
3696B94L02m26R9j69j98j07q1o7L41J81R1K04l60P1l13j99r9l09O72L71J77O5
$$ 294 596 170 269 100 -98 -205 -286 -353 -12 169 260 464 104 175 -138 -337 -436 -745 -73 298 475 540
3718E40l26Jl82l03J25mL47L16R1j19q3R9m25l92q4K90J80J76L86J79l43J5n36
$$ 540 214 215 -167 -470 -345 -349 -2 314 405 286 203 302 -123 -515 -599 -309 -129 47 433 612 269 284 -252
3741b52j48j18J35K37L47L87q1o6k99k31n45J09L77k2K22J96J35j95p0j63o6l98
$$ -252 -400 -518 -383 -146 201 588 507 441 142 -89 -634 -525 -148 -170 52 248 383 188 118 -45 -111 -509
3763e09m1L54L17K39R0j77oq4m47j33qM29K9K62o2K10k52j04m7m58rL30K01q8
$$ -509 -550 -196 121 360 450 273 267 183 -264 -397 -405 24 53 315 253 463 211 107 60 -398 -407 -77 124 36
3787C6L00m1J92o09o0J1k02m5L31J93K31K6j07j78l75L9j78J83N2J64M57M4K1
$$ 36 336 295 487 -122 -182 -171 -373 -418 -87 106 337 363 256 78 -297 -258 -436 -253 -201 -37 420 464 485
3810D85l92l64k8k20l7K93L98J18L04j49m92j35j11J5J22N2K45K77J0K90m70k0
$$ 485 93 -271 -299 -519 -556 -263 135 253 557 408 -84 -219 -330 -315 -193 -141 104 381 391 681 211 191
3832A91l55j8l32K62L81K57l2j65K1q3k11k79q7L25k4L28K84j06j64k18qm08O0
$$ 191 -164 -182 -514 -252 129 386 354 189 210 127 -84 -363 -450 -125 -149 179 463 357 193 -25 -33 -441 -381
3855c81jK76N04r0p8J22l15k47Q7k17k08N12j1K84O4K21m48n3k87k65K61M8K67
$$ -381 -382 -106 398 308 230 352 37 -210 -123 -340 -548 -36 -47 237 301 522 74 21 -266 -531 -270 -222 45
3878D5L97K8j13k34k93N8k28J2J95N52p3k8K6j82l24j46q6j81J57M82L04L05l34
$$ 45 442 470 357 123 -170 -112 -340 -328 -133 419 346 318 344 162 -162 -308 -394 -575 -418 64 368 673 339
3901C39K4k37k16k5k92K46K07qM18j15m7k31k76k41J22n8M93p4K15o8J61j80j94
$$ 339 363 126 -90 -115 -407 -161 46 38 456 341 294 63 -213 -454 -332 -390 103 29 244 176 337 157 -37
3924c7k78J57k70L01J51J5K93J37k35l93k88J64o0K9L70J17j5N5J49m89j94L2
$$ -37 -315 -158 -428 -127 24 39 332 469 234 -159 -447 -283 -343 -314 56 173 158 213 362 -127 -321 -289
3946b89M8j75K29N04J55m3Qj36m20j35k30K29L49n9M65j32k29j22j37l17P7K9
$$ -289 -241 -416 -187 317 472 429 437 301 -119 -254 -484 -255 94 35 500 368 139 17 -120 -437 -360 -331
3968c31K24L10Q3Q8M7m52j71r0O5n0J41J22M10P7l42J27j09k83K4k97M59P4L30
$$ -331 -107 203 286 374 421 -31 -202 -292 -227 -277 -136 -14 396 473 131 258 149 -134 -110 -407 52 126 456
3991D56ll90J92k30l37m5J90Q7jO15l9j41j72k00j66k35L51j30J96K58R8k29J22
$$ 456 453 63 255 25 -312 -357 -167 -80 -81 534 495 354 182 -18 -184 -419 -68 -198 -2 256 354 125 247
4014B47J17n17j88N5m7L21P4J93kPk3l87m36L14o6K55R9L24j15j2J7n78M3j17
$$ 247 364 -153 -341 -286 -333 -12 62 255 253 260 237 -150 -586 -272 -338 -83 16 340 225 213 230 -348 -305 -422
4038d22pK53K62J72j9J15k37l09k8j18K66j55M92Q0Q5l1k98k43J27l75j70K11
$$ -422 -429 -176 86 258 239 354 117 -192 -220 -338 -72 -227 265 345 430 399 101 -142 -15 -390 -560 -349
4060c49M79J78j96J54j36j29j69q8j94Q6L12K41j9K06k63o1l50j37K05J9Q1K39
$$ -349 130 308 112 266 130 1 -168 -256 -450 -364 -52 189 170 376 113 52 -298 -435 -230 -211 -130 109
4082A09K77q1p2j67j03k20k15J01K02L16MK06r9J16l81j18l34J4L26J16L77j93
$$ 109 386 305 233 66 -37 -257 -472 -371 -169 147 151 357 258 374 -7 -125 -459 -445 -119 -3 374 181
4104A81kQ4k03j66j49M8nK39J88J83j58l20N5l17J4K06Qn1M17J92j01k06k39J3
$$ 181 179 263 60 -106 -255 -207 -212 27 215 398 240 -80 -25 -342 -328 -122 -114 -165 252 444 343 137 -102 -89
4128h9j87J44J19l5K86P6j14j1Q3m05r8K15l26J73M36l5Mq2j70l48J55k76K30
$$ -89 -276 -132 -13 -48 238 314 200 189 272 -133 -231 -16 -342 -169 267 232 236 154 -16 -364 -209 -485 -255
4151b55M08j92K52J6lk2l29k54PK04J21J56j8M42m66j18O0l22J26k25K94M7M30
$$ -255 153 -39 213 229 226 204 -125 -379 -372 -168 -47 109 91 533 67 -51 9 -313 -187 -412 -118 -71 359
4174C59L7k34P0l45k4k16J37j05J11J52J62L70m5l28k71JL6k55M23K8J29K54l55
$$ 359 396 162 232 -113 -137 -353 -216 -321 -210 -58 104 474 429 101 -170 -169 -133 -388 35 63 192 446 91
4197I1j36j22k6m0rL69j22L40%k70r5j78k23K73o5J5K84J05N8M8k77P6k29k15
$$ 91 -45 -167 -193 -233 -242 127 5 345 345 75 -20 -198 -421 -148 -213 -198 86 191 249 297 20 96 -133 -348
4221c48K2L18N9J59J65M3j49l78J10j21l10J88J67J77J15kj46j76P5j23OK33j81
$$ -348 -326 -8 51 210 375 418 269 -109 1 -120 -430 -242 -75 102 217 215 69 -107 -32 -155 -149 84 -97
4244i7M08K21m59K90k33k78l10K31K18M7J30j90K94M8l52p5k19K62k25L28k0J20
$$ -97 311 532 73 363 130 -148 -458 -227 -9 38 168 -22 272 320 -32 -107 -326 -64 -289 39 19 139
4266A39J80q9k10j27j37p4K81q0J8K76K36j82p5l27k15J42J02J93kJ36J02Q4l09
$$ 139 319 230 20 -107 -244 -318 -37 -117 -99 177 413 231 156 -171 -386 -244 -142 51 49 185 287 371 62
4289F2l3l93l7L9L19KK16P2m9on2m69M3J91l4N7L47O2n5l08Ok22K4R4k8L59j05
$$ 62 29 -364 -401 -362 -43 -41 175 247 198 192 140 -329 -286 -95 -129 -72 275 337 282 -26 -20 -242 -218 -124 -152 207 102
4316A02lQ2j26m6j34j78N3Q0J70q2J60M19k03k15j60o5l3p5K43J10K6Q2p5jn71
$$ 102 99 181 55 9 -125 -303 -250 -170 0 -82 78 497 294 79 -81 -146 -179 -254 -11 99 125 207 132 131 -440
4341d40N7L46j01J27J14j23K68j6j64j74j47O3m8J27J91J84J40j68N6k70J07n23
$$ -440 -383 -37 -138 -11 103 -20 248 232 68 -106 -253 -190 -238 -111 80 264 404 236 292 22 129 -394
4363c94J44K69J66J13Jq1q8l08J79k16L2R3J67j8n7K46o9K26o63O9j82N1K22J57
$$ -394 -250 19 185 298 299 218 130 -178 1 -215 -183 -90 77 59 2 248 179 405 -258 -189 -371 -320 -98 59
4387E9J12J34k67R3k08p4n9j53M27o6O0J4K19k06p7j23P6k80P9M91j53J62o6K18
$$ 59 171 305 38 131 -77 -151 -210 -363 64 -2 58 72 291 85 8 -115 -39 -319 -240 251 98 260 194 412
4411D12m65k3j00j1J71j2K61qj5j54k46j45J12j32J60N10j61LL3l0k45j12L2r2
$$ 412 -53 -76 -176 -187 -16 -28 233 225 210 56 -190 -335 -223 -355 -195 315 154 157 190 160 -85 -197 -165 -257
4435b57J46l8L74j27P7k9j84R7j26k57j3K83P2j4L14k25j46j60l4K3Q1p1M67m0
$$ -257 -111 -149 225 98 175 146 -38 59 -67 -324 -337 -54 18 4 318 93 -53 -213 -247 -224 -143 -214 253 213
4459B13j77Q1l53N6J82l93K04J2J23M80k01J68k85N2j87j31j71L91j8R3J68o7
$$ 213 36 117 -236 -180 2 -391 -187 -175 -52 428 227 395 110 162 -25 -156 -327 64 46 139 307 240
4481B40j30k21M4l0j08J42K33k59K58K04n05J44l03J80o2J4J53K63j14m8K41n46
$$ 240 110 -111 -67 -97 -205 -63 170 -89 169 373 -132 12 -291 -111 -173 -159 -6 257 143 95 336 -210
4503b10J40k00J9J52J29J15J17j51k2O7j74k11K7p3K05K20l24K85o6k32O0j04
$$ -210 -70 -270 -251 -99 30 145 262 111 89 156 -18 -229 -202 -275 -70 150 -174 111 45 -187 -127 -231
4525b31j74M04J81j24J16j92O70k84l48k18j27q78J067j30J8J25K32k14Q2k2N0
$$ -231 -405 -1 180 56 172 -20 650 366 18 -200 -327 -1205 -138 -268 -250 -125 107 -107 -25 -47 3
4546Cl18P1K77J78J37k91J59k40j72k58N40l67J83L66j67K98k15k01k04r9k1K43
$$ 3 -315 -244 33 211 348 57 216 -24 -196 -454 86 -281 -98 268 101 399 184 -17 -221 -320 -341 -98
4568i8K0J13K76k60k4j5k49k8K29j63K25J1j16L13j94J22J0m17K47j89K29O3J54
$$ -98 -78 35 311 51 27 12 -237 -265 -36 -199 26 37 -79 234 40 162 172 -245 2 -187 42 105 259
4591B59j04m6l30J70k07j0L38m24N21q2M7l08L51k82j59O1J38J26J08n6N4L5j83
$$ 259 155 109 -221 -51 -258 -268 70 -354 167 85 132 -176 175 -107 -266 -205 -67 59 167 111 165 200 17
4614A7o2K17l04K66l64L68j73L21N0l06L3l92j8J77J8L7J64J73m9j57j17j31J72
$$ 17 -45 172 -132 134 -230 138 -35 286 336 30 63 -329 -347 -170 -152 -115 49 222 173 16 -101 -232 -60
4637f0l42K00R8O3K6L9K78l45o2j18l0RQ6L14r1L76k92j36P5j51R9k19J41J62
$$ -60 -402 -202 -104 -41 -15 24 302 -43 -105 -223 -253 -244 -158 156 65 441 149 13 88 -63 36 -183 -42 120
4661A20p7N4J13l47n1J77m5o9jL38r9M5l6o0n9l43L32j04nJ05J16J22l30L16j46
$$ 120 43 97 210 -137 -188 -11 -56 -125 -126 212 113 158 122 62 3 -340 -8 -112 -117 -12 104 226 -104 212 66
4686F6k50J71p4J69J15k41M37j9k37m1m26K47j21J20J19N9K82r4n0l21K18m39
$$ 66 -184 -13 -87 82 197 -44 393 374 137 96 -330 -83 -204 -84 35 94 376 282 232 -89 129 -310
4708c10J08J56p4J83J07Q0L9j35l11K7l4k00L74J75r8J45J3j33j90O9k34r9K02
$$ -310 -202 -46 -120 63 170 250 289 154 -157 -130 -164 -364 10 185 87 232 245 112 -78 -9 -243 -342 -140
4731a40J75M6K39m7k99j59L9j44K51L3o4K62R0j46j00J24k20l37J85P0J27J25
$$ -140 35 81 320 273 -26 -185 -146 -290 -39 -6 -70 192 282 136 36 160 -60 -397 -212 -142 -15 110
4753A10k04J80J05j44k51L30l08L0J0K22L57j90j90l3p8j07q1J81l1P8J58j81
$$ 110 -94 86 191 47 -204 126 -182 -152 -142 80 437 247 57 24 -54 -161 -242 -61 -92 -14 144 -37
4775c7K54lk14j06j34K9J61q0K46Lj97j3L2J67k51J88j28q3L57k54R7J09k21P0
$$ -37 217 214 0 -106 -240 -211 -50 -130 116 119 -78 -91 -59 108 -143 45 -83 -166 191 -63 34 143 -78 -8
4799hl44K85j0j14K99Om0l5kj81m5j32J75M5L46o3k35L26l81o7J6ljn6R6J26J38
$$ -8 -352 -67 -77 -191 108 114 74 39 37 -144 -189 -321 -146 -101 245 182 -53 273 -108 -175 -159 -162 -163 -219 -123 3 141
4826A41j29P4k73m0q3J24J90M08k66n1j27K46l00j37K11j45J85K15j28J63l83
$$ 141 12 86 -187 -227 -310 -186 4 412 146 95 -32 214 -86 -223 -12 -157 28 243 115 278 -105
4847a05J73j41O7k26K35P1j31L16q7K0N4l93J17q6k68nJ74O8L47l6j43r6j64M3
$$ -105 68 -73 -6 -232 3 74 -57 259 172 192 246 -147 -30 -116 -384 -389 -215 -147 200 164 21 -75 -239 -196
4871a96j84L71J34J14k25q6J97j05j28k36J78J21k96K90N0J74k10K77q6n40J68
$$ -196 -380 -9 125 239 14 -72 125 20 -108 -344 -166 -45 -341 -51 -1 173 -37 240 154 -386 -218
4892b18L35k25J41L22r5r9q7j28j92m3J21Q3L61n4M4k17K21l14j04K4q4K02k06
$$ -218 117 -108 33 355 260 161 74 -54 -246 -289 -168 -85 276 222 266 49 270 -44 -148 -124 -208 -6 -212
4915b12L53J24k33R2l97Q0M4n1L42R8n5m2J43k59n1l34L82o3j04K62j34K51r9
$$ -212 141 265 32 124 -273 -193 -149 -200 142 240 185 143 286 27 -24 -358 24 -39 -143 119 -15 236 137
4938A37p2M3m08K40j56L1RQ4K08l7P9j92J9K15n89K42K8J90j08K11k00K38j69
$$ 137 65 108 -300 -60 -216 -185 -176 -92 116 79 158 -34 -15 200 -389 -147 -119 71 -37 174 -26 212 43
4961D3l85J55R4J77j5j29J42Q0k92K25m0k87l3K11j4J61K05r7l44J46j77M1N9
$$ 43 -342 -187 -93 84 69 -60 82 162 -130 95 55 -232 -265 -54 -68 93 298 201 -143 3 -174 -133 -74
4984g4J20j22M1J84j49P3n7j26mj24K31J21n6K56p2l41R5j80m6j17J75lK45j17
$$ -74 46 -76 -35 149 0 73 16 -110 -114 -238 -7 114 58 314 242 -99 -4 -184 -230 -347 -172 -175 70 -47
5008d7L06l02R7j74J08K00j83R8k52M61p2r7j5R7k59l79K40L9P2j5K03O2k54J59
$$ -47 259 -43 54 -120 -12 188 5 103 -149 312 240 143 128 225 -34 -413 -173 -134 -62 -77 126 188 -66 93
5032I3j15j94M4J04J13p6K52k37q8M0j94M2K51l97K20K47k99L38P2j20Ml10Q9
$$ 93 -22 -216 -172 -68 45 -31 221 -16 -104 -64 -258 -216 35 -362 -142 105 -194 144 216 96 100 -210 -121
5055a21K67j63K13K2L4m00p1O9J60l43J74Q1K92k67M5oK05k83j16J30j74J52R9
$$ -121 146 -17 196 218 252 -148 -219 -150 10 -333 -159 -78 214 -53 -8 -14 191 -92 -208 -78 -252 -100 -1
5078aL07j84L3j10j26j76Q0K38r1M9l3j9J66j42J74k44p4K0j6J86j08J58JP5Q4
$$ -1 306 122 155 45 -81 -257 -177 61 -30 19 -14 -33 133 -9 165 -79 -153 -133 -149 37 -71 87 88 163 247
5103B47k81j10j20K95j38K41j94L25l11M9j48J22R6r0o2J8M03N2n29M3Q4N0l76
$$ 247 -34 -144 -264 31 -107 134 -60 265 -46 3 -145 -23 73 -17 -79 -61 342 394 -135 -92 -8 42 -334
5126c34L11N9mJ62k2l8j11J8j99l6qJ76J97K1J4j45O3J1m27L64P5pj56M2l9Q2
$$ -334 -23 36 32 194 172 134 23 41 -158 -194 -202 -26 171 192 206 61 124 135 -292 72 147 140 -16 26 -13 69
5152F9j64K72k60j70O0K9K49k19j8M76k32k15J63l2P4j38K05j09J7J4j63R0j82
$$ 69 -95 177 -83 -253 -193 -164 85 -134 -152 324 92 -123 40 8 82 -56 149 40 57 71 -92 -2 -184
5175a84J92j35J53J11J5j19K01k70n5J92k32N4P3R0k02P6n2J74j72J80j36m9J58
$$ -184 8 -127 26 137 152 33 234 -36 -91 101 -131 -77 -4 86 -116 -40 -92 82 -90 90 -46 -95 63
5198F3j39l1J95k84N69k55j34J78k76j61K65J10p7K34Lj29j43m8K5j7p8P4J59
$$ 63 -76 -107 88 -196 373 118 -16 162 -114 -275 -10 100 23 257 260 131 -12 -60 -35 -52 -130 -56 103
5221A03L05m75L85k18k80j55P8J58j8K15N7j2R4j34l37J53O5j5n8J9L4OJ00j3
$$ 103 408 -67 318 100 -180 -335 -257 -99 -117 98 155 143 237 103 -234 -81 -16 -31 -89 -70 -36 -30 70 57
5245E7p4j59K28j38K0p6R3K12n1j62j17J51j52J03J89k76L36j42P0k6j11P9j65
$$ 57 -17 -176 52 -86 -66 -142 -49 163 112 -50 -167 -16 -168 -65 124 -152 184 42 112 86 -25 54 -111
5268a11J80j63J12j77J97J26j68J07j96J12j83P1K79J48k34j28P7n0N9k42J95
$$ -111 69 -94 18 -159 38 164 -4 103 -93 19 -164 -93 186 334 100 -28 49 -1 58 -184 11
5289A1j48J82l6N4J81k77J75l39J42j93L8k20M91K1J32O6j24l5j71KJ37l84L20
$$ 11 -137 45 9 63 244 -33 142 -197 -55 -248 -210 -430 61 82 214 280 156 121 -50 -48 89 -295 25
5312B5k7J06o0M3j33k3J2P4j43K02M3k9K2j28j75L27l34PL5L81j80j99K15O7l45
$$ 25 -2 104 44 87 -46 -69 -57 17 -126 76 119 90 112 -16 -191 136 -198 -191 -156 225 45 -154 61 128 -217
5337b17K48mj37J34m6N0Q0P6j13j18J39k49J79k05J49K0J36p3j8N9j05q7M9k23
$$ -217 31 27 -110 24 -22 28 108 184 71 -47 92 -157 22 -183 -34 -14 122 49 31 90 -15 -102 -53 -276
5361b76J62J25J41k3pm6j97J58o9J81Q5j04%j42Rj04j6j73K7L66J40k50L48l30
$$ -276 -114 11 152 129 122 76 -121 37 -32 149 234 130 130 -12 -3 -107 -123 -296 -269 97 237 -13 335 5
5385EO5R3l50K71p2k60J72K5K81k63J92n9k91P1q7J18p2L2K28Q8m5l31K80J14
$$ 5 70 163 -187 84 12 -248 -76 -51 230 -33 159 100 -191 -120 -207 -89 -161 -129 99 187 142 -189 91 205
5409B05j17j84J00J04j69L36j27k3j74r4K84k45j08J23J04j59K97k89J92j09j72
$$ 205 88 -96 4 108 -61 275 148 125 -49 -143 141 -104 -212 -89 15 -144 153 -136 56 -53 -225
5430b25L30k54M2O5K98n6j96J55N6k19j37L50q6k4j37k9L25k89N2j35j09Q0J2
$$ -225 105 -149 -107 -42 256 200 4 159 215 -4 -141 209 123 99 -38 -67 258 -31 21 -114 -223 -143 -131
5453a31J33J29K7Jk0K8l40p9L03k29L40L5r0mJ27k37j7j06L0J30q0J91J00j25
$$ -131 2 131 158 159 139 167 -173 -252 51 -178 162 197 107 103 230 -7 -24 -130 -100 30 -50 141 241 116
5477A16l6j17k1j10Q1pL6M1K08k2j53J29l12M3J56j85L13q1j18K5K46k15L1j75
$$ 116 80 -37 -58 -168 -87 -94 -58 -17 191 169 16 145 -167 -124 32 -153 160 79 -39 -14 232 17 48 -127
5501a27qo4L8J19L07j19O2k13j82J00k8M0j06R5L07k61L21k83j97J09J17j16P5
$$ -127 -135 -199 -161 -42 265 146 208 -5 -187 -87 -115 -75 -181 -86 221 -40 281 -2 -199 -90 27 -89 -14
5524a4J1J19j38n3P8PQl1p8j05J66J37j79R3P0Nj55J71l19J23N1j3m0J71j9j08
$$ -14 -3 116 -22 -75 3 10 18 -13 -91 -196 -30 107 -72 21 91 96 -59 112 -207 -84 -33 -46 -86 85 66 -42
5550d2R1k06k1J16Q3K41k39J2J16l59J16m6M4M4j25J1J02R5J51l18L1j79M18j25
$$ -42 49 -157 -178 -62 21 262 23 35 151 -208 -92 -138 -94 -50 -175 -164 -62 33 184 -134 -103 -282 136 11
5574A1J7j60K41j43K22k11J4k8j02P6j50J26J22R7j39j99J60L5J8k7j35K25l3
$$ 11 28 -132 109 -34 188 -23 -9 -37 -139 -63 -213 -87 35 132 -7 -206 -46 -11 7 -20 -155 70 37
5597C7j48Q5K17k96j18j70M23j18o4K60j98J33K01j81M8J8k49J04K13m19L04r6
$$ 37 -111 -26 191 -105 -223 -393 30 -88 -152 108 -90 43 244 63 111 129 -120 -16 197 -222 82 -14
5619a4Q7N2j13j47J06j55j04K67J3r5J71K9l36K76l9k40K75j70M2J91J36j1j29
$$ -14 73 125 12 -135 -29 -184 -288 -21 -8 -103 68 97 -239 37 -2 -242 33 -137 -95 96 232 221 92
5642I2j46R8j69j0K83j28L62l28j0l3k9J58j69j6j86K84j41J21J97k41J13l38
$$ 92 -54 44 -125 -135 148 20 382 54 44 11 -18 140 -29 -45 -231 53 -88 33 230 -11 102 -236
5664b36L28Nj9j19O8j17K18J34k73k31J76P3j34Q5j63l1M4L60j94o8j24K03j43
$$ -236 92 97 78 -41 27 -90 128 262 -11 -242 -66 7 -127 -42 -205 -236 -192 168 -26 -94 -218 -15 -158
5687a58J35J44m2J15l18K10j02L50l62Mj58K0K44K01j75j6k14J90j71K40j42L3
$$ -158 -23 121 79 194 -124 86 -16 334 -28 -24 -182 -162 82 283 108 92 -122 68 -103 137 -5 28
5709B8Q7J19k27k36L23k66L08j99J38J09j24P3k07m4O2j11M06k20j29J79n2o5
$$ 28 115 234 7 -229 94 -172 136 -63 75 184 60 133 -74 -118 -56 -167 239 19 -110 69 17 -48
5731d8oj89L91k97L46o1n18L59L1j24k7K93n6r0j54J43j03J10J56l89J50J37Q7
$$ -48 -54 -243 148 -149 197 136 -382 -23 8 -116 -143 150 94 4 -150 -7 -110 0 156 -233 -83 54 141
5754A41j12L0j17J31L9m9q3o4n7K07j26j2j15J73j06K25l3j29pOJ16j39P6j34
$$ 141 29 59 -58 73 112 63 -20 -84 -141 66 -60 -72 -187 -14 -120 105 72 -57 -64 -58 58 -81 -5 -139
5778a39M6J01J21l04K52J26q4n0J09j79j47L06j68k6R4l03nn6l0L45l07J99K77
$$ -139 -93 8 129 -175 77 203 119 69 178 -1 -148 158 -10 -36 58 -245 -250 -306 -336 9 -298 -99 178
5801A78j28O2j38J62o4K4J5j52k22K86r4K68o8qj62J4n2J77K8P7k0lj25o9P6k88
$$ 178 50 112 -26 136 72 96 111 -41 -263 23 -71 197 129 121 -41 -27 -79 98 126 203 183 180 55 -14 62 -226
5827b26R6M8k4J66j70L0p7N2M5J17j46J4l9j19K45O3j78O3J48j02n3k5j6J16n2
$$ -226 -130 -82 -106 60 -110 -80 -157 -105 -60 57 -89 -75 -114 -233 12 75 -103 -40 108 6 -47 -72 -88 28 -24
5852b4L29k46R9j56J15j55j81K50r1K02R7m36N02o96M32j33J79m3R0j87K11j52
$$ -24 305 59 158 2 117 -38 -219 31 -60 142 239 -197 305 -391 41 -92 87 44 134 -53 158 6
5874FJ49k89j6L42l20P5J60j5j94K82j63P8j45R6k90J18J04J38j60n9K65Qj81
$$ 6 155 -134 -150 192 -128 -53 107 92 -102 180 17 95 -50 46 -244 -126 -22 116 -44 -103 162 170 -11
5897a1r4K19N7j11N7m13N91r0K9k37Nl6m9L74ll02j01K90k92p5K74l59J23J87
$$ -11 -105 114 171 60 117 -296 295 205 234 -3 2 -34 -83 291 288 -14 -115 175 -117 -192 82 -277 -154 33
5921C3K7P5p1mJ64l06J76k62K64j88K44M8k00j22R7j30K4M0L4K35J7k51j76J34
$$ 33 60 135 64 60 224 -82 94 -168 96 -92 152 200 0 -122 -25 -155 -131 -91 -57 178 195 -56 -232 -98
5945i8Q0J10k34R5O2j01J27j31J31k6Q4k43L6Q2O6k98K96q5j3K37m4k11j91K74
$$ -98 -18 92 -142 -47 15 -86 41 -90 41 15 99 -144 -108 -26 40 -258 38 -47 -60 177 133 -78 -269 5
5969Ej19Q3j41K79l17N25q7k66J13k1j08M9k62L33J65k75R6J81l58O6J30o1j91
$$ 5 -114 -31 -172 107 -210 315 228 -38 75 54 -54 -5 -267 66 231 -44 52 233 -125 -59 71 10 -181
5992a81l7O4K63k57L02K0n4k40r8L68k86M0J95J96j37Ml51K48K51l83k75N25j79
$$ -181 -218 -154 109 -148 154 174 120 -120 -218 150 -136 -96 99 295 158 162 -189 59 310 -73 -348 177 -2
6015bJ6L2N1j42j53R9R3j51k8K13q4O4j27M18l60o8J58j60L36j44MJ57k60n2J93
$$ -2 14 46 97 -45 -198 -99 -6 -157 -185 28 -56 8 -119 299 -61 -129 29 -131 205 61 65 222 -38 -90 103
6040A03k18l8K8M23l08J80R8j35J6j56k67J43M2L7J19j53J74j98L11l12K23k46
$$ 103 -115 -153 -125 298 -10 170 268 133 149 -7 -274 -131 -89 -52 67 -86 88 -110 201 -111 112 -134
6062a34O1J3J50J02j07j66O8l1Q1n4k01K49j50K65j00p2P9L9k82L94l05J07o3
$$ -134 -73 -60 90 192 85 -81 -13 -44 37 -17 -218 31 -119 146 46 -26 53 92 -190 204 -101 6 -57
6085e7L49k31Oo2K53j59k21J7n7M8K68l6J4j98J91k15p7J2j51J88Kl5Q1r3k7J19
$$ -57 292 61 67 5 258 99 -122 -105 -162 -114 154 118 132 -66 125 -90 -167 -155 -306 -118 -116 -151 -70 -163 -190 -71
6111g1J15o4n4J2k61J93O2J31L9P9k94j70J04N6K86m3K47l40K33k02N8r8K8j44
$$ -71 44 -20 -74 -62 -323 -130 -68 63 102 181 -113 -283 -179 -123 163 120 367 27 260 58 116 18 46 -98
6135i8J2K56l32K77j84j7j25K63k43o2M22j77J08k1k17R3j79K12j87jJ42Q2j93
$$ -98 -86 170 -162 115 -69 -86 -211 52 -191 -253 169 -8 100 79 -138 -45 -224 -12 -199 -200 -58 24 -169
6158a69J5K62n8Q2l23J26kj88J77K77k77L8L14l32j38M03l58N3J80j28k01L63
$$ -169 -154 108 50 132 -191 -65 -67 -255 -78 199 -78 -40 274 -58 -196 207 -151 -98 82 -46 -247 116
6180A16q9l8j8q1K7n6L56Mq6P4j24pr9lJ86k14j30J38Q3K4J7k30K10n6J41j1j93
$$ 116 27 -11 -29 -110 -83 -139 217 221 135 209 85 78 -21 -24 162 -52 -182 -44 39 63 80 -150 60 4 145 134 -59
6207e9J32r9J65j50j3n0L8Q4j80O8J80o8q8P4k15K50j6k1k22J41J04p9J07k89
$$ -59 73 -26 139 -11 -24 -74 -36 48 -132 -64 116 48 -40 34 -181 69 53 32 -190 -49 55 -24 83 -206
6231b06J60K21o6L5p2l4J03Rm46L91p9J86k25K2q3J80j73M3R2J41r6j03j1k35
$$ -206 -46 175 109 144 72 38 141 150 -296 95 16 202 -23 -1 -84 96 -77 -34 58 199 103 0 -11 -246
6255b46J24J58J70k95P1j57J79J66n0l1k79P0K2m1L07l09M0j28M98l76L62j17
$$ -246 -122 36 206 -89 -18 -175 4 170 120 89 -190 -120 -98 -139 168 -141 -101 -229 269 -107 255 138
6277A38j52q6m8L94m06L84k60jq6j7J35K5o0mK17j21m6P1q6j03J61R9l83L04R1
$$ 138 -14 -100 -148 246 -160 224 -36 -37 -123 -140 -5 20 -40 -44 173 52 6 77 -9 -112 49 148 -235 69 160
6302A60l11K62k37N3L3j15J97M9J53k82Kr3N8P1k24L91j94m8J99L8j33N9o6J03
$$ 160 -151 111 -126 -73 -40 -155 42 91 244 -38 -36 -129 -71 0 -224 167 -27 -75 124 162 29 88 22 125
6326A25j25k3J43k01J59j88L23l93K52j78j73K39R3o4R3L0m7MRk61L65J1m7l10
$$ 125 0 -23 120 -81 78 -110 213 -180 72 -106 -279 -40 53 -11 82 112 65 69 78 -183 182 193 146 -164
6350a64n1M62m13J95O6j05j33L3j16K21o2j5J33k8J09p5o0KM2Q9k63J48JOkj20
$$ -164 -215 247 -166 29 95 -10 -143 -110 -226 -5 -67 -82 51 23 132 57 -3 -1 41 130 -133 15 16 22 20 -100
6376a00K02j44j5n4K02p3J76k9l78K03L8j52k2R3J06m7l0k5K9l2K2N7j52n0J84
$$ -100 102 -42 -57 -111 91 18 194 165 -213 -10 28 -124 -146 -53 53 6 -24 -49 -20 -52 -30 27 -125 -175 9
6401Ij13N2J03J16k37L40n30M68k72J24J47k49j94M14j72j28pJ76q6J49m0P7Q2
$$ 9 -104 -52 51 167 -70 270 -260 208 -64 60 207 -42 -236 178 6 -122 -129 47 -39 110 70 147 229
6424B29J0k91K6j82K80n6P8j6k73J75o4P7o8K74m20K15p5J34j40N9K21k11j41
$$ 229 239 -52 -26 -208 72 16 94 78 -195 -20 -84 -7 -75 199 -221 -6 -81 53 -87 -28 193 -18 -159
6447a59K03p9o3J36k16K13j84K41J04l68J87j52K92k39J86r4O2L8j31J7R1%l8
$$ -159 44 -35 -98 38 -178 35 -149 92 196 -172 15 -137 155 -84 102 8 70 108 -23 -6 85 85 47
6470D7ok39P9L2J58J15q9M6j81L6l95K44K28l5Q3j99K17j37j9L5r6k12O3K67k1
$$ 47 41 -198 -119 -87 71 186 97 143 -38 -2 -397 -153 75 40 123 -76 141 4 -15 20 -76 -288 -225 42 21
6495B1J07k95L59r6j13n8PK38J94m13K32j88Q5j34k88L07J63k1j82K35k92q8o
$$ 21 128 -167 192 96 -17 -75 -68 170 364 -49 183 -5 80 -54 -342 -35 128 107 -75 160 -132 -220 -226
6518b26J87J62j7j24KJ10k68K88k10J90k19mk1K93l0k19K05j22J84J9q8k08N0
$$ -226 -39 123 106 -18 -16 94 -174 114 -96 94 -125 -129 -150 143 113 -106 99 -23 161 180 92 -116 -66
6541f6j09q4K84O4Q3k3j1j48o1j05J40O4M5j38j36L82l9n3j99n0J64M4r6j07L84
$$ -66 -175 -259 25 89 172 149 138 -10 -71 -176 -36 28 73 -65 -201 181 142 89 -110 -160 4 48 -48 -155 229
6566B29j65Q0l2n3l25K02o6N8P7J01r8n1rK3j04K04K8n4m1K3R7k31K84l88J44
$$ 229 64 144 112 59 -266 -64 -130 -72 5 106 8 -43 -52 -29 -133 71 99 45 4 27 124 -107 177 -211 -67
6591f7J35j76K7J76Q0o9j88K84k49L9J3m4m4K31k79OJ95j43J83k04j89K36m4J37
$$ -67 68 -108 -81 95 175 106 -82 202 -47 -8 5 -39 -83 148 -131 -125 70 -73 110 -94 -283 -47 -91 46
6615D6m5K49r0m0r7L9M1j86O2J70N1m03R4L98k35j53N8N9j7j27O6l2J3J31j0o6
$$ 46 1 250 160 120 23 62 103 -83 -21 149 200 -203 -109 289 54 -99 -41 18 1 -126 -60 -92 -79 52 42 -24
6641b4K1m2J3j51J87J91j11m5k9q5r8K45k42m2J38J27R5l2l03J78j67O2j08Q4
$$ -24 -3 -45 -32 -183 4 195 84 39 10 -75 -173 72 -170 -212 -74 53 148 116 -187 -9 -176 -114 -222 -138
6665a38N7K46k17K20k56jL5%Q3M3k03O6J19j40K61k78J20j05j82M6K31k8K1N6
$$ -138 -81 165 -52 168 -88 -89 -54 -54 29 72 -131 -65 54 -86 175 -103 17 -88 -270 -224 7 -21 0 56
6689E6O5j48J8j92L42k33j95K28J07j91J22j11J26k92J81o7L24k96L6J61O1l31
$$ 56 121 -27 -9 -201 141 -92 -287 -59 48 -143 -21 -132 -6 -298 -117 -184 140 -156 -120 41 102 -229
6711b29L39Kj28P8k34K36K22k94Nj6K04j57q5J78j33K42k78J18j80K27l83K69
$$ -229 110 112 -16 62 -172 64 286 -8 -3 -19 185 28 -57 121 -12 230 -48 70 -110 117 -266 3
6733Cm1J4Q2n4j30Pj5J49j29O7r0K35k09o6M49k80M2p8K25j51p2K27j80O7M2m2
$$ 3 -38 -24 58 4 -126 -119 -134 15 -114 -47 -137 98 -111 -177 272 -8 34 -44 181 30 -42 185 5 72 114 72
6759G2p0j1J87j47j04J0J8K29j53k5m1J71m19J77K46j31K79n25K60j01N5L66l66
$$ 72 2 -9 178 31 -73 -63 -45 184 31 6 -35 136 -283 -106 140 9 288 -237 23 -78 -23 343 -23
6782b3j04J76k08o9J52J54m0K39j94k68o5P8L37k79j39J81J46j50K5J21m7o5J74
$$ -23 -127 49 -159 -228 -76 78 38 277 83 -185 -250 -172 165 -114 -253 -72 74 -76 -51 70 23 -42 132
6805A32k59q1L08j54o3K80l20J81N6q9k04K41J12J0qP5k86K4K0l1Qln0N0K13k88
$$ 132 -127 -208 100 -54 -117 163 -157 24 80 -9 -213 28 140 150 142 217 -69 -45 -25 -56 -48 -51 -101 -51 162 -126
6831a26K31k89m1J88Qm6J07k62L79l25J93J71q5n2k16J43j07M4j16K95p3m4K9
$$ -126 105 -184 -225 -37 -29 -75 32 -230 149 -176 17 188 103 51 -165 -22 -129 -85 -201 94 21 -23 6
6854FP2k91K69q5J27j92l5J24J49l41K03q3K86k23P6k33J29p7J63M6K11k05q1
$$ 6 78 -213 56 -29 98 -94 -129 -5 144 -197 6 -77 209 -14 62 -171 -42 -119 44 90 301 96 15
6877A5n8O4K15n1k12o7K7k05L62R7n21K08J19pj36K42KL9J38m26J54l4K04m01
$$ 15 -43 21 236 185 -27 -94 -67 -272 90 187 -334 -126 -7 -14 -150 92 94 133 271 -155 -1 -35 169 -232
6901b32K28MJ71l33L6n2J88j22K29j00q2L8L3l5k6n4N4j41J51m5P1J05k13K89
$$ -232 -4 0 171 -162 -126 -178 10 -112 117 17 -65 -27 6 -29 -55 -109 -55 -196 -45 -90 -19 86 -127 162
6925A62k31K00k48K66j43N2R1j53J07J20k42O5J09k80J49k69kL60k38J94r9J12
$$ 162 -69 131 -117 149 6 58 149 -4 103 223 -19 46 155 -125 24 -245 -247 113 -125 69 -30 82
6947H2M5j20Q0O5j02j02L86l22m2J41j74P8J18l10L08k34M37n50J19K94j06n1
$$ 82 127 7 87 152 50 -52 334 12 -30 111 -63 15 133 -177 131 -103 334 -216 -97 197 91 40
6969D0j34l1K74j88j02k9O8j23J75Q6j13j1K24j93O1n6n6Q3r1K14n3j28j1N0L08
$$ 40 -94 -125 149 -39 -141 -170 -102 -225 -50 36 -77 -88 136 -57 4 -52 -108 -25 -116 98 45 -83 -94 -44 264
6994B64j78j31J60j74K18j96K32n5pj96J75M0J14j08k26q4J17n2J69m6j85J71
$$ 264 86 -45 115 -59 159 -37 195 140 133 -63 112 152 266 158 -68 -152 -35 -87 82 36 -149 22
7016B2l4o3k33L34J38j56j45J46L11k06o4P3l41M2L53l06J39K5J90l36J53J21
$$ 22 -12 -75 -308 26 164 8 -137 9 320 114 50 123 -218 -176 177 -129 10 35 225 -111 42 163
7038A63j80J0j14K06p2J53m41K85N4j38k01L79k66j72L33q1M7Q5j74l7K88l72
$$ 163 -17 -7 -121 85 13 166 -275 10 64 -74 -275 104 -162 -334 -1 -82 -35 50 -124 -161 127 -245
7060b45J34O0n3J80J30j7Pk49J91K9j85l29N18m35L92j99k08M63k41On3k4J82
$$ -245 -111 -51 -104 76 206 189 196 -53 138 167 -18 -347 171 -264 128 -71 -279 184 -57 -51 -104 -128 54
7083E4r5R2R5o0j58R8j24K07k05Q4J49l53P0j5K25j45j61K73q6R9p5J33m5nj76
$$ 54 -41 51 146 86 -72 26 -98 109 -96 -12 137 -216 -146 -161 64 -81 -242 31 -55 44 -31 102 57 52 -124
7108a24j2J72R9k76Q7L11O4l91R4QJ5j13kJ43Rm3K49k27p2j00j03QL82o5l01K67
$$ -124 -136 36 135 -141 -54 257 321 -70 24 32 47 -66 -68 75 84 41 290 63 -9 -109 -212 -204 178 113 -188 79
7134G9K80k41j51k1L7Pj00Q1np1L29j17M6j57j32K91l67J07J92k15Rm4P0J23j85
$$ 79 359 118 -33 -54 -17 -10 -110 -29 -34 -105 224 107 153 -4 -136 155 -212 -105 87 -128 -119 -163 -93 30 -155
7159a55K04j17J30k01L16k40j73J61J00p3j9K42j24j9k34J07N1K2J78o8k15n6
$$ -155 49 -68 62 -139 177 -63 -236 -75 25 -48 -67 175 51 32 -202 -95 -44 -22 156 88 -127 -183
7181a83J62J66j52j88L21j87J14O9j29J45k39Q5p9j40rL88p3j08Q1q6j04m2K03
$$ -183 -21 145 -7 -195 126 -61 53 122 -7 138 -101 -16 -95 -235 -244 144 71 -37 44 -42 -146 -188 15
7204A5J90m35K42m2J22j4k2m1lj94J89j21K14o9P6P2Qj22j68K18j29K04rj90p7
$$ 15 205 -230 12 -30 92 78 56 15 12 -182 7 -114 100 31 107 179 187 65 -103 115 -14 190 181 -9 -86
7229h6J49n3M0j86J13k21J96l0J73KK3q0J98l58O3KQ8O5j44N2M1k6n7k6J46n2
$$ -86 63 10 50 -136 -23 -244 -48 -78 95 97 120 40 238 -120 -57 -55 33 98 -46 6 47 21 -36 -62 84 32
7255C2j3n5m3Q8Kkm5J58j15o6J26N9n4K78m69pR3j33O0K68m21L93R7q7k86K3N7
$$ 32 19 -36 -79 9 11 9 -36 122 7 -59 67 126 72 350 -119 -126 -33 -166 -106 162 -259 134 231 144 -142 -119 -62
7282f2jm0k83K07K01k1L10l41J38J9k43K01k47K83j06Kn0J00k04m8Q9J78R8k82
$$ -62 -63 -103 -386 -179 22 1 311 -30 108 127 -116 85 -162 121 15 17 -33 67 -137 -185 -96 82 180 -102
7306a02K53K2m57J92R1J29j77k23K19j23L17o3k7J54k1j13J1l21K01O1r3K7j23
$$ -102 151 173 -284 -92 -1 128 -49 -272 -53 -176 141 78 51 205 184 71 82 -239 -38 23 -70 -43 -166
7329a66L61K7o8k64J73r8j62N47Lj00R8j93j66r0K13k82J88q7q8J04J38Q8q9k09
$$ -166 195 222 154 -110 63 -35 -197 350 353 253 351 158 -8 -98 115 -167 21 -66 -154 -50 88 176 87 -122
7353a22PJ74k1k8p8J7M9J54j20K27l34l0q0L53l71L01J98k95j31p4J89J41j00
$$ -122 -115 59 38 10 -68 -51 -2 152 32 259 -75 -105 -185 168 -203 98 296 1 -130 -204 -15 126 26
7376B6j55J94k40J08J64j15j59K85r9k46L25k20J8N3q3K89j17J11M9j97K11j49
$$ 26 -129 65 -175 -67 97 -18 -177 108 9 -237 88 -132 -114 -61 -144 145 28 139 188 -9 202 53
7398E3k51R0J02P6P7qj6m44K40k7p3L69k64K41J23k97j1P4O6O9Q3k53j46K02k26
$$ 53 -198 -108 -6 70 147 139 123 -321 -81 -108 -181 188 -76 165 288 -9 -20 54 120 189 272 19 -127 75 -151
7423a51J07J74m61L84k60LK89P9j30k73K55J63j54j74K12k66L09p4N8j52J58j20
$$ -151 -44 130 -331 53 -207 -204 85 164 34 -239 16 179 25 -149 63 -203 106 32 90 -62 96 -24
7445b4j50k9K6L42m2N2j49L0o6l9KN7J10k11L01k41M2n7R4Q4j20l6J63n8n0j95
$$ -24 -174 -203 -177 165 123 175 26 56 -10 -49 -47 10 120 -91 210 -31 11 -46 48 132 12 -24 139 81 31 -164
7471a64K76n0J44r1r3q9O0m7R7J56r1j77NK40%j61J5j64Q8K8J4J14j52r6mK61
$$ -164 112 62 206 115 22 -67 -7 -54 43 199 108 -69 -64 176 176 15 30 -134 -46 -18 -4 110 -42 -138 -142 119
7497A19j40Q1l6J45k16R8R8o4j61Q8Kl97M14J03l94M11l4Q8l65J35j99K72j67
$$ 119 -21 60 24 169 -47 51 149 85 -76 12 14 -383 31 134 -260 151 117 205 -160 -25 -224 48 -119
7520a19j2K96k30K76j43m3j56K33j07M6j28j4J47J80r5j09k12p2M33n19R2N60
$$ -119 -131 165 -65 211 68 25 -131 102 -5 41 -87 -101 46 226 131 22 -190 -262 171 -348 -256 304
7542C04j20r3k14J4j80M61j96o4j09L34L3j28k18K08K3j94K68k23K27k15n9J74
$$ 304 184 91 -123 -109 -289 172 -24 -88 -197 137 170 42 -176 32 55 -139 129 -94 133 -82 -141 33
7564C3j83J07j28L6J74j89N0N6k03R1J20k8o9J00R7j40op2J92p0J46Q9k19j16
$$ 33 -150 -43 -171 -135 39 -150 -100 -44 -247 -156 -36 -64 -133 -33 64 -76 -82 -154 38 -32 114 203 -16 -132
7588a32j28m9O11j97pk74K20j16M9J6p8J11J42j60j04J52j48r2J18J10j78O9K25
$$ -132 -260 -309 302 105 98 -176 44 -72 -23 -7 -85 26 168 8 -96 56 -92 -184 -66 44 -134 -65 160
7611A60j84J22o8P2J54l88L00l73Q3J94L0j14j49P9M6O2P6r3k87K03Q5l2P6Q2
$$ 160 -24 98 30 102 256 -132 168 -205 -122 72 102 -12 -161 -82 -36 26 102 9 -278 -75 10 -22 54 136
7635A36L0J1j32l3j21qL38l36L38l27J74K5j41k7K58k14P4O3J27l89M8N8J17O9
$$ 136 166 177 45 12 -109 -117 221 -115 223 -104 70 95 -46 -73 185 -29 45 108 235 -154 -106 -48 69 138
7659A38j62l02J89J02L8J6K26k71k03J62J10k89K35j80%L61j92J48m8l82K69M1
$$ 138 -24 -326 -137 -35 3 19 245 -26 -229 -67 43 -246 -11 -191 -191 170 -22 126 78 -304 -35 6
7681FL0K04j6k7J33o52M50l06Q5j61P5J14r2L43j57n8o1Ok9n1K59N8k00j46K48
$$ 6 36 240 224 197 330 -322 128 -178 -93 -254 -179 -65 -157 186 29 -29 -90 -84 -113 -164 95 153 -47 -193 55
7706E5j14Q6Q5m6j41K16j27k27K3l6M29k35L0J87j29j65J16J6j09k7J69k7J25
$$ 55 -59 27 112 66 -75 141 14 -213 -190 -226 203 -32 -2 185 56 -109 7 23 -86 -113 56 29 154
7729A54j78p0J09k00k7L74j35J67j3J5o3j63j73J60R3m0R5j78J65j76j15o0O7
$$ 154 -24 -94 15 -185 -212 162 27 194 181 196 133 -30 -203 -43 50 10 105 -73 92 -84 -199 -259 -192
7752a92l3kJ12L70k47J9j10J83p5J9j64J74J86j32j83K52n3l3K7l20K41K5j06
$$ -192 -225 -227 -115 255 8 27 -83 100 25 44 -120 54 240 108 -75 177 124 91 118 -202 39 64 -42
7775d2o6pj9J64j28PK3j2J21k30L34j23k99L62l36K7K08J83Q4l00Lj21K75j99
$$ -42 -108 -115 -134 30 -98 -91 -68 -80 41 -189 145 22 -277 85 -251 -224 -16 167 251 -49 -46 -167 108 -91
7799i1M09k56k17K32j76J29j77L05r0M5J05j26k26jM8j73J59r5J34r6JJ36P5k6
$$ -91 318 62 -155 77 -99 30 -147 158 68 113 218 92 -134 -135 -87 -260 -101 -196 -62 -158 -157 -21 54 28
7823B8j41J75J22j35J94j18p7k7N3j99j23J84Q8j96J93rO8NJ1k26k5J56m6J68
$$ 28 -113 62 184 49 243 125 48 21 74 -125 -248 -64 24 -172 21 12 80 85 96 -130 -155 1 -45 123
7847A23k39J84R4j88m5K27j31j8J9LL9R1j83J73n3L5J9j02k87J85p0K42j68J73
$$ 123 -116 68 162 -26 -71 156 25 7 26 29 68 159 -24 149 96 131 150 48 -239 -54 -124 118 -50 123
7871A23k41L34m19j4J85k13K96l7J89k86K98j96M3J02k34j03J53j11J20N6L4j53
$$ 123 -118 216 -203 -217 -32 -245 51 14 203 -83 215 19 62 164 -70 -173 -20 -131 -11 45 79 -74
7893g4N2mK28j52j54K85j72J35k02M0RJ18j07mJ8J59m3M3j43J3j87J00k36J21
$$ -74 -22 -26 202 50 -104 181 9 144 -58 -18 -9 109 2 -2 16 175 132 175 32 45 -142 -42 -278 -157
7917a57J18J60k46L28r7j39j43J1Q4o7J53r5J11j19n3L17k19j26J20p9K00j11
$$ -157 -39 121 -125 203 106 -33 -176 -165 -81 -148 5 -90 21 -98 -151 166 -53 -179 -59 -138 62 -49
7939d9J04q3j01j0J64j45j0K1q8J38K39k66j1L56l08k0J38k22J90L6j60K60K43
$$ -49 55 -28 -129 -139 25 -120 -130 -109 -197 -59 180 -86 -97 259 -49 -69 69 -153 37 73 -87 173 416
7962D16n31j16K08l1j59N5J86k2k40L07Q7j12n6p4O8j98J72J39n7K81k00ok49
$$ 416 -115 -231 -23 -54 -213 -158 28 6 -234 73 160 48 -8 -82 -14 -212 -40 99 42 323 123 117 -132
7985a32m7Lj08J66K63j23J09k15N8J29k88R9J7K78k51J8K2K37j62J56n18K73N1
$$ -132 -179 -176 -284 -118 145 22 131 -84 -26 103 -185 -86 -69 209 -42 -24 -2 235 73 229 -289 -16 35
8008C5J33k20J16o2J88k06J73l81K30M3j42J42J09L9l15L05k56J49j4m14J55K21
$$ 35 168 -52 64 2 190 -16 157 -224 6 49 -93 49 158 197 -118 187 -69 80 66 -348 -193 28
8030B8Q8K2j5r6P6k64J77K19k09k24J50Q0j60K27j8j9l70K41k0j24J71O5j89K69
$$ 28 116 138 123 27 103 -161 16 235 26 -198 -48 32 -128 99 81 62 -308 -67 -87 -211 -40 25 -164 105
8054A05j7n7R8Nk6K30j25k77J31l2k07L17O7r1j13k53R2K90k4r2O0j21K13r1r2
$$ 105 88 31 129 134 108 338 213 -64 67 35 -172 145 212 121 8 -245 -153 137 113 21 81 -40 173 82 -10
8079a0p7j18L79l8j19J0l3%m1O3j71L05j06l0J94k45p9K05m1N2k99M03r7j24L17
$$ -10 -87 -205 174 136 17 27 -6 -6 -47 16 -155 150 44 14 208 -37 -116 89 48 100 -199 204 107 -17 300
8104C00l43N1J3j10J3k5O4J18p2J89k21k20J94Rm0J81j40L52j93l90L94n01K7
$$ 300 -43 8 21 -89 -76 -101 -37 81 9 198 -23 -243 -49 -40 -80 101 -39 313 120 -270 124 -377 -350
8127c50L03Q1K06j77r7O7n5J09J70j49j94n2Q4j7J37L22k69k40J56j44j8J28J43
$$ -350 -47 34 240 63 -34 33 -22 87 257 108 -86 -138 -54 -71 66 388 119 -121 35 -109 -127 1 144
8150A44l60J37Q2K0L2J23j01o3p5k5P4J30j80K61n97K64O4M2K22m02J94j90J93
$$ 144 -216 -79 3 23 55 178 77 14 -61 -86 -12 118 -62 199 -398 -134 -70 -28 194 -208 -14 -204 -11
8173a1J05o1mo9j60j64L18PP3m9j80L85j1j88k0jJ51l41
$$ -11 94 33 29 -40 -200 -364 -46 -39 34 -15 -195 190 179 -9 -29 -30 121 -220
8191b20
$$ Imaginary data points
##PAGE= N=2
##DATA TABLE= (X++(I..I)), XYDATA
0@%%%%%%%%%%%%%%%qJ6j6J6j6J7k5L2l3M1m9N7o6P5r0J05j21J38j54J70j92K17
$$ 0 0 0 0 0 0 0 0 0 0 0 0 0 0 0 0 -8 8 -8 8 -8 9 -16 16 -17 24 -25 32 -34 41 -49 56 -65 73 -81 89 -103 114
37A14k43K74l06L39l75M15m61N11n65O25o90P60q37R22j016J120j235J364j509
$$ 114 -129 145 -161 178 -197 218 -243 268 -297 328 -362 398 -439 483 -533 587 -648 716 -793
56g93J673j859K076k332K635l001L458m048M837n956P691j0758J7824o8896j2233
$$ -793 880 -979 1097 -1235 1400 -1601 1857 -2191 2646 -3310 4381 -6377 11447 -57449 -69682
71f9682Q2490P349K9671L1572n203o7763m4564j2389p68n021K9699N4032M0351
$$ -69682 12808 20157 49828 81400 76197 8434 -36130 -48519 -49287 -54308 -24609 29423 69774
84F9774r052k3532j6294k7380n4482k4126L1269L8515J4579L1107M2443k495m8787
$$ 69774 60722 37190 20896 -6484 -60966 -85092 -53823 -15308 -729 30378 72821 70326 21539
97B1539l4052j3264j9531j3564K6814M8228K9007K834l669r759l2780m6872k0681
$$ 21539 -12513 -25777 -45308 -58872 -32058 16170 45177 48011 44342 34583 1803 -45069 -65750
110f5750J6113J8744J4466L5342M0988J085l0697k1080j6484l2571j9755K2252
$$ -65750 -49637 -30893 -16427 18915 59903 60988 30291 9211 -7273 -39844 -59599 -37347
122c7347L7523K3359J4561J3846o713l5459m1090j9696J405O654J8565L9270L5226
$$ -37347 176 23535 38096 51942 45229 9770 -31320 -51016 -49611 -42957 -24392 14878 50104
135E0104J187j8347j3007k1068l5089j5209J9594K4945J5425K0661K0123p086
$$ 50104 51291 32944 19937 -1131 -36220 -51429 -31835 -6890 8535 29196 49319 42233
147D2233l1252k8588j6180j1166j635J8887L5895K7503N538m568q331k4019l3347
$$ 42233 10981 -17607 -33787 -44953 -46588 -27701 8194 35697 41235 36667 28336 4317 -29030
160b9030j3025J2731J4080J2915K4984K1570o267k3931j8526j6261j8735o119
$$ -29030 -42055 -29324 -15244 -2329 22655 44225 37958 14027 -4499 -20760 -39495 -45614
172d5614J7458K8014K0721J0844O159m384k3379k9037j2790L802N765J2056K7113
$$ -45614 -28156 -142 20579 31423 37582 33198 9819 -19218 -32008 -28206 -22441 -10385 16728
185A6728K2013m358j7141j3064j7103k3957p376J7065K2517J5932J5027J1946
$$ 16728 38741 34383 17242 4178 -12925 -36882 -44258 -27193 -4676 11256 26283 38229
197C8229m608k2109k3853j1197l271N21J2316K5907J9396j123r247r415j8682
$$ 38229 33621 11512 -12341 -23538 -26809 -26288 -13972 11935 31331 30208 20961 11546 -7136
210g136k5232q351J3291J6396J3483J9160J6087m085k0107j8254j1179j0104l190
$$ -7136 -32368 -40719 -27428 -11032 2451 21611 37698 33613 13506 -4748 -15927 -26031 -29221
223b9221J3214K3892J5684K216k224o922k0247k3497q034Q219J0552J3145K1273
$$ -29221 -16007 7885 23569 25785 23561 16639 -3608 -27105 -35139 -26920 -16368 -3223 18050
236A8050J6783k801j5951j4569j2954j4065m994J2738K1010J4047O412L010o249
$$ 18050 34833 32032 16081 1512 -11442 -25507 -30501 -17763 3247 17294 23706 26716 20467
249B0467k0336k2086q707K980O021J3391K2591J7037o15j1023j1329j4675j7194
$$ 20467 131 -21955 -30662 -27682 -21661 -8270 14321 31358 30743 19720 8391 -6284 -23478
262b3478o655J0835J6940J2802J0164P443m743j9601j9572r061l120J705J3662
$$ -23478 -30133 -19298 -2358 10444 20608 28051 23308 3707 -15865 -24926 -28046 -26341 -12679
275a2679K3296J6101J710n303q434j7007j9652o638Q122J2196J1881J4993J1113
$$ -12679 10617 26718 28428 23125 14691 -2316 -21968 -28606 -20484 -8288 3593 18586 29699
288B9699m929j7442j6380j0890q843j478J4535K1774J5093M967J185o960j9046
$$ 29699 24770 7328 -9052 -19942 -28785 -30263 -15728 6046 21139 26106 27291 20331 1285
301A285j9634p234L671P230J2402J7845J2789l459j2931j3151j3510j3354l457
$$ 1285 -18349 -25583 -21912 -14682 -2280 15565 28354 24895 11964 -1187 -14697 -28051 -31508
314c1508J2926J8899J3663R533N801n063j8833j8579q407j232K707J1920K0293
$$ -31508 -18582 317 13980 23513 29314 24251 5418 -13161 -21568 -22800 -20093 -8173 12120
327A2120J3476j378q439r635j5669j7029n140J0557J5206J2627J3895J0796m054
$$ 12120 25596 24218 15779 6144 -9525 -26554 -31694 -21137 -5931 6696 20591 31387 27333
340B7333j7597j6660r384o928j847J2310K0412J2768J847j930p108j7628j8784
$$ 27333 9736 -6924 -16308 -23236 -25083 -12773 7639 20407 22254 20324 13216 -4412 -23196
353b3196o082P262R266J2270J7327J3287k867j3747j2930j1392j2110m020J1260
$$ -23196 -29278 -22016 -12750 -480 16847 30134 27267 13520 590 -10802 -22912 -26932 -15672
366a5672J8117J1392N878L489n448j7763j8350o276J795M065J2238K0094J3591
$$ -15672 2445 13837 19715 23204 17756 -7 -18357 -24633 -22838 -18773 -6535 13559 27150
379B7150q28q683r788j3671j5486n800R342J4229J0519R850P970l722j7061j6189
$$ 27150 26322 17639 7851 -5820 -21306 -27106 -17764 -3535 6984 16834 24804 21082 4021 -12168
393a2168p433l253m51J1865K0691J3264J169l007o176j5464j7696o209O643Q998
$$ -12168 -19601 -22854 -23305 -11440 9251 22515 23684 20677 14501 -963 -18659 -24868 -18225 -9227
407i227R548J3173J0867k945j4048j2948q173q295l284J1167J8737J1901L785
$$ -9227 321 13494 24361 21416 7368 -5580 -13753 -22048 -25332 -14165 4572 16473 20258
420B0258K839l963j6087j7910o363K593L689R191J6227J2129j751r641r471j1009
$$ 20258 23097 19134 3047 -14863 -21226 -18633 -14944 -5753 10474 22603 20852 11211 1740 -9269
434i269j1824m741R774J5609J0373P460O727k353j5715j5427o458k050p42Q829
$$ -9269 -21093 -25834 -16060 -451 9922 17382 24109 21756 6041 -9386 -15844 -17894 -18636 -9807
448i807J6789J0895qm114o448j2018j3664n415P085J1223R602J0232R766j664
$$ -9807 6982 17877 17869 13755 7307 -4711 -18375 -23790 -16705 -5482 4120 14352 24118 22454
462B2454j3701j3352p041o116k933Q813J5701R788J703L35m179j2996j4042m661
$$ 22454 8753 -4599 -11640 -17756 -20689 -11876 3825 13613 15316 15651 11472 -1524 -15566 -20227
476b0227L490O800R127J2728R826l38r849j0265q634r306m726P670J4103Q344
$$ -20227 -16737 -9937 -810 11918 21744 21406 11557 1292 -7342 -16648 -21374 -13704 399 8743
490H743M107M376l035j4011j2496l931J5K663R315J4195Q935j27n430p547r884
$$ 8743 12850 17226 14191 180 -12316 -16247 -16232 -13569 -4254 9941 18876 18749 13319 5772 -4112
505d112j0834m769N954R944P984O794O815k055j2760j1087m881l559j96J0042
$$ -4112 -14946 -19715 -13761 -3817 4167 10961 17776 15721 2961 -8126 -13007 -16566 -16762 -6720
519f720J4251Q074J676j459n999j1498j1843m456L707O944P259R014Q118j291
$$ -6720 7531 15605 17281 15822 9823 -1675 -13518 -17974 -14267 -7323 -64 8950 17068 15777
533A5777j0288r070n765o623k650R114J3832P510L663K188m455j2830j1518m876
$$ 15777 5489 -3581 -9346 -15969 -18619 -9505 4327 11837 15500 17688 13233 403 -11115 -15991
547a5991J100M441P899J0612Q055j004q303p516o646p838l176Q438J2099O280
$$ -15991 -14891 -10450 -2551 8061 16116 15112 6809 -707 -7353 -15191 -18367 -9929 2170 8450
561H450M744N336l347j2781j0664m573j910P68Q050J2224P606O52m720o063q595
$$ 8450 13194 18530 15183 2402 -8262 -12835 -14745 -13977 -5927 6297 13903 14555 9835 3772 -4823
576d823r408l749O460J0182O657O720O608k690j1572r513m833m597j342Q173J1488
$$ -4823 -14231 -17980 -11520 -1338 5319 12039 18647 15957 4385 -5128 -9961 -14558 -15900 -7727 3761
591C761P165J941p89m825r427j0330m559L701P373P464R506Q038j372j0141r304
$$ 3761 10926 12867 12078 7253 -2174 -12504 -17063 -13362 -5989 1475 10981 19019 17647 7506 -1798
606a798o535p100k583Q084J1810P060L416K047m210j0920j0145m061J295M695
$$ -1798 -8333 -15433 -18016 -9932 1878 8938 12354 14401 10191 -729 -10874 -14935 -13640 -8945
620h945P155J0516Q606k15p074p556p224r728l850O450J0590O216N891N117l146
$$ -8945 -1790 8726 17332 17117 10043 2487 -4737 -14465 -18315 -11865 -1275 4941 10832 15949 12803
635A2803j0864r919m465j936J903Q132J1337Q359R37m220o023q665j0155m927
$$ 12803 1939 -7980 -12445 -14381 -12478 -4346 6991 15350 16287 12067 6044 -2621 -12776 -17703
649a7703M760P876O245Q381O523j851r470q643o005m977m82Q034J1377Q039L186
$$ -17703 -12943 -5067 1178 9559 16082 14231 4761 -3882 -9887 -14864 -15346 -7312 4065 12104 15290
664A5290m06m752j0038j1019n376K389N100O631R514P940p95p913o855o193p625
$$ 15290 14884 10132 94 -10925 -16301 -13912 -8812 -2181 7333 15273 14478 6565 -290 -6483 -14108
679a4108k173O764J0728P099M952L097l457j0220j0973n583m17K159O474J0887
$$ -14108 -16281 -9517 1211 8310 13262 16359 12902 2682 -8291 -13874 -14291 -12132 -5658 5229
693E229Q787N29m908n623p772r501l064N413Q541O996O968N644k641r695r297
$$ 5229 14016 14545 9637 4014 -3758 -13259 -16323 -10910 -2369 4627 11595 17239 14598 4903 -4394
708d394o240m195j71O470J0921Q529K193j451l812q678r988m830L801O006O397
$$ -4394 -10634 -14829 -15000 -8530 2391 10920 13113 11662 7850 -828 -10816 -15646 -11845 -5839 558
723E58Q861P339j342q184q026o547o525k208N749J0050P548L928J684k454q525
$$ 558 9419 16758 15416 7232 -794 -7341 -13866 -16074 -10325 -275 7273 11201 12885 10431 1906
738A906j0224n017R10L381O235R754Q088J67n561o168p506q630l979M886Q347
$$ 1906 -8318 -13335 -12425 -9044 -2809 6945 15033 15200 9639 3471 -4035 -12665 -16644 -11758 -3411
753c411P210N463M742j614q350r377m719k208Q59N983J0027P658J284k258m430
$$ -3411 3799 9262 14004 12390 4040 -5337 -10056 -12264 -11405 -5422 4605 12263 13547 11289 6859
768F859q048r741m191L041N989N919P400O398j004p031p163n629m324j573N512
$$ 6859 -1189 -10930 -15121 -12080 -6091 -172 7228 13626 12622 5591 -1572 -7201 -11525 -13098 -7586
783g586R766P015K879L37l084q332r441m764J304L140N198Q691O808N06m914n583
$$ -7586 2180 9195 12074 12411 9327 995 -8446 -13210 -11906 -8766 -3568 5123 11931 12437 7523 1940
799A940n870o552k794M694P746O596M407K624j635p823r165m795j376J004N117
$$ 1940 -3930 -10482 -13276 -8582 -836 5760 10167 12791 11156 3333 -5832 -10627 -12003 -10999 -5882
814e882Q856P116J435k838l998o497p396l534L721O213N530N604M650j219p273
$$ -5882 2974 10090 11525 8687 4689 -1808 -9204 -12738 -9017 -2804 2726 8330 12980 11761 4488
829D488p657m969k884j147M841Q644O544K141n89k306o528q029l451K076L801
$$ 4488 -3169 -8138 -11022 -12169 -7328 1316 7860 10001 9412 7106 578 -7451 -10902 -8826 -5025
844e025M488P040N432m23n644n908n092n105k130M083P516N681L337J931j656
$$ -5025 -537 6503 11935 11512 5868 -40 -5132 -10237 -12367 -8284 -768 4913 8250 10181 8525
859H525o631p590l396N08J678M396P475O101P6m042m536n542o861k662L464O304
$$ 8525 1894 -5696 -9092 -8584 -6906 -2510 4965 11066 11142 7100 2564 -2978 -9839 -12501 -9037 -2733
875b733N389M652L207o86o687p109l671j047q9M404P960N859O25j920l142o246
$$ -2733 2656 7308 10515 9829 3142 -3967 -7638 -8685 -8774 -4370 3590 9449 10074 8154 5012 -1234
891a234p618l061K938M442M778N696M507p03n447n857l792l266j067M307P427
$$ -1234 -8852 -11913 -8975 -4533 245 5941 10448 9745 4298 -1559 -5351 -8617 -9684 -5377 2050
906B050N555J238Nk122o556p713k916J647K381M045P063N430p83m165m285m266
$$ 2050 7605 8843 8848 6726 170 -7543 -10459 -8812 -6431 -2386 4677 10107 9324 5159 874 -3392
922c392m931j821M023O506M839L058J751j545o981p323l308l14R46M173P783N705
$$ -3392 -8323 -10144 -6121 385 5224 8282 10033 8488 1507 -5816 -9124 -9438 -8492 -4319 3464 9169
938I169J26k393l211n653n977k236L469N152M610M269K832j016o080o989l720
$$ 9169 9295 6902 3691 -1962 -7939 -10175 -6706 -1554 3056 7325 10157 9141 3061 -3928 -7648
953g648j743k67L968P786N468J285j051k254n808p157k212K256L574M709N543
$$ -7648 -9391 -9658 -5690 2096 7564 8849 7798 5544 -264 -7421 -9633 -7377 -3803 906 6449
968F449M025q59n285n829m406l371j556M111P126N132K457J033j658o265o897
$$ 6449 10474 9615 4330 -1499 -5905 -9276 -10832 -6721 405 5537 7994 9027 7369 1104 -5793
983e793k604M95J498M654O811M739j30l703m354n496n341j565K992N820N448L629
$$ -5793 -8397 -7902 -6404 -1750 5061 9800 9670 5967 1613 -3883 -9224 -10789 -7797 -1977 3471 7100
999G100K720j137o165o379l040j219L36M329P290M738N18j660l433o182o055k518
$$ 7100 9820 8683 2518 -3861 -6901 -8120 -7784 -3455 3835 8573 9091 7431 3998 -2184 -8239 -10757
1015a0757J969M500N194N039M234n48n206n816l960k921q67M092P031M693J640
$$ -10757 -8788 -4288 906 5945 10179 9631 4425 -1391 -5351 -8272 -9139 -5047 1984 6677 8317
1030H317K74k755o107o707k577N46L121M575N807M287N63l425m842m704l733k241
$$ 8317 8591 5836 -271 -6978 -9555 -9009 -5888 -1313 4494 8781 9344 5919 1077 -3627 -7360 -9601
1046i601L052O533M713K705J757j533o061o816l016p39R27M587O876M723Q42j716
$$ -9601 -6549 -16 4697 7402 9159 7626 1565 -5251 -8267 -9006 -8079 -3492 3384 8107 8949 7233
1062G233l782m895n239k306K065M329M731L694L200k83n410n992l601k487o84
$$ 7233 3451 -1444 -6683 -8989 -6924 -2595 2136 5830 9030 8747 3337 -2655 -6256 -8743 -9427
1077i427L896O800M914J962K53k706n527n697k567N44L348M115M840L551M90m385
$$ -9427 -5531 1269 6183 8145 8398 5692 165 -5532 -8099 -7555 -4207 -92 4748 8299 8789 4404
1093D404m921l595l625k029K984O213M598K773J660j337n148n997l004p27J827
$$ 4404 -517 -4112 -7737 -9766 -6782 -569 4029 6802 8462 7125 1977 -4020 -7024 -7751 -5924
1108e924L890N319M437Q90k745m170m531m224k447K504M942M058L556K783l21
$$ -5924 -2034 3285 7722 8612 5867 1697 -2834 -7058 -9505 -7001 -2059 1999 5555 8338 8017
1123H017m656n478l124j900L39L225N341M254J727j519k738m575m587l278J611
$$ 8017 3361 -2117 -5241 -7141 -6802 -3577 1764 6018 7745 6226 3488 -1087 -5674 -8952 -7341
1138g341L462M067M241L600K80m338m474l522k328r54K623N035M200J904L72j707
$$ -7341 -3879 188 4429 8029 8309 3971 -503 -4025 -6353 -7307 -4684 351 4551 6455 6827 5120
1154E120m453m969l188K27K253L176M415M447R95k727l753l203l842k141K306
$$ 5120 667 -4302 -7490 -7263 -5010 -1834 2581 7028 8023 5296 1543 -1660 -5502 -7643 -5337
1169e337M408L536K534J966j399l884n088k972p83J159K914M499M247J503j530
$$ -5337 -929 2607 5141 7107 5708 1824 -3264 -6236 -7019 -5860 -2946 1553 5800 7303 5773
1184E773k776l478l956k767J572L707L036L000K596k28m005m253k870k027k00
$$ 5773 2997 -481 -4437 -7204 -5632 -1925 1111 4111 6707 6479 2474 -1779 -4649 -6676 -6876
1199f876K834M560M360J470m92j667l471m419k713P17K319K861L701L151J08l270
$$ -6876 -4042 518 4878 6348 5856 4189 718 -3701 -6414 -5697 -3378 -517 3184 6335 6443 3173
1215C173l524k994k474r80K173M358L495K261J066j467l487m569k618J68J074
$$ 3173 -351 -3345 -5819 -6799 -4626 -268 3227 5488 6554 5087 1600 -2969 -5587 -5419 -4345
1230d345K852L781L719L82k603k602l518l325j720K242L779L291K737K074n43
$$ -4345 -1493 2288 6007 6389 3786 1184 -2334 -5659 -7379 -5137 -1358 1933 4670 6744 6201
1245F201l879m197k659q97K50K340M207L600O20j000k006l452l978k209J598K913
$$ 6201 2322 -1875 -4534 -5431 -5181 -2841 1366 4966 5586 4586 2580 -872 -4850 -7059 -5461 -2548
1261b548K992L458K788m85l273l569k520j810q93K264M391L079J256n4j444l545
$$ -2548 444 3902 6690 6205 2932 -637 -3157 -4967 -5860 -3596 795 3874 5130 5076 3632 87
1277H7m220k320O21K168K617M150L347J56k757k974k906k984j371K069L977K972
$$ 87 -4133 -6453 -5832 -3664 -1047 3103 6450 6606 3849 875 -2031 -5015 -6386 -4317 -340 2632
1293B632J893J291j088l618m345k179l99J019K696M355L391N59j382k360l757
$$ 2632 4525 5816 4728 1110 -3235 -5414 -5813 -4794 -2098 2257 5648 6207 4825 2465 -1292
1308a292l561j187J319L152K622K644K311q50l304l855k495j209M5K392M664L541
$$ -1292 -4853 -6040 -4721 -1569 1053 3697 6008 5158 1854 -2001 -4496 -5705 -5660 -3268 1396 4937
1324D937P69k43j914l488m035k183J186K228K553L572K277n9k808l204k675k622
$$ 4937 5706 5463 3549 61 -3974 -6157 -4971 -2743 -190 3382 5659 5600 2792 -412 -3087 -5709
1340e709p37K485L998L284K153N11j410l388l996k445q2J102K674L982K980l7
$$ -5709 -6446 -3961 37 3321 5474 5985 4575 1187 -2809 -5254 -5336 -4234 -1560 2422 5402 5365
1356E365j742k711l140l106j153K135L118L313K708J712j043l377l655k760j148
$$ 5365 3623 912 -2228 -5334 -6487 -4352 -1234 2079 4787 6499 5456 2079 -1576 -4336 -5484
1371e484O44K306M147K703J262j361j605l461m038j150J108K465K879L634K012
$$ -5484 -4840 -2534 1613 4316 5578 4217 2612 -849 -4887 -6037 -4929 -2464 415 4049 6061
1386F061j16k807l395k867k131l55J889L868L225J525K3j459l353l643k051L01
$$ 6061 5945 3138 -257 -3124 -5255 -5610 -3721 147 3372 4897 4920 3461 108 -3535 -5586 -5285
1402e285J640K865L756K755K75k068k793k992k952j171J687L212K870K424J008
$$ -5285 -3645 -780 2976 5731 6006 3938 1145 -1847 -4799 -5970 -4283 -1071 1799 4223 5231
1417E231p73k942l973k314n88P71K553L796K966Q13q98j971l264l192j945J148
$$ 5231 4458 1516 -2457 -4771 -5359 -4588 -2035 1761 4727 5540 4642 2671 -593 -3785 -5730 -4582
1433d582K422K644K876J671j06k299l373l119j267L49J670L552L627R95r0j612
$$ -4582 -2160 484 3360 5031 4925 2626 -747 -3866 -5133 -4784 -3114 438 4065 5060 4970 3358
1449C358k717l569k084J41J671K485L424K194j6j666l067k867j751o75J328L361
$$ 3358 641 -2928 -5012 -4871 -3200 -715 2709 4903 4887 3221 154 -2713 -4464 -5139 -3811 -450
1465d50L135J764O11j85l328l514k482j36O73K051L092K833P10j163j917l201
$$ -450 2685 4449 5060 4875 1547 -1967 -4449 -4585 -3912 -1861 1231 4064 4774 3611 1694 -1507
1481a507k396j343J087K418L324K064J308j23k207l556k637j173N26J472K964
$$ -1507 -3903 -5246 -4159 -1741 1583 3647 4955 4832 2625 -931 -3568 -4741 -4215 -2743 221
1496B21L115J203n95j585k595k956j826O91K029K639K480K038K6j571l362k350
$$ 221 3336 4539 3944 2359 -236 -3192 -5018 -4327 -2298 341 2821 4859 4885 3314 -48 -2398
1512b398j478j030J236L298K806J195M12p45k537l087j754r8J070K245K782K335
$$ -2398 -3876 -4906 -3670 -372 2434 3629 4041 3296 759 -2328 -4082 -4180 -3110 -865 1917 4252
1528D252J010j837k101k646j970j335Q44K384K843J636M05K96k228l402j768k99
$$ 4252 5262 3425 1324 -1322 -3292 -4627 -3783 -1399 1444 3080 3485 3781 1553 -1849 -3617 -3916
1544c916M82J683K654L049O15q44j730k439k740j021N1K149K430J940J433L14
$$ -3916 -3434 -1751 903 3952 4567 3723 1993 -446 -3186 -4207 -4156 -2007 423 2363 3796 4110
1560D110k190k827j987o96j47J071L033K701J336o82r11k403k570j847j03J567
$$ 4110 1920 -907 -2894 -3590 -3737 -2666 367 3068 4404 3722 2811 408 -2162 -4009 -4112 -2545
1576b545K128K030J895O45j730k531k085j026p74Q65K791K587J458K19j75k708
$$ -2545 -417 1613 3508 4153 2423 -108 -2193 -3219 -3993 -3128 -337 2250 3708 3927 3752 1044
1592A044k924j747l05J032J337K952K087M28j005k011k033j776r25L26K619K378
$$ 1044 -1880 -3627 -3932 -2900 -1563 1389 3476 3904 2899 888 -1145 -2921 -3846 -3520 -901 1477
1608A477J613J112k89j932l296j872m19l37J407L000K466M97k97j325k390k285
$$ 1477 3090 4202 3913 1981 -1315 -3187 -3606 -3943 -2536 464 2930 3427 3130 1805 -585 -2870
1624b870j548Q31J979K292J953J508O1j913k606j828j517m73J294K965K297R13
$$ -2870 -4418 -3587 -1608 684 2637 4145 4206 2293 -313 -2141 -3658 -4131 -2837 128 2425 3338
1640C338J86r84k307k780j144J12J061K077K415K095L24j690k160k081j762j081
$$ 3338 3524 2540 233 -2547 -3691 -3579 -2518 -441 1974 4069 4393 2703 543 -1538 -3300 -4381
1656d381R83K639K238J079R56j39k428k644j407o23R20J445K881J898N51o17j817
$$ -4381 -3398 -759 1479 2558 3514 3375 947 -1697 -3104 -3727 -2807 -1362 1519 3417 3968 3351 1534
1673A534k364k277j065P24J783K016K019J491O5k314k190j838j029j71J335L171
$$ 1534 -830 -3107 -4172 -3448 -1665 351 2370 3861 3926 1612 -578 -2416 -3445 -3616 -2281 890
1689H90K235P92k41j273k549k348j591L58J384J613K698J778L11j765k257j900
$$ 890 3125 3917 3676 2403 -146 -2494 -4085 -3727 -2343 -730 1968 3746 4057 2292 35 -1865
1705a865j550q83J639K649K206J221N97o50k355k960j370l40L52J891K564K146
$$ -1865 -3415 -4298 -2659 -10 2196 3417 4014 3364 1009 -1951 -3321 -3661 -3309 -1418 1146 3292
1721C292N22j245j678k076k109o45P47K237K184J419J410n23k105k263k091o67
$$ 3292 3814 2569 891 -1185 -3294 -3939 -3192 -955 1229 2648 4058 3535 1430 -833 -2924 -3591
1737c591k80J819K449K366O44q7j471j905k312j331M77J317K201K038J432J82
$$ -3591 -3871 -2052 397 2763 3407 3320 1849 -56 -2368 -3699 -3222 -1905 296 2334 3766 3948
1753C948j619k283k327j185m44J166K502K188J183L51r93j736k739j275l14J291
$$ 3948 2329 46 -2281 -3466 -3910 -2744 -242 1946 3129 3480 2487 751 -1988 -3263 -3577 -2286
1769b286J645K124J704R46j276j903k156k045n26P94J784K085J691P37l89j924
$$ -2286 -641 1483 3187 4133 2857 954 -1202 -3247 -3773 -2979 -1195 890 2581 3318 2929 1005
1785A005j969j632p92M60J482K262K134Q62n67j477k072k147j211J66J566K154
$$ 1005 -964 -2596 -3388 -2928 -1446 816 2950 3812 3245 1768 -304 -2451 -3662 -3496 -1930 224
1801B24J762J222k8j476k039j571j102m54J308K191K391O67L9r73j736k255j546
$$ 224 1986 3208 3180 1704 -335 -1906 -3008 -3462 -2154 37 2428 3095 3134 2161 425 -1830 -3376
1818c376p2Q68J993J908J831N5q35j813j699j485o02Q13J983J966J500J00m99
$$ -3376 -3448 -2580 -587 1321 3152 3207 2372 559 -1140 -2625 -3227 -2414 -431 1535 3035 3135 2636
1835B636j610k230j735l72M04J643J725J826R21o04j653j427j563r89M55J457
$$ 2636 1026 -1204 -2939 -3311 -2907 -1264 461 2287 3208 2604 951 -476 -2039 -3028 -2573 -1116
1851a116J960J550Q65J6j655k198j842m20r1J022J863K062R14j15j156j508j986
$$ -1116 844 2394 3259 3275 1620 -578 -2420 -2840 -2931 -1909 -46 2016 2930 2815 1659 151 -1835
1868a835j126K71J108J839J299J786K6j409k070j429j076m13Q42J740J999J053
$$ -1835 -2961 -2690 -1582 257 1556 3342 3368 1959 -111 -1540 -2616 -3029 -2187 -447 1552 2605
1884B605M34q33j346k094j484O6O38J479J639J527N40q77j690j982j168o56N27
$$ 2605 3039 2206 860 -1234 -2718 -2652 -2014 -535 1104 2631 3171 2294 604 -1378 -2546 -3202 -2675
1901b675J744J802J279M69k79r80k047j493m68L97J120J650J929M82o36j297j276
$$ -2675 -931 871 2150 2619 2340 1360 -687 -2180 -2648 -2251 -1131 519 2448 2930 2294 997 -279
1918b79j981r65N34J185J805J293J119J97j304j957j357n45k45J289J317J719
$$ -279 -2260 -3225 -2691 -1506 299 1592 2711 2908 1604 -353 -1710 -2255 -2500 -1211 106 1825
1934A825J007k39j005j316j861j238M7J048J156J783J507n1p16j823j329j307
$$ 1825 2832 2593 1588 272 -1589 -2827 -2780 -1732 -576 1207 2714 2663 1947 124 -1205 -2512
1950b512J27O90J355J919J025j01o77j174k006j326k09P29J048J894J640O80j077
$$ -2512 -2385 -1695 -340 1579 2604 2503 1826 652 -1354 -2680 -2889 -2160 -1112 782 2422 3102 2025
1967B025r07j661j420p35M37J415J562J337R71n92j425j725j583l28nJ314J610
$$ 2025 1118 -543 -1963 -2698 -2261 -846 716 2053 3024 2432 1007 -718 -2301 -2629 -2634 -1320 290
1984B90J754O02m90q30j302j538j037L5J149J489J408J050J33j191j485j764r29
$$ 290 2044 2646 2156 1326 24 -1514 -2551 -2516 -1367 122 1530 2580 2713 1522 37 -1727 -2656
2001b656k35Q66J664J818R89p0m45j201k012j440K53P39J221J674J527K0q85j416
$$ -2656 -2891 -2025 -361 1457 2446 2376 1931 730 -1282 -2722 -2469 -1730 -509 1165 2692 2712 1827 411
2019D11j554r93q38M61J749J827J111M24j26j500j508j563m15M44J062J531J813
$$ 411 -1143 -2136 -2974 -2513 -764 1063 2174 2598 2472 972 -536 -2099 -2514 -2070 -1008 523 2336
2036B336M37o74j089j606j372j151N36J178J675J407R85k1q23k053j249q04K3
$$ 2336 2773 2099 1010 -596 -1968 -3119 -2583 -1405 270 1677 2662 2641 1818 -235 -1484 -2288 -2265
2053b265O11J790J554J058l26r96j233j764j357K00J007J204J691J061N57j037
$$ -2265 -1654 136 1690 2748 2422 1426 193 -1571 -2928 -2728 -1721 -517 1174 2235 2792 1755
2069A755j411j335j147m08P01J538J452J180K78l87j478j832j226l48N77Q20J865
$$ 1755 344 -991 -2138 -2546 -1845 -307 1145 2325 2603 2216 738 -1094 -2320 -2668 -2091 -1271 594
2086E94J518M32l19j320j210j283j079K09J451J797R82O58J93j376j784j268p04
$$ 594 2112 2544 2225 905 -305 -1588 -2667 -2458 -1007 790 1772 2430 2623 1247 -537 -1805 -2509
2103b509L0J083J326J926O55k9r38j291j492j142N5O56J660J335R67l3o60j789
$$ -2509 -2479 -1396 -70 1856 2511 2482 1544 253 -1239 -2381 -2326 -1670 -10 1325 2292 2259 1599 -190
2121a90j265p53m73Q82J302J510R56N32o31j263j526q98j58J59J030J849R96M92
$$ -190 -1455 -2208 -2681 -1799 -497 1013 1969 2501 1870 607 -919 -1817 -1975 -1816 -786 1063 2059 2551
2139B551o43j227j599j127k59J18J380J327J118Q02j93j067j718j114o40M05J000
$$ 2551 1908 681 -918 -2045 -2304 -2186 -806 521 1639 2441 2248 1181 -537 -1651 -2291 -1886 -886
2156h86J083J631L81R2j295j452r10r81j26R78J365J413O92M41q83j427j346p22
$$ -886 197 1828 2209 2301 1006 -446 -1356 -2337 -2463 -1485 -120 1293 1985 2426 1543 116 -1230 -1952
2174a952j30M93J406J576Q13n5o89j251j491q46mN43J395R13J273J98l88j228
$$ -1952 -2082 -1589 -183 1393 2206 2151 1462 211 -1280 -2126 -2130 -1587 -192 721 1994 2192 1804 576
2192E76j471q01l17L03Q21J668Q75L22J15j547j138j131n50O13Q08J270J149M84
$$ 576 -895 -1696 -2013 -1710 -889 779 1654 1976 2091 544 -594 -1725 -2275 -1662 -854 416 1565 2049
2210B049m21o37j428q48p54K03J051R75R85O33p5o80j328j153q10L91P38J216
$$ 2049 1628 991 -437 -1285 -2039 -1836 -785 190 1175 1808 1733 1053 -275 -1428 -2238 -1847 -1109 107
2228A07J319P35l02l57j355j195r34j33R08J085R75R73k4l57j367r47r61l11P72
$$ 107 1426 2161 1859 1502 147 -1048 -1982 -2115 -1207 -122 853 1826 1802 1445 78 -869 -1830 -2141 -1369
2247a369J199J133P98n1j94q46j147r96o85P91Q87J025R49M57m16j201q94q57
$$ -1369 -170 963 1761 1710 1516 670 -477 -1473 -2158 -1367 -480 545 1494 1951 1535 334 -560 -1417
2265a417m82J45J164J359O59O08j81r91j085j262m04K75P25P50J359R75m68j050
$$ -1417 -1899 -1754 -590 769 1428 2036 1855 864 -221 -1483 -1887 -1612 -887 -137 1222 2197 1729 679
2283F79r56j005o63q3J128J229R02N10K45q21j041j122m57m15N45J298J343M30
$$ 679 -277 -1282 -1945 -2028 -900 329 1231 1741 1986 1165 124 -998 -1455 -1870 -1325 -27 1316 1746
2301A746Pn29r97j040j009n5O14Q75J144J224K21q73r91r74q65n50M16J316J003
$$ 1746 1753 1224 227 -813 -1822 -1877 -1263 -388 756 1980 2201 1328 337 -637 -1502 -2052 -1636 -320 683
2320F83Q10K73Jj447j206o70n10N67O07J530P99N36k40r28r46r96p28K57N78J470
$$ 683 1493 1766 1767 320 -886 -1556 -2066 -1499 -892 638 1437 1973 1733 805 -141 -1137 -1865 -1608 -1030 440
2340D40P62L59L22q54j476r46n27R3P51J036J549M38j80n81j187j013p89J05N36
$$ 440 1202 1561 1883 1029 -447 -1393 -1920 -1827 -1076 -40 1509 1947 1767 1186 -1 -1014 -1803 -1698 -1162
2359a162J088R06Q14L10p31j262r86n47o9M66J019J161M61K45j4r23j320j248
$$ -1162 -74 832 1646 1956 1225 -37 -1023 -1570 -1639 -1173 -154 1007 1468 1713 1699 776 -544 -1792
2377a792j39O37P94Q84R51N25m32j159r24q57k91L38R59R97P77O09k85o87j499
$$ -1792 -1931 -1294 -500 384 1335 1860 1428 269 -655 -1512 -1803 -1465 -506 491 1268 1877 1592 905 -594
2396e94p89o39N13N70R00J444M12m41m63j039j035q20J48R17R07J085N69M13r49
$$ -594 -1383 -2022 -1509 -939 -39 1405 1817 1376 913 -126 -1161 -1981 -1833 -916 -9 1076 1645 2058 1109
2415A109r90j044r56L34N04O49J479N81R9m53j115r49j092Q5M94R88J112P53l77
$$ 1109 119 -925 -1881 -1547 -1043 -394 1085 1666 1765 1312 197 -752 -1844 -1759 -1265 -277 835 1588 1211
2434A211o9J12j206j272q96O51Q51J305O68R5k33p03j115q90m27L95Q56R65J103
$$ 1211 1142 1254 48 -1224 -2120 -1469 -618 687 1355 1450 1217 514 -601 -1491 -1918 -1523 -667 298 1401
2453A401N79m04j007o97r60k66k45P45J096O71O89J45p31j005j186l55oM26J038
$$ 1401 1980 1576 569 -128 -1088 -1354 -1599 -854 242 913 1602 1747 1016 11 -1175 -1530 -1536 -1110 -72
2472g2J133P70j90o68n45j238q63M6N22P53J255N42M5k45j063q82o42l73N05Q61
$$ -72 1061 1831 1641 973 428 -810 -1673 -1627 -1105 -352 903 1445 1490 1245 182 -700 -1342 -1715 -1210 -349
2492c49J097R75l2m70o01j072j160j24M51O81J029Q05K46j14q40j051o76l01J0
$$ -349 748 1723 1691 1221 620 -452 -1612 -1736 -1285 -604 425 1230 1476 1362 522 -529 -1205 -1506 -1496
2511a496Q46J232N21M04%p81r25q19n61J25O56Q37J063K74j35m08j094p86n61
$$ -1496 -650 582 1103 1507 1507 726 -199 -1018 -1579 -1454 -798 39 1102 1376 1241 833 -261 -1047 -1608
2530a608oN94R20J020N93L0o44o11j209o50M12J1Q81J093P16Kl66q32q00r43J63
$$ -1608 -1614 -1020 -100 920 1513 1543 899 288 -921 -1571 -1159 -1148 -267 826 1542 1544 1178 346 -454 -1397 -1234
2551a234J70Q24P42R43K20m37q12q27q65k59K60O48R80Q57J69l30l16q65j095
$$ -1234 -1064 -240 502 1445 1665 1228 416 -411 -1276 -1535 -1275 -627 353 1210 1379 1049 733 -132 -1227
2570a227k64L25O96Q35P94N22l33p41p36p57m69K11L45Q19Q24M30k38j36j034
$$ -1227 -1491 -1166 -470 365 1159 1681 1348 607 -129 -886 -1355 -1144 -799 20 844 1274 1036 900 -134
2589a34j002k7l9M73N25J106P29j66p20n02r49p03k1M09J056N82P74l47L21j173
$$ -134 -1136 -1163 -1202 -729 -204 902 1631 1465 745 243 -706 -1409 -1430 -1021 35 617 1391 1044 1365 192
2609A92r20n86p4L34Q62Q53O63j1m20k17j179m38m95L40O55P81O38J06j25l65
$$ 192 -728 -1314 -1388 -1054 -192 661 1324 1313 893 676 -503 -941 -1436 -1096 -441 340 978 1084 959 594
2629E94j127m36l69J38O56P34R75J57k28o01p51p04l60J19M25Q62P46L85M4n84
$$ 594 -533 -969 -1338 -1200 -544 190 1165 1322 1094 493 -258 -962 -1322 -1203 -778 84 830 1215 1259 675
2649F75q05p31m24J64M02R03P61K34J0l52r75o24n50kM85P30M58P42k4k62p40
$$ 675 -130 -861 -1285 -1121 -719 184 945 1179 1189 837 -138 -762 -1312 -1314 -829 -99 359 1101 1077 815 75
2670G5q04k40l57N44O53N98O94J52j60q45r51m41k24rO60J136M47n8K57o78n55
$$ 75 -729 -969 -1326 -782 -129 469 1163 1315 1155 310 -641 -1082 -1306 -1315 -655 481 928 870 1127 449 -106
2691a06j161k2L90N73P83M90M75k39p76q16n64l39J59L47R66O10M17J24m84p89
$$ -106 -1267 -1289 -899 -326 457 947 1422 1183 407 -409 -973 -1312 -1153 -806 160 770 1187 1311 827 38
2711C8j122l34L20N35O08P85L00J27m89n07p56q08L5N21Q01N79L93K62j32j227
$$ 38 -1084 -1418 -1098 -563 45 830 1130 1257 768 261 -495 -1303 -1268 -747 54 633 1026 1288 1156 -71
2731g1m43n49k50L63P64P89P07K5n34m47j070m97k45L37P62O44N19N68k13r33
$$ -71 -514 -1063 -1313 -950 -186 603 1310 1335 801 354 -716 -1213 -1458 -1121 -359 285 804 1372 1159 226
2751B26m31n38n90K12O90P47O26L02k71m94n32j010q5k8L85P42N51P86l85m95
$$ 226 -205 -743 -1333 -1121 -431 316 942 1244 973 479 -53 -1063 -1148 -1176 -791 -49 502 1288 903 408
2771D08n29n92j47k41N43O00P86L17K42m77o89r14p02J59M68N50P75O60k37k07
$$ 408 -121 -713 -860 -1101 -558 42 828 1145 1387 910 221 -693 -1395 -1236 -768 -218 557 1217 980 773
2791G73n04r44l05j19M72N91M72O38K48l70p92m78m73l67K36L59R66N09j6J14
$$ 773 269 -675 -980 -1099 -627 -36 436 1074 1322 952 160 -318 -791 -1158 -922 -563 403 912 896 1010
2811A010q78k44q07m6j42O55N72P07L65k96n01l30q19m92M7O76M42O22M28J55
$$ 1010 132 -112 -919 -965 -1107 -452 120 827 1192 896 395 65 -754 -1246 -1199 -523 -81 541 969 1124
2831A124n86n60o70m77O6P25K68O66L90J07l05p50n42n19j01J02P83Q15M00N4
$$ 1124 538 -22 -692 -1169 -1103 -378 -110 556 946 1053 748 -2 -544 -1063 -1164 -1062 -279 536 936 990
2851I90N7o97p31m98k33L78N11O71N13Q7k08n64m71p90q0L3P61M31K80P26l65
$$ 990 1047 350 -381 -879 -1112 -734 -223 448 961 1048 840 276 -195 -985 -1065 -1032 -271 160 440 1166 801
2872H01m49n73n29j36K30M00M17M33J82J79n42o75m34k98M9K33O82O08K04J13
$$ 801 352 -221 -750 -886 -656 -256 161 594 776 955 413 -262 -696 -994 -945 -712 -30 578 782 895
2892H95m00m42o08k96l6M15O08K66L51K48m55l66n04n02j30L7P51O75L61k3j35
$$ 895 495 53 -555 -851 -887 -472 136 402 753 1001 546 180 -324 -826 -956 -919 -168 507 868 845 710
2913G10n30m82o24j3K01P26L73M88K53l68n77n98m53j51k3O88P11J97K65K94n52
$$ 710 180 -302 -926 -939 -738 -12 361 849 1102 734 157 -441 -894 -1045 -1068 -380 331 528 793 1087 535
2934E35p01n97j51M94K08K73Q12J03k14j76r11l46k06k02L61R17J67L49K65l65
$$ 535 -166 -763 -914 -420 -212 61 873 976 762 586 -325 -671 -877 -1079 -718 199 366 715 980 615
2954F15o76o48j78J46J72N64O14M47k1m93m23o94l32n4M07M75M18K62L49j85n20
$$ 615 -61 -709 -887 -741 -569 -5 609 1056 1035 542 119 -575 -907 -961 -554 -79 339 601 950 765 245
2975B45r81r3n8L81L20O47J55L73l30l35m67q14M0L37L20K12Q57R6j15l73o27
$$ 245 -736 -829 -887 -506 -186 461 616 989 659 324 -143 -957 -917 -580 -260 -48 809 905 790 417 -210
2996b10m36l94L22J49N77M14N77j65n23n81n21k31L20J71O31O73J72j60k74m04
$$ -210 -646 -1040 -718 -569 8 422 999 834 311 -270 -791 -1022 -702 -531 100 773 945 785 511 107
3016A07m47l56j66K17O36O78J61O3o3p00l55o09j68N29L34N07M57p0j29m28o50
$$ 107 -340 -696 -862 -645 -9 669 830 893 830 130 -225 -834 -1002 -473 -139 368 825 755 626 198 -452
3037d52l42m9J23P47N5P40j2j3n80n81m20k02K55K97O64P43o2k44j50o78o65R6
$$ -452 -794 -843 -720 27 82 822 810 797 217 -364 -784 -986 -731 -434 230 973 911 667 517 -161 -826 -730
3059g30j22O05L62N90K51n7m15o00j82n82k5M00O87M57K49j86m01l72m81k53K39
$$ -730 -852 -247 115 705 956 899 484 -116 -298 -880 -905 -505 182 639 888 702 301 -71 -552 -805 -566
3080e66M5L51N39O60l70O7o13o36l01j37K81M16Q73O7J86k06l48p80l38J77q7
$$ -566 -521 -170 369 1029 659 726 113 -523 -824 -961 -680 -264 609 676 862 656 308 -472 -810 -633 -720
3101g20O54L27M31J30j81k21q65m48j31K67K65R50K86K40k66n15l74k15m16K31
$$ -720 -66 261 692 822 641 420 -445 -893 -1024 -757 -492 458 744 984 718 203 -171 -386 -802 -571
3121e71K10N01N22J82l08j06m01p41l1J55M4O67M38K23O8m94J02q32k98l9K49
$$ -571 -361 140 662 844 536 430 29 -712 -743 -588 -544 123 561 784 852 358 460 -372 -670 -709 -460
3142d60M18N35J57J42k95k60r18j41N0j13N29O62N04J89j99m32o09l93k2J20L56
$$ -460 -42 493 650 792 497 237 -681 -822 -772 -885 -356 306 810 999 800 368 -241 -634 -656 -536 -180
3163a80O31L47Pj6n76n28j56n0p6M32K91M82K51j32l37o53l82k64J56M17O95j9
$$ -180 451 798 805 789 213 -315 -471 -521 -597 -165 126 608 859 727 390 -263 -645 -909 -753 -336 359 340
3185C40M80k32n2n80m96j50n5M15J66O64K79J07j16o06l68m89K54J64R5O82M9
$$ 340 820 588 536 -44 -540 -690 -745 -330 -164 500 779 886 770 164 -204 -693 -439 -275 -180 502 551
3206E51R6ko68k25j94m95N72J35M00M66K8J2l80p20k39J32j1L08M40K22J43K8
$$ 551 647 645 -23 -248 -442 -937 -365 -230 170 636 664 676 296 -424 -663 -531 -542 -234 206 428 571 599
3228E99l86n52k12n9m2L95M45P14j64k12K3n76m28j29qk2P30J82K42K39m20l73
$$ 599 213 -339 -551 -610 -652 -257 188 902 738 526 549 -27 -455 -584 -592 -614 116 298 540 779 359 -14
3250a4m70q6J23j80N82N22J53J6m25j87m21k95j94O23O5N50K86L7J61r33j23n10
$$ -14 -484 -570 -447 -627 -45 477 630 646 221 34 -387 -682 -876 -253 -188 362 648 685 846 -87 -210 -720
3272g20J41j51O08M65L98q9k52k00l96m14j39L96q4O53J40J69j4m18m64Ml40J67
$$ -720 -579 -730 -122 343 741 652 400 200 -196 -610 -749 -353 -437 216 356 525 511 93 -371 -367 -707 -540
3294e40L55L73L68o6J16k00o25m31K8o1L94L72M35J62J03o75l0n40j03J2J2N61
$$ -540 -185 188 556 490 606 406 -219 -650 -622 -683 -289 83 518 680 783 108 78 -462 -565 -553 -541 20
3316B0M17K34L7j4q12j88l78K16k7N84N25j72J69k01n72j47n77K23K53K96K04
$$ 20 437 671 708 694 -118 -306 -684 -468 -495 89 614 442 611 410 -162 -309 -886 -663 -410 -114 90
3337I0M35K36p1k41m74l56j52j18O31K21K20L28l43j26o18n9j43J2K4R80J5Q7
$$ 90 525 761 690 449 -25 -381 -533 -651 -20 201 421 749 406 280 -338 -397 -540 -528 -504 476 491 578
3359E78rl23k95l54m00K71L45L06K75K27q7l63m2m40l41K65J66J30M21K75J18
$$ 578 569 246 -49 -403 -803 -532 -187 119 394 621 534 171 129 -311 -652 -387 -221 -91 330 605 723
3380G23n49j07j58o26K48J48L97O31n3o2j31n35m52j0M8O1K87K67O54j59j82l74
$$ 723 174 67 -91 -717 -469 -321 76 707 654 592 461 -74 -526 -536 -488 -427 -140 127 781 622 440 66
3402F6q3m55j69J03K98L00J53N39k57l23n44M9l05R6L26K63N63L8j27j37m81k53
$$ 66 -17 -472 -641 -538 -240 60 213 752 495 172 -372 -323 -628 -532 -206 57 620 658 531 394 -87 -340
3424c40k55q8L75K37L06M91k44j96n81n5l87J06J49L02O81J81J23n17k32l20j99
$$ -340 -595 -683 -308 -71 235 726 482 286 -295 -350 -737 -631 -482 -180 501 682 805 288 56 -264 -463
3445d63k64N95Q3L60L77K8m07r2n09l07j1K03J78O10K77n2j70m22j94j10l06O3
$$ -463 -727 -132 -49 311 688 716 309 217 -292 -599 -610 -407 -229 381 658 606 436 14 -180 -290 -596 -533
3467e33L16K42N10q9J59l05k95m18m0k49M42L60M40N1p9k73l11k48l33J1K60N14
$$ -533 -217 25 535 446 605 300 5 -413 -453 -702 -260 100 540 591 512 239 -72 -320 -653 -642 -382 132
3489A32J56L49k34j86j61m58o0M2L33J94L66L0O4k59R9o61l33k8K21L58K38J69
$$ 132 288 637 403 217 56 -402 -462 -420 -87 107 473 503 567 308 407 -254 -587 -615 -394 -36 202 371
3511C71%j0k93m96Q2j76M7L70K81N37j49k8n70j12k03m63L89L06N11J18J83k03
$$ 371 371 361 68 -428 -346 -522 -475 -105 176 713 564 536 -34 -146 -349 -812 -423 -117 394 512 695 492
3533D92k09p72o5Q7j32O84N8L01L7j8k06j24m94k2l30M97L45J98K27M0k72r0p16
$$ 492 283 -489 -554 -467 -599 85 143 444 481 463 257 133 -361 -383 -713 -216 129 327 554 594 322 232 -484
3556d84m6P6R5M20K71K60j72k11k39j75k48Q1J93j7O67j8k39J7k22l15j70k8J05
$$ -484 -530 -454 -359 61 332 592 420 209 -30 -205 -453 -372 -179 -196 471 453 214 231 9 -306 -476 -504 -399
3579c99L89N24j88K28K7k99l43k73M9k13K77L52L04J65j13k38l86k18j57J07L5
$$ -399 -10 514 326 554 581 282 -61 -334 -285 -498 -221 131 435 600 487 249 -137 -355 -512 -405 -370
3600c70J45P51L5q8k64r8m85L8k94J31P79j18N00j49n61P1l99J53j78K4M11L86
$$ -370 -225 526 561 473 209 111 -374 -336 -630 -499 280 162 662 513 -48 23 -376 -223 -401 -377 34 420
3622D20J38j87r5l95j59k13O0J09K93N78l23J42j19k53l04k52j9J50K55M08K48
$$ 420 558 371 276 -119 -278 -491 -431 -322 -29 549 226 368 249 -4 -308 -560 -579 -429 -174 234 482
3643D82J1m49j0k70p2j8k93M28J88K60M7J20l45j95l15O7q0K17M46J63j10P7M0
$$ 482 493 44 34 -236 -308 -326 -619 -191 -3 257 304 424 79 -116 -431 -364 -444 -227 219 382 272 349 389
3666C89l62m50r4k2K30J61L52J35O5r0l29l03L4l10L86L64J09K10L7j59j7n67
$$ 389 27 -423 -517 -539 -309 -148 204 339 404 314 -15 -318 -284 -594 -208 156 265 475 512 353 336 -231
3688b31m5q5J17J53J91M95O9k57l17l99j56n9R7L51L72oJ31l9j13n37J42j51j76
$$ -231 -276 -361 -244 -91 100 595 664 407 90 -309 -465 -524 -427 -76 296 290 421 382 269 -268 -126 -277 -453
3711d53J22N66J36J99k86k09l84Ql65L79Q1J06N89r9K17l85j72n16J24k01L41
$$ -453 -331 235 371 570 284 75 -309 -301 -666 -287 -206 -100 489 390 607 222 50 -466 -342 -543 -202
3732b02J55N42J1j09J51p10l21J6k6M2L80K40M54j35k78m05j33k08j69K00L57
$$ -202 -47 495 506 397 548 -162 -483 -467 -493 -451 -71 169 623 488 210 -195 -328 -536 -705 -505 -148
3753a48N55J42J5p7m24m57O1O7j78L59K45K19L85o33mk08l81j09J61N89j32L21
$$ -148 407 549 564 487 63 -394 -333 -266 -444 -85 160 379 764 131 127 -81 -462 -571 -410 179 47 368
3775C68L6k00J06l93j45j04o2L1M00M76k8rk56j47k47m01P6M08R9L94q0R2k63
$$ 368 404 204 310 -83 -228 -332 -394 -363 37 513 485 476 220 73 -174 -575 -499 -91 8 402 322 414 151
3798A51M1l82n0l04J90M10r6L62L3o8l64m39K34r5J3K53J96J86J46o7m36J43l94
$$ 151 192 -190 -240 -544 -354 56 -40 322 355 287 -77 -516 -282 -377 -364 -111 85 271 417 350 -86 57 -337
3821c37k53J16L25K23L92j7j8l23k87m31J48l2K69K17R4K70J03k82j44k97k40
$$ -337 -590 -474 -149 74 466 449 431 108 -179 -610 -462 -494 -225 -8 86 356 459 177 33 -264 -504
3842e04O9J40K92J15K49J4k43k01j86r8J6o9N20j17M82K88m41n92Q3l27P2J16
$$ -504 -435 -295 -3 112 361 375 132 -69 -255 -353 -337 -406 114 -3 479 767 326 -266 -183 -510 -438 -322
3864c22J09L85p9K74ol02l35q3J01q6L95J21M1J18J45l12j99l33K3j17K75K07
$$ -322 -213 172 93 367 361 59 -276 -359 -258 -344 51 172 213 331 476 164 -35 -368 -345 -462 -187 20
3886B0J42J80%K7k83m73o0l4L50J71K01K6J6m9m13n7l0r3J52L35J20M4M7o8l4
$$ 20 162 342 342 369 86 -387 -447 -481 -131 40 241 267 283 234 -179 -236 -266 -359 -207 128 248 292 339 271 237
3911B37o07n8L3J46M63J22K1Q4j02k91l40K40k60o8L69P6J55qk9k67P7l78r8K06
$$ 237 -370 -428 -395 -249 214 336 357 441 339 48 -292 -52 -312 -380 -11 65 220 212 183 -84 -7 -385 -483 -277
3935b77p5N91J63q1j31j13j02k22j57J53K27J51K73OK9j84m98j63J21j70K26L25
$$ -277 -352 239 402 321 190 77 -25 -247 -404 -251 -24 127 400 406 435 251 -247 -410 -289 -459 -233 92
3957I2qN79k12l24j7k09m37K58K12L6K28J48J23k62m61o4r5J85J17O2K98J17O5
$$ 92 84 663 451 127 110 -99 -536 -278 -66 -30 198 346 469 207 -254 -318 -413 -228 -111 -49 249 366 431
3980D31k16m55m0J4m2J34m5L44K69K20j85l28l18k5j65jN20j11J82k8L80k45k99
$$ 431 215 -240 -280 -266 -308 -174 -219 125 394 614 429 101 -217 -242 -407 -408 112 1 183 155 535 290 -9
4003ik97L9K66k33M85K6j49K85k94pm13j14J5K17R2K93L26k66K76m12k61j18j17
$$ -9 -306 -267 -1 -234 251 277 128 413 119 112 -301 -415 -400 -183 -91 202 528 262 538 126 -135 -253 -370
4026c70K01P6N19L7m61L86l08k79k08J78K11MK57M2K23l93j24Q3m92J07L5L11
$$ -370 -169 -93 426 463 2 388 80 -199 -407 -229 -18 -14 243 285 508 115 -9 74 -418 -311 -276 35
4048C5K43J5J3j75j87j9l23j2L11n4L82K25r7j1k81k68L2m58K75J21L35K32Q3
$$ 35 278 293 306 131 -56 -75 -398 -410 -99 -153 229 454 357 346 65 -203 -171 -629 -354 -233 102 334 417
4071D17m2l30l14l1J56m4J61L32o6K76r5j83l41k59Q2O3K72J99J19p7j56j27J12
$$ 417 375 45 -269 -300 -144 -188 -27 305 239 515 420 237 -104 -363 -281 -218 54 253 372 295 139 12 124
4094A24j62k74O5j32K45L56Q4J77k96k37O2o17J08M47L0K14%K73M2k19m20l06
$$ 124 -38 -312 -247 -379 -134 222 306 483 187 -50 12 -605 -497 -50 -20 194 194 467 509 290 -130 -436
4116d36L01j35L78M8nK00N6r6l95k45j55K19K04J63J19J68kk95k85o3q9J66J44
$$ -436 -135 -270 108 156 151 351 407 311 -84 -329 -484 -265 -61 102 221 389 387 92 -193 -256 -345 -179 -35
4139c5oJ55L71k96Q7m85L8q1JK9J1L55J28O4J66n58k76K15l26M59j71N70k00L27
$$ -35 -41 114 485 189 276 -209 -171 -252 -251 -222 -211 144 272 336 502 -56 -332 -117 -443 16 -155 415 215 542
4163E42j75k92j91j65j24K64K35j83L42J78l38L4m83j32k8K56L2K87J39j52R8
$$ 542 367 75 -116 -281 -405 -141 94 -89 253 431 93 127 -356 -488 -516 -260 -228 59 198 46 144
4184A44J84n90j12NJ13n7N23n3j0m4j02k7l17l9M1L06j48L00L74n5o0l83j27k53
$$ 144 328 -262 -374 -369 -256 -313 210 157 147 103 1 -26 -343 -382 -341 -35 -183 117 491 436 376 -7 -134 -387
4208c87r8J53K63M87j40J6K5m20k2o7K1R4K01j81N4J31J91j33n2k61l05L78k57
$$ -387 -485 -332 -69 418 278 294 319 -101 -123 -190 -169 -75 126 -55 -1 130 321 188 136 -125 -430 -52 -309
4231c09N47o4K56j80k45J02l23j29J55J12O2j20M29L7j61k29o2k23K1L01Q2J62
$$ -309 238 174 430 250 5 107 -216 -345 -190 -78 -16 -136 293 330 169 -60 -122 -345 -324 -23 59 221
4253B21R0r7k38j34j70J7J71j19J32L20P8O1l04N2k17l18N56k60K14N0K41O2o5
$$ 221 311 214 -24 -158 -328 -311 -140 -259 -127 193 271 332 28 80 -137 -455 101 -159 55 105 346 408 343
4276C43l60m9k27J7L14l8R4J99J75m92P0k18k46K07J76j30L64K28k56l7l5k19
$$ 343 -17 -66 -293 -276 38 0 94 293 468 -24 46 -172 -418 -211 -35 -165 199 427 171 134 99 -120
4298a20j65p6K81r8K17N2K9j68R5o4k27k31K33L20kK2J76o7k51M2j21j11Q6M8
$$ -120 -285 -361 -80 -178 39 91 120 -48 47 -17 -244 -475 -242 78 76 98 274 207 -44 -2 -123 -234 -148 -100
4322a00o6L66J20N7j66j21k03j22j41L34O1K17j3K10k42j29j95j81R7R0R9M51
$$ -100 -166 200 320 377 211 90 -113 -235 -376 -42 19 236 223 433 191 62 -133 -314 -217 -127 -28 423
4344D23j01k34K53m08J13k40j78K17j3J74K81k21j3l9j82j53q9K79LJ61J72K89
$$ 423 322 88 341 -67 46 -194 -372 -155 -168 6 287 66 53 14 -168 -321 -410 -131 -128 33 205 494
4366D94k23k11q0k90L53Pn4Q7q6L42nj98j74j67K3k4J49P8N7J94N6k17k30j07
$$ 494 271 60 -20 -310 43 50 -4 83 -3 339 334 136 -38 -205 -182 -206 -57 21 78 272 328 111 -119 -226
4390b26j42N4K26J47P1oL29m15l5k05j02o8J85J77J59J9%L0k79j17Q5j81J61K04
$$ -226 -368 -314 -88 59 130 124 453 38 3 -202 -304 -372 -187 -10 149 168 168 198 -81 -198 -113 -294 -133 71
4414G1O6j49K60j7j88j40j66J83r5P2M2L39Q6l73M3j0k47M6k79L81K08m9L74k20
$$ 71 137 -12 248 231 43 -97 -263 -80 -175 -103 -61 278 364 -9 34 24 -223 -177 -456 -75 133 84 458 238
4438B38K9k36j44j74K61k48L72K53j37J94l45j29R1k17n0J63J52k78K80r4K34
$$ 238 267 31 -113 -287 -26 -274 98 351 214 408 63 -66 25 -192 -242 -79 73 -205 75 -19 215
4459B15k83k20L27r4l15M26J32L07l84M5k17L2k73r6J45L63oK93j7j21j17m01
$$ 215 -68 -288 39 -55 -370 56 188 495 111 156 -61 -29 -302 -398 -253 110 104 397 380 259 142 -259
4481b59q1O4K04Q7J9J69nm5k0l07O0j7MJ05J37m5Qp2j33j48L38l64P7o4O36j06
$$ -259 -340 -276 -72 15 34 203 198 153 133 -174 -114 -131 -127 -22 115 70 78 6 -127 -275 63 -301 -224 -288 348 242
4507B42k47L32n21n1j9M3jK25J94m5O6j28J48l38j81K80l16K56p7L50r1J23K65
$$ 242 -5 327 -194 -245 -264 -221 -222 3 197 152 218 90 238 -100 -281 -1 -317 -61 -138 212 121 244 509
4530E09l28m90M45m31LN34K97m72N47k85p06M75l84J4R7J65L8J36J41n1j81k25
$$ 509 181 -309 136 -295 -292 242 539 67 614 329 -377 98 -286 -272 -175 -10 28 164 305 254 73 -152
4552a52J68j57k03K76MK39j04J43k82no9k73P9K01J30K04q2n7J73k76k29LQ9j
$$ -152 16 -141 -344 -68 -64 175 71 214 -68 -73 -142 -415 -336 -135 -5 199 117 60 233 -43 -272 -269 -180 -181
4576a81J01J25L77k58k62J69j60K09l26j21K49nL55l21j2k8P5j23j89K51Q2J05
$$ -181 -80 45 422 164 -98 71 -89 120 -206 -327 -78 -83 272 -49 -61 -89 -14 -137 -326 -75 7 112
4598A12J13J02j75J49n34j27L07k50K19K91j73K42Rl31j19j18J32N9J44k9L08
$$ 112 225 327 152 301 -233 -360 -53 -303 -84 207 34 276 285 -46 -165 -283 -151 -92 52 23 331
4619C31o1j79j39N7k48L6K35m8K40k63J81m6q4j18j5J57m22L28j05K91p2R5J8
$$ 331 270 91 -48 9 -239 -203 32 -16 224 -39 142 96 12 -106 -121 36 -386 -58 -163 128 56 151 169
4642A69m2k44K6J07j44KL52k8m6n8j34O8rj29p0K4J65K23k78K11j20k21J08q7
$$ 169 127 -117 -91 16 -128 -126 226 198 152 94 -40 28 19 -110 -180 -156 9 232 -46 165 45 -176 -68 -155
4666a55pK60L9j46J78J70k85m1j6j81q7K95R5K70j13p7rj49Q1j70M3j44J43K45
$$ -155 -162 98 137 -9 169 339 54 13 -3 -184 -271 24 119 389 276 199 190 41 122 -48 -5 -149 -6 239
4690B39k0o7k46L2n18M79J0K73k88L9K33j58M9j83J8M1p7K05J42r4J93j04n4j01
$$ 239 219 152 -94 -62 -580 -101 -91 182 -106 -67 166 8 57 -126 -108 -67 -144 61 203 109 302 198 144 43
4714D3j96q2K16j36J50j00J68K32k04j07m00J87j82L99K83j50J17k75J10j55Q6
$$ 43 -153 -235 -19 -155 -5 -105 63 295 91 -16 -416 -229 -411 -12 271 121 238 -37 73 -82 4
4735Dl02M20k46K6J78J12j75j02K94q4j47k91J79Q8JQ3L03m49K12k34k4j27j38
$$ 4 -298 122 -124 -98 80 192 17 -85 209 125 -22 -313 -134 -46 -45 38 341 -108 104 -130 -154 -281 -419
4758d19M37R6K14l25K5j20R6Q7k15j2Q6L23l96M01n2j40k58O7K75n08K83p3M08
$$ -419 18 114 328 3 28 -92 4 91 -124 -136 -50 273 -123 278 226 86 -172 -105 170 -338 -55 -128 280
4781B80j39P9L6j77j53j67J50j07M20k62J78K30l54J75k51k4j46M1L8J37J98p3
$$ 280 141 220 256 79 -74 -241 -91 -198 222 -40 138 368 14 189 -62 -86 -232 -191 -153 -16 182 109
4803A09M6j03M0m61K69K13mk96Q6M44l77J23j68n5kp3K58K9r3K63k06R5j52k9
$$ 109 155 52 92 -369 -100 113 109 -187 -101 343 -34 89 -79 -134 -136 -209 49 78 -15 248 42 137 -15 -44
4827d4M2P4o2J91r1K58k70l8O1k3k44P1j39R4K54j80J80k3o2L2k08O8J96M5j15
$$ -44 -2 72 10 201 110 368 98 60 121 98 -146 -75 -214 -120 134 -46 134 111 49 81 -127 -59 137 182 67
4852F7R3J23j21p5l2N6k86P6r8J31J99J02n7j40p2LJ0L8p1P5K50k59K70J72l93
$$ 67 160 283 162 87 55 111 -175 -99 -197 -66 133 235 178 38 -34 -31 -21 17 -54 21 271 12 282 454 61
4877F1j29n7n5K90p7K3J46r3l68K29J40k86J82JK47j61q3J07J68m15O0o8N9j89
$$ 61 -68 -125 -180 110 33 56 202 109 -259 -30 110 -176 6 7 254 93 10 117 285 -130 -70 -138 -79 -268
4901b68L92J8j48K18m8J72j04q3k35j0J78j5o1K3k9O1j92J41k76L08J30O0nL1
$$ -268 124 142 -6 212 164 336 232 149 -86 -96 82 67 6 29 0 61 -131 10 -266 42 172 232 227 258
4925B58k41j25J34o9k75J47L4J08O3K90j47j77P8l8l10K52J08K20j73k35L21j40
$$ 258 17 -108 26 -43 -318 -171 -137 -29 34 324 177 0 78 40 -270 -18 90 310 137 -98 223 83
4947H3m7ll13K85j77K41P3M1j97O7j00l38L57k55K75M6M0m1K16k70N3l8k43L90
$$ 83 36 33 -280 5 -172 69 142 183 -14 53 -47 -385 -28 -283 -8 38 78 37 253 -17 36 -2 -245 145
4971A45m6O0j73qK64k26K18j84k96J57j28J33j54M92j93k58K99j73k6p8J6M4n0
$$ 145 99 159 -14 -22 242 16 234 50 -246 -89 -217 -84 -238 254 61 -197 102 -71 -97 -175 -159 -115 -165
4994a65K62K95l79j9k6k44M9o6J60L69m01P4J62J10k80mj0J59k2k28K36P2O1r8
$$ -165 97 392 13 -6 -32 -276 -227 -293 -133 236 -165 -91 71 181 -99 -103 -113 46 24 -204 32 104 165 67
5018F7M3m21m5J63p5M08l5q6K28n2j41k20L04k24j40J47k5K33O7k03j14K45j16
$$ 67 110 -311 -356 -193 -268 140 105 19 247 195 54 -166 138 -86 -226 -79 -104 129 196 -7 -121 124 8
5041Hk34K21j43Q0j1J17L88m24j16J76q9K5j80M71j16k61k2L2P2n5j37M55k37
$$ 8 -226 -5 -148 -68 -79 38 426 2 -114 62 -27 -2 -182 289 173 -88 -110 -78 -6 -61 -198 257 20
5064B0J14j1J1P3j86P1l56K97J2Nk1j42K48Q9q2k8k86N7K46j4j24l1J93k22J36
$$ 20 134 123 134 207 21 92 -264 33 45 50 29 -113 135 224 142 114 -172 -115 131 117 -7 -38 155 -67 69
5089F9j71o5j9L28j74J03Q6K5o6j03n0K48j95k8L5j22J95n9P6j58J99j31m5p0
$$ 69 -102 -167 -186 142 -32 71 157 182 116 13 -37 211 16 -12 23 -99 96 37 113 -45 154 23 -22 -92
5113i2n8q0N3M92k09J2kk8l35K36k32K40P6Q4k12J8J05k48Q1J85q3l4O8l7J94
$$ -92 -150 -230 -177 315 106 118 116 88 -247 -11 -243 -3 73 157 -55 -37 68 -180 -99 86 3 -31 37 0 194
5138A94j79k0k52L36j74M2j03J54l1K84j7r0M2j72R6l96M21Q4k77K92j37P6%n24
$$ 194 15 -5 -257 79 -95 -53 -156 -2 -33 251 234 144 186 14 110 -286 135 219 -58 234 97 173 173 -351
5162c51M73k95K18j5M7MJ66R3j14k00j41Ok4K74l3k35K43P4k82K39p5l82J66j07
$$ -351 122 -173 45 30 77 81 247 340 226 26 -115 -109 -133 141 108 -127 116 190 -92 147 72 -310 -144 -251
5186b51M48k48K81k82L96n04J59M3k00M0P2rR0O7j04P8r6J99k41qL7K85j42K2
$$ -251 197 -51 230 -52 344 -160 -1 42 -158 -118 -46 -55 35 102 -2 76 -20 179 -62 -70 -33 252 110 132
5210A32k97R2r4k22M75m8J38j40J31r8j24J48j72R9K21k73lJ7L1J74J37k59r4
$$ 132 -165 -73 -167 -389 86 38 176 36 167 69 -55 93 -79 20 241 -32 -35 -18 13 187 324 65 -29
5233b9q6RK11l40M56j87j4n6O3Q7k02J25j01j03L92o5j43j39K0K09l36K21O8j11
$$ -29 -115 -106 105 -235 221 34 20 -36 27 114 -88 37 -64 -167 225 160 17 -122 -102 107 -229 -8 60 -51
$$ [...]
8191A38
##END NTUPLES=NMR FID
##END=
