##TITLE=1H_DE-27sr1
 D2O
 8 sc, 
 13.2.2024
##JCAMPDX= 6.0         $$ Bruker NMR JCAMP-DX V2.0
##DATA TYPE= NMR FID
##DATA CLASS= NTUPLES
##ORIGIN= UXNMR, Bruker Analytische Messtechnik GmbH
##OWNER= root
$$ XWIN-NMR		Version 3.5
$$ Tue Feb 13 14:13:11 2024 Russian Standard Time (UT+4h)  she@DPX200
##.OBSERVE FREQUENCY= 200.1313
##.OBSERVE NUCLEUS= ^1H
##.DELAY= (6, 6)
##.ACQUISITION MODE= SIMULTANEOUS
##.ACQUISITION SCHEME= undefined
##.AVERAGES= 8
##.DIGITISER RES= 18
##SPECTROMETER/DATA SYSTEM= spect
##.PULSE SEQUENCE= zg30
##.SOLVENT NAME= D2O
##.SHIFT REFERENCE= (INTERNAL, D2O, 0, 15.7039)
##AUDIT TRAIL= $$ (NUMBER, WHEN, WHO, WHERE, WHAT)
$$ ##TITLE= Audit trail, XWIN-NMR		Version 3.5
$$ ##JCAMPDX= 5.01
$$ ##ORIGIN= Bruker BioSpin GmbH
$$ ##OWNER= she
$$ F:/spectra/data/she/nmr/H-F/1/audita.txt
$$ ##AUDIT TRAIL=  $$ (NUMBER, WHEN, WHO, WHERE, WHAT)
(   1,<2024-02-13 14:12:00.93 +0400>,<she>,<DPX200>,
      <created by zg, POWCHK disabled, PULCHK disabled
       configuration hash MD5:
       00 E9 B6 7A A2 85 ED C7 34 08 36 98 17 FE 4E 26
       data hash MD5: 16K
       E5 9E 23 36 BC 9D A5 3C C3 17 87 BA 37 DE 71 1D>)
$$ ##END=
$$ 
$$ hash MD5
$$ 7A E3 FC C3 9E A3 DC D6 4B 20 19 CC 60 51 CF 93
##$RELAX= 
##$RELAX= 
##$RELAX= 
##$RELAX= 
##$RELAX= 
##$RELAX= 
$$ Bruker specific parameters
$$ --------------------------
##$DU= <F:/spectra>
##$EXPNO= 1
##$NAME= <H-F>
##$PROCNO= 1
##$TYPE= <nmr>
##$USER= <she>
##$AMP= (0..31)
100 100 100 100 100 100 100 100 100 100 100 100 100 100 100 100 100 100 
100 100 100 100 100 100 100 100 100 100 100 100 100 100 
##$AQSEQ= 0
##$AQ_mod= 1
##$AUNM= <au_zg>
##$AUTOPOS= <>
##$BF1= 200.13
##$BF2= 200.13
##$BF3= 200.13
##$BF4= 200.13
##$BF5= 200.13
##$BF6= 200.13
##$BF7= 200.13
##$BF8= 200.13
##$BYTORDA= 1
##$CFDGTYP= 0
##$CFRGTYP= 5
##$CHEMSTR= <none>
##$CNST= (0..31)
1 1 145 1 1 1 1 1 1 1 1 1 1 1 1 1 1 1 1 1 1 1 1 1 1 1 1 1 1 1 1 1 
##$CPDPRG= <>
##$CPDPRG1= <>
##$CPDPRG2= <>
##$CPDPRG3= <>
##$CPDPRG4= <mlev>
##$CPDPRG5= <mlev>
##$CPDPRG6= <mlev>
##$CPDPRG7= <mlev>
##$CPDPRG8= <mlev>
##$CPDPRGB= <>
##$CPDPRGT= <>
##$D= (0..31)
0 1.2 0 0 0 0 0 0 0 0.06 0 0.03 0 0 0 0 0.0002 0 0 0 0 0 0 0 0 0 0 0 0 
0 0 0 
##$DATE= 1707819120
##$DBL= (0..7)
120 120 120 120 120 120 120 120 
##$DBP= (0..7)
150 150 150 150 150 150 150 150 
##$DBP07= 0
##$DBPNAM0= <>
##$DBPNAM1= <>
##$DBPNAM2= <>
##$DBPNAM3= <>
##$DBPNAM4= <>
##$DBPNAM5= <>
##$DBPNAM6= <>
##$DBPNAM7= <>
##$DBPOAL= (0..7)
0.5 0.5 0.5 0.5 0.5 0.5 0.5 0.5 
##$DBPOFFS= (0..7)
0 0 0 0 0 0 0 0 
##$DE= 6
##$DECBNUC= <off>
##$DECIM= 32
##$DECNUC= <off>
##$DECSTAT= 4
##$DIGMOD= 1
##$DIGTYP= 9
##$DL= (0..7)
0 120 120 120 120 120 120 120 
##$DP= (0..7)
150 150 150 150 150 150 150 150 
##$DP07= 0
##$DPNAME0= <>
##$DPNAME1= <>
##$DPNAME2= <>
##$DPNAME3= <>
##$DPNAME4= <>
##$DPNAME5= <>
##$DPNAME6= <>
##$DPNAME7= <>
##$DPOAL= (0..7)
0.5 0.5 0.5 0.5 0.5 0.5 0.5 0.5 
##$DPOFFS= (0..7)
0 0 0 0 0 0 0 0 
##$DQDMODE= 0
##$DR= 18
##$DS= 0
##$DSLIST= <SSSSSSSSSSSSSSS>
##$DSPFIRM= 0
$$ [...]
##$SUBNAM2= <"">
##$SUBNAM3= <"">
##$SUBNAM4= <"">
##$SUBNAM5= <"">
##$SUBNAM6= <"">
##$SUBNAM7= <"">
##$SUBNAM8= <"">
##$SUBNAM9= <"">
##$SW= 18.0517328524113
##$SWIBOX= (0..15)
0 0 2 0 0 0 0 0 0 0 0 0 0 0 0 0 
##$SW_h= 3612.71676300578
##$TD= 16384
##$TD0= 1
##$TE= 0
##$TE2= 300
##$TE3= 300
##$TEG= 300
##$TL= (0..7)
0 120 120 120 120 120 120 120 
##$TP= (0..7)
150 150 150 150 150 150 150 150 
##$TP07= 0
##$TPNAME0= <>
##$TPNAME1= <>
##$TPNAME2= <>
##$TPNAME3= <>
##$TPNAME4= <>
##$TPNAME5= <>
##$TPNAME6= <>
##$TPNAME7= <>
##$TPOAL= (0..7)
0.5 0.5 0.5 0.5 0.5 0.5 0.5 0.5 
##$TPOFFS= (0..7)
0 0 0 0 0 0 0 0 
##$TUNHIN= 0
##$TUNHOUT= 0
##$TUNXOUT= 0
##$USERA1= <user>
##$USERA2= <user>
##$USERA3= <user>
##$USERA4= <user>
##$USERA5= <user>
##$V9= 5
##$VALIST= <valist>
##$VCLIST= <CCCCCCCCCCCCCCC>
##$VD= 0
##$VDLIST= <DDDDDDDDDDDDDDD>
##$VPLIST= <PPPPPPPPPPPPPPP>
##$VTLIST= <TTTTTTTTTTTTTTT>
##$WBST= 1024
##$WBSW= 4
##$XGAIN= (0..3)
0 0 0 0 
##$XL= 0
##$YL= 0
##$YMAX_a= 60987
##$YMIN_a= -64165
##$ZGOPTNS= <>
##$ZL1= 120
##$ZL2= 120
##$ZL3= 120
##$ZL4= 120
##$ABSF1= 10
##$ABSF2= 0
##$ABSG= 5
##$ABSL= 3
##$ALPHA= 0
##$AQORDER= 0
##$ASSFAC= 0
##$ASSFACI= 0
##$ASSFACX= 0
##$ASSWID= 0
##$AUNMP= <proc_1d>
##$AZFE= 0.1
##$AZFW= 0.1
##$BCFW= 1
##$BC_mod= 2
##$BYTORDP= 1
##$COROFFS= 0
##$CY= 11.3945322036743
##$DATMOD= 1
##$DC= 2
##$DFILT= <>
##$DTYPP= 0
##$F1P= 15.7292609196834
##$F2P= 12.9074282941183
##$FCOR= 0.5
##$FTSIZE= 0
##$FT_mod= 4
##$GAMMA= 1
##$GB= 0.15
##$INTBC= 1
##$INTSCL= 1
##$ISEN= 128
##$LB= 0.24
##$LEV0= 0
##$LPBIN= 0
##$MAXI= 10000
##$MC2= 0
##$MEAN= 0
##$ME_mod= 0
##$MI= 1.114404
##$NCOEF= 0
##$NC_proc= 0
##$NLEV= 6
##$NOISF1= 3.799351
##$NOISF2= 2.8
##$NSP= 1
##$NTH_PI= 0
##$NZP= 0
##$OFFSET= 15.70392
##$PC= 1
##$PHC0= -24954.39
##$PHC1= 15.2527
##$PH_mod= 1
##$PKNL= yes
##$PPARMOD= 0
##$PSCAL= 0
##$PSIGN= 0
##$REVERSE= no
##$SF= 200.130013532006
##$SI= 16384
##$SIGF1= 3
##$SIGF2= 2
##$SINO= 400
##$SIOLD= 16384
##$SREGLST= <1H.CDCl3>
##$SSB= 0
##$STSI= 0
##$STSR= 0
##$SW_p= 3612.71676300578
##$SYMM= 0
##$S_DEV= 0
##$TDeff= 0
##$TDoff= 0
##$TI= <>
##$TILT= no
##$TM1= 0
##$TM2= 0
##$TOPLEV= 0
##$USERP1= <user>
##$USERP2= <user>
##$USERP3= <user>
##$USERP4= <user>
##$USERP5= <user>
##$WDW= 1
##$XDIM= 8192
##$YMAX_p= 0
##$YMIN_p= 0
$$ End of Bruker specific parameters
$$ ---------------------------------
##NTUPLES= NMR FID
##VAR_NAME=  TIME,          FID/REAL,        FID/IMAG
##SYMBOL=    X,             R,               I
##VAR_TYPE=  INDEPENDENT,   DEPENDENT,       DEPENDENT
##VAR_FORM=  AFFN,          ASDF,            ASDF
##VAR_DIM=   8192,          8192,            8192
##UNITS=     SECONDS,       ARBITRARY UNITS, ARBITRARY UNITS
##FACTOR=    0.0002768,     1,               1
##FIRST=     0,             0,               0
##LAST=      2.2672688,     0,               0
##MIN=       0,             -64165,          0
##MAX=       2.2672688,     60987,           0
$$ Real data points
##PAGE= N=1
##DATA TABLE= (X++(R..R)), XYDATA
$$ [...]
2307b256k01N35J181J435J191N44l49j269j364j273n36K72J146J644J247L90q0
$$ -2256 -2457 -1922 -741 694 1885 2429 2080 811 -553 -1826 -2362 -2090 -944 700 1947 2337 2257
2324B257r18j506j700m09J49R02J295J576O22r8j107j205j158r27k7J103J254
$$ 2257 1339 -167 -1867 -2276 -2127 -1225 70 1646 2268 2170 1063 -142 -1300 -2227 -2254 -1151 103
2341A03J405O34L6o42j544j386p13j6N76J177J654J000qp32j256j373j131j04
$$ 103 1508 2142 2178 1536 -8 -1394 -2107 -2123 -1547 -370 1284 2284 2276 1544 288 -1085 -2216 -2320
2359b320O53J315J350J000M84p59j263j584p48l62M16J118J488J265J17l37q87
$$ -2320 -1667 -352 998 1998 2482 1723 460 -1124 -1872 -2234 -1818 -700 788 2053 2170 1833 946
2376I46j489j319k78L70Q88J272J259Q04o10r56j141j623o01J85J213J381J453
$$ 946 -543 -1862 -2140 -1770 -882 390 1649 2453 1843 887 -254 -1877 -2478 -2293 -1080 301 1754
2393A754J45L52q97j447j569m60J08N61J446J572P17l93q94r65j375o36k16J095
$$ 1754 1899 2251 1354 -93 -1662 -2122 -2014 -1453 -7 1565 2282 1889 995 30 -1345 -1981 -2197 -1102
2411a102J205J089P47L23o30j426j191q89j11M89J000J384J114r9o62q96j080
$$ -1102 103 1192 1939 2262 1632 206 -985 -1874 -1985 -1496 -496 888 2002 1903 1241 345 -735
2428g35j258l87R77J106J022J139L44n98j177j183q99l62J80J157J264J417J22
$$ -735 -1993 -2380 -1403 -297 725 1864 2208 1610 433 -750 -1649 -2011 -1831 -674 590 2007 2129
2445B129m66q39j311j001n33L04Q91J399Q76P17n11p64j018j199p93K46P53J572
$$ 2129 1663 824 -487 -1488 -2021 -1717 -826 573 1449 2166 1655 891 -127 -1326 -2119 -1873 -1120 452
2463D52Q21O34L1o63j121j329r34K91L84J061J492J263j16r91j130j187r86L23
$$ 452 1273 1907 1938 1275 154 -1175 -2109 -1818 -1434 -373 1119 2382 2266 1275 145 -1042 -2028 -1705
2481a705M96J087J094P35M51n88j215j365q04k14K69J056J732P79M11p13r20j209
$$ -1705 -1209 -122 972 1707 2158 1570 355 -1010 -1814 -2028 -1759 -703 1029 1808 2219 1506 586 -623
2499f23j089l67M05R49J368J039J61k48r58j283r61l78K12P47J518J066J43j29
$$ -623 -1712 -2079 -1674 -725 643 1682 1843 1595 637 -646 -1607 -1985 -1773 -1026 492 1558 1701 1572
2517A572m79j431j144l76K37O27J186J083Q71k01j022q87j274m41k44R32Q08J567
$$ 1572 1093 -338 -1482 -1858 -1621 -994 192 1275 2146 1945 923 36 -1238 -1679 -1923 -991 -183 1384
2535A384O23k75k02j421j078q21K0M29J026J400N85J15k87r37j584r62J3N84Q78
$$ 1384 2007 1732 1530 109 -969 -1790 -1770 -1341 -315 1085 1670 1785 1498 561 -1023 -1985 -1972 -1388 -510
2554e10J256R41m8j65r98j124p73l82Q4R14J542J053J00k89j048j089q02n71N1
$$ -510 746 1687 1639 1474 476 -648 -1421 -1803 -1719 -805 737 1790 1890 1601 553 -536 -1338 -1909 -1858
2573a858Q69J235J035P93m52p40j185j003o45J20P39J488P80N20J48o89j211j318
$$ -1858 -989 246 1281 2074 1622 882 -303 -1306 -1951 -1831 -1092 396 1176 1696 1844 1155 -56 -1374
2591a374n00L10K59J305J138Q79k71n60q89j260r32l7N10J364J147N42K02m66
$$ -1374 -1874 -1564 -1305 0 1138 2017 1746 1186 297 -963 -1895 -1932 -1422 -58 1089 1631 1833 1367
2609A367j296r85p53k36N96J044J187Q94q9j82r34j333q29k96O27O29J207P94
$$ 1367 71 -914 -1667 -1903 -1307 -263 924 1818 1729 1547 613 -720 -1549 -1845 -1218 -589 618 1412
2627A412L98m58q59j324p49j82L77M07J342J208M50o11p44p82j170n91R0Q14J164
$$ 1412 1810 1352 493 -831 -1580 -1762 -1385 -978 364 1572 2022 1411 667 -115 -1285 -1876 -1786 -972 192
2646A92J032O07l8p87j287p79o14L5M56J079J042R18j92l94j067j297o26k00P18
$$ 192 1224 1831 1793 1006 -281 -1060 -1674 -1639 -1183 -104 938 1856 1664 1270 203 -1094 -1720 -1920 -1202
2665a202J020J082P76l5l98r59j116p45n2K86R13J266P85J90l87j047j034n81
$$ -1202 -182 900 1676 1641 1243 284 -832 -1577 -1629 -1343 -430 836 1621 1811 1424 377 -657 -1238
2683a238m02L41P53J159R84j7m3j053p45j186k19J48R67R67P45N04j76q42j006
$$ -1238 -1640 -1299 -546 613 1597 1580 1537 484 -261 -1447 -1666 -1518 -551 416 1161 1665 1489 647 -359
2702c59p75n82J17O38J507M83O59k45l61j219j045n98L14M49R79J110P33j88n85
$$ -359 -1134 -1716 -1599 -961 546 1029 1688 1443 1082 -137 -1182 -1780 -1466 -1017 -38 1072 1805 1617 1032
2721A032r35j143l46o00R70Q59J127M62L58l92j373j168l86j28L81R63J097P30
$$ 1032 97 -1046 -1392 -1992 -1022 -163 964 1426 1784 1392 19 -1149 -1535 -1663 -1282 -319 778 1508
2739A508K49m50p02j147r02l66N70J083Q36P01K30j14j153q14q41l28J59Q77J216
$$ 1508 1757 1307 605 -542 -1444 -1810 -1240 -157 679 1380 1610 1496 343 -471 -1312 -1640 -1481 -604 612
2758F12Q26R9j68n25j156r54k65J60O61R53R72N80l64n79j049r99m77K52M55J160
$$ 612 1438 1537 1369 844 -312 -1266 -1531 -1371 -710 243 1215 1795 1431 852 -197 -1196 -1673 -1421 -966 194
2778A94P63N54K76r25r38p14p57mN38J058Q28P28o5o37p72o78j087j8O37Q37P23
$$ 194 957 1511 1787 862 -76 -790 -1547 -1551 -1013 45 873 1601 1536 899 127 -551 -1638 -1656 -1019 -182 541
2799E41P52L38l42j036j054o93j61N74Q51J044P35Qn94n15r27q16l12K46J040
$$ 541 1293 1631 1289 253 -801 -1494 -1655 -1081 -230 814 1549 1557 963 448 -479 -1295 -1607 -1361 -321
2818c21P24R97L27l53p30j192n95m40K96O87J215O47K55j61m17r99j251j93M02
$$ -321 403 1400 1727 1374 644 -548 -1143 -1583 -1287 -600 615 1262 1517 1356 939 -60 -1311 -1504 -1102
2837a102K37Q04R81Q75n67m08j103m51q35J3P71Q75Q47M65o3l54r52r40k44j30
$$ -1102 -865 -61 920 1795 1228 820 -283 -734 -1569 -1556 -785 90 937 1402 1339 985 33 -907 -1151 -1281
2857a281L29P22J176L27K33q23m65r28q05j7M30J039P69M83M48m78q14j202l38
$$ -1281 -952 -230 946 1273 1506 683 218 -710 -1515 -1532 -1102 -63 706 1189 1637 1159 345 -857 -1195
2876a195m50O15P02O64R56K06j51o27j149p15j63Q0N31J141N22L94o8q31n11r64
$$ -1195 -1645 -1030 -328 336 1292 1498 1347 720 -429 -1144 -1307 -1227 -696 445 967 1361 1293 462 -49 -1013
2896a013o09L32N85R90J080q7J04m70j003r25n44K46M00P78J158M08p3m93j059
$$ -1013 -1622 -1290 -705 285 1365 1278 1382 912 -91 -1016 -1560 -1314 -914 -136 1022 1430 1357 864 -195
2915a95n24o93n3O60N29Q59P88L13p91r02m95p50q2L98N04Q79P39q3Q9p96r04
$$ -195 -719 -1412 -1465 -805 -276 583 1371 1684 893 -9 -504 -1254 -1336 -938 -434 445 1184 1101 1190 394 -510
2936e10n39m98O83M07R16O14L94l25q29o99m23n04O7O10R15P85J24J78n40j105
$$ -510 -1049 -1547 -864 -457 459 1073 1467 1142 313 -386 -809 -1313 -1246 -636 279 1064 1188 1366 826 -279
2956b79p40n69M61N32O73Q66N37k42k90j003o73o76K09L95R01L96P45o2k62j011
$$ -279 -1019 -1588 -1127 -595 78 944 1481 1239 949 -54 -727 -1403 -1194 -799 102 498 1243 1181 919 -92
2976i2o07o45k4M51O53Q89O71K62o11o64j064l95k74K09Q87Q76O02K90l41p57
$$ -92 -699 -1344 -1368 -917 -264 625 1296 1558 947 283 -781 -1176 -1450 -1241 -354 522 1124 1414 1073 316
2996C16p25p73l65M08N58R47O29K46k30j15j360q73k7M43O31O94O42L79k27q86
$$ 316 -409 -1182 -1547 -1139 -581 366 995 1241 1011 896 -464 -1337 -1364 -921 -290 404 1046 1425 1198 312
3016C12n27p84m59J28N92J052N99M17j83m24p86o69m55l6L73Q46P92M86R4q53
$$ 312 -215 -999 -1458 -1330 -738 314 913 1330 1147 723 -63 -732 -1187 -1223 -850 -4 788 1274 1368 515
3036E15k70r51p82L06K01J084P31N57k76k09q55p21m76O6K75N80P64O08L82p17
$$ 515 245 -706 -1488 -1182 -981 103 834 1391 1115 906 51 -670 -1146 -1080 -805 -225 539 1147 1529 812
3056H12m73q08m94l45K96Q56N11O12K23k20o28m95p06k02p7N50J036M57J63n68
$$ 812 339 -469 -963 -1308 -1012 -156 355 967 1190 970 342 -153 -859 -1061 -1138 -588 448 905 1068 500
3076E00L02r45p21m85R4P57O11O73Q32m23o45n77j014m03K98M04J013M46O18p2
$$ 500 802 -143 -864 -1349 -1255 -498 113 786 1618 1195 550 -27 -1041 -1444 -1146 -742 271 717 1335 1263
3096A263l44r53r00j76J3M74K47J096L70J85l12q16p55m63k10N90L12Q89O32R8
$$ 1263 919 -34 -934 -1110 -1097 -623 -376 720 1090 1275 963 147 -608 -1071 -1281 -691 -379 510 1142 1240
3116A240m54n55q69p68M18L0P33N33J043J81o23o01p28n78k82L76L77R84P10n8
$$ 1240 786 231 -638 -1406 -988 -958 -225 308 1351 1532 909 308 -420 -998 -1280 -904 -527 457 1167 1109
3136A109l8o74n31q44m03P0N03R98R38k4j97l74o93r66j61L07J62P60N99N68O1
$$ 1109 1071 397 -134 -978 -1381 -1311 -808 190 1128 1104 907 533 -160 -1126 -1287 -980 -818 -58 541 1109 1170
3157A170m62p85l01q41M3N13R39N88M41P2n22q01p84n16K61j6Q88P62N32J75m97
$$ 1170 708 -77 -378 -1219 -1176 -663 276 864 1305 1377 855 54 -730 -1246 -985 -1001 -113 649 1181 1356 859
3178H59n02p91p00R4J6Q38N76N95L34m21r39l05p74K2qL36J006N38L44j72l49
$$ 859 357 -434 -1134 -1040 -1024 -186 390 985 1319 898 -41 -346 -1120 -1098 -1106 -770 236 774 1118 946 597
3199E97r88m65m73N34J05R56N60L73n7o61l81j020k43j39N76R37N54M58P4n75
$$ 597 -391 -856 -1329 -795 -690 266 826 1199 1142 481 100 -920 -1163 -1302 -726 211 765 1223 1297 722
3219G22n85r26j31k04L35O08N52P39j3m34n46r22m66M3P60M94L51O11R6m05n37
$$ 722 137 -789 -920 -1124 -789 -181 371 1110 1097 663 117 -805 -1271 -1228 -468 26 377 988 1084 679 142
3240A42n20m41n36K54P28Q84L08J25j99l44p66n97l06M55N83N16N53K16l3p29
$$ 142 -378 -819 -1355 -1101 -373 511 819 944 745 401 -365 -962 -1268 -813 -230 286 839 1055 1022 293
3260B93m74m74m18L12J04R20O03J93J74r19m60r35M5L46J63N28Q65K57j09o38
$$ 293 -181 -655 -1073 -761 -657 263 866 1059 1233 314 -146 -1081 -1036 -690 -527 1 866 1123 1014 376
3280C76l73q02k33J65K91P95M62L74j81o88%p94k74l9J5O33R72J92K38n15k23
$$ 376 3 -799 -1032 -867 -576 219 681 1055 874 186 186 -608 -882 -921 -906 -273 699 891 1129 614 391
3301C91q40m06r0J19P22O10Q0M10k94m21n83p49j3R8O92O43L39J31K9l98q06l81
$$ 391 -449 -855 -945 -826 -104 506 586 996 702 281 -302 -1051 -1064 -966 -274 369 708 839 868 470 -336 -717
3323g17l72j5O02O34M03N67P4o05o17o52m13NM82P75O73K85k57l28n46p56k10
$$ -717 -1089 -1104 -502 132 535 1102 1176 571 -46 -698 -1111 -1106 -624 151 824 1109 852 524 -22 -778 -988
3344i88K53J95K72Q28N15j40l54l80n61p38J81j08R46N31M95j33j46l54o36m39
$$ -988 -735 -540 -268 560 1075 935 581 201 -360 -1098 -917 -1025 -79 452 947 814 668 314 -322 -761
3364g61j71R8O54P23K98K13m10j26n82j047J23J18N95P42M64O9k75k92p16l72
$$ -761 -932 -834 -180 543 841 1054 644 518 -64 -1111 -988 -870 -275 467 931 1000 725 433 -283 -655
3384f55m41M81R1P80N12m0J93l47p40l79n38K5O38L60M86N52N6o51n32n58l00
$$ -655 -1096 -615 -524 256 768 728 921 574 -166 -545 -1083 -1058 -420 -60 426 978 1034 383 -149 -707 -1007
3405a007J2M83N74M47R0L56l70l06o52n89K20J04O32M48N58Q2l11n42n89n98j80
$$ -1007 -995 -512 62 509 599 955 585 279 -373 -962 -742 -638 -6 442 1000 1082 771 229 -360 -958 -1138
3426a138N06O71M74K75L33l42p76m86j3m08J61K49Q91L03J64m5m12o13m82l20
$$ -1138 -632 39 513 788 1121 779 3 -483 -496 -904 -743 -494 397 700 864 819 407 -206 -688 -1008
3446a008o1P06M69R03j26k09k43m66k87m96m7K60J000M02N7J13m96l85q02j39
$$ -1008 -1069 -363 106 1009 883 674 431 -35 -322 -818 -865 -605 395 797 854 967 471 86 -716 -855
3466h55J21K89N17M00M77l9n03j92n83o63m2N49M68M94K33K82l25n81n29l38M9
$$ -855 -734 -445 72 472 949 910 407 215 -368 -1031 -1073 -524 -56 438 671 953 628 47 -482 -820 -771
3487g71K10J56O39N33J43k71k87q23l18o1K69L88L80L05L86k07n30n45l36r7l3
$$ -771 -561 -405 234 767 910 639 352 -471 -789 -850 -581 -193 187 492 878 671 141 -404 -740 -837 -870
3508h70N80P79j55M40j95l88j74m72l97L61J86N02M78J10r1q8n34m06n01NK41
$$ -870 -290 489 334 774 579 191 17 -455 -852 -491 -305 197 675 785 694 606 72 -334 -835 -830 -589
3529e89M60N80L55m7k14m76n31k67p0J46N02N25O63L3l78n15m25o18k17N67K33
$$ -589 -129 451 806 759 545 69 -462 -729 -799 -653 -151 374 1037 1070 692 177 -248 -866 -1083 -516 -283
3550b83M63M07K66l13m02m43k59k84J87M40O69L5K59J0o84l84m75q2N4N32L94
$$ -283 180 587 853 540 138 -305 -564 -848 -661 -221 448 483 742 752 68 -316 -791 -873 -819 -287 107
3571A07M55L73j08m01n97l11n36J76M12K83P72J42j04n3q47k26l27O4L18K07O54
$$ 107 562 935 827 426 -171 -482 -1018 -842 -430 -147 625 767 663 610 -237 -463 -790 -726 -408 -201 453
3592D53N03j55o29k57m57j07j79O77K23J77M78K67k97n49m08k66k76M67J64N20
$$ 453 956 801 172 -85 -542 -649 -828 -151 72 249 727 994 697 148 -260 -526 -802 -335 -171 349
3612C49K68q3O3m15m06q00L31L4N21K22P12O9k42n54l23j03m75K1L65M67P13J05
$$ 349 617 534 597 182 -224 -1024 -693 -659 -138 84 796 865 623 69 -254 -357 -832 -811 -446 21 734 839
3634H39n01J48o02m94l21L62L27L73L07J98K53o16n35J02q51M31K6M74N45J80
$$ 839 338 486 -116 -610 -931 -569 -242 131 438 636 889 273 -262 -160 -1011 -580 -554 -80 465 645
3654F45K38j19p12l79m90J09M7O49M69M48K55n92k42p97r4q7O0M71M32N14o6k07
$$ 645 883 764 52 -327 -817 -708 -661 -12 457 905 1160 568 326 -471 -565 -652 -592 -121 311 825 759 552
3676E52m50m62l97K92J07O7O20K36J87j61k09o36l35l87J69M99K45O21L36k99
$$ 552 102 -360 -757 -465 -358 -291 329 565 752 591 382 -254 -589 -976 -807 -308 -63 558 894 595
3696E95n03j81n01N6k41L49N60M66J68L4l02n75k92l05J24K38J61N49N04j53k99
$$ 595 92 -89 -590 -534 -775 -426 134 600 768 802 500 -75 -367 -672 -548 -310 -149 400 904 751 452
3717D52o94J03o32R9J78K64O19J01M62l31l67n12k52k12K6M30L68N47R9n71J06
$$ 452 -242 -139 -771 -672 -494 -230 389 490 952 621 254 -258 -510 -722 -696 -266 102 649 748 177 283
3738B83o23j95m4l4M69L41K34L41j26o16o7m48k89j38O17N53K96J42r7r3o58k89
$$ 283 -340 -535 -579 -613 -144 197 431 772 646 30 -37 -485 -774 -912 -295 258 554 696 599 506 -152 -441
3760d41k22l2L52K26N34L35n5l80k75n31l96R4M98M76M87O5q6pn88m58m18P9K16
$$ -441 -663 -695 -343 -117 417 752 697 317 42 -489 -885 -791 -293 183 670 735 649 642 54 -404 -822 -743 -527
3783e27M84L55M12l8q4q02j17k81j07K67M48M10K19L00k72k30o83k73j59K8M71
$$ -527 -43 312 724 686 602 -200 -317 -598 -705 -438 10 420 639 939 667 437 -246 -519 -678 -650 -179
3804a79K21N87k4n7m71l55l03j76N4L35O41M39J62k65k48m97k35k82r4N69J61
$$ -179 42 629 605 548 77 -278 -581 -757 -703 -368 273 712 874 609 361 -136 -371 -653 -747 -178 -17
3825a7K69K18L27n64m32j08k12k09K71J83N61M77k18j74m03m67Om6J72J51L92
$$ -17 252 470 797 233 -199 -307 -519 -728 -457 -274 287 764 546 372 -31 -498 -492 -538 -366 -215 177
3846A77N04P2l34l42l75k95Q9LM49M57K23r7j70j39m76j71j97L6M31K61M47J29
$$ 177 681 753 419 77 -298 -593 -504 -501 -52 405 628 531 361 222 -254 -425 -622 -586 -155 106 553 682
3868F82j47m43l37r9n91K79L88M91L09k5k78m2m22j23j28O1K76L51J48K87O5m63
$$ 682 535 92 -245 -344 -935 -656 -268 223 532 507 229 187 -235 -358 -486 -425 -149 202 350 637 702 239
3890B39j40m85j63k04K24O21J43M76k49J03p29p4m25l2N12J47L42J39L86l33m94
$$ 239 99 -386 -549 -753 -529 92 235 711 462 565 -164 -238 -663 -695 -183 -36 306 445 831 498 4
3911Dm53r2n9O2N36RM64J15j30l68m24l2k03K21m1N41L94r2J6j88l72m40k50M00
$$ 4 -449 -541 -600 -538 -2 7 471 586 456 88 -336 -368 -571 -350 -391 150 544 452 468 280 -92 -532 -782 -382
3935c82J88K41L64J88j10l13m26l31J18J08J26L90K06M73m22j13k71k28l63K5
$$ -382 -194 47 411 599 489 176 -250 -581 -463 -355 -229 161 367 840 418 305 34 -194 -557 -532
3955e32K57M59K64K4J54k40l40m35J6j65L68J53M89j98K73L4l48n64m87M21j71
$$ -532 -275 184 448 472 626 386 46 -389 -373 -538 -170 -17 472 274 547 581 233 -331 -818 -397 -568
3976e68L20M31L28J35l00j28n16j72l10N63K20L73J97R4j54k38q12K77l89J80
$$ -568 -248 183 511 646 346 218 -298 -470 -780 -217 3 376 573 667 513 275 -537 -260 -649 -469
3996d69J48M75K12L57k67r2l74o66j34M24J96J87K08M48k35l50J67l67m74n8L75
$$ -469 -321 154 366 723 456 364 -10 -676 -810 -386 -190 -3 205 653 418 68 235 -132 -606 -664 -289
4017b89J68O14n1J73j79m29n44K79m3m7K30M27L93j63q2l31k49k67l6q6N16L45
$$ -289 -121 493 442 615 436 7 -537 -258 -301 -348 -118 309 702 539 457 126 -123 -390 -426 -512 4 349
4039C49J4J38o1m91n6l06j42K37J65K45L48P2j03l56m22l07K46L0K33K51L00j36
$$ 349 363 501 440 -51 -107 -413 -555 -318 -153 92 440 512 409 53 -369 -676 -430 -400 -167 84 384 248
4061B48J88j28l71l92Qj23K35O57P5J73P2l65j23m60m98L05J46N44K57J81p8j40
$$ 248 436 308 -63 -455 -447 -570 -335 322 397 570 642 277 154 -306 -804 -499 -353 191 448 629 551 411
4083D11m55l6k86l86M32L95K95J18j94K91l58n76j62J72J07RN22J85j34p7j75
$$ 411 -44 -80 -366 -752 -320 75 370 488 294 585 227 -349 -511 -339 -232 -223 299 484 350 273 98
4104I8n35j08J73P1K70K28L27n3J14n29k63k48r1L89k9L18J59M94k99j16n58k07
$$ 98 -437 -545 -372 -301 -31 197 524 471 585 56 -207 -455 -546 -157 -186 132 291 785 486 370 -188 -395
4126c95l09J96L36K45L74L16m05m30rr7l89k8K12M05L70l7l8l8k57j11l82oK9
$$ -395 -704 -508 -172 73 447 763 358 -72 -81 -178 -567 -595 -383 22 392 355 317 279 22 -89 -471 -477 -448
4149d48L76K07K31R1k12k62k05k40m4J62L56J35J71K71l18l32j99j68j53j31N45
$$ -448 -72 135 366 457 245 -17 -222 -462 -506 -344 12 147 318 589 271 -61 -260 -428 -581 -712 -167
4170a67K97J70L72m00j48l37j68j94K64K94r8O90k5Km54l69j9J14k83K74J82M01
$$ -167 130 300 672 272 124 -213 -381 -575 -311 -17 -115 575 550 552 98 -271 -290 -176 -459 -185 -3 398
4192C98J64l18j5k14j67k81K42p3J03N05K12J45m76j67k79k30J33J51m2L81K87
$$ 398 562 244 229 15 -152 -433 -191 -264 -161 344 556 701 225 58 -221 -451 -318 -167 -209 172 459
4213D59J14p7l85k89k58OK14j17M99L37k4J12n05k96k51K18l7R7L84j4L18k50
$$ 459 573 496 111 -178 -436 -430 -216 -333 166 503 479 591 86 -210 -461 -243 -280 -183 201 187 505 255
4235B55k94J7k00m12K40L55K32K40k7M9k76l50k55j6m1K57M54N8L39r7m49L2n31
$$ 255 -39 -22 -222 -634 -394 -39 193 433 406 455 179 -171 -426 -442 -483 -226 228 286 625 528 79 111 -420
4258d20N9k09Q4O51R9nJ36J52o22O6m08k5J97r1O39r5L91l62k71l43j27j09L63
$$ -420 -361 -570 -486 165 264 259 395 547 -75 -9 -417 -442 -245 -336 303 208 599 237 -34 -377 -504 -613 -250
4281b50k4K17M97N1j34k69j15l39j95J30L49J19K71Q3r2N7n24k06J52K9N0L83
$$ -250 -274 -57 440 491 357 88 -27 -366 -561 -431 -82 37 308 391 299 356 -168 -374 -222 -193 -143 240
4303B40n9P1K1j17k10l81L2J90M9L71J77J93l74o7k31N9k29j47L82K28N4K58r3
$$ 240 181 252 273 156 -54 -435 -403 -213 -164 207 384 577 203 136 -95 -36 -265 -412 -30 198 252 510 417
4326D17l58j59j65q9k08L74R9L24R6O3j67k70j89j17j50J98MK38N68l10m8R3k07
$$ 417 59 -100 -265 -354 -562 -188 -89 235 331 394 227 -43 -232 -349 -499 -301 -297 -59 509 199 151 244 37
4349C7n20j18L20M18j0O5M31j08m25l12m8k35M55k52M16J31K3J77p9l74n94M2
$$ 37 -483 -601 -281 137 127 192 623 515 90 -222 -270 -505 -50 -302 114 245 268 445 366 -8 -602 -560
4371e60K07J50M49J15L67m30m5m02k1l02J10M7K86J19J60P8K82l63n01j71K9K08
$$ -560 -353 -203 246 361 728 298 253 -149 -170 -472 -362 -315 -29 90 250 328 610 247 -254 -425 -396 -188
4393a88j30M11K82O2k58m0j98j18k52J59K24J89J93k20M79n05l80p1q5O5K30J86
$$ -188 -318 93 375 437 179 139 -59 -177 -429 -270 -46 143 336 116 595 90 -290 -361 -446 -381 -151 35
4415C5M26o6k00j61q0j31k65J37K34K65M4oK00m7m09j96n4O7K19J25Q2K74p8L7
$$ 35 461 395 195 34 -46 -177 -442 -305 -71 194 238 232 432 385 -24 -220 -274 -207 12 137 219 493 415 452
4439D52l72l27n6J00J14k5K83K47m2K0l61j65k75P1Q2J48J34K05O0J14m77l86
$$ 452 80 -247 -303 -203 -89 -114 169 416 374 394 33 -132 -407 -336 -254 -106 28 233 293 407 -70 -456
4461d56L50l92K22K33J23O5K00J42m85j75j39k15J6N58J19J60J4n9m9k84l81N1
$$ -456 -106 -498 -276 -43 80 145 345 487 2 -173 -312 -527 -511 47 166 326 340 281 232 -52 -433 -382
4483c82N4K4N44n7L88n04Q1j17l45r0j39J30J67N47p6j08Mj97p2k18J14J50q8
$$ -382 -328 -304 240 183 571 67 148 31 -314 -404 -543 -413 -246 301 225 117 121 -76 -148 -366 -252 -102 -190
4506a90L99J82qP5n05j88K8j28L60p2K99P4k25M3j25l8k61M6j55N31K41%J27j87
$$ -190 209 391 383 458 -47 -235 -207 -335 25 -47 252 326 101 144 19 -19 -280 -234 -389 142 383 383 510 323
4530C23k18m26L9k02Q9M47o9L29P6P1l84R2m39j43J32L32l0K53J85p5j35q8l80
$$ 323 105 -321 -282 -484 -395 52 -17 312 388 459 75 167 -272 -415 -283 49 19 272 457 382 247 159 -221
4553b21j86J18J08L7L38J28r7p2m1j48k34o0N1K36J80R1K63k20q1m88j5J47R9
$$ -221 -407 -289 -181 -144 194 322 225 153 112 -36 -270 -330 -279 -43 137 228 491 271 190 -298 -313 -166 -67
4576f7K12m7J11Kn5j36l8n59L09j5M90j80J20L22l63O6m8k18j89r4K17K66j48
$$ -67 145 98 209 211 156 20 -18 -577 -268 -283 207 27 147 469 106 172 124 -94 -283 -377 -160 106 -42
4599d2M03p2j96j96k14k32L47l2L91j5J80j35p2j72m8l78O3K26L44K44n3M9m17
$$ -42 361 289 93 -103 -317 -549 -202 -234 157 142 322 187 115 -57 -105 -483 -420 -194 150 394 341 390 -27
4622b7P3k60Q7l4q2K27K53J60J49l74j35k21j74K18p4L8K81N3K41k56o2k07q2
$$ -27 46 -214 -127 -161 -243 -16 237 397 546 172 37 -184 -358 -140 -214 -176 105 158 399 143 81 -126 -208
4645b08Q0k08L98N0q8L03j69J55o24o1M31k91J13K74o8K71r4o1l86j4n6%K38K08
$$ -208 -128 -336 62 112 24 327 158 313 -311 -372 59 -232 -119 155 87 358 264 203 -183 -197 -253 -253 -15 193
4669A93O3K54l60Nk35k00Q1J60l9R1K39J38l4m28J25n7k32k06R9N45j28J58Q4
$$ 193 256 510 150 155 -80 -280 -199 -39 -78 13 252 390 356 -72 53 -4 -236 -442 -343 202 74 232 316
4692C16N1r7n03J18r2J24J24J60J62k35J60j62k43l13M81k95R9R1L4K35r0J4l27
$$ 316 367 270 -233 -115 -207 -83 41 201 363 128 288 126 -117 -430 51 -244 -145 -54 -20 215 125 139 -188
4715a88k28J61M8j6K87J67Q9j66q2n1j40j0l54L13L58j3j60J68L8k35l90K12l70
$$ -188 -416 -255 -207 -223 64 231 320 154 72 21 -119 -129 -483 -170 188 175 15 183 221 -14 -404 -192 -562
4738e62M73J43P6p3O8L9K7l61J28k19J99J18L3L25k16M6l50K38n66J16J39K73
$$ -562 -89 54 130 57 125 164 191 -170 -42 -261 -62 56 89 414 198 244 -106 132 -434 -318 -179 94
4760I4r0J80K75j74l58J0j04j48J79Q4M03j29o1O0p4k83L1P5k62K30j8K96L9J1
$$ 94 4 184 459 285 -73 -63 -167 -315 -136 -52 351 222 161 221 147 -136 -105 -30 -292 -62 -80 216 255 266
4784B66Q2n53j62J95N2pP1J57L87k90P3k86q9q7k3K9Q2K16J49O4l88j50J42j46
$$ 266 348 -205 -367 -172 -120 -127 -56 101 488 198 271 -15 -104 -191 -214 -185 -103 113 262 326 -62 -212 -70 -216
4808b16m7j78J65M64J81o0O2m02q6N7j34R8lK24J50L3l02L45m25k44N3K95q9J42
$$ -216 -263 -441 -276 188 369 309 371 -31 -117 -60 -194 -96 -99 125 275 308 6 351 -74 -318 -265 30 -59 83
4832H3M1L83l23J4l05l3K1j04J03L05J20%k42pr7j28K37l77J43Q7K09J16K47m41
$$ 83 124 507 184 198 -107 -140 -119 -223 -120 185 305 305 63 56 -41 -169 68 -309 -166 -79 130 246 493 52
4856E2J86m39k90L05K76l7J94M6j10n4p3m0k97K46J4j37J10J07j64K53J3l80J29
$$ 52 238 -201 -491 -186 90 53 247 293 183 129 56 16 -281 -35 -21 -158 -48 59 -105 148 161 -219 -90
4879i0q1O0K1O5J97Q4k9k29n1j41l6K7L3K74K61j48K2l78J48l35J66J4K95j0k7
$$ -90 -171 -111 -90 -25 172 256 227 -2 -53 -194 -230 -203 -170 104 365 217 239 -139 9 -326 -160 -146 149 139 112
4904A12Q7J85l88J42j18l6k65K34J35J61J04j64m4j41j94J01j15p3J97K59R5j50
$$ 112 199 384 -4 138 20 -16 -281 -47 88 249 353 189 145 4 -190 -89 -204 -277 -80 179 274 124
4926A24r3O8j90k26j15L9L28K16j49N51l48k05M1k46q8K51j13K09k5L53j08j13
$$ 124 31 99 -91 -317 -432 -393 -65 151 2 553 205 0 41 -205 -293 -42 -155 54 29 382 274 161
4948A61l05R1k22l8J66K74J44j2%l87n5mp6K68l81M48J01O1oK3k03l75K27j04
$$ 161 -144 -53 -275 -313 -147 127 271 259 259 -128 -183 -187 -263 5 -376 72 173 234 228 251 48 -327 -100 -204
4972b04jK07O9j43J67n5j69j21K19k25O7K17n7J09j7K67l75J17l59J06k1J50K94
$$ -204 -205 2 71 -72 95 40 -129 -250 -31 -256 -189 28 -29 80 63 330 -45 72 -287 -181 -202 -52 242
4995B42j08O6K02m38j04j80n7K29O8J32J10J09j41M0l75K8l64K20L56l1Q2j11
$$ 242 134 200 402 -36 -140 -320 -377 -148 -80 52 162 271 130 170 -205 -177 -541 -321 35 4 86 -25
5017b5K91m21J28m6j80J14J6K69P5R7l43J98k60q7n5o7J66J47j59N44K5l38J44
$$ -25 266 -155 -27 -73 -253 -139 -123 146 221 318 -25 173 -87 -174 -229 -296 -130 17 -142 402 427 89 233
5040B33n56J86J9j6j3K93r8K40j25j28j94J15Jk89L71K9J02k3K25l14k0j03m29
$$ 233 -323 -137 -118 -134 -147 146 48 288 163 35 -159 -44 -43 -332 39 68 170 147 372 58 38 -65 -494
5063d94M59R7J29R1K08k80j69j55j18qJ38O0P5pL7J18l7j49p8j67K09J30j36R8
$$ -494 -35 62 191 282 490 210 41 -114 -232 -240 -102 -42 33 26 63 181 144 -5 -83 -250 -41 89 -47 51
5087E1k6K59k01nk3l05R7k45L91pK26j64r5J69m6k62J7k6M5R0K49j10K07j47j90
$$ 51 25 284 83 78 55 -250 -153 -398 -7 -14 212 48 -47 122 76 -186 -169 -195 -150 -60 189 79 286 139 -51
5112e1j82J17j39J80K24p3L18r5k55N9k70J54j64J59j41K44K65j30k07p8l5l15
$$ -51 -233 -116 -255 -75 149 76 394 299 44 103 -167 -13 -177 -18 -159 85 350 220 13 -65 -100 -415
5134d15L10j54M17J16o9J5k4j96p0o4R5j26L72k2r5K23l57J51k55j82K20J49L6
$$ -415 -105 -259 158 274 205 220 196 0 -70 -134 -39 -165 207 185 90 313 -44 107 -148 -330 -110 39 75
5157G5j0L36k79j22Q7k35N1j34J27j2K51k28M78l94m6Rj47O5N2J22J68j3J22m9
$$ 75 65 401 122 0 87 -148 -97 -231 -104 -116 135 -93 385 -9 -55 -46 -193 -128 -76 46 214 201 323 274
5181B74j38l32Jj57K41o9K53K17J04l97j82J38j34j65K7L67J63J29j57K8jk83
$$ 274 136 -196 -195 -352 -111 -180 73 290 394 -3 -185 -47 -181 -346 -319 48 211 340 183 211 210 -73
5203g3L4L2q8r9L64k01N7l6OJ37l20K5r3J33jK43N9K4l7k49m6q5M1K20j07L47
$$ -73 -39 -7 -95 -194 170 -31 26 -10 -4 133 -187 -162 -255 -122 -123 120 179 203 166 -83 -129 -214 -173 47 -60 287
5229B87k15L42j34j79L6j29k95K83j41R9L21k1P2k69P6m90J0L79o2L35k32r9J06
$$ 287 72 414 280 101 137 8 -287 -4 -145 -46 275 254 326 57 133 -357 -347 32 -30 305 73 -26 80
5252H0J96k94nR4l3j95J32M33j1k04j13m7q6j76R4j7J89J00J43l41L18k32n03
$$ 80 276 -18 -23 71 38 -157 -25 408 397 193 80 33 -53 -229 -135 -152 37 137 280 -61 257 25 -478
5275d78P9M90j08J84K9k09O06m89p7lk32N2K2K54j77K27J77l51J28k84j75O5J45
$$ -478 -399 91 -17 167 196 -13 593 104 27 24 -208 -156 -134 120 -57 170 347 -4 124 -160 -335 -270 -125
5298a25J69J11o6N3Q7l91J29q7J79k33o1M19j30o9L72l01j77j64R5l5n6L96J21
$$ -125 44 155 89 142 229 -162 -33 -120 59 -174 -235 184 54 -15 357 56 -121 -285 -190 -225 -281 115 236
5321B36k01J47j61K74l26k99r1M82J9K70j84j20J18l21K23m60J08K63j94K51J94
$$ 236 35 182 21 295 -31 -330 -421 61 80 350 166 46 164 -157 66 -394 -286 -23 -217 34 228
5342B28j47K01k57o2r8k36N56j62O4J2O7j13L3j1l53p8K22J1J93Q7J78k29J78
$$ 228 81 282 25 -37 -135 -371 185 23 87 99 166 53 86 75 -278 -356 -134 -123 70 157 335 106 284
5365B84l75R0r6o1N9K27J01k31j25J30k22l1n8J96N3KK82q1J3n9j1k65j47J54
$$ 284 -91 -1 -97 -158 -99 128 229 -2 -127 3 -219 -250 -308 -112 -59 -57 225 144 157 98 87 -178 -325 -171
5389a71J87J83l7kj0n6j22L0j83j64L82N4j91L23K9l20k3K37m88L41l58K81K59
$$ -171 16 199 162 160 150 94 -28 2 -181 -345 37 91 -100 223 252 -68 -91 146 -342 -1 -359 -78 181
5412A81j62O2J37j25k89J42l31K84j70K52L64j6n9k53j47J49j31q8J6O9L50p1
$$ 181 19 81 218 93 -196 -54 -385 -101 -271 -19 345 329 270 17 -130 19 -112 -200 -184 -115 235 164
5434A64rJ25l04j61K65J06q5k61L92j89KJ16j02K5l57j61K99K46j03K32j04k04
$$ 164 155 280 -24 -185 80 186 101 -160 232 43 45 161 59 84 -273 -434 -135 111 8 240 136 -68
5456f8K8k48K62k26O4K53J53k00J85k49J84j93O9J0k13L52k92L28o2kj36k51J12
$$ -68 -40 -288 -26 -252 -188 65 218 18 203 -46 138 -55 14 24 -189 163 -129 199 137 135 -1 -252 -140
5479a40Q3q5K17l6L03M6k48l37j69K31N1j66L25m9J48j4q4O0k92J18k11j7K86
$$ -140 -57 -142 75 39 342 388 140 -197 -366 -135 -84 -250 75 26 174 160 76 136 -156 -38 -249 -266 20
5502B0JM3J19n4L4m10J1J26l12J64K76J37k2L5k07J24q1rP7j81J95R8k27K78k42
$$ 20 21 64 183 129 163 -247 -236 -110 -422 -258 18 155 133 168 -39 85 4 -5 72 -109 86 184 -43 235 -7
5527gj49M6o3K64k79N1J77K06n2j17k09j9Q5k94K34J82O9j44L01k93pJ50k96j62
$$ -7 -156 -110 -173 91 -188 -137 40 246 194 77 -132 -151 -66 -360 -126 56 125 -19 282 -11 -18 132 -164 -326
5551c26L53R5j95K14J8kR3l24R5j2k38l7M09k8J39l44mJ19m9k65Q3K32o3K12J04
$$ -326 27 122 -73 141 159 157 250 -74 21 9 -229 -266 143 115 254 -90 -94 25 -24 -289 -206 26 -37 175 279
5576B79l98J25j64j58J14j35M56L5K5P4ok74J04J6k33P6q5K55L5k80M72j52l52
$$ 279 -119 6 -158 -316 -202 -337 119 154 179 253 247 -27 77 93 -140 -64 -149 106 141 -139 333 181 -171
5599a71J8J23j67K46p5m6J17J66Mj12j15n4k37J08m3K22J38m0R5j93m6K63l54
$$ -171 -153 -30 -197 49 -26 -72 45 211 215 103 -12 -66 -303 -195 -238 -16 122 82 177 -16 -62 201 -153
5622a53J47l02K40R2K79j96L9r4k17j91L06J47l2j89M56k54K22k60l21J13J12
$$ -153 -6 -308 -68 24 303 107 146 52 -165 -356 -50 97 65 -124 332 78 300 40 -281 -168 -56
5643e6J31km1l6K27j16o5k83n0J93k5J06K90l5%j90K62o06J30L36l87j32N27j26
$$ -56 75 73 32 -4 223 107 42 -241 -291 -98 -123 -17 273 238 238 48 310 -296 -166 170 -217 -349 178 52
5667E2K2J17j98o6k70J36nK70Kj00K80m4k52K08M2l98Q6K2K36k9J16K16j34n04
$$ 52 74 191 -7 -73 -343 -207 -212 58 60 -40 240 196 -56 152 194 -204 -118 -96 140 111 227 443 309 -195
5691a95P7M8q4L01L2l57J46N6O3J37j39k67J79P1j91J53J45J75l75J62n07p2L32
$$ -195 -118 -70 -154 147 179 -178 -32 24 87 224 85 -182 -3 68 -123 30 175 350 -25 137 -370 -442 -110
5714a10J92l2M7j68M9L05k94N3k48J23L2q7L42K3j69P1j31J9q6j39K43J7p4J35
$$ -110 82 50 97 -71 -22 283 -11 42 -206 -83 -51 -138 204 227 58 129 -2 17 -69 -208 35 52 -22 113
5738A13J41j45n3r1j69N0P1l0M32k89J57l04L53j17p1Q9k11R2k75L47L37k42m5
$$ 113 254 109 56 -35 -204 -154 -83 -113 319 30 187 -117 236 119 48 137 -74 18 -257 90 427 185 140
5761A40j45O8j79N2Q7j27L40j85J31k66M37j09l61n1L03j97M42l23J41k24JJ7
$$ 140 -5 63 -116 -64 23 -104 236 51 182 -84 353 244 -117 -168 135 -62 380 57 198 -26 -25 -8
5783hj52K7J51j07K17J7J59l17R5P3k58j28J90j01j20M37k50J62j99J46k23K66
$$ -8 -160 -133 18 -89 128 145 304 -13 82 155 -103 -231 -41 -142 -262 175 -75 87 -112 34 -189 77
5805G7k71K46J07J93j69L1o5l13J49L2j49q7L25mp2K9J82k38l5N8j86J34oK40
$$ 77 -194 52 159 352 183 214 149 -164 -15 17 -132 -219 106 102 30 59 241 3 -32 26 -160 -26 -32 208
5829B08r9K21k11j95Oj41O2L16N6j63R2j66J77l44j1R6j39K45N3P3k41J16k15
$$ 208 109 330 119 -76 -70 -211 -149 167 223 60 152 -14 163 -181 -192 -96 -235 10 63 136 -105 11 -204
5852b04K62K3k05J68mJ3J54j18K17j80J6j32m8j26K85l2j55O6K58M4k89j7j13
$$ -204 58 81 -124 44 40 53 207 89 306 126 142 10 -38 -164 121 89 -66 0 258 302 13 -4 -117
5875a17K79n67M34l4J93K2J13q1j79j8j94n3J15K8K75M4j81k05L6l6m04L10L8
$$ -117 162 -405 29 -5 188 210 323 242 63 45 -149 -202 -87 -59 216 260 79 -126 -90 -126 -530 -220 -182
5898a82K02j09K76k01M29m52q6p2k16N30k65J48J33m2m1j8R6l58J07j24L15J83
$$ -182 20 -89 187 -14 415 -37 -123 -195 -411 119 -146 2 135 93 52 34 130 -228 -121 -245 70 253
5920B53j38o4J40j93k03K37l43M91m51K25J30p5M6J13N1l70J15K41m12J52J65
$$ 253 115 51 191 -2 -205 32 -311 180 -271 -46 84 9 55 168 219 -151 -36 205 -207 -55 110
5941A10m6j47J99K41p44L93p5k22K64J91K88l75k71M4P5k34K43OJ12J12j58J90
$$ 110 64 -83 116 357 -387 6 -69 -291 -27 164 452 77 -194 -150 -75 -309 -66 -60 52 164 6 196
5963A96J53l22K51k27J32l97Q2P9K56J8KR8k91M4m57M19q3J9J66k17L13r8k17
$$ 196 349 27 278 51 183 -214 -132 -53 203 221 223 321 30 74 -383 36 -47 -28 138 -79 234 136 -81
5986h1J21j96J39m2R2j39K12rm01L23k77n5J4M46p0mQ8K1m0j44k14J20l74J93
$$ -81 40 -156 -17 -59 33 -106 106 97 -304 19 -258 -313 -299 147 77 73 161 182 142 -2 -216 -96 -470 -277
6010b77M50j33q1J37J16m13P6j24j01L95O3l87K68R7j63J51l49K90L0j97K17p1
$$ -277 173 40 -41 96 212 -201 -125 -249 -350 45 108 -279 -11 86 -77 74 -275 15 45 -152 65 -6
6032fj15P0M6M3P9k06n6J92k82j63N94k18J96k52qj67K71j43N5P7J80k20L43k62
$$ -6 -121 -51 -5 38 117 -89 -145 47 -235 -398 196 -22 174 -78 -86 -253 18 -125 -70 7 187 -33 310 48
6056D8o9l34M65m7j80J48K26o5j16J22j98j31N1o9J51j4K97l9l13Rj9N7j58R4
$$ 48 -21 -355 110 63 -117 31 257 192 76 198 0 -131 -80 -149 2 -12 285 246 -67 -58 -77 -20 -178 -84
6080h4j56J56J86j45J30k48K86k47jN9L5J1J55J30k41J8k09K35j54j18N1l5J17
$$ -84 -240 -84 102 -43 87 -161 125 -122 -123 -64 -29 -18 137 267 26 44 -165 70 -84 -202 -151 -186 -69
6103f9J81J95j99r4p4j54J79J78k30M3J30M1l8q9l97L59j43K11k77J09l3K42J7
$$ -69 112 307 108 14 -60 -214 -35 143 -87 -44 86 127 89 0 -397 -38 -181 30 -247 -138 -171 71 88
6126H8q2j05k8l9k2L47j02J02j79r3K86j29m9L4k40J45l0O0o9K10j17P4j97l6
$$ 88 6 -99 -127 -166 -188 159 57 159 -20 -113 173 44 -5 29 -211 -66 -96 -36 -105 105 -12 62 -135 -171
6150a71JJ48P1K2j91K52j99K67m10J86l5k01O08l01J51k29K72j40j57l7K2o8K16
$$ -171 -170 -22 49 71 -120 132 -67 200 -210 -24 -59 -260 348 47 198 -31 241 101 -56 -93 -71 -139 77
6173G7o4r6L09j28j37j77M8k1P7J27o4J09J56j86l3J22m08j64M74j1J9j02J21
$$ 77 13 -83 226 98 -39 -216 -168 -189 -112 15 -49 60 216 30 -3 119 -289 -453 21 10 29 -73 48
6196D8K96l22N8k41P3j11q2K52P4O1K00j62k05J6j00K65j73j38K99J07r2P6p9
$$ 48 344 22 80 -161 -88 -199 -281 -29 45 106 306 144 -61 -45 -145 120 -53 -191 108 215 123 199 120
6219A20k62j83K85p9mK68n4J17P2k1l77m0k29P8J73K87p1p6j4J55m9j94L6k3J1
$$ 120 -142 -325 -40 -119 -123 145 91 208 280 259 -118 -158 -387 -309 -136 151 80 4 -10 145 96 -98 -62 -85 -74
6244g4L30o5l00J41J96m85l3J82L70m24N2K87n6L3J5j46j86j5K31j57q7K26J5
$$ -74 256 191 -109 32 228 -257 -290 -108 262 -162 -110 177 121 154 169 23 -163 -178 53 -104 -191 35 50
6267E0j43K10o4j93P3l3j9R6j25K34p4l9o2J38k10l8J25J22m5J3mn4R9J66k73
$$ 50 -93 117 53 -140 -67 -100 -119 -23 -148 86 12 -27 -89 49 -161 -199 -74 48 3 16 12 -42 57 223 -50
6292e0j94J67k6J58j06L58l40J24m0j79Q3j78K22J39l76J88L00l00K34m89J20
$$ -50 -244 -77 -103 55 -51 307 -33 91 51 -128 -45 -223 -1 138 -238 -50 250 -50 184 -305 -185
6313a85J43j0R5r8J79M7K1Jk66m6k50K10J65K54j41j80R6N5j05j77J71p4J93p7
$$ -185 -42 -52 43 -55 124 171 192 193 -73 -119 -369 -159 6 260 119 -61 35 90 -15 -192 -21 -95 98 21
6337B1M9J90j31K8j50p6k56J20l6K36n2L62M3m87j7N6j19K30j21K37r8K64r4k39
$$ 21 70 260 129 157 7 -69 -325 -205 -241 -5 -57 305 348 -139 -156 -100 -219 11 -110 127 29 293 199 -40
6361d0R7l67P6Pp9L36o8L24K1l27m9j42l7L57j79J76q4l1K75k13R0q1r5j2j46
$$ -40 57 -310 -234 -227 -306 30 -38 286 307 -20 -69 -211 -248 109 -70 106 22 -9 266 53 143 62 -33 -45 -191
6386a91M03k04K48j32l7j34n1R8j56Nj5J96l4K67j70M6j06N3m1q9m7N01j66n9
$$ -191 212 8 256 124 87 -47 -98 0 -156 -151 -166 30 -4 263 93 139 33 86 45 -44 -91 410 244 185
6410A85k17J12N4q6n5l6J16j39j03M58l46n6J31l52K82o6J29J8N5J4p7J36j71
$$ 185 -32 80 134 48 -7 -43 73 -66 -169 289 -57 -113 18 -334 -52 -118 11 29 84 98 21 157 -14
6433a4k8k56R8J39o0M03j15l9J6k0k34J21j48L0K07k35L24j01j12l3j58M5N0j12
$$ -14 -42 -298 -200 -61 -121 282 167 128 144 124 -110 11 -137 -107 100 -135 189 88 -24 -57 -215 -170 -120 -232
6457b32J01Q3j5J47O2o8Q0j62J65k27K38J91j87o0j8N6k20N7Q3k67L40k0k28K35
$$ -232 -131 -48 -63 84 146 78 158 -4 161 -66 172 363 176 116 98 154 -66 -9 74 -193 147 127 -101 134
6481A34R0j30J32k39j71J80j60K96M1k78K10k31K71k73L4O0J68Q8j26oJ97j9l06
$$ 134 224 94 226 -13 -184 -4 -164 132 173 -105 105 -126 145 -128 -94 -34 134 222 96 90 287 268 -38
6504c8%p9J41m6K1J98l4j84J8J08j51j52O8j2K27J83k53m8J79l00J46Lp1o8M1
$$ -38 -38 -117 24 -22 -1 197 163 -21 -3 105 -46 -198 -130 -142 85 268 15 -33 146 -154 -8 -5 -76 -144 -103
6529a03K47K4k8j2k12ql9l2k7J64j03L06L0l6N0j97k11j07J21J16L1K77q4o5l6
$$ -103 144 168 140 128 -84 -92 -131 -163 -190 -26 -129 177 207 171 221 24 -187 -294 -173 -57 -26 251 167 102 66
6554F6k69M1J19k78J05J40L18m8q7J18k55r3L2NqL56m06L0L04r6k93N7r7K38q
$$ 66 -203 -162 -43 -321 -216 -76 242 194 107 225 -30 -123 -91 -86 -94 262 -144 -114 190 94 -199 -142 -239 -1 -9
6579ij54N7j15K23J44r1j94K19m47J77J4J10N3K57l02P9nK97k02j24k51K96L0
$$ -9 -163 -106 -221 2 146 55 -139 80 -367 -190 -176 -66 -13 244 -58 21 16 313 111 -13 -264 32 62
6602F2Q0l7l62K5K45o5j64K73l6N6l57L65j42j13n4K64j00O6j50L65j11p2j07
$$ 62 142 105 -257 -232 13 -52 -216 57 21 77 -280 85 -57 -170 -224 40 -60 6 -144 221 110 38 -69
6625f9K18l6j85j65p8N26J9p4j00l21L43NJ8l02R5J78k42M18k38R6J16l60K00
$$ -69 149 113 -72 -237 -315 211 230 156 56 -265 78 83 101 -201 -106 72 -170 248 10 106 222 -138 62
6648F2J05j70R7N7k03K27K70k77j62j55j09K84j1j56K59q6J97j73r6m4j29O9N6
$$ 62 167 -3 94 151 -52 175 445 168 6 -149 -258 26 15 -141 118 32 229 56 -40 -84 -213 -144 -88
6671h8o7J73K39j55j53P0j20j25J74R4MK33p9p3K7j63j69O0r5J52M4J55J23j79
$$ -88 -155 18 257 102 -51 19 -101 -226 -52 42 46 279 200 127 154 -9 -178 -118 -213 -61 -17 138 261 82
6695H2K56k87k18J62j72J79O7l39L37oK7q8K59l70O1j35Q9K53n70N77n5j18R1
$$ 82 338 51 -167 -5 -177 2 69 -270 67 61 88 0 259 -111 -50 -185 -96 157 -413 164 109 -9 82
6718H2j41j32p9J57O9j11K27j82K58l45M6J50l22P1K06J7O0j37J00J05k18j52
$$ 82 -59 -191 -270 -113 -44 -155 72 -110 148 -197 -151 -1 -323 -252 -46 -29 31 -106 -6 99 -119 -271
6740b71L61j42M1K07p2n7N0j95O0k56M5J19j08L06K23l36J21j3o2j82N6P6K06
$$ -271 90 -52 -11 196 124 67 117 -78 -18 -274 -229 -110 -218 88 311 -25 96 83 21 -161 -105 -29 177
6763A77k77J73j1mj05o0J04m29K79J87J14m8J0j58J70j48k01J41j20L07j54R5
$$ 177 -100 73 62 58 -47 -107 -3 -432 -153 34 148 100 110 -48 122 -26 -227 -86 -206 101 -53 42
6785D2j7m6j17K07l11K81J19k72P3R6J72j59K77m39l52K38J81QJ2J89j38J04j65
$$ 42 25 -21 -138 69 -242 39 158 -114 -41 55 227 68 345 -94 -446 -208 -27 -19 -7 182 44 148 -17
6808a7m5r8O0l2Q2J1j23M82j81n1j66K0rJ99q2O5j69K90M5l37L20o6l61P1j2r8
$$ -17 -62 -160 -100 -132 -50 -39 -162 320 139 88 -78 -58 -67 132 50 115 -54 236 281 -56 264 198 -163 -92 -104 -202
6834b02L11j06J9k26K80n1j26j01J50n0J70q0j12R5j43L8J30p7O5mK98q0k34J04
$$ -202 109 3 22 -204 76 25 -101 -202 -52 -102 68 -12 -124 -29 -172 -134 -4 -81 -16 -20 278 198 -36 68
6858F8k08J02P2m10K16n2K8L26j29J37r4O7l1j40L2q8j22K85j12p9K26p2k58K84
$$ 68 -140 -38 34 -376 -160 -212 -184 142 13 150 56 123 92 -48 -16 -104 -226 59 -53 -132 94 22 -236 48
6882D8l5j87q7L65j6n9j0j30j12j32M54o4j40P0PJ07n7O8m2j29j39Q1J54J39l2
$$ 48 13 -174 -261 104 88 29 19 -111 -223 -355 99 35 -105 -35 -28 79 22 90 48 -81 -220 -139 15 154 122
6907A22q1m9J1q5J57j94M9J18RJ4J05j11N4l54K24j06K64k33J55J20j72Q7n7j6
$$ 122 41 -8 3 -82 75 -119 -70 48 57 71 176 65 119 -235 -11 -117 147 -86 69 189 17 104 47 31
6931C1j51K6j70N3K70j4jk7n3j74J11j7O3J75k23L17l19J67Om8l5k42K55J59m61
$$ 31 -120 -94 -264 -211 59 45 44 17 -36 -210 -99 -116 -53 122 -101 216 -103 64 70 22 -13 -255 0 159 -302
6956c02L66J92j8j19R9k58P4j96k5J64R9j01N6K36j52q7j13K24j89P4N3j15L01
$$ -302 64 256 238 119 218 -40 34 -162 -187 -23 76 -25 31 267 115 28 -85 139 -50 24 77 -38 263
6979B63k78K37k70m9n9K09j67O3J47k4N2M6j8j04o5J75k65M3j07M09j75K4j05
$$ 263 -15 222 -48 -97 -156 53 -114 -51 96 72 124 170 152 48 -17 158 -107 -64 -171 238 63 87 -18
7002a8q0J43j25n2K43j80J72J38j84p2l0Q0o4l43J04K65J76K45m45q6RK3k76N12
$$ -18 -98 45 -80 -132 111 -69 103 241 57 -15 -45 35 -29 -372 -268 -3 173 418 -27 -113 -104 -81 -357 155
7026A55j15N8j02O9P9j43k36j3K41r7j7N2L13k23m2L13l93p0J5J89J13R9j91J30
$$ 155 40 98 -4 65 144 1 -235 -248 -7 -104 -121 -69 244 21 -21 292 -101 -171 -156 33 146 245 54 184
7050A84J92m46p0R2o0l9L29m8Q1k15J41J1k7j16l45M51k06N0p5J58J03r3j4rj18
$$ 184 376 -70 -140 -48 -108 -147 182 134 215 0 141 152 125 9 -336 115 -91 -41 -116 42 145 52 38 29 -89
7075h9J3J81k38R1K22o8o8M2k57P6R4Pk9p6Q4J87R1l08L69k94p6k74M09q7j42
$$ -89 -76 105 -133 -42 180 112 44 86 -171 -95 -1 6 -23 -99 -15 172 263 -45 324 30 -46 -320 89 2 -140
7100a40J70J3J45l86p8K75j04P5O6Q2K42j12p3j56J47l35k29K98j1K57k5m7j06
$$ -140 30 43 188 -198 -276 -1 -105 -30 36 118 360 248 175 19 166 -169 -398 -100 -111 146 121 74 -32
7123c2N4p8J77J5j61J39j53j7l0J46p1j35R5N6K4l90N86j05k41K32k73K08q3l7
$$ -32 22 -56 121 136 -25 114 -39 -56 -86 60 -11 -146 -51 5 29 -361 225 120 -121 111 -162 46 -37 -74
7147g4j61J44K92k10P3k64K60j27m3N5n6L2P4O9M8M9j33q2J76j56N1j81J12kR2
$$ -74 -235 -91 201 -9 64 -200 60 -67 -110 -55 -111 -79 -5 64 112 161 28 -54 122 -34 17 -164 -52 -54 38
7172C8p2m8K04m4k29J42jP0LM8J1j17qJ88j67j17KJ97k25M55j81j70K32k67N7
$$ 38 -34 -82 122 78 -151 -9 -10 60 63 111 122 5 -3 185 18 -99 -97 100 -125 330 149 -21 211 -56 1
7197Aj76J31r3K33p1K91k82p7J63j57j86K12j00J31L7j41K23m2J7j99m6J55j7
$$ 1 -175 -44 -137 96 25 316 34 -43 120 -37 -223 -11 -111 20 57 -84 139 97 114 -85 -131 24 7
7220Gj1n2J0J94J8k77K50r7j45J09N7Q2l07J35K0K32l77J81j58L64m03J89%J92
$$ 7 -4 -56 -46 148 166 -111 139 42 -103 6 63 145 -162 -27 -7 225 -152 29 -129 235 -168 21 21 213
7244B13k24M9N1j36K2j75R0K04K00K1r6j05r4o3j42K61k49J64p8J89J87p5m26
$$ 213 -11 38 89 -47 -25 -200 -110 94 294 315 219 114 20 -43 -185 76 -173 -9 -87 102 289 214 -212
7267b12J52N4Q6M9j06J97o4n9n8j43MJ12KM4j99L41L0k14J41n11L15k9O2J84n1
$$ -212 -60 -6 80 129 23 220 156 97 39 -104 -100 12 14 58 -141 200 230 16 157 -354 -39 -68 -6 178 127
7292A27j72J96J14j82p3j02j30J27P0j26K83oN2L7k95J27k94R2mL5K34M3L3p8
$$ 127 -45 151 265 83 10 -92 -222 -95 -25 -151 132 126 178 215 -80 47 -247 -155 -159 -124 110 153 186 108
7316A08k79R2J6J83l91K59J83j80J48Kk40n0N8j88J90K11j45j7n1L07k2k00n1
$$ 108 -171 -79 -63 120 -271 -12 171 -9 139 141 -99 -149 -91 -279 -89 122 -23 -40 -91 216 194 -6 -57
7339e7k6Q5M0R3K87l33J73l12K51j58O7m37K48P5R6L0k02L6J6n6k33J77P4K07
$$ -57 -83 2 42 135 422 89 262 -50 201 43 110 -327 -79 -4 92 122 -80 -44 -28 -84 -317 -140 -66 141
7363A41o6m0L9j59J45m9O6j46l4J55K6j52J2K2K49k4k08L1K8k18L73Nj31P3Nj92
$$ 141 75 35 74 -85 60 11 77 -69 -103 52 78 -74 -62 -40 209 185 -23 8 36 -182 191 196 65 138 143 -49
7389d9Lj46j3J70j09pK52O4m22J15J56l4J84k96J3k5L11J4k11n3K9j18J18j56
$$ -49 -46 -192 -205 -35 -144 -151 101 165 -257 -142 14 -20 164 -132 -119 -144 167 181 -30 -83 -54 -172 -54 -210
7413b10K7J97r9R5o8J73k08L3K2N6J64j67J5J28q1P9j24m51L78J29l14O1K29j13
$$ -210 -183 14 -85 10 -58 115 -93 -60 -38 18 182 15 30 158 77 156 32 -419 -41 88 -226 -165 64 -49
7437d9k68O57k82k10l1L65j74J61l28J94M28n69J3J42k91J83J00j34K54j42jJ23
$$ -49 -317 340 58 -152 -183 182 8 169 -159 35 463 -106 -93 49 -242 -59 41 -93 161 19 18 141
7459A41p7j8k97J85J57p0lj22M7j25J42J08o6n2j84J12L00k15P1J4o5l62K24J90
$$ 141 64 46 -251 -66 91 21 18 -104 -57 -182 -40 68 2 -50 -234 -122 178 -37 34 48 -17 -379 -155 35
7483C5o0l8J10K11k15J56M6l21J73p3j97J37J17JK7o9lj62M8N1QQ5j45M5J65j37
$$ 35 -25 -63 47 258 43 199 245 -76 97 24 -173 -36 81 82 109 40 37 -125 -77 -26 -18 67 -78 -33 132 -5
7509eK29l46J96mq5m0l4K06Q5k7j88j15%J56J07l9k83J85K56k27K59l13j76J22
$$ -5 224 -122 74 70 -15 -55 -89 117 202 175 -13 -128 -128 28 135 96 -187 -2 254 27 286 -27 -203 -81
7533h1j57J62l8K75Q4k39P1j61J31j15k5J34J83k75J80l45K38Q2j29M6j19O9J16
$$ -81 -238 -76 -114 161 245 6 77 -84 47 -68 -93 41 224 -51 129 -216 22 104 -25 21 -98 -29 87
7556H7l9M6jj41j16L38k30j36K17r8p8L93q3n4N5m8l39K75k63K59o2j25K54Ll
$$ 87 48 94 93 -48 -164 174 -56 -192 25 -73 -151 242 159 105 160 112 -227 48 -215 44 -18 -143 111 114 111
7581A11k22Q1j6rJ88r6J26k63K24J86k16J51l46j24K30j7m2J70k28J48Q6l63J44
$$ 111 -111 -30 -46 -55 133 37 163 -100 124 310 94 245 -101 -225 5 -12 -54 116 -112 36 122 -241 -97
7604i7J43o5J17O7r0J11o6k72K05j30J03L6j99K62k26L63l37k69M79k85p8M93
$$ -97 46 -19 98 165 75 186 120 -152 53 -77 26 62 -137 125 -101 262 -75 -344 135 -150 -228 265
7626B65j59J32m08L74m23M27j82j15J56k42L12J58k28k41K39J2j03k31J94n2l7
$$ 265 106 238 -170 204 -219 208 26 -89 67 -175 137 295 67 -174 65 77 -26 -257 -63 -115 -152
7647a52JM4J52j77%J03r5O7n6r8K25J59N4k5r9n7Kj06j12L8M4J16J05q2rk92K67
$$ -152 -151 -107 45 -132 -132 -29 -124 -57 -113 -211 14 173 227 202 103 46 48 -58 -170 -132 -88 28 133 51 42 -250 17
7674A7n8j60J24J6J46j3j0mk49K59j28k29R2J68J93k40O9J4n7j98K73r7J68j97
$$ 17 -41 -201 -77 -61 85 72 62 58 -191 68 -60 -289 -197 -29 164 -76 -7 7 -50 -248 25 -72 96 -101
7698a01M9Q5P7p9K3n4J1k6pj29J92r3K29M7j68k1r7N9m9K81m18K52K01k51Rj84
$$ -101 -52 33 110 31 54 0 11 -15 -22 -151 41 -52 177 224 56 35 -62 -3 -52 229 -189 63 264 13 22 -162
7724a62K99k14j00K1J55K45k75l5L83j46k95J89qk13J55J21j41K0J16j55J06l34
$$ -162 137 -77 -177 -156 -1 244 -31 -66 317 171 -124 65 57 -156 -1 120 -21 -1 115 -40 66 -268
7746b68P3j27K51j22K81j10M1R9j02J40j77R0K1k3m9j63K16L8j50K03j54O5J78
$$ -268 -195 -322 -71 -193 88 -22 19 118 16 156 -21 69 90 67 18 -145 71 109 -41 162 8 73 251
7769B51k93M5krO7K0j23O3N5K39j33q8j8p0j03Q4K96l91K12K1q5J53l0p2N4M9
$$ 251 -42 3 1 -8 59 79 -44 19 74 313 180 92 74 4 -99 -15 281 -110 102 123 38 191 161 89 143 192
7795A92l94J28R7l5K20k66J89j64J35j99j01k1n7L5K47J7nj59K83k70J56q7j86
$$ 192 -202 -74 23 -12 208 -58 131 -33 102 -97 -198 -219 -276 -241 6 23 18 -141 142 -128 28 -59 -245
7818b45L10k24K73m2j0j4q2J22j33k04K11J82p6j02L01k87j74j82M64j51M1P0
$$ -245 65 -159 114 72 62 48 -34 88 -45 -249 -38 144 68 -34 267 -20 -194 -376 88 -63 -22 48
7840D8j0N4o8j53L0R9Q7k29L0K16l32M48q9j26l6p6rM67k58j73J77j59L63j18
$$ 48 38 92 24 -129 -99 0 87 -142 -112 104 -228 220 131 5 -31 -107 -116 351 93 -80 97 -62 301 183
7864A83l77K92n0q3K18M9j32P2k62J83r4J14j44J80j2l07k9R2J81r3j91L95k66
$$ 183 -194 98 48 -35 183 232 100 172 -90 93 -1 113 -31 149 137 -170 -199 -107 74 -19 -210 185 -81
7887h1J43Q5P0l91K67p8N6M0J83l71j05K70j34o7J00M6R6o3j25j75K06J38j69
$$ -81 62 147 217 -174 93 15 71 111 294 -77 -182 88 -46 -113 -13 33 129 66 -59 -234 -28 110 -59
7910e9J27r3m4R6K6K21k78J22j95J43j28J83pk00K80l47K84k58K40k72J19q4L8
$$ -59 68 -25 -69 27 53 274 -4 118 -77 66 -62 121 114 -86 194 -153 131 -127 113 -159 -40 -124 -86
7933h6R8O1r5j97J76l0p2K70j77J05J37n3m9Mr6o3o2J47m6P5J43k62R3k6j08K88
$$ -86 12 73 -22 -219 -43 -73 -145 125 -52 53 190 137 88 92 -4 -67 -129 18 -28 47 190 -72 21 -5 -113 175
7959A75k55J07j94J03K93o0p3m94M79j54j19J51O3j33J64j09J14p9J90k51R0N5
$$ 175 -80 27 -167 -64 229 169 96 -398 81 -73 -192 -41 22 -111 53 -56 58 -21 169 -82 8 63
7981F3J25k35L06j39k30J27n1j68K42k29J82Q0j11o5K33J07j64Kj11J92k19K27
$$ 63 188 -47 259 120 -110 17 -34 -202 40 -189 -7 73 -38 -103 130 237 73 75 -36 156 -63 164
8003A64L12l75P4k20J80j29k42L67p3j94J84M5j61J84N0j76K42m28j5P2L19J11
$$ 164 476 101 175 -45 135 6 -236 131 58 -136 48 93 -68 116 166 -10 232 -196 -211 -139 180 291
8025B91j75N0k46R2j98J14o8L3j03J09L46K0l15J4J1m5j39L28k59K21p4J79j05
$$ 291 116 166 -80 12 -186 -72 -140 -107 -210 -101 245 265 -50 -36 -25 -70 -209 119 -140 81 7 186 81
8048H1j11J92j32k23L5J27m6J78j21m4J73l1O7j72J39j38J3j21J18k1L2Pr6K9
$$ 81 -30 162 30 -193 -158 -31 -77 101 -20 -64 109 78 145 -27 112 -26 -13 -134 -16 -37 -5 2 -94 -65
8072f5J80J8o4r9m5o9L43l02J05k72Q9K83j30N3q6J57J42j3l28R1L2k23K66J50
$$ -65 115 133 69 -30 -75 -144 199 -103 2 -270 -181 102 -28 25 -61 96 238 225 -103 -12 20 -203 63 213
8096B13k14J39j12j00J69j33j2n3l1N35m20J00k38J46j49j8L75k45O6q2J01j21
$$ 213 -1 138 26 -74 95 -38 -50 -103 -134 401 -19 81 -157 -11 -160 -178 197 -48 18 -64 37 -84
8118h4J99j23L15m63L1J96j44J14K62k49k02p0N9J49J27j09L1J66l32J74J11l2
$$ -84 115 -8 307 -156 -125 71 -73 41 303 54 -148 -218 -159 -10 117 8 39 205 -127 47 158 126
8140A26j55J32J20j71M7q8J52n5j24K2J1M4j66J50k09J74P3Q4J28k88Q0l30M13
$$ 126 -29 103 223 52 99 11 163 108 -16 6 17 61 -105 45 -164 10 83 167 295 7 87 -243 170
8163A70q9J10Lj70J46r5j78J68J8p0J38k22M5K26j97M1N3q1N8k4j05n3K07o8j6
$$ 170 81 191 194 24 170 75 -103 65 83 13 151 -71 -26 200 3 44 97 16 74 50 -55 -108 99 31 15
8188A5K08l02J54
$$ 15 223 -79 75
8191G5
$$ Imaginary data points
##PAGE= N=2
##DATA TABLE= (X++(I..I)), XYDATA
0@%%%%%%%%%%%%%%%%Qj6J6j6J6j6K4l2L2m0M8n3O1p2Q1r0J05j20J36j53J70j89
$$ 0 0 0 0 0 0 0 0 0 0 0 0 0 0 0 0 0 8 -8 8 -8 8 -8 16 -16 16 -24 24 -29 32 -40 41 -49 56 -64 72 -81 89 -100
38a00K13k40K66k94L28l64M02m45M93n43N98o60P26p99Q80r71J074j190J319j464
$$ -100 113 -127 139 -155 173 -191 211 -234 259 -284 314 -346 380 -419 461 -510 564 -626 693 -771
58g71J635j836K075k365K726l189L811m695O060q474J4039n5796m078O4310L106
$$ -771 864 -972 1103 -1262 1464 -1725 2086 -2609 3451 -5023 9016 -46780 -50858 13452 16558
73A6558K1331K3098m700n2954l3956q661P03l379K3122M1577L1437o828j9755
$$ 16558 37889 60987 56287 3333 -30623 -39284 -38581 -41960 -18838 22739 54176 47348 27593
86B7593j2355k0118m0534j8198K4671L1041J0731K1506L0650k052l8666k7585
$$ 27593 15238 -4880 -45414 -63612 -38941 -7900 2831 24337 54987 52935 14269 -13316
98a3316j0456j2990r102K1234L8317K2734J618m153q204k5152l4755j5087J2446
$$ -13316 -23772 -36762 -45864 -24630 13687 36421 38039 33886 25682 530 -34225 -49312 -36866
111c6866J6376J2083K5617K9556p41k4784j8373j3228k3516j3423J8173L0183
$$ -36866 -20490 -8407 17210 46766 46025 21241 2868 -10360 -33876 -47299 -29126 1057
123A057J8769J1533R475n666k7878l2033j4250J787O098J4890L0716K6165p16
$$ 1057 19826 31359 40834 35168 7290 -24743 -38993 -37206 -31108 -16218 14498 40663 39947
136C9947j5754j1872j7422k6790j0789J6443K1528J3721J6184J5144o047k5116
$$ 39947 24193 12321 -5101 -31891 -42680 -26237 -4709 9012 25196 40340 34293 9177
148I177k3640j2774p647o73J6131K8786K1099K748n237p967k0454k6321r647J1251
$$ 9177 -14463 -27237 -34884 -35557 -19426 9360 30459 33207 27970 20003 -451 -26772 -36419 -25168
162b5168J2911J2149K0403J6932n647j9587j5897j3291j4394m113J4700K2728
$$ -25168 -12257 -108 20295 37227 31580 11993 -3904 -17195 -31589 -35702 -21002 1726
174A726J6779P668L422m997j9505k3995r897M355O293J1068K2329J7954l567j4463
$$ 1726 18505 26173 29595 24598 5093 -18902 -28799 -24444 -18151 -7083 15246 33200 29633 15170
188A5170j1744j4330j8806n568J3754J8963J3287J1676Q417m388j9048j9907r938
$$ 15170 3426 -10904 -29710 -35278 -21524 -2561 10726 22402 30819 26431 7383 -12524 -22462
201b2462j727J804J1113K1812J6879n76q265q667j5123k1013o987J1424J3631
$$ -22462 -24189 -22385 -11272 10540 27419 26843 18578 9911 -5212 -26225 -33212 -21788 -8157
214h157J1445J5233J2115l623j7126j5768r903p813j472J1616K0112J3723K687
$$ -8157 3288 18521 30636 27013 9887 -5881 -15784 -23597 -25069 -13453 6659 20382 23069
227B3069k076o390j6340j9643p218O270R115J0955J7377J3551k470j3279j2544
$$ 23069 20993 14603 -1737 -21380 -28598 -22328 -13213 -2258 15119 28670 26200 12921 377
240C77j1670j1470l693J1025J7298J2690O265K695n286j6696j8217p855J771M799
$$ 377 -11293 -22763 -26456 -15431 1867 14557 20822 23517 18231 1535 -16682 -24537 -22766 -17967
254a7967J1105J8164J3856l37q861r703j2581j4051n616R280J3832J1079R294
$$ -17967 -6862 11302 25158 24821 15960 6257 -6324 -20375 -25991 -16711 -2879 8200 17494
267A7494P054m018j5640j6123p769l287P15J1012J8616J2724J119l742o863j4012
$$ 17494 24548 20530 4890 -11233 -19002 -22289 -21574 -10562 8054 20778 21897 18155 11292 -2720
281b720j5742n667O865J0184R373J2991R586l127j4676j2629q793p887k202J0765
$$ -2720 -18462 -24129 -17264 -7080 2293 15284 24870 21743 7067 -5562 -14355 -22242 -24444 -13679
295a3679J8573J0956L591J173m687j5108j6534n691M178N165R392J4923J1357
$$ -13679 4894 15850 19441 20614 15927 819 -15715 -21406 -17228 -12063 -2671 12252 23609
308B3609k742j0923r665j0054j1094m096J0124J5304J0054O402N050l116j5218
$$ 23609 20867 9944 279 -9775 -20869 -24965 -14841 463 10517 16919 21969 18853 3635
321C635j5365o010K28K082Q624J6493J1334j332p116p113j1332j3855m801Q500
$$ 3635 -11730 -17740 -17512 -15430 -6806 9687 21021 19689 12573 5460 -5872 -19727 -24528 -16028
335a6028J2168R100R363Q942l066j4325j3444o557m231j550R388J6958J0517R48
$$ -16028 -3860 5240 14603 23545 20479 6154 -7290 -13847 -18078 -19628 -10240 6718 17235 18183
349A8183k562m889j2865j5748m764O078Q234Q110J2949J0189k155j2600j0143
$$ 18183 15621 10732 -2133 -17881 -22645 -16567 -8333 -223 12726 22915 20760 8160 -1983
362a983p600q142l648R668J5375R155L079K110l647j4271j4925n091K963L472
$$ -1983 -9583 -17725 -21373 -11705 3670 12825 15904 18014 14367 96 -14829 -19920 -16957 -13485
376a3485R149J5033J0916k194q025p991r551j1585m088Q334J2687Q478O698N552
$$ -13485 -4336 10697 21613 19419 11394 3403 -6148 -17733 -21821 -13487 -800 7678 14376 19928
390A9928k930j3691j3933n384j465K51Q949J6034J0743j7m473n126j1432j3511
$$ 19928 16998 3307 -10626 -16010 -17475 -17224 -8275 7759 18502 18485 14012 8886 -2546 -16057
404a6057m663O711Q933P989R586P690k140j2372j1844o403n040j682Q619J5390
$$ -16057 -20720 -14009 -5076 2913 12499 20189 18049 5677 -6167 -12570 -17610 -19292 -10673 4717
418D717J0022J572K13l579j2999j3682m709L694M955P977J2421R371k173r304
$$ 4717 14739 16311 16524 12945 -54 -13736 -18445 -14751 -9796 -1819 10602 19973 17800 8496
432H496q915q510q753l408Q405J3747R002M851L743k951j2809j3259m925N4J337
$$ 8496 -419 -8929 -17682 -21090 -12685 1062 10064 14915 18658 15707 2898 -10361 -15286 -15232 -13895
447a3895Q161J4065R057q49n087o780j0124j0948l828O798J0138Q547P746O442
$$ -13895 -5734 8331 17388 16539 11452 4672 -5452 -16400 -20228 -13430 -3292 5255 13001 19443
461A9443k012j2015j1831n696l544r46Q086J4180Q730Q12j429m807j1392j1926
$$ 19443 17431 5416 -6415 -12111 -15655 -16601 -8515 5665 14395 15207 13778 8971 -2421 -14347
475a4347l915M078O381Q234J0367Q181j213r665r820o818o812l216P549J3316
$$ -14347 -18262 -14184 -7803 431 10798 18979 17766 8101 -1719 -8537 -15349 -18565 -11016 2300
489B300Q418K838K114k959j2091j2627l683J418K849Q111J2240Q187m61o134p776
$$ 2300 10718 13556 15670 12711 620 -12007 -15690 -14272 -11423 -3312 8928 17115 16654 10520 2744
504B744p672r381l867N988J0933P432N294N280j935j1797j1600m401j680Q3P827
$$ 2744 -4928 -14309 -18176 -12188 -1255 6177 11471 16751 14816 3019 -8581 -12982 -14662 -14579 -6752
519f752J3184Q335Q33l194n324r386j0531m387M079Q143P228O942O915n00r702
$$ -6752 6432 14767 15600 12406 7082 -2304 -12835 -17222 -13143 -5000 2228 9170 16085 15585 5883
534E883r922n414m424k253O685J2544Q277K731J30l717r961j1053n339J844N516
$$ 5883 -4039 -9453 -13877 -16130 -9445 3099 11376 14107 14237 10520 559 -10494 -15833 -13989 -8473
549h473P435Q821P772L68q201q580o016o514l689O255J1604P434L825L399k589
$$ -8473 -1038 7783 15555 15923 7722 -858 -6874 -13388 -17077 -10822 782 8216 12041 15440 12851
564A2851j0296j0424m974n67J694P138J0233Q131J125m915o828p402q143m234
$$ 12851 2555 -7869 -12843 -13410 -11716 -4578 5655 13786 14911 9996 3168 -4234 -12377 -16611
578a6611M626R722P024N333N216j353r732r445m823k970j3O230J0081P545K103
$$ -16611 -11985 -2263 4761 10094 15310 13957 4225 -5220 -10043 -13013 -13026 -6796 3285 10830 12933
593A2933j948m596p575r133m893K854O687O548P247P029j00q345q832n129n423
$$ 12933 10985 6389 -1186 -10319 -15212 -12358 -5671 877 8124 15153 15053 6708 -2124 -7253 -12676
608a2676k192N877J0173P517L063Q81l007q788r518m560P94M203O351Q089P378
$$ -12676 -14868 -8991 1182 8699 11762 12643 9636 848 -8670 -13230 -12436 -8233 -1882 6207 13585
623A3585J225o385o956n857o993m041M754R544O733M472L568k069q915r477m550
$$ 13585 14810 8425 1469 -4388 -11381 -15422 -10668 -1124 5609 10081 13649 11580 2665 -6812 -11362
638a1362j107J815O194R311P590J063l942n225o708q241m286M178P295N654O138
$$ -11362 -12469 -10654 -4460 4851 12441 13504 9562 4337 -2371 -10612 -14898 -10720 -3425 2229 8367
653H367N211r70q441p853m845l635n57N973R661P077K293o84m052p773q852m373
$$ 8367 13578 12608 4167 -3686 -8531 -12166 -12723 -6750 2911 9988 12281 11597 7545 -228 -9080 -13453
669a3453K392M974N462P047O722o58o911o516m940n460k237N398R036O500L482
$$ -13453 -11061 -6087 -625 6422 13144 12486 5575 -941 -5881 -11341 -13578 -8180 856 7356 10838
684A0838J369k519p904r230m515N54L109M961Q395P307R5m902n449n659p571k914
$$ 10838 12207 9688 1784 -7446 -11961 -11407 -8298 -3337 5058 12365 12460 7558 2109 -3550 -11121 -14035
700a4035N024P921N461N113L649j806q250q102m436k059O09N178R114P068J110
$$ -14035 -9011 -1090 4371 9484 13133 11327 3077 -5025 -9461 -11520 -10911 -5733 3381 10449 11559
715A1559k737l559o518q560l507L714N930N290O183N432j413p362o788m938m107
$$ 11559 8822 5263 -1255 -9815 -13322 -9608 -3678 1612 7795 13227 11814 4452 -2336 -7274 -11381
730a1381r28N513Q824O330K059o8k807p437q836l160J886M081M629P815O245n41
$$ -11381 -12309 -6796 2028 8358 10417 10349 7542 105 -8731 -11891 -10005 -5924 -1295 6520 12765 12224
746A2224o083n435n369o098k300M717Q053N655L721K372j958p793p973l860l8
$$ 12224 6141 706 -4663 -10761 -13061 -8344 -291 5364 9085 11457 9499 1706 -6267 -10127 -10165
761a0165J427N156Q389O694J6l659m349o129p397k877L928O340N175N164M248
$$ -10165 -8738 -3582 4807 11501 11517 7858 3509 -2620 -10017 -12894 -8966 -2626 2549 7713 11961
776A1961j328p495p049m202k151k66N035Q967O439P46j376l193o751q146l439
$$ 11961 10633 3138 -3911 -8113 -10264 -10530 -5495 3472 9911 10657 9281 6088 -663 -8809 -12248
791a2248L045M171M752O594N586r00o296n650m816m362j529M869Q139N658K540
$$ -12248 -9203 -5032 -280 6314 11900 11000 4704 -946 -5762 -10124 -11653 -6784 1355 7013 9553
806I553J026k206p549p980l287P18K435M644P319O127p5m366m607n155o203k481
$$ 9553 10579 8373 824 -7156 -10443 -9725 -7290 -2646 4673 10800 10725 6359 1752 -3403 -9606 -12087
822a2087M223O814N086M121L138j439p064p632m136r78Q13M402Q260O018R51k886
$$ -12087 -7864 -1050 4036 8157 11295 9856 2792 -4840 -8976 -9954 -9141 -4739 3521 9539 10490 7604
838G604l184n693p459l047L463N207M536N387M703q52o506o857l725l252r84M537
$$ 7604 4420 -1273 -8732 -11779 -8316 -3109 1427 6814 11517 10665 4159 -2698 -6423 -9675 -10659 -6122
854f122P947N629J574l8k391o358p604k899J740L259M499O337N346o32n190n042
$$ -6122 1825 7454 9028 8990 6599 241 -7363 -10262 -8522 -5263 -764 5573 10919 10287 5097 55
870E5m479m898j885M094O902M999L058K025j759o359p085l614M04J159M192P150
$$ 55 -4424 -9322 -11207 -7113 -211 4788 7846 9871 8112 1753 -5332 -8946 -8542 -7383 -3191 3959
886C959N649K43k887m100n178o247k318K997N534M572M635L176r09n701o797l652
$$ 3959 9608 9851 6964 2864 -2314 -8561 -10879 -7882 -2348 2224 6859 10035 9126 3425 -3372 -7024
902g024j576j42L871P423N783R93j468k719n705p008k883K321L776M676N439M394
$$ -7024 -8600 -8742 -4871 2552 8335 9328 7860 5141 -564 -7572 -10455 -8134 -4358 318 5757 10151
918A0151j033m699n238m308l264j292L705O931N289J940N41j920o017o809l126
$$ 10151 9118 4419 -819 -5127 -8391 -9683 -5978 953 6242 8182 8723 6803 786 -6023 -9149
933i149R62J921M027O423N191l34l426m249m471m846j796L260N591M656L230K307
$$ -9149 -8187 -6266 -2239 4184 9375 9041 5615 1366 -3105 -7951 -9747 -6487 -896 3760 6990 9297
949I297j509n454o595l095j011O06L756O863N250L98j823k939n095n959k417K906
$$ 9297 7788 2334 -4261 -7356 -8367 -7761 -4005 2858 8108 8506 6683 3744 -1351 -7310 -9727 -6821
965f821M124M098M636L441p54n270n588l909k226o96L733O595M888J615n06j700
$$ -6821 -2697 1401 6037 9478 8724 3454 -2134 -6043 -8269 -8965 -5232 1363 6251 7866 7360 5660
981E660n440o236k659J503K691L720N512M201m80l988m401m210l828j405L310
$$ 5660 220 -6016 -8675 -7172 -4481 -761 4751 8952 8472 4484 83 -4127 -7955 -9360 -6050
996f050O143M274K607J374j672n560n942k696L58Q95L864O400L939l12j989l601
$$ -6050 93 4367 6974 8348 6676 1116 -4826 -7522 -7164 -6269 -2405 3995 7934 7622 5633 2032
1012B032m528m717k028K780M548M189L571K931j212m909n768k753j518j49L561
$$ 2032 -2496 -7213 -9241 -6461 -1913 2276 5847 8778 7566 2657 -3111 -5864 -7382 -7531 -3970
1027c970O809M248P11j163k411n699n196j824J608L137M301M903K532m01l745
$$ -3970 2839 7087 7798 6635 4224 -1475 -6671 -8495 -6887 -3750 551 5454 7986 7585 3840
1042C840m907l665k360q76L113O066M399J632J89j635n731n871k073Q47J864M022
$$ 3840 -1067 -4732 -7092 -7968 -4855 1211 5610 7242 7431 5796 65 -5806 -7879 -7032 -5168 -1146
1058a146N593L465l47k795l773m227l742j455K983N270L753K417J734j270m833
$$ -1146 4447 7912 7565 4770 997 -3230 -6972 -8427 -5444 -174 3579 5996 7730 6460 1627
1073A627n631k328p88M80L753O081L766N53j695k743n022m620j437K237L605M268
$$ 1627 -4004 -6332 -7120 -6640 -2887 3194 6960 7513 5818 3075 -1947 -6567 -8004 -5767 -2162 2106
1089B106L808K116q90m787m838k915j843j4L351N786L901J057o2k462m919m695
$$ 2106 5914 8030 7140 2353 -2485 -5400 -7243 -7257 -3906 1880 5781 6838 6776 4314 -605 -5300
1105e300k624J173L043L814M587L042k91l715m665l313k802r40K895N726L690
$$ -5300 -7924 -6751 -3708 106 4693 7735 7444 3729 -936 -4249 -7051 -7991 -5096 630 4320
1120D320K112P91j816m796m745k474l1J549L539N127L481K53k481l764l753l745
$$ 4320 6432 7223 5407 611 -4134 -6608 -6639 -5090 -1551 3576 7057 7310 4829 1065 -2688 -6433
1136f433j963K826M437M018K577K263j326m632n049k377j012K90L600N257L845
$$ -6433 -8396 -5570 -1133 2885 5462 7725 6399 1767 -3282 -5659 -6671 -6381 -2781 2476 6321
1151F321P74j219k880m569m159k241J970L174L909L658K704k91m077m355l268
$$ 6321 7095 5876 2996 -1573 -5732 -7973 -6003 -2829 1080 4738 7442 7151 3074 -1281 -4549
1166d549k229j92L140N150L629J582l6k223n047m132k329O71K508L501M260L385
$$ -4549 -6778 -6970 -3830 1320 4949 6531 6495 4272 -775 -4907 -7236 -6565 -4057 -556 3704 7089
1182G089J81l337l776l160l428q91K730M521L755K091Q85j236m462m662k586m54
$$ 7089 7270 3933 157 -3003 -6431 -7322 -4592 -71 3684 5775 6660 5424 962 -3700 -6286 -6740
1198f740J209L183N207L817K49j957k909m066l756j339J415L898L671L126K199
$$ -6740 -5531 -2348 2859 6676 6925 4968 2059 -2007 -5763 -7102 -5687 -1789 1882 5008 7207
1213G207r41m312m346k655j589j90L614N292L516J283p31k279m683m461j761J206
$$ 7207 6266 1954 -2392 -5047 -6636 -6826 -3212 2080 5596 6879 6148 3869 -814 -5275 -7036 -5830
1229e830K872L368L871K682l64l372m096l099k471p23L108M647L537J622L92j219
$$ -5830 -2958 410 4281 6963 6599 3227 -869 -3968 -6439 -7162 -4054 593 4130 5752 6144 4925
1245D925m406m532k321Q2J805L113M293L536m3k097l363l500l523j279K402M079
$$ 4925 519 -4013 -6334 -6252 -4447 -1334 2959 6495 6452 4355 992 -2508 -6031 -7310 -4908 -829
1261h29L487K333J664p30m334m402k425o81M41L040M806L378M19j382k425l604
$$ -829 2658 4991 6655 5925 1591 -2811 -5236 -5917 -5476 -2436 2370 5748 6167 4785 2360 -1244
1277a244m266j779K016L055L024L713K360o85l626l954k696j755m74K879M725
$$ -1244 -5510 -7289 -5273 -2218 806 4519 6879 6194 2568 -1386 -4082 -5837 -6311 -3432 1293
1292A293L315J168q4k088l830m511j571P57J989L029L946L287n08k992k820l242
$$ 1293 4608 5776 5692 3604 -226 -4737 -6308 -5551 -3562 -533 3413 6700 6192 3200 380 -2862
1308b862k834p28K498L867L248J979P83j553l758l708k385k26Q08L136M327L320
$$ -2862 -5696 -6424 -3926 -59 3189 5168 5951 4398 640 -3068 -5453 -5679 -4871 -1735 2592 5912
1324E912L48j914k514l662l504j119J835L009L313K776J619p84l504l963k430
$$ 5912 6260 4346 1832 -1830 -5334 -6453 -4618 -1609 1704 4480 6099 5315 1811 -2152 -4582
1339d582j268L11L069M142L213Q90r79j766l862l722j433J263J911L182L330K302
$$ -4582 -5850 -5539 -2470 1672 4885 5775 4796 3030 -832 -4554 -5987 -4724 -2813 369 3699 6001
1355F001k50l320l211k421k555k43K746L842L139J534M62j770l873l635j809M70
$$ 6001 5751 2431 -780 -3201 -5756 -5999 -3253 589 3728 5262 5724 3954 81 -3554 -5363 -4893
1371d893J309K641L868K906l43j969k783l353k513j130K311L240L184K208J280
$$ -4893 -3584 -943 2925 5831 5488 3519 736 -2617 -5130 -6260 -3949 -709 2475 4683 5963
1386E963j371l471l578k216m30N90K665L985K626Q48j368k350l360l123j400J521
$$ 5963 4592 1121 -2457 -4673 -5103 -4513 -1848 2137 4763 5611 4243 1893 -1467 -4590 -5990 -4469
1402d469K959K784K677J875o29l130l543k194j644K32K382L620L292R99p52j463
$$ -4469 -1510 1274 3951 5826 5197 2067 -1476 -3670 -5314 -5082 -2700 920 4212 5211 4459 2996
1418B996l415l657j451O77K224K576L342K421m36k531k892k575k163p09K288L250
$$ 2996 -419 -4076 -5527 -4850 -2626 -50 3292 5713 5277 2746 -146 -2721 -4884 -5593 -3305 -55
1434e5L139J348L68j072l182l433k125J09J472K624L167K552K59j456k646k929
$$ -55 3084 4432 4800 3728 546 -2887 -5012 -4903 -3431 -807 2360 4912 5171 3715 1069 -1860
1450a860k802r77J771K890K803K082J113p62k836l303k633n26P09K403L196L249
$$ -1860 -4662 -5639 -3868 -978 1825 3907 5020 4258 1422 -1881 -4514 -5040 -4331 -1928 1268 4517
1466D517P66j083k175k768l266j524J113K177L271K274J901o00k207l239k500
$$ 4517 5283 4200 2025 -743 -4009 -5533 -4420 -2243 1028 3302 5203 4603 2396 -843 -3343
1481c343j347k26K219L327K895J261L0j624l051l441j746N28J891K358K913K573
$$ -3343 -4690 -4916 -2697 630 3525 4786 4816 3192 141 -3300 -5046 -4518 -2627 -269 2644 5217
1497E217r5k316k773k314k147o05J603L179K886J788O04j094k815l451k274J31
$$ 5217 5122 2806 33 -2281 -4428 -5033 -3430 -251 2635 4423 5027 3933 1118 -2333 -4607 -4476
1513d476P36K381L008K900L18j460k195k482k719j378J439K621K875K244J120
$$ -4476 -3740 -1359 1649 4549 4867 3407 1212 -1270 -3989 -5367 -3928 -1307 1568 3812 4932
1528D932r30k094l356k292j040M55K085L361K852R10q93j979k487l175j247O69
$$ 4932 4002 1908 -1448 -3740 -4780 -4325 -2240 1121 3973 4883 3990 2011 -476 -3651 -4898 -4229
1544d229K299K080K913J918j77k235k637k677j832k45J537L524K881J185Q0j060
$$ -4229 -1930 150 3063 4981 4804 2569 -68 -2745 -4577 -4822 -3285 239 3120 4305 4385 3325
1560C325k963l490j686O11J123K263L188K453k34j521k407k529k521o77J764K634
$$ 3325 362 -3128 -4814 -4203 -3080 -817 2371 4824 4590 3069 662 -1867 -4388 -5065 -3301 -667
1576f67K643J571J012o44k681l273k028j24L17K096L564K480L08j206j632k920
$$ -667 1976 3547 4559 3915 1234 -2039 -4067 -4191 -3874 -1778 1786 4266 4574 3368 1736 -1184
1592a184k747j135J333K193K479K486J148n05k347k834j840j374O4J739L169K672
$$ -1184 -3931 -5066 -3733 -1540 939 3425 4573 4068 1721 -1113 -2953 -4327 -4263 -2524 645 3317
1608C317J009k18j332l053k938j360M50J585K256L090J874k68k076k228k685j758
$$ 3317 4326 4108 2776 -277 -3215 -4575 -4125 -2540 -284 2806 4680 4412 2336 108 -2577 -4335
1624d335o03K056L048K345J413M26o28l182l001j525k64J121J882L345K156j6
$$ -4335 -4938 -2882 166 2511 3924 4350 3722 540 -2461 -3986 -4250 -3129 -1247 2098 4254 4238
1640D238j283j653k781k592n10J188K340K516J865J041n03k569k901j747o82J64
$$ 4238 2955 1302 -1479 -4071 -4581 -3393 -1053 1463 3328 4369 3866 1297 -1604 -3351 -4033 -3869
1656c869J827L260K456K10l25j238k836k963r83Q16J794K262K423J764m27k164
$$ -3869 -2042 1218 3674 3884 3559 2321 -515 -3478 -4461 -3645 -1851 411 2834 4598 4171 2007
1672B007k498k020j449m74J914K835K407R88J39j035k666l023j134K01J194K149
$$ 2007 -491 -2511 -3960 -4434 -2520 315 2722 3710 3849 2814 148 -2875 -4009 -3808 -2614 -465
1688d65K953J833j98j617k010k399j981n46J457K752J890J863O25n03k830k793
$$ -465 2488 4321 4123 2506 496 -1903 -3884 -4430 -2973 -221 1669 3532 4157 3654 824 -1969
1704a969j471n29O38J881L057K027K92r26j373k421k722q91J146K054K004K094
$$ -1969 -3440 -3969 -3331 -1450 1607 3634 3926 3000 1627 -794 -3516 -4407 -3261 -1207 797 2891
1720B891J259m65k259k470j797j018P6J835K921K134Q23k73j318k675k533j323
$$ 2891 4150 3685 1426 -1044 -2841 -3859 -3783 -1948 973 3107 3930 3657 2339 -336 -2869 -4192
1736d192P42J380J762K775J510j33j499k541k140j351n55J898K435J904J519N23
$$ -4192 -3450 -2070 -308 2467 3977 3844 2345 -196 -2336 -3687 -4242 -2344 91 1995 3514 4037
1752D037j015k603k631j104l07R29K134K374J550L41j094j578k460k083p60J323
$$ 4037 3022 419 -2212 -3316 -3623 -2694 -560 1814 3364 3705 2611 1033 -1427 -3510 -4270 -2947
1768b947J886K566J705O89n20k468k107j839o47J36K174K482K141O58q10j608
$$ -2947 -1061 1505 3210 3899 3379 911 -1196 -3035 -3682 -3546 -1372 1110 3251 3909 3099 1491
1784A491k145k593o72O21J734K138K381J097n41j494k586j893j341J79J668K147
$$ 1491 -654 -3247 -3919 -3298 -1564 574 2955 4052 3511 2017 -569 -2462 -3803 -3624 -1956 191
1800A91K210J040o5r61k622k190j378K82J520J789K524J486k94j213k292j838
$$ 191 2401 3441 3376 2415 -207 -2397 -3775 -3493 -1973 -184 2340 3826 3532 2319 27 -1811
1816a811j615m17J227K464J883J590k5m97k340k367j432k36R05J593K653J829
$$ -1811 -3426 -3843 -2616 -152 1731 3321 3296 2799 459 -1908 -3340 -3576 -2671 -1078 1575 3404
1832C404M34j052j788k166j950q70R88J950J994J707Q28N2k232k458j576q12N46
$$ 3404 3838 2786 998 -1168 -3118 -3988 -3000 -1050 944 2651 3479 3531 1299 -1159 -2735 -3547 -3001
1849c001J335K497J958N89m18j305k218k070j226N72J864J701K127J338n05j583
$$ -3001 -1666 831 2789 3378 2960 1655 -563 -2633 -3859 -3287 -1423 278 2405 3743 3238 1655
1865A655k069j804j086j51J473K262K215Q56J30j211k054k193j617J45J159J806
$$ 1655 -414 -2218 -3304 -3455 -1982 280 2495 3351 3481 2270 216 -1977 -3594 -3449 -2290 -484
1881d84K291J456L32j357j997j836j405q27J108K494J774J305Q08o94j993k547
$$ -484 1807 3263 3595 2238 241 -1595 -3000 -3827 -2719 -225 1549 2854 3662 2968 975 -1572
1897a572j321m80N55J801K226J792L87p61j798j770j701j198Q67J893J988J545
$$ -1572 -2893 -3373 -2818 -1017 1209 3001 3388 2627 829 -941 -2642 -3840 -2973 -1080 908 2453
1913B453J335p68j948j914j447j182L39J302K303K224L54o4j046k112j981j325
$$ 2453 3788 3020 1072 -842 -2289 -3471 -3132 -1830 473 2697 3051 2987 1941 -171 -2152 -3477
1929c477M27J482J682J957J546l01j480k043j700j299l86J338K309J802J157N1
$$ -3477 -3050 -1568 114 2071 3617 3316 1836 -207 -1907 -3206 -3592 -2254 55 1857 3014 3065
1945C065m27k343k418r60K29L99J868K055J880J4j161j371k227j517n71Q49J960
$$ 3065 2638 295 -2123 -3083 -2854 -2455 -587 1468 3348 3362 2201 830 -1397 -2914 -3485 -2636 -676
1962f76J770J217J153m33k061k332j156n27R2J539K545J417N52m31j290j799j885
$$ -676 1094 2311 3464 3031 970 -1362 -2518 -3045 -2953 -1414 1131 2548 3100 2669 1379 -420 -2305
1979b305j121P20J228J864J803J195l89j410k295j092j338k17J768J943J966N13
$$ -2305 -3426 -2706 -1478 386 2189 3384 2995 1585 -710 -1802 -3140 -3357 -1589 354 2320 2833
1995B833J33j058k014j970j124J8J385J723J897J215j59j134j394j736j395n32
$$ 2833 2966 1908 -106 -2076 -3200 -3182 -1797 -74 1823 3038 2879 1745 351 -1385 -2780 -3312
2011c312J313J667J518J532O50q64k150j649j213o35R07J117K143J481O13p19
$$ -3312 -1999 -332 1186 2718 3368 2504 354 -1295 -2508 -3143 -2236 -1119 1024 2505 3118 2399
2027B399j514j646j959m73Q88J524J530J434J002n69j391j912j584q74K77J513
$$ 2399 885 -761 -2720 -3193 -2305 -781 749 2183 3185 2616 1225 -687 -2271 -3145 -2868 -1355
2043a355J806J870O97k76j115j977k020p73N54J166J499J884J394k70j659j594
$$ -1355 451 2321 3018 2742 1627 -350 -2370 -3143 -2589 -1423 76 1960 3354 3084 1425 -169
2059a69j356j300l55J347J570J952J024M11j084j688j785j467K64P35J172K240
$$ -169 -1525 -2825 -3180 -1833 -263 1689 2713 3124 2040 352 -1433 -2900 -2636 -1901 -729 1511
2075A511J218K63j255j169j529j743l78P70J723J535J414O27p99j274j852j283
$$ 1511 2729 2992 1737 568 -961 -2704 -3082 -2312 -589 946 2360 2987 2188 914 -938 -2221
2091b221p61L79J501K149J299M06n65r92j774j566p81M69J066J868J607Q46m39
$$ -2221 -2982 -2603 -1102 1047 2346 2752 2187 1195 -579 -2145 -2926 -2457 -1391 477 2084 2930 2491
2108B491j234j768j267j120M04R74J822J646O01J78q12j903j900p09k7J093J330
$$ 2491 1257 -511 -1778 -2898 -2494 -1520 302 1948 2549 2727 1915 12 -1888 -2597 -2624 -1531 -201
2125b01J950R80j7j004j785j174j177k13Q08J671J678O86N47q37j349j948j103
$$ -201 1749 2729 2712 1708 -77 -1251 -2428 -2641 -1833 -162 1516 2202 2749 1912 563 -1385 -2488
2142b488j29N86J211K002J461L94j041j147j587j779l66O57J507J496J268N35
$$ -2488 -2617 -2031 -820 1182 2643 3037 1996 849 -738 -2517 -2883 -2226 -719 777 2045 2580
2158B580j39j368j846j294n94L49R25J977J407O60k85j321j342j691p57N63J045
$$ 2580 2441 1073 -773 -2067 -2661 -2312 -1387 590 1997 2657 2372 1051 -291 -1982 -2739 -2176 -1131
2175a131J410J551O23kj029j587j585p06mO56J992J448Q79j6p67j354k142p86
$$ -1131 279 1830 2453 2451 1422 -165 -1750 -2456 -2460 -1804 188 1636 2515 2499 1732 378 -1764 -2550
2193b550j89J096J173J822R54M82j443j316j125j390j27O19J661J517R73K75l01
$$ -2550 -2739 -1643 -470 1352 2306 2788 1345 29 -1096 -2486 -2613 -1994 -333 1184 2157 2432 2131
2210B131j746j391j209m07N98J091J714J436N39p61j074j475j560o93N47J328
$$ 2131 385 -1006 -2215 -2622 -2024 -933 781 2217 2756 1995 921 -554 -2114 -2807 -2260 -932
2226i32J108J724Q18l92j260j494j087q99q2J085J670J586O46k13o82j664j862
$$ -932 176 1900 2718 2326 1066 -428 -1515 -2414 -2496 -1411 259 1845 2491 2278 1596 -68 -1930
2243a930n02K64O57J296J872O70J01r08j438j236j200jM36J890J692N32J68p27
$$ -1930 -2432 -2168 -1511 -215 1657 2327 2428 1520 82 -1154 -2354 -2355 -1919 -29 1663 2195 2363 1636
2261A636j300j658r89N6N02J147J755J202N5p59j120j479j152l14N14J517J151
$$ 1636 336 -1322 -2311 -2255 -1753 -606 1149 2351 2406 1647 527 -952 -2104 -2418 -1904 -387 764
2278G64J173O41l64j637j490j053n58M87R46J672J408K99k24j039j418j336p30
$$ 764 1937 2578 2214 577 -913 -1966 -2524 -2037 -1091 581 1989 2288 2064 1025 -393 -1729 -2459
2295b459L22J150J388J295Q73l07j004j686j102q92m8J206J573J496N31j0n10
$$ -2459 -2137 -987 401 1696 2569 2262 1258 -428 -1530 -2422 -2470 -1264 309 1805 2336 2326 1816
2312A816j713j765p05J22P84J327J483R17J13j126j420j219p42l47P33J421J322
$$ 1816 103 -1662 -2367 -2245 -1461 -134 1349 2266 2379 1253 -167 -1386 -2128 -2475 -1742 -321 1001
2329A001J137P8o06j184j626q93K3M91Q14J767J039J32l11j148j430j193m97N03
$$ 1001 2138 2216 1610 426 -1200 -2093 -2070 -1579 -765 1002 2041 2173 1862 714 -716 -1909 -2406 -1903
2347a903J345J122J108J094n58j347j417j127m32R5J191J436J045M12J18r82j277
$$ -1903 -558 564 1672 2766 2208 861 -556 -1683 -2115 -2020 -829 607 1652 2064 2182 1200 -77
2364g7j415q57O1P84J607J268Q28j25n03j584j332p65j49J060J200J329R73j49
$$ -77 -1492 -2349 -2288 -1504 103 1371 2199 2074 1571 -13 -1345 -2110 -2259 -1199 1 1330 2303 2154
2382B154o43j162j585q38PM80J142J229J245R6p45r65j107j228l73N80J397J418
$$ 2154 1511 349 -1236 -2074 -2067 -1587 -445 784 2029 2125 1380 415 -692 -1920 -2293 -1713 -316 1102
2400A102O36N37l73j400j350q61m75M59P00J808J199J58j24j022j623r81p74M72
$$ 1102 1738 2275 1902 502 -848 -1709 -2184 -1725 -1025 783 1982 2140 2016 994 -629 -1610 -2384 -1912
2418a912Q26J349J199N89J22j259j460j001n61L7R69J214J136O46J39q85r48j605
$$ -1912 -1086 263 1462 2051 2173 914 -546 -1547 -2108 -2071 -1102 112 1248 1894 2033 1148 200 -1405
2436a405p02K5Q12J239J241J048l14p06j010j436r55r4N67J463J390O68O3k43
$$ -1405 -2107 -2082 -1270 -31 1210 2258 1944 1238 228 -1208 -2163 -2257 -1690 -227 1163 1831 1894 1651
2454A651j020j426j073o7K75J125J314J104L27r09p50j147j146n76N34J235J250
$$ 1651 631 -795 -1868 -1935 -1660 -535 779 1883 2210 1301 551 -596 -1742 -2318 -1784 -549 701
2471G01R00L34J15j129j788m72q92M46O83J613J206K12j76r61r52j326o13L62
$$ 701 1601 1935 2050 921 -867 -1339 -2231 -1785 -1102 511 1717 1929 1753 792 -160 -1486 -2099 -1737
2489a737J030Q60R30Q91o4p50j288j254n38k19R00J128J550M47q1l09j239j454
$$ -1737 -707 153 1083 1974 1910 1160 -128 -1382 -1920 -2139 -1239 -111 1439 1886 1805 1496 257 -1197
2507a197r27R0Q45R30J390Q27k72l36j354q73r01m97Q47J260Q43Q00M63l28j008
$$ -1197 -2124 -2034 -1189 -259 1131 1958 1686 1350 -4 -877 -1778 -2275 -1428 -168 675 1475 1938 1610 602
2526F02j442r10j18K11R52J249J186J35k79r05j366o50o15M06R94R75N87J046
$$ 602 -840 -1750 -1868 -1657 -705 544 1730 1865 1586 681 -685 -1335 -1950 -1544 -550 425 1012 2058
2544B058k56j033j467o68o44QJ006J191J202N43m16p19r66j126n33M3Q49R77J036
$$ 2058 1802 769 -698 -1366 -2010 -2002 -996 195 1397 1940 1524 805 -161 -1287 -1820 -1777 -928 49 1085
2563A085R07n2q72j102j072q25k59Q97J278J130L54K02N4j342j425p95J6N77Q60
$$ 1085 1992 1940 1068 -34 -1106 -1931 -2190 -1293 -15 1115 1469 1671 1725 383 -1042 -1837 -1821 -1244 -384
2582c84J270Q08O9n82p96q28j338k11O88Q17J029O23P98m26q79j370o77m13L32
$$ -384 886 1694 1763 1181 385 -443 -1781 -1992 -1304 -487 542 1165 1963 1537 658 -712 -1389 -1802 -1470
2601a470Q26J200Q27N60n29o21j319n80q56L72R73N94J216P31r5r10j127r10m20
$$ -1470 -644 556 1383 1943 1414 793 -526 -1106 -1962 -1590 -617 -23 1193 1924 1829 919 -208 -1118 -1538
2620a538k58P81J229J156M11k0o19j170j179n74p5P01J040J008R46nr78o36q52
$$ -1538 -1796 -1015 214 1370 1781 1761 1142 -28 -1207 -1781 -1856 -1155 -115 893 1839 1834 856 220 -632
2639f32q62k91O12J023J033P95K03n06j307r92o84k78O73M73J346J128L90p24
$$ -632 -1494 -1785 -1173 -150 883 1678 1881 1375 68 -924 -1608 -1886 -1213 -740 606 1734 2124 1400
2657A400p36j323p07o02P07P27P43J329p1p1p60j121r67m61N10M90J226J133O0
$$ 1400 664 -659 -1366 -1968 -1261 -534 209 1538 1467 1396 636 -485 -1452 -1913 -1403 -913 313 1446 1506
2676A506M6o36q23j365n77K64Q80Q68R91N69j83p41j007r33k51l91P06J300N03
$$ 1506 1552 916 93 -1272 -1849 -1585 -705 163 1154 1723 1540 799 -208 -1141 -1392 -1783 -1077 223 726
2695G26Q51J90n36j030j160o44j11N89R79R10R05q1m58q85j191n84k53O10O70
$$ 726 1577 1767 1231 201 -959 -1603 -1714 -1125 -146 764 1669 1588 1130 245 -946 -1530 -1783 -1173 -503
2714e03J066O01M57l67q15j219o65k04L26O37R61J206P9k49o10j183p73m15J29
$$ -503 563 1164 1621 1254 439 -780 -1445 -1649 -1323 -686 275 1481 1560 1311 701 -482 -1255 -1670 -1541
2733a541R36Q22Q31P96m98o92j085n78o57K97M41J137J033L63Rp21o40j216p62
$$ -1541 -605 217 1048 1844 1346 654 -431 -1009 -1666 -1369 -928 209 1242 1605 1614 893 253 -963 -1725
2752a725J70O68R43J050N67L5p36r29r28o22j14O47O93J022N69L68m05j126p92
$$ -1725 -1555 -887 56 1106 1673 1708 972 43 -885 -1507 -1621 -974 -281 741 1310 1678 1273 147 -645
2771f45r85M02R9P17J082P48P8l14o62j101p48l48N09P31R02N74P78j69j233q78
$$ -645 -1630 -1228 -1129 -412 670 1418 1496 1182 520 -581 -1329 -1677 -1168 -437 465 1039 1817 1648 415 -463
2791d63r89k02N68L04J173J004J54j60m69j211q97p31M06P50O97R14R00k23p00
$$ -463 -1452 -1654 -1086 -782 391 1395 1549 1389 920 -291 -1188 -1919 -1513 -763 -66 848 1748 1525 825
2810H25r31q75o80J88M75J203P32M52p3m71p91j071k60j2N36L52J157M95K41m37
$$ 825 -106 -981 -1661 -1473 -998 205 937 1389 1316 845 54 -1017 -1277 -1289 -753 -401 756 1251 1492 1055
2830A055j048q09k86n02M97Q25J092M66Q3k75p73r40q60N0J83N03J290R59k06
$$ 1055 7 -802 -1088 -1590 -1093 -268 824 1290 1373 1098 325 -615 -1475 -1425 -1242 -739 551 1510 1304
2849A304j69n39j130o38n97L42Q67Q82Q56M98l27q60o66o35n49k49R07J159O46
$$ 1304 1135 596 -534 -1172 -1769 -1427 -560 322 1178 1676 1349 489 -177 -812 -1361 -1610 -703 456 1102
2868A102J44R5m14q02j140l56p9N42P94R40P48K2o70p39r91l82k95M76R00R69
$$ 1102 1246 1341 927 125 -1015 -1371 -1450 -908 -114 826 1574 1596 926 187 -804 -1186 -1481 -1005 -105 864
2888H64M64K49n60p90j149l20Oo6J064Q02Q22L1m53q23p37o76j44Q9J001P33O43
$$ 864 1328 1577 1017 227 -922 -1242 -1236 -1302 -238 564 1386 1417 964 141 -596 -1272 -1416 -1327 -326 407 1050
2909A050L68l5o94j082o79k19j08R23O58Q61L12j04p40n76j001k29J43N28P65
$$ 1050 1418 1383 689 -393 -1072 -1291 -1399 -476 182 1043 1355 1251 511 -65 -1066 -1295 -1152 -624 141
2928A41Q33M52l33l81r25n81o68J74M62J115M46O93k14l58p27j171k21j06M82
$$ 141 974 1426 1093 712 -213 -794 -1462 -1288 -826 289 735 1428 1214 856 129 -1042 -1263 -1369 -887
2947h87Q21R10M65L09o86q46n78r11J6L64Q49P32N67K62k71p51r12o13j57k6Q92
$$ -887 -66 844 1309 1618 932 86 -492 -1403 -1387 -1023 -174 558 1125 1387 1116 365 -547 -1160 -1317 -1343 -451
2968d51P65J033j15j4p34q28p70k35K57Q88N52L66P80k18n75j081p17j83M12P8
$$ -451 314 1347 1232 1218 484 -344 -1114 -1349 -1092 -204 348 714 1494 1276 701 -380 -1097 -1280 -868 -790
2988g90J069N82L14M6l48q25j238k02J85K90R86Q20M84M6o08p36p72o93RM98Q06
$$ -790 279 861 1175 1221 873 48 -1190 -1392 -1207 -917 69 889 1373 1419 811 75 -697 -1390 -1381 -883 -77
3009g7P35M17N3j01r16p58p08k9L70P39R34M51L03l40r40o10l41n60J6J108O09
$$ -77 658 1075 1128 1027 111 -647 -1355 -1384 -1014 -275 659 1110 1413 1073 133 -477 -818 -1378 -1362 -254 355
3030C55O16L36j71q61q54l75k16J85N50J070K90J68J60q17n90o53m09J58M66O89
$$ 355 971 1307 1136 275 -579 -954 -1170 -985 -435 635 925 1093 1253 436 -154 -807 -1216 -1058 -592 97
3050I7N61P84o7p58p21q47k50k61P73N82J139J44J88m31r40o26m89j69N77O41
$$ 97 658 1442 1375 617 -104 -951 -1201 -1462 -689 -107 1032 1176 1364 933 -7 -633 -1122 -1291 -714 -73
3070g3O95P08j85l06j074m88o12ON05N81R29M15j3r4o82r69l39l79N77K40R43
$$ -73 622 1330 1145 839 -235 -723 -1335 -1329 -824 -243 686 1101 1088 994 312 -657 -996 -1375 -798 -558 385
3091C85N81K26q0o04q59o46m19L14R13N55N07L64j68n78j096m70qj7O87L98R06
$$ 385 966 1192 1112 508 -351 -997 -1416 -1102 -189 366 873 1237 1069 491 -605 -1075 -1083 -1100 -413 -15 891
3112H91N00l68m80p20p82k43lO73P46O78L29q9o58o53m65o53O9L19R46N59M76
$$ 891 1391 1023 543 -177 -959 -1202 -1205 -532 214 892 1221 1132 474 -179 -644 -1297 -1228 -909 37 596 1072
3133A072L09n36n42j029l66m8L42O34Q14M20p2N6j062n10o84j81M00O71P12N13
$$ 1072 1381 845 303 -726 -1092 -1140 -798 -164 650 1070 998 1054 -8 -518 -1202 -1383 -983 -312 400 913
3153I13K16l08n38p45l78m13K91M25R11Q62q8j72n57m54q23m50J62Q15N06O88
$$ 913 1129 821 283 -462 -840 -1253 -962 -537 374 1236 1148 976 419 -35 -858 -1308 -1146 -331 175 863
3173H63N67l84o69q59j52n23J7N81P53N56L92K47q10o67n82m32J34K87M68Q76
$$ 863 1430 1046 377 -482 -634 -1157 -1140 -559 194 750 1142 1389 579 -88 -670 -1102 -968 -681 -213 663
3193F63M91O6p10l66o33p29L10k9R82O60J66L05m13n98m63p86J66L8Q31M88N26
$$ 663 1154 1220 510 144 -489 -1218 -908 -937 45 705 871 1176 763 165 -298 -1084 -918 -880 -49 439 965
3214I65Q3j53n16n90p99m29M79P84N98M70J88k01m82m27r49k76L59M08R56J59
$$ 965 1048 895 379 -211 -1010 -1439 -960 -176 422 892 1080 879 397 -30 -979 -1255 -896 -488 468 627
3234F27K88j05k41p57n07m57J22M48P94N39M16j5p35n97o14k61j03N16N50Q07
$$ 627 915 810 569 -188 -695 -1152 -1030 -582 212 751 1167 1152 417 -180 -794 -1055 -1158 -642 -92 715
3254G15K46K03o53o49n40l87O3L56O98M79L36K64l84k15j242l91j64N84M69P07
$$ 715 961 1164 511 -138 -678 -1065 -1002 -646 52 531 867 1131 747 532 -710 -1101 -1265 -681 -212 495
3274D95M83j71n8k91j033k70k08K50M52O29M48L35j44n87p09n83J0J93L79M98
$$ 495 978 807 749 458 -575 -845 -1053 -803 -351 278 726 1061 917 330 -379 -962 -952 -759 -380 118
3294A18O06L76p7o57m88l45p22K14M76L21Q10M59j90l79m87p92l36Q9M66L80Q25
$$ 118 724 1100 1023 366 -122 -467 -1189 -975 -499 -178 632 1091 901 522 35 -757 -1093 -1004 -538 -158 667
3315F67M98K2o42m15o90l16o1J48R76L49L70R5l02o58m35n53k15N84L37O48O57
$$ 667 1165 1187 545 130 -560 -876 -937 -789 187 536 906 1001 699 41 -394 -947 -1162 -578 -241 407 1064
3336A064K9k84p09m58l66m76M03M97Q58J09M46k85n15n95m43m47M34K99O79M65
$$ 1064 1093 809 100 -358 -724 -1200 -797 -300 558 667 1113 828 313 -282 -725 -1172 -738 -439 240 705
3356G05L43k2n34n28o73l80N0N75M27P06J80Q8l17p98p45N3j04M16N56N18K21
$$ 705 1048 1026 492 -36 -709 -1089 -1039 -464 -37 669 849 937 620 -178 -923 -870 -974 -558 -2 516 737
3377G37J0j17o64m49o29l1P48L52M26N11J3kp66m10o59k67K03P81P59L01k90K94
$$ 737 747 630 -34 -483 -1112 -1143 -395 -43 383 894 907 905 139 -271 -930 -1197 -994 -213 546 847 557 851
3399H51m88o98m20k81M8O18O60N54K02k43m81m42n32l76oO82N60L37L92l40j37
$$ 851 363 -335 -755 -1036 -988 -370 290 844 1046 803 322 -120 -652 -1028 -1034 -352 208 545 937 597 460
3420D60p92l55k85M53m2O24P01J00Q3m91o16m68m56K41J02J038K61L17q0j77n00
$$ 460 -332 -687 -972 -519 -561 63 764 864 947 456 -160 -628 -1084 -843 -741 297 558 875 795 618 118
3441A18o60k24j39L18N53Q20p6L08l91m45o49l07J26K5M24M35N48J32l22l92l70
$$ 118 -542 -766 -905 -587 -34 786 710 1018 627 182 -467 -774 -648 -623 -199 236 784 916 594 202 -168
3462a68o19j43j4P55M99N79O0k66m56o03q5l15m3J76O50Q76K73l88p1o70n91l40
$$ -168 -787 -930 -944 -189 310 889 949 683 227 -376 -461 -776 -819 -643 7 883 1156 768 697 27 -564 -904
3484i04M8M44N60L62N77q2p19k57o61O3l50K98N46N73L98J15k86p50l92n27OM81
$$ -904 -856 -412 148 510 1087 1005 286 29 -632 -569 -919 -621 -75 498 896 1011 725 -25 -417 -944 -938 -457
3506d57L61N36M25j37j59m86n50m25l7J37Q85L64M45P2k01m76n96m14j97N02J70
$$ -457 -96 440 865 728 569 83 -467 -892 -929 -792 93 457 902 974 773 297 -299 -713 -910 -408 -238
3527b38N65L07L45k41p72j77m92l04L23O13L03M07M76k76n41o61m27J6k31O19
$$ -238 327 634 979 738 -34 -211 -703 -1007 -684 -71 232 639 1115 839 298 -363 -790 -774 -1005 -386
3547c86Q35k1L22l50j1n79l71l39J28M56J42P05K75j22k20l91l18n84J81J38K28
$$ -386 449 428 750 400 389 -190 -561 -900 -772 -316 -174 531 806 684 464 73 -245 -829 -648 -510 -282
3568b82N78O23Oj80o32o74j23J42R0M22O18J23Q0j91m50o12k01k16L57K99N08
$$ -282 296 919 925 745 113 -561 -684 -542 -452 -30 588 711 791 600 150 -462 -663 -879 -522 -223 285
3589B85J14K93L6o49m12l17m95L63N24J69N62L29j30k05o52l86k20P1M67K00P59
$$ 285 399 692 728 79 -333 -650 -1145 -782 -258 -89 473 802 672 467 -185 -571 -791 -720 -253 -53 706
3610G06J3k14k43n51j49k52j69M84M85L63J59l7j3o70n33j23r4M99K31L08N09
$$ 706 719 505 262 -289 -438 -690 -859 -375 110 473 632 595 582 -88 -621 -744 -838 -339 -108 200 709
3631G09j64l0o08k99m08m5K38N29M82J18K30J76q71l30p24J97l6O10P10J33L17
$$ 709 545 515 -93 -392 -800 -845 -607 -78 404 522 752 928 57 -273 -997 -800 -836 -226 484 617 934
3652I34m60k38n01l38l06J53M89M55M82J04J31n39n87l84m7k12N99L00M05L44
$$ 934 474 236 -265 -603 -909 -756 -267 188 670 774 905 366 -221 -605 -652 -864 -265 35 440 784
3672G84q7l64r9r04j16P9M53M67L84J73j02l94j47n95l09j46M10M50M72J83K32
$$ 784 697 333 234 -670 -786 -707 -254 213 597 770 668 274 127 -468 -777 -923 -513 -63 409 592 824
3693H24m13m77k78m58j24L82O69K5L04N34n59j65j60o89j28J13L70N43L19K57
$$ 824 411 -66 -344 -802 -926 -544 125 150 454 988 429 264 104 -585 -713 -600 -230 313 632 889
3713H89J6m56l93n40k18q0L95M37M27K74l9m04l32l67m35O2K86O62L27K94j40
$$ 889 905 449 56 -484 -702 -782 -387 50 477 751 712 308 -24 -391 -826 -764 -478 184 511 805 665
3734F65k96m24m38l21M29L8K94N84L00l22j46m37m11l56K65L27J36N50R0N03o43
$$ 665 369 -55 -493 -814 -385 -347 -53 531 831 509 363 -74 -485 -841 -576 -249 -113 437 527 1030 387
3755C87l99l64j50q4L39K92K42J00K58j65k13p42nk84N05j40N89N32r2k85r2l66
$$ 387 -12 -376 -526 -610 -271 21 263 363 621 456 243 -499 -504 -788 -283 -423 166 698 606 321 229 -137
3777a37k20l29L14K56J08M48J92r9k48o42J8k24M5P8L93O39Q6j99j59k92o21j20
$$ -137 -357 -686 -372 -116 -8 440 632 533 285 -357 -339 -563 -518 -440 -47 592 678 479 320 28 -593 -713
3799g13k0K94L10N20J97J82n29m83k08M7l36K31K46O11J57L8j02k61l58l54r8
$$ -713 -733 -439 -129 391 588 770 241 -242 -450 -403 -739 -508 -262 349 506 544 442 181 -177 -531 -629
3820f29R7L16M68L53pj59l10k18k65m10J1P99J25K11J84K43o69k77k92L9k07O00
$$ -629 -532 -216 252 605 598 439 129 -89 -354 -764 -753 46 171 382 566 809 140 -137 -429 -390 -597 3
3842CK85K72R1M7o04k08m79r2K45K66J51K43N39k5j56p05k86k76K71L3N25J13
$$ 3 288 560 651 698 94 -114 -593 -685 -440 -174 -23 220 759 734 578 -127 -413 -689 -418 -385 140 253
3864B53L94j7k62m03k77j21l38K70N12L70L6K46m27j27o50J46j22K37K95M82j0
$$ 253 647 630 368 -35 -312 -433 -771 -501 11 381 417 663 236 109 -541 -395 -517 -280 15 497 487
3885D87Q7n8m93l61o4k56L01K27N4L83L02k21k92j08o12l0J77K35L65M70j11L5
$$ 487 574 516 23 -338 -402 -658 -357 -130 -76 307 609 388 96 -12 -624 -654 -477 -242 123 593 482 517
3907E17l47j76l81j83n5L90M82J75K51j33n29j09m48mk77N10L91K09L67q3l72
$$ 517 170 -6 -387 -570 -625 -235 247 422 673 540 11 -98 -546 -550 -827 -317 74 283 650 567 195
3928A95k18m17n5j30L22L02N30N4M9k41k46m21j92K3K1K68M87K68J08m33l55j3
$$ 195 -23 -440 -495 -625 -303 -1 529 583 632 391 145 -276 -468 -445 -424 -156 331 599 707 274 -81 -94
3950i4l84k85K02L20M64J44J31J07j64r15Q2j02J32J51J45N21p2O4k50k86m22
$$ -94 -478 -763 -561 -241 223 367 498 605 441 -474 -392 -494 -362 -211 -66 455 383 447 197 -89 -511
3971e11K18j25J47M73K10K51J65o49l20m14J30j21J79L08M11J61n4j36n17k40
$$ -511 -293 -418 -271 202 412 663 828 179 -141 -555 -425 -546 -367 -59 352 513 459 323 -194 -434
3991d34k96M82k27O00P1M57o8j34l85k51j95k03J79K64M81J80J6o2m83k30k04
$$ -434 -730 -248 -475 125 196 653 585 451 66 -185 -380 -583 -404 -140 341 521 537 475 -8 -238 -442
4012d42j09J05K24N66J5J08q9k67m68l63m3J62M63J57M68N2j34j55m10l10j60
$$ -442 -551 -446 -222 344 359 467 378 111 -357 -720 -763 -601 -138 19 487 539 405 250 -160 -470 -630
4033f30J86K16L08K50L23j04j95n24k89Q2j9J10M10K18K20p2j64m13k21k38k31
$$ -630 -444 -228 80 330 653 549 354 -170 -459 -377 -396 -286 124 342 562 490 326 -87 -308 -546 -777
4054g77M84K25J63L06J06n5m38k22k72Q8J88Q1L09J67Kj20j72l18q2J30j07K17
$$ -777 -293 -68 95 401 507 452 14 -208 -480 -392 -204 -123 186 353 355 235 63 -255 -337 -207 -314 -97
4076i7M92L88j54Q4n48l04m27K4K6L15P22k27J52j77J24o52k10j67J85l1M53K77
$$ -97 395 783 629 713 165 -139 -566 -542 -516 -201 521 294 446 269 393 -259 -469 -636 -451 -482 -29 248
4098B48K30K4k40k89m72J14j29J13M96L24J12k10j7l46j97l16j17K55N01K23K20
$$ 248 478 502 262 -27 -499 -385 -514 -401 95 419 531 321 304 -42 -239 -555 -672 -417 84 307 527
4119E27kl80Jm14k92K34J32J97J75L70n5r6l08n82j04K61j50L43L02P5l8J15j47
$$ 527 525 145 146 -268 -560 -326 -194 3 178 548 493 397 89 -493 -597 -336 -486 -143 159 234 196 311 164
4142A64k10j46j95q1M10M04Q5R1J11n87k76L8l41K52K04K73K14Q1On05j55k00
$$ 164 -46 -192 -387 -468 -58 346 431 522 633 46 -230 -192 -533 -281 -77 196 410 491 497 -8 -163 -363
4164c63j99p3M03J82L66J13J48k40l02m31k48K14K59J29J74N29j74k58j57m28
$$ -363 -562 -635 -232 -50 316 429 577 337 35 -396 -644 -430 -171 -42 132 661 487 229 72 -356
4184c56J27j60qL29K23K74J23j78k45k28j83l41J94J05L06N88l64J75m35J70n01
$$ -356 -229 -389 -397 -68 155 429 552 374 129 -99 -282 -623 -429 -324 -18 570 206 381 -54 116 -385
4205c85p9j11N04K10K14M47l00m12l34O5k14p0O7M49K09J92Rj81l76q7j37k99
$$ -385 -464 -575 -71 139 353 800 500 88 -246 -181 -395 -465 -398 51 260 452 461 280 -96 -183 -320 -619
4227f19L29J06M96L42j61k35l90r0m71M82p4J00M69J81k4m50N1k59l47o3M16K47
$$ -619 -290 -184 312 654 493 258 -132 -222 -693 -211 -285 -185 284 465 441 -9 42 -217 -564 -627 -211 36
4249C6L19N3J53k81k57k54j85m6nL08L79LK81j81j3n35j1l79K62M18J32n4N45
$$ 36 355 408 561 280 23 -231 -416 -462 -467 -159 220 223 504 323 310 -225 -236 -615 -353 65 197 143 688
4272F88m54J96o86m7J60q3o4J13M52K82j72l08k20k03o9j44L23J58L59j63j2J
$$ 688 234 430 -256 -303 -143 -226 -290 -177 275 557 385 77 -143 -346 -415 -559 -236 -78 281 118 106 107
4294A07o2l93K75m91O35k39K48L93j74l1l46j2j71j61K84J5K25L77j25Q5o03R8
$$ 107 45 -348 -73 -564 71 -168 80 473 299 268 -78 -90 -261 -422 -138 -123 102 479 354 439 -164 -66
4316f6l88J62n8q5O43j9L82r7j80m51l10J70j09K12N6M24K98j58k53j31n96k22
$$ -66 -454 -292 -350 -435 208 189 571 474 294 -157 -467 -297 -406 -194 -138 286 584 426 173 42 -554 -776
4338g76M44K52K02J41J43l2k95J6m18j83L1K20K21K88L46m89Lo4l64j15o0K1N82
$$ -776 -332 -80 122 263 406 374 79 95 -323 -506 -475 -255 -34 254 600 111 114 50 -314 -429 -489 -468 114
4361A14j81O56Ml40o4k70k14j98J35L94K49Q6Q1l54l7l34J5k7K19j19L96J31J10
$$ 114 -67 589 593 253 189 -81 -295 -493 -358 36 285 371 452 98 61 -273 -258 -285 -66 -185 211 342 452
4384D52j00j36m62j19K1l0p6L30L80J23j48k31O4j24m97L85n1J70L16j01J78K
$$ 452 352 216 -246 -365 -344 -374 -450 -120 260 383 235 4 68 -56 -553 -168 -219 -49 267 166 344 346
4406C46l55n27J02j10L86J48R2L17K49m79l27O5r7k81J47L93j0L04J75l12l24
$$ 346 -9 -536 -434 -544 -158 -10 82 399 648 169 -158 -93 -190 -471 -324 69 59 363 538 226 -98
4427i8j06O4j15k30K67L26K14J08j51j78k75M3Jj79K51L73J38J3k27k4n90K30
$$ -98 -204 -140 -255 -485 -218 108 322 430 279 101 -174 -131 -130 -309 -58 315 453 466 239 215 -375 -145
4449a45l01R0K76K86k8J3J27j11q3n96J52K34k27J79K65N6pL57n26k75k10J77
$$ -145 -446 -356 -80 206 178 191 318 207 124 -472 -320 -86 -313 -134 131 187 180 537 11 -264 -474 -297
4471b97oO17k87J40J09K1l46j89j12j23K29K61j3r0N54k97k18l24P4r4L80k38
$$ -297 -303 314 27 167 276 297 -49 -238 -350 -473 -244 17 4 -86 468 171 -47 -371 -297 -391 -11 -249
4493b49M61o9L18k32K4m75l27L20J4J00K14L20m1j47k1k05k06L6R7j20L15K72
$$ -249 212 143 461 229 253 -222 -549 -229 -215 -115 99 419 378 231 210 5 -201 -165 -68 -188 127 399
4515C99j83L18n26j18k77k0O3K76J02L11j06J08J06l77l62k7j16K71J57J72R5
$$ 399 216 534 8 -110 -387 -407 -344 -68 34 345 239 347 453 76 -286 -313 -429 -158 -1 171 266
4536B66J58k42k45n9j82J46ojK08M07m3k71J41o89n1K06QK65P8N7J97j09j03n4
$$ 266 424 182 -63 -122 -304 -158 -164 -165 43 450 407 136 277 -412 -463 -257 -249 16 94 151 348 239 136 82
4560H2l47L5k44L46K08K14k41L18l77j21N4l46J57K17N8L24j21ok0k45l6m02K16
$$ 82 -265 -230 -474 -128 80 294 53 371 -6 -127 -73 -419 -262 -45 13 337 216 210 190 -55 -91 -493 -277
4583b77L9K89o2L39L05m05l55j92j42J17J62L06N1o4L28m59L4l1n02K02J01J1
$$ -277 -238 51 -11 328 633 228 -127 -319 -461 -344 -182 124 175 111 439 -20 14 -17 -519 -317 -216 -205
4605b05M22K21j64q7j41L4l65k05J08L56K8K30p8L30l65l04q2p7K23K3K15oJ67
$$ -205 217 438 274 187 46 80 -285 -490 -382 -26 2 232 154 484 119 -185 -267 -344 -121 -98 117 111 278
4628B78q8k8k54k86j10L25q4L50J40k68K92o7l57l5q0L5K60K2K58r2lq3K8l79
$$ 278 190 162 -92 -378 -488 -163 -247 103 243 -25 267 200 -157 -192 -272 -237 23 45 303 211 208 125 153 -226
4652b26J12j93j76M62M08k36m7K10k99j26j64k9M9L25K13P4N2k01l9j22m03J15
$$ -226 -114 -307 -483 -21 387 151 104 314 15 -111 -275 -304 -255 70 283 357 409 208 169 47 -356 -241
4674b41O4K45J9J45J53n7r3m41N7j13Q3K09K43j0K07o6j81l31j38r6R4q6M66J02
$$ -241 -177 68 87 232 385 328 235 -206 -149 -262 -179 30 273 263 470 404 223 -108 -246 -342 -248 -334 132 234
4698B34J66j43k3m14K9n6k46K86L00K61k77J26k8k18l03K82k95K79J12K20ok97
$$ 234 400 257 234 -180 -151 -207 -453 -167 133 394 117 243 215 -3 -306 -24 -319 -40 72 292 286 -11
4720a1J59p5j99Nj88R9l2M78%N5J67m5n58j38J47r9pM60J93j22J3k10k81L7j88
$$ -11 148 73 -126 -121 -309 -210 -242 236 236 291 458 413 -145 -283 -136 -235 -242 218 411 289 302 92 -189 -152 -340
4745c40J20J18P4K22N2l27J65lj74k12k29L37J57L06K19k30j56j7j69k68J39L30
$$ -340 -220 -102 -28 194 246 -81 84 81 -93 -305 -534 -197 -40 266 485 255 99 82 -87 -355 -216 114
4767A14J50j55J59J42l85J73k94k31J41k4j62M88pJ69jn03J04J14j42j3p1N58
$$ 114 264 109 268 410 25 198 -96 -327 -186 -210 -372 116 109 278 277 -226 -122 -8 -150 -163 -234 324
4789C24L2j07n2j54l12P6j27K17j59L43J90Pm83L82j62k29O7j75L47j47L04K06
$$ 324 356 249 197 43 -269 -193 -320 -103 -262 81 271 278 -205 177 15 -214 -147 -322 25 -122 182 388
4811C88l39K47k80j29KlP2r1J96J81K45m72j70N5p9j37J09J62J79J51j64J66j57
$$ 388 49 296 16 -113 -111 -114 -42 -133 63 244 489 17 -153 -98 -177 -314 -205 -43 136 287 123 289 132
4834A32l17K6o3R5m0K65J99J78k51k17j39j25P9M3o5J50J71K76k74n6M1m04J23
$$ 132 -185 -159 -222 -127 -167 98 297 475 224 7 -132 -257 -178 -135 -200 -50 121 397 123 67 108 -296 -173
4857a73k37M15K7J01P5P1k26j05n25K66k4L54K98k6o6L0j39l57j35N3N6N2J20
$$ -173 -410 5 32 133 208 279 53 -52 -577 -311 -335 19 317 291 225 255 116 -241 -376 -323 -267 -215 -95
4880i5P8J29K45j28n60q0n3K60K01j69L02pj38J07n6j47o9l6n8J71M67l9pp8j21
$$ -95 -17 112 357 229 -331 -411 -464 -204 -3 -172 130 123 -15 92 36 -111 -180 -216 -274 -103 364 325 318 240 119
4905A19k37q5k70P8L66J58L5M01l70k65j81K1P2j59K35O3r1L78j98P7j18n09K43
$$ 119 -118 -203 -473 -395 -29 129 164 565 195 -70 -251 -230 -158 -317 -82 -19 -110 268 70 147 29 -480 -237
4928b37k9M61p5O4Ql8J81k55l05k39K42j12L98P6J78J08m33J51l02k6J3P4RK69
$$ -237 -266 195 120 184 192 154 335 80 -225 -464 -222 -334 64 140 318 426 -7 144 -158 -184 -171 -97 -88 181
4952A81K42k96O0L0k45l07K6L73r0K85J36j83P8k60k82j06j07J72K85K12k67M82
$$ 181 423 127 187 217 -28 -335 -309 64 -26 259 395 212 290 30 -252 -358 -465 -293 -8 204 -63 419
4974D19l1m60J17q4j80r0L48L11O1k45N1j28j25p6j07k7M8N1K48l6K33j72k87
$$ 419 388 -72 45 -39 -219 -309 39 350 411 166 217 89 -36 -112 -219 -246 -198 -147 101 65 298 126 -161
4997a61j88J00l0J12Q5L17J80j97j80k82J60J15l41L42R2l6J29N5m9j78j54O9
$$ -161 -349 -249 -279 -167 -82 235 415 218 38 -244 -84 31 -310 32 124 88 217 272 223 45 -109 -40
5019d0j64J77k02L13Q4o6J20l02%j17J0J07n4J87J15J6P5l65o9j66M0K4L27J19
$$ -40 -204 -27 -229 84 168 102 222 -80 -80 -197 -187 -80 -134 53 168 184 259 -106 -175 -341 -301 -277 50 169
5043A69j66Q7N6j57n7l5k59Q4J62J66J60K33j1m27m0o2J52o7j74J96K86l5p3k1
$$ 169 3 90 146 -11 -68 -103 -362 -278 -116 50 210 443 432 5 -35 -97 55 -12 -186 10 296 261 188 167
5067A67k57j59r1J25K4K23l1J93j06K30k53m13K43j38J2J08K38k9K33m5k79L5
$$ 167 -90 -249 -340 -215 -191 32 1 194 88 318 65 -348 -105 -243 -231 -123 115 86 319 274 -5 30
5089C0k48k07L48N9J66K32j28R0j06j32j05n4j8k04L89M7q3K14j25l28m4j23L01
$$ 30 -218 -425 -77 -18 148 380 252 342 236 104 -1 -55 -73 -277 112 159 76 290 165 -163 -207 -330 -29
5112b9j30K76K64j1j83q3k00p1L8J2Q2j4Q4K07l21K56k43m3j00N5K24jJ97j18
$$ -29 -159 117 381 370 187 104 -96 -167 -129 -117 -35 -49 35 242 -79 177 -66 -109 -209 -154 70 69 266 148
5136A48P6L6k94J1l3l58L48J69k15K88J82l51lj45M8j96K66p2K07R6o8j74j8J21
$$ 148 224 260 -34 -23 -56 -414 -66 103 -112 176 358 7 4 -141 -93 -289 -23 -95 112 208 140 -34 -52 69
5160F9j92q0JP1K22J98j39k4k9Oj58j21J98l11J39L63J62j38j93k75M7k7Q1J08
$$ 69 -123 -203 -202 -131 91 289 150 126 97 103 -55 -176 22 -289 -150 213 375 237 44 -231 -184 -211 -130 -22
5184b2L5R9P2j71L23m46m7m0K4K14J59j87P2J37l6R9l09k81J03Q2L2L29j24J69
$$ -22 13 112 184 13 336 -110 -157 -197 -173 41 200 13 85 222 186 285 -24 -305 -202 -120 -88 241 117 286
5208B86R6l78l03J31mo5o3N44j02p8K75j08l6n09P7K36o6J96j32L6J36k75j24
$$ 286 382 4 -299 -168 -172 -237 -300 244 142 64 339 231 195 -314 -237 -1 -67 129 -3 33 169 -106 -230
$$ [...]
8191a12
##END NTUPLES=NMR FID
##END=
