##TITLE=1H_DE-27sr0
 D2O
 8 sc, 
 14.2.2024
##JCAMPDX= 6.0         $$ Bruker NMR JCAMP-DX V2.0
##DATA TYPE= NMR FID
##DATA CLASS= NTUPLES
##ORIGIN= UXNMR, Bruker Analytische Messtechnik GmbH
##OWNER= root
$$ XWIN-NMR		Version 3.5
$$ Wed Feb 14 15:36:53 2024 Russian Standard Time (UT+4h)  she@DPX200
##.OBSERVE FREQUENCY= 200.1313
##.OBSERVE NUCLEUS= ^1H
##.DELAY= (6, 6)
##.ACQUISITION MODE= SIMULTANEOUS
##.ACQUISITION SCHEME= undefined
##.AVERAGES= 8
##.DIGITISER RES= 18
##SPECTROMETER/DATA SYSTEM= spect
##.PULSE SEQUENCE= zg30
##.SOLVENT NAME= CDCl3
##.SHIFT REFERENCE= (INTERNAL, CDCl3, 0, 15.7039)
##AUDIT TRAIL= $$ (NUMBER, WHEN, WHO, WHERE, WHAT)
$$ ##TITLE= Audit trail, XWIN-NMR		Version 3.5
$$ ##JCAMPDX= 5.01
$$ ##ORIGIN= Bruker BioSpin GmbH
$$ ##OWNER= she
$$ F:/spectra/data/she/nmr/H-F/1/audita.txt
$$ ##AUDIT TRAIL=  $$ (NUMBER, WHEN, WHO, WHERE, WHAT)
(   1,<2024-02-14 15:36:12.21 +0400>,<she>,<DPX200>,
      <created by zg, POWCHK disabled, PULCHK disabled
       configuration hash MD5:
       00 E9 B6 7A A2 85 ED C7 34 08 36 98 17 FE 4E 26
       data hash MD5: 16K
       62 FD 6E BE 1A 4C 0C 02 AB E9 04 AF 7E F6 37 B5>)
$$ ##END=
$$ 
$$ hash MD5
$$ 4C EA B3 8D 74 BB A7 41 BA 86 62 8E 63 3E 88 12
##$RELAX= 
##$RELAX= 
##$RELAX= 
##$RELAX= 
##$RELAX= 
##$RELAX= 
$$ Bruker specific parameters
$$ --------------------------
##$DU= <F:/spectra>
##$EXPNO= 1
##$NAME= <H-F>
##$PROCNO= 1
##$TYPE= <nmr>
##$USER= <she>
##$AMP= (0..31)
100 100 100 100 100 100 100 100 100 100 100 100 100 100 100 100 100 100 
100 100 100 100 100 100 100 100 100 100 100 100 100 100 
##$AQSEQ= 0
##$AQ_mod= 1
##$AUNM= <au_zg>
##$AUTOPOS= <>
##$BF1= 200.13
##$BF2= 200.13
##$BF3= 200.13
##$BF4= 200.13
##$BF5= 200.13
##$BF6= 200.13
##$BF7= 200.13
##$BF8= 200.13
##$BYTORDA= 1
##$CFDGTYP= 0
##$CFRGTYP= 5
##$CHEMSTR= <none>
##$CNST= (0..31)
1 1 145 1 1 1 1 1 1 1 1 1 1 1 1 1 1 1 1 1 1 1 1 1 1 1 1 1 1 1 1 1 
##$CPDPRG= <>
##$CPDPRG1= <>
##$CPDPRG2= <>
##$CPDPRG3= <>
##$CPDPRG4= <mlev>
##$CPDPRG5= <mlev>
##$CPDPRG6= <mlev>
##$CPDPRG7= <mlev>
##$CPDPRG8= <mlev>
##$CPDPRGB= <>
##$CPDPRGT= <>
##$D= (0..31)
0 1.2 0 0 0 0 0 0 0 0.06 0 0.03 0 0 0 0 0.0002 0 0 0 0 0 0 0 0 0 0 0 0 
0 0 0 
##$DATE= 1707910571
##$DBL= (0..7)
120 120 120 120 120 120 120 120 
##$DBP= (0..7)
150 150 150 150 150 150 150 150 
##$DBP07= 0
##$DBPNAM0= <>
##$DBPNAM1= <>
##$DBPNAM2= <>
##$DBPNAM3= <>
##$DBPNAM4= <>
##$DBPNAM5= <>
##$DBPNAM6= <>
##$DBPNAM7= <>
##$DBPOAL= (0..7)
0.5 0.5 0.5 0.5 0.5 0.5 0.5 0.5 
##$DBPOFFS= (0..7)
0 0 0 0 0 0 0 0 
##$DE= 6
##$DECBNUC= <off>
##$DECIM= 32
##$DECNUC= <off>
##$DECSTAT= 4
##$DIGMOD= 1
##$DIGTYP= 9
##$DL= (0..7)
0 120 120 120 120 120 120 120 
##$DP= (0..7)
150 150 150 150 150 150 150 150 
##$DP07= 0
##$DPNAME0= <>
##$DPNAME1= <>
##$DPNAME2= <>
##$DPNAME3= <>
##$DPNAME4= <>
##$DPNAME5= <>
##$DPNAME6= <>
##$DPNAME7= <>
##$DPOAL= (0..7)
0.5 0.5 0.5 0.5 0.5 0.5 0.5 0.5 
##$DPOFFS= (0..7)
0 0 0 0 0 0 0 0 
##$DQDMODE= 0
##$DR= 18
##$DS= 0
##$DSLIST= <SSSSSSSSSSSSSSS>
$$ [...]
##$SUBNAM2= <"">
##$SUBNAM3= <"">
##$SUBNAM4= <"">
##$SUBNAM5= <"">
##$SUBNAM6= <"">
##$SUBNAM7= <"">
##$SUBNAM8= <"">
##$SUBNAM9= <"">
##$SW= 18.0517328524113
##$SWIBOX= (0..15)
0 0 2 0 0 0 0 0 0 0 0 0 0 0 0 0 
##$SW_h= 3612.71676300578
##$TD= 16384
##$TD0= 1
##$TE= 0
##$TE2= 300
##$TE3= 300
##$TEG= 300
##$TL= (0..7)
0 120 120 120 120 120 120 120 
##$TP= (0..7)
150 150 150 150 150 150 150 150 
##$TP07= 0
##$TPNAME0= <>
##$TPNAME1= <>
##$TPNAME2= <>
##$TPNAME3= <>
##$TPNAME4= <>
##$TPNAME5= <>
##$TPNAME6= <>
##$TPNAME7= <>
##$TPOAL= (0..7)
0.5 0.5 0.5 0.5 0.5 0.5 0.5 0.5 
##$TPOFFS= (0..7)
0 0 0 0 0 0 0 0 
##$TUNHIN= 0
##$TUNHOUT= 0
##$TUNXOUT= 0
##$USERA1= <user>
##$USERA2= <user>
##$USERA3= <user>
##$USERA4= <user>
##$USERA5= <user>
##$V9= 5
##$VALIST= <valist>
##$VCLIST= <CCCCCCCCCCCCCCC>
##$VD= 0
##$VDLIST= <DDDDDDDDDDDDDDD>
##$VPLIST= <PPPPPPPPPPPPPPP>
##$VTLIST= <TTTTTTTTTTTTTTT>
##$WBST= 1024
##$WBSW= 4
##$XGAIN= (0..3)
0 0 0 0 
##$XL= 0
##$YL= 0
##$YMAX_a= 25545
##$YMIN_a= -39624
##$ZGOPTNS= <>
##$ZL1= 120
##$ZL2= 120
##$ZL3= 120
##$ZL4= 120
##$ABSF1= 10
##$ABSF2= 0
##$ABSG= 5
##$ABSL= 3
##$ALPHA= 0
##$AQORDER= 0
##$ASSFAC= 0
##$ASSFACI= 0
##$ASSFACX= 0
##$ASSWID= 0
##$AUNMP= <proc_1d>
##$AZFE= 0.1
##$AZFW= 0.1
##$BCFW= 1
##$BC_mod= 2
##$BYTORDP= 1
##$COROFFS= 0
##$CY= 11.3945322036743
##$DATMOD= 1
##$DC= 2
##$DFILT= <>
##$DTYPP= 0
##$F1P= 15.7292609196834
##$F2P= 12.9074282941183
##$FCOR= 0.5
##$FTSIZE= 0
##$FT_mod= 4
##$GAMMA= 1
##$GB= 0.15
##$INTBC= 1
##$INTSCL= 1
##$ISEN= 128
##$LB= 0.24
##$LEV0= 0
##$LPBIN= 0
##$MAXI= 10000
##$MC2= 0
##$MEAN= 0
##$ME_mod= 0
##$MI= 1.114404
##$NCOEF= 0
##$NC_proc= 0
##$NLEV= 6
##$NOISF1= 3.799351
##$NOISF2= 2.8
##$NSP= 1
##$NTH_PI= 0
##$NZP= 0
##$OFFSET= 15.70392
##$PC= 1
##$PHC0= -24950.74
##$PHC1= 8.252645
##$PH_mod= 1
##$PKNL= yes
##$PPARMOD= 0
##$PSCAL= 0
##$PSIGN= 0
##$REVERSE= no
##$SF= 200.130013532006
##$SI= 16384
##$SIGF1= 3
##$SIGF2= 2
##$SINO= 400
##$SIOLD= 16384
##$SREGLST= <1H.CDCl3>
##$SSB= 0
##$STSI= 0
##$STSR= 0
##$SW_p= 3612.71676300578
##$SYMM= 0
##$S_DEV= 0
##$TDeff= 0
##$TDoff= 0
##$TI= <>
##$TILT= no
##$TM1= 0
##$TM2= 0
##$TOPLEV= 0
##$USERP1= <user>
##$USERP2= <user>
##$USERP3= <user>
##$USERP4= <user>
##$USERP5= <user>
##$WDW= 1
##$XDIM= 8192
##$YMAX_p= 0
##$YMIN_p= 0
$$ End of Bruker specific parameters
$$ ---------------------------------
##NTUPLES= NMR FID
##VAR_NAME=  TIME,          FID/REAL,        FID/IMAG
##SYMBOL=    X,             R,               I
##VAR_TYPE=  INDEPENDENT,   DEPENDENT,       DEPENDENT
##VAR_FORM=  AFFN,          ASDF,            ASDF
##VAR_DIM=   8192,          8192,            8192
##UNITS=     SECONDS,       ARBITRARY UNITS, ARBITRARY UNITS
##FACTOR=    0.0002768,     1,               1
##FIRST=     0,             0,               0
##LAST=      2.2672688,     0,               0
##MIN=       0,             -39624,          0
##MAX=       2.2672688,     25545,           0
$$ Real data points
##PAGE= N=1
##DATA TABLE= (X++(R..R)), XYDATA
0@%%%%%%%%%%%%%%%%%%%%%%%%%jMpJ1j5J6j6J6j7J8k0K3k7L2l6L8m1M6n2N7o4
46c5P2p9Q6r5J07j17J27j39J54j72J91k12K37k68L05l50M06m79N79p26R62j406
68h52K526j0791k5071K615J6273K0484J1918M772Q07P3n321j2988j9292j5222
82c0069m069J0248J8964J8665Q426l152r499r018n405l272l623QP896J3508J0398
97B0006O8r865j2863j0341m489K8L815P798J0347R119M188k578p874j0171q139
112a0951k627L329P091O749M627J681r84l623p742p940m023K604P600Q217N651
127I659J378j631l778n859n610l921k74L780O116N975L765n40m402n642m689k347
143h020J58K788M329M945L671P67k983m996m609k816Q4K077L400M299L113Q29
$$ plain form
0 0 0 0 0 0 0 0 0 0 0 0 0 0 0 0 0 0 0 0 0 0 0 0 0 0 0 -1 3 -4 7 -8 8 -8 8 -9 9 -11 12 -15 17 -19 19 -22 24 -28 29 -35
46 -35 37 -42 44 -51 56 -61 66 -73 81 -91 100 -112 125 -143 162 -188 218 -261 318 -408 554 -852
68 -852 1674 -9117 -34188 -31573 -15300 5184 17102 21874 22681 22754 17433 4445 -14847 -30069
82 -30069 -34138 -23890 -4926 13739 22165 19013 9514 496 -4909 -8181 -11804 -11796 -3900 9608 20006
97 20006 20074 10209 -2654 -12995 -17484 -17456 -13641 -5843 4504 13623 17811 15233 7359 -2812 -10951
112 -10951 -13578 -10249 -3158 3591 8218 9899 8915 5292 -2450 -10390 -14413 -11809 -4209 4008 9659
127 9659 11037 9406 5628 -231 -5841 -9762 -10036 -6256 -140 5835 9600 9060 4658 -984 -5673 -8020
143 -8020 -7862 -5074 -745 4200 7871 8638 5655 659 -3950 -6766 -6682 -4605 -1205 3094 6207 7036
159G036j912l956m285l065o28J845L225M140K730Q82j400k463l591k861j277Q48
175d732K971L236K687N15n78k577k528k542j369O13K471K764K457J199o76j723
191B188k524k480j230R8J629K649K092J411k62j440k396k094j074J24R94K123
207a92K202J075M80j340k093j866j097m44J446J446J593J138N36q72j385j860
223a233j132l80R78J143J624J440J97m64j363j569j302l88M22J476J124J119O67
240B359l55j156j472r67n13K77J113J186J134N30l51p04j246j181n17J38P57J024
258E6R96N84rn81q73j148o62R4O52Q66Q08M81K04o16o76p61q86J0L88P79Q17O30
280A153M67o15o64j054k85l12L58R43L74O20J61j37q25n96n11l58L50N78O00N02
$$ plain form
159 7036 5124 1168 -3117 -6182 -6810 -4965 -1740 2400 5130 6012 4612 2149 -1442 -4303 -5580 -4732
175 -4732 -1761 1475 4162 4677 4099 1522 -1006 -3548 -4917 -4304 -1833 931 3388 4587 3911 2188
191 2188 -336 -2816 -4046 -3948 -2319 330 2422 3833 3571 2131 -265 -2359 -3433 -3309 -2315 -192
207 -192 2010 3085 3565 2225 132 -1734 -2831 -3275 -1829 -383 1210 2348 2884 2012 627 -1233
223 -1233 -2365 -2745 -1767 -624 1000 2440 2637 2173 810 -759 -2061 -2449 -2027 -551 573 1692 2359
240 2359 2004 848 -624 -1591 -2104 -1827 -714 472 1606 2136 1785 1081 -165 -1346 -1863 -1725 -968 56
258 56 1052 1636 1627 1046 173 -975 -1637 -1543 -891 -25 783 1264 1468 852 176 -585 -1471 -1461 -1073 -294 523 1153
280 1153 1620 1005 341 -713 -998 -1310 -952 -9 365 985 1146 1009 184 -412 -923 -1281 -931 -353 247 749
300G49J66O2m90q06n88kL08P3M53N00N59j76l96p69l96L4p0M28M33N41K13l02
322E24j38l78m29p17K29O40K97L90Q4J18j96l39m63m48J21J55M19P09nn0k28k19
344G6m81k46R4J08M70K81P0J04j3p08J91l94o4M7M14M19K52j88J01m67j88l64
366d86J77j18M65J14j09L95l0L3o34m7k87L78K15j92N66n1J66m09j37l71L5n2
388c79P3J90K15K39Q3n66k89J56k86N52j61J49JO3K20j64qj56k74J1L45j7J57
411A54j4p4L13l98j55K9R0J92k93K91k2J53r5k20K9j96k25L84K58m26K69l3Q4
434I5Q0j88q4j29J53P9j1J51K11k93Orl79p2L42J15j54Q8K58k41j7J1k65J57Q0
459a6N6k7J76K7L2j49j81k15q7J32J04J9L38k04N1P4n8L3k31J48q9J12Q9J37j26
$$ plain form
300 749 915 977 487 -319 -907 -909 -601 -528 -75 425 984 808 412 -357 -753 -719 -789 -361 72 613 826 524
322 524 386 8 -421 -1138 -909 -269 28 418 502 620 424 85 -378 -826 -705 -550 -131 578 573 523 295 76
344 76 -405 -651 -557 -449 21 302 372 476 463 -245 -54 -448 -512 -465 -51 368 620 432 533 66 -122 -486
366 -486 -309 -427 38 152 43 438 408 441 -193 -240 -527 -149 66 -126 440 389 555 146 9 -362 -327 -379
388 -379 -306 -116 99 338 421 -145 -434 -278 -564 -12 -173 -24 -23 40 260 96 88 -68 -342 -331 14 -3 154
411 154 140 66 379 -19 -174 -145 -55 137 -156 135 113 266 171 -49 -20 -216 -441 -57 201 -225 44 11 95
434 95 175 -13 -97 -226 -73 6 -5 146 357 64 70 61 -318 -390 -48 67 -87 1 259 18 1 12 -253 -96 -16
459 -16 40 13 189 216 248 99 -82 -297 -384 -252 -148 -129 209 5 56 130 72 105 -126 22 -67 45 134 271 145
484A45M6j50P1l21J92k1j2n0J38J57l20L42o4M1l64M8J95J27k86L19j23Q6j78
507A8j07q4J04m8K12m8N1J4k28K94l9k74K23k02j4M8K08M0j51Q3k00J14l75K60
531a01J05PK25k09K16l43L84k39j53L3J52j68J50j92K60j94K00k14J1R3Q4J6N4
554A77K8k70K31m81L74j99K41k16M5j04K93j9j96q8M4J04J6R1k55M7LJ48J91j28
578G7j40J8J06L6j91M0R7j40L41j39l2j62R4K1J74k11J23j49J37n3k27O0j31K76
602B5O1j42J12R9j80P7j54J01K0r4J58j17J73j73oO5j23P2N7j44m6K8J83j9J8
627E1N4j47L5L6K0q3L01k49pM0p4m8r2mK46j25J63J75l65M9n9K67j18k54K72K6
653A10r8j53K19l7p0l25J85L20j06k4J2j17J34O7k7M0M8j48j29R6j9q7L09m2k23
$$ plain form
484 145 191 41 112 -209 -17 -38 -50 -100 38 195 -125 217 153 194 -170 -122 73 200 -86 233 110 196 18
507 18 -89 -173 -69 -117 95 47 98 112 -116 178 139 -135 88 -114 -128 -80 128 168 17 100 -100 14 -361 -101
531 -101 4 11 236 27 243 -100 284 45 -108 -75 77 -91 59 -133 127 -67 133 -81 -70 23 107 123 177
554 177 205 -65 166 -315 59 -140 101 -115 -70 -174 119 100 -96 -184 -140 -36 -20 71 -184 -137 -134 14 205 77
578 77 -63 -45 61 97 -94 -54 43 -97 244 105 73 -89 5 26 200 -11 112 -37 100 47 -180 -120 -251 25
602 25 86 -56 56 155 -25 52 -102 -1 19 -75 83 -34 139 -34 -40 25 -98 -26 31 -113 -159 -131 52 33 51
627 51 105 -42 -7 29 49 -34 267 18 11 51 -23 -71 -163 -167 79 -46 117 292 -73 -24 -83 184 66 -188 84 110
653 110 12 -141 78 41 -29 -354 -169 151 45 21 33 -84 50 117 90 130 178 30 -99 -3 -22 -109 200 158 -65
678f5K02o7R4j61K8j54K2j2J40q9K9J3l9J66M2r8k12L45j48jO0L2j90Q1M6k83
704b19L38j78j18J26J66n6q8K3r9j6J87k37J45J63j53J25j63R0P9r1Q7J7k33K66
728A61l71K78q7K0n0J61l06K96k39K42j45J25k45J61R8l8q2J60k53M0K40l33J75
751HJ13K8k23k48M02k9j61J75k20N0k4J43j50J55jj21K11j00k13K66l5j8k20K19
775GJ05J10l53K92j99J65J27n00J56J68k02Q7j5J23j0N9j70Qr3J7J43r8k6M9K47
800A97o8j8k99M05k97J54j99L4o7m4J13J65j55r3J51M4P1q3l08L60K24l90O2n1
824i2J72M4k54K41j18J01L01l12k1l7j65J58K84m07L07j68l6j57R9K2o7K1J41
847E7J50k73N5j12K13j49L01k09k40K06O3K3j48K12q0K4k01M7J8P5J26k34J68
$$ plain form
678 -65 137 70 164 3 31 -123 -101 -113 27 -62 -33 -20 -59 107 149 51 -161 184 36 35 95 127 -63 18 64 -219
704 -219 119 -59 -177 -51 115 59 -29 -6 -105 -121 66 -171 -26 137 -16 109 -54 36 115 24 111 128 -105 161
728 161 -210 68 -19 1 -49 112 -194 102 -137 105 -40 85 -160 1 99 61 -21 139 -114 -74 166 -167 8
751 8 121 149 -74 -322 80 51 -110 65 -155 -105 -129 14 -136 19 18 -103 108 8 -205 61 26 8 -212 7
775 7 112 222 -131 161 -38 127 254 -246 -90 78 -124 -37 -52 71 61 120 -50 -42 -135 -118 25 -73 -99 -50 197
800 197 129 111 -188 217 -80 74 -125 -91 -158 -202 -89 76 -79 -172 -21 23 94 11 -297 63 287 -103 -41 -92
824 -92 80 124 -130 111 -7 94 395 83 62 25 -140 18 302 -105 202 34 -2 -159 -60 -38 -105 -84 57
847 57 207 -66 -11 -123 90 -59 242 33 -207 -1 62 85 -63 149 69 93 -108 -61 -43 32 158 -76 92
870I2k4P4Ml1j2m0q4p4K78l07J57L9p1k32J93j63J25K09r8pj95M18j37j01k7k80
896b94J95L86l15q3K0K10j05K72j93NR1j39j63K33J8l69N00k97P5q6K74J3l12
919f4j43J28p3K2K04J40l55K69j89J11J41j0q1J6k06M2J29J3M5l73K38r6J43k52
943b01J20l9n7K18j35J15K42k79P0k03P3K50j56k44L84k76M9r2J06j08j6L28l77
966b28L13j20j81J2N32l16k9k4L1o3j30J46J8J16l20L43k74k7N7J02K63j49k2
989E0j35R2J51j34O7k89mm2J27m8J78p6J88q0j12J41J56k31p0R0O8k15J05K13
1013A90k50Q9op7KL91n09k25L92N0l33L00n1J3r4M7j35J78q1J36K01m04L68j73
1037A9j41lJ91J35l37K13J42k9k72J62k44K21K5R3j28J48j00j09J0N4J80j89k2
$$ plain form
870 92 68 142 146 115 103 63 -21 -95 183 -124 33 72 1 -231 -38 -201 -76 133 35 28 -167 251 114 13 -14 -294
896 -294 -99 287 -28 -111 -91 119 14 286 93 98 189 50 -113 120 138 -231 269 -28 47 -39 235 248 -64
919 -64 -207 -79 -152 -130 74 214 -141 128 -61 50 191 181 100 116 -90 -48 81 94 139 -234 4 -92 51 -201
943 -201 -81 -120 -177 41 -94 21 263 -16 54 -149 -76 174 18 -226 158 -118 -69 -161 -55 -163 -179 149 -228
966 -228 85 -35 -216 -204 328 12 -17 -41 -10 -73 -203 -57 -39 77 -243 100 -174 -201 -144 -42 221 72 50
989 50 -85 7 158 24 91 -198 -202 -244 -117 -165 13 -63 125 45 -67 74 230 -1 -71 19 87 -128 -23 190
1013 190 -60 29 23 -54 -52 339 -170 -395 -3 47 -286 14 -37 -24 -118 -71 -206 -28 -109 27 228 -176 192 19
1037 19 -122 -125 66 201 -136 77 219 190 -82 80 -164 57 82 175 47 195 95 -14 -4 50 230 41 19
1060A9o3J23j56kJ99n4J0J53k86K65k80L80k30m4j64L9J82k98K11lK92l99P1J27
1084I2j04J1r5K19j01J11j8k5L9p7K5J58k75K57k10o0q5n5J87J2O8j24K5J92n0
1109A17o4J09l3j68k43N5K47J6k4j66J05N5L4J33k34Q0K36k56L3r3K17j5k49J41
1133C3j20m2K01j12N7K18j92j34J85L9j05j46QJ85j59j68L95j01k01K06rJ62o6
1156A34j28K60k34o2R6j72O4K24j87J20J5p8k03O9Q1j00l8L28k41L07l11J57m1
1179F0j55k9p3L52l43J1K89R6r6j95J53j72O4K4j03K10j88r1J27J7L02m13J61
1202HJ33j8j9j53O1K31k77J21j85O9J5K84j43k78J18K8p1P6j59K00j25J21Q5o3
1226E9M5j17p7p1L35k51J93k45Q7j49O3n3L93k78N3k29K4N43k72K15k93O8J26
$$ plain form
1060 19 -44 79 -77 -79 120 66 76 229 -57 208 -72 308 78 34 -130 -91 91 -207 4 1 293 -106 -35 92
1084 92 -12 -1 -96 123 22 133 115 90 129 52 77 235 -40 217 7 -53 -138 -193 -6 6 74 -50 -25 167 117
1109 117 53 162 129 -39 -282 -227 20 36 12 -154 -49 6 40 173 -61 19 255 -1 32 -61 156 141 -108 33
1133 33 -87 -129 72 -40 17 235 43 -91 94 133 28 -118 -110 75 -84 -252 143 42 -159 47 38 200 134
1156 134 6 266 32 -30 66 -106 -42 182 -5 115 130 52 -151 -82 -1 -101 -139 189 -52 255 -56 101 60
1179 60 -95 -124 -197 155 -188 -177 112 208 112 -83 70 -102 -38 -14 -117 93 -95 -186 -59 -42 260 -153 8
1202 8 141 123 104 -49 12 243 -34 87 -98 -29 -14 270 127 -151 -33 -5 -76 0 -159 41 -84 37 122 59
1226 59 104 -13 -90 -161 174 -77 116 -129 -42 -191 -128 -181 212 -66 -13 -242 -218 325 53 268 -25 43 169
1249A69p3n0j87J68Q9j66R5J14Q3l11j35Q5J89J40q3j60J22j20J3N7j35N1J8o8
1273i5J18m6k69M78j39j49K40r1j83K21l6j26K21k51O3Q2M7q0q1L26l47q4R9K29
1297A47j16R1Jj0k45J43q1J79j8p5J26j70m2J94j26j1L7j69J20K01k86K06J13
1320B09j93M8j08O7j14J55J43j58k45J42Q2Mn1J35j88m1j13N73l52L7L2o2j02
1343a00J31j93K85n6o5K43j36j95K66j49K3J94n96L51o3J7j36K32k49L57k60m2
1365a41K03n0N9J9k86J11J49j56J00j65O21n12K50k31k1q0k1J76K87k96kJ00k21
1388a07K76j75M3Lj48%L9P9K75l18K30l65K89j38k70RJ70pL6J72Q0m5k62R4K11
1413A71j78K9p1M14j57n0l74J41R2j39J68j48M00k51j6K0j4l5KR7k3k8N9j93o8
$$ plain form
1249 169 96 46 -141 27 116 -50 45 159 242 -69 -204 -119 70 210 127 -33 89 -31 -18 39 -96 -45 -27 -95
1273 -95 23 -23 -292 186 47 -102 138 47 -136 85 49 -77 144 -107 -44 38 85 5 -76 250 -97 -181 -82 147
1297 147 31 122 123 113 -132 11 -70 109 91 16 142 -28 -70 124 -2 -13 24 -145 -25 176 -110 96 209
1320 209 16 64 -44 23 -91 64 207 49 -196 -54 28 32 -19 116 -72 -113 -226 347 -5 32 64 2 -100
1343 -100 31 -162 123 67 2 245 109 -86 180 31 54 248 -348 3 -60 -43 -179 53 -196 161 -99 -141
1365 -141 62 12 71 90 -196 -85 64 -92 8 -157 464 -48 202 -29 -50 -130 -151 25 312 16 14 114 -107
1388 -107 169 -6 37 40 -108 -108 -69 10 285 -33 197 -168 121 -17 -287 -278 -108 -115 -79 93 173 128 -134 -40 171
1413 171 -7 22 -49 365 208 158 -216 -75 17 -122 46 -102 298 47 31 51 37 2 4 101 78 50 109 -84 -152
1438a52L23j14j46P6O7k2p8J96k8j53J16j56j3K06P0k22P2M7r3J8p0j32N96k80
1462A28j49j57L24j61j09L5%J93l06J79kP2k9J21Q7j24j71K14j92m8J1K10l30
1485b04K74J38J6m56O03j33k00N2k41PL67l21K15N3k31N9j35J16l5k1Q1P9j23
1508d0K01n21N12q1P6j7P4k44O0k9M3m9J47q3q3P9l5J98j98J8j42L00l68K99l9
1533G8j05k18L22o7P3Q4j19j54J07K29l37j37K47K17j42P1k49N3O6j8j5pJ95j35
1557C9k06K94r3j12L7k2m3K72j39j43L02j92j03J85M2k14P7Jnj33L68j88K02l08
1581h2P7rJ66r5k35J52j78J83K61k57l1j07J96J1k26L53k96J39K4m3l72N15k94
1604a48J89np6J40j6K6J69j94j36q2j81N38k35k36K12N7k36K17p7k44L71j00J3
$$ plain form
1438 -152 171 57 -89 -13 54 32 -46 150 122 -31 85 -71 -84 122 192 -30 42 89 -4 14 -56 -188 408 128
1462 128 -21 -178 146 -15 -124 -89 -89 104 -202 -23 -25 47 18 139 226 102 -69 145 -47 -95 -84 126 -204
1485 -204 70 208 224 -232 371 238 38 90 -151 -144 223 -98 117 170 -61 -2 -137 -21 -56 -77 4 83 -40
1508 -40 161 -360 152 71 147 130 204 -40 20 -9 34 -15 132 49 -34 45 10 208 10 28 -114 186 -182 117 78
1533 78 -27 -245 77 10 83 167 48 -106 1 230 -107 -244 3 220 78 149 -100 -47 19 1 -14 -21 174 39
1557 39 -167 127 34 -78 -41 -63 -106 166 27 -116 186 -6 -109 76 118 -96 -19 -18 -23 -156 212 24 226 -82
1581 -82 -5 -14 152 57 -178 -26 -204 -21 240 -17 -48 -155 41 52 -174 179 -117 22 46 3 -369 146 -148
1604 -148 41 36 -40 100 84 110 279 85 -51 -133 -314 224 -11 -247 -35 22 -214 3 -74 -318 53 -47 -34
1627c4J74m7j9q1ol4K27n01K08J37l0n6J57r6p9J66j73M04j41k27J24k5n8J82
1651A72j59Q4l2rj11J80k69J64J42m34J70K61l99K46N2M1KN2j16j46K20q0j30
1674i9N2j46K97k23p1J2P3oJ83J55l3o0j39l00J25J75k54L22k0M1m9k9Q1k06j85
1699c04M00m0p3J62j49J77j28J0n0P2k00J14P8K4O3p9k4p1j9K5J26m09L54J36
1723A95m0j88R8j01k62K90o9kj79R7nJ17J65k19L4O3k09L90j97J67m4j14J77k83
1747a19l3M8K46Q3l23J30l8Lp6m8O1J67j68r4L7L14j82J16j33j18P3J3j03m8J41
1772e1l4J70q1JJ98O0l76K69q9Q8N6o8j27l1l3N5j40j74L30m5O9K8J11k63j4J99
1798A08j82J38r4K33ql18R1j48j0K70J0k33L54k09p0J80j38k27L61Q6l53J81o1
$$ plain form
1627 -34 140 93 74 -7 -13 -47 180 -321 -113 24 -6 -62 95 -1 -80 86 -87 317 176 -51 73 48 -10 172
1651 172 13 97 65 56 -55 125 -144 20 162 -272 -102 159 -240 6 58 99 101 153 37 -109 111 31 -99
1674 -99 -47 -193 104 -119 -190 -178 -105 -111 72 227 194 134 -5 -305 -180 -5 -259 63 43 84 35 6 87 -119 -304
1699 -304 96 56 -17 145 -4 173 45 55 5 77 -123 -9 69 93 156 77 53 -18 -37 -12 114 -295 59 195
1723 195 155 -33 65 -36 -298 -8 -77 -79 -258 -161 -166 -49 116 -103 -69 -6 -215 175 -22 145 101 -13 164 -119
1747 -119 -152 -104 142 225 -98 32 -6 -3 -79 -127 -66 101 -67 -161 -124 190 8 124 -9 -127 -54 -41 -144 -192 -51
1772 -51 -85 85 4 5 203 263 -113 156 67 155 211 143 16 -15 -48 7 -133 -307 23 -22 47 75 186 -77 -91 108
1798 108 -74 64 -30 203 195 -123 -32 -180 -190 80 90 -143 211 2 -68 112 -26 -253 108 194 -159 22 -39
1821c9oj3K96r1k47J8J53j0k1K15m6l63K22k0P2j43j76J49J07k27K95j91J43q8
1845a1k77J69p4L17P2l15K09j62J04K2l7o3M9k5j96L10l01P8L92k57J67q3j90
1868a02K4q7NJ80J35j42k00L18l40J41J49k1j69P8o7k3J45m4Q1j85J31j65J55
1891cJ10j43o3K69j47n6P5j36r4K22q8K15k13O2j25J57j61K82k71K08j96O7jJ27
1915I7jl43Q2K48o5j46O0j63J90L10j73j36O6K8J66p7j42j18J11M2Q7P5n43J46
1939a99K13j62K11L2j33O1k3qr5j7K6J11J30rjl28Q7PO6J89k41Q8M4p5O3j70K34
1966A01k9M0P1q0j22J53Q8q6n1k51J59K5K6kj05K29j79J16n0l08K74l3L59k69
1990G6o5j26j4K50j43N7O6Nn6m5Q7m4j27N3J1o9Q1MJ49k81K93j61j03J47q9k3
$$ plain form
1821 -39 -45 -58 238 147 -100 -82 71 61 40 255 209 -154 68 48 120 -23 -199 -50 57 -170 125 -66 77 -11
1845 -11 -288 -119 -193 124 196 -119 90 -72 32 54 17 -46 3 -22 -218 92 -209 -131 261 4 171 88 -102
1868 -102 -78 -165 -160 20 155 13 -187 131 -209 -68 81 60 -109 -31 -98 -121 24 -20 61 -124 7 -158 -3
1891 -3 107 -36 -99 170 23 -33 42 -94 -188 34 -54 161 -52 10 -115 42 -119 163 -108 100 -96 -29 -30 97
1915 97 96 -247 -165 83 18 -128 -68 -231 -41 269 96 -40 26 54 220 143 1 -117 -6 36 123 198 -345 -199
1939 -199 14 -148 63 95 -38 23 0 -8 -103 -120 -94 17 147 138 137 -191 -104 -97 -31 158 -83 5 49 -26 37 -133 101
1966 101 72 112 183 103 -19 134 222 136 85 -166 -7 18 44 42 -63 166 -13 103 53 -255 19 -14 345 76
1990 76 11 -115 -129 121 -22 35 101 106 50 5 92 48 -79 -26 -15 -84 -3 1 150 -131 162 1 -102 45 -44 -67
2016f7m2J44O5l9o8k9MQ4j10J15j10L8k05K11n3n6J56p7j29J03J0Rm7Q2J39j96
2042f8J38l0j56K07l5J8q8Q6K1n3j13m2J52q4j56K52j04J71q9k9p5J21j7j73J59
2067A3Q9j41Q8j53K15j88J7o7K02j01NJ25k07K00l0j98K66k34K00p9j10L42j92
2090F2k02L2K34j43l3k49M42j89M6p9j25K99m83L11O1r3J90j22L4j19L65j78j49
2113h8M5j05N4J89j13J52mj71n0o2K12J42k97L51j74k8k8M0j86J82j61Mk5m9J87
2138A7j04J36j9p4K18L0k03J91k2q4J3r9j45M08k56K42l48k0J5l3J31J34n53L49
2162g6j01K33R5O6j88k01K06o0Q7j1l12J44K55j8j39K26j30j84K40j49k98M26
2184A11qk86R6L7Q4q8R1rj66J14L31m37J92k41m4J7J50m2O4N0n0J83n5l93RM91
$$ plain form
2016 -67 -109 35 100 61 -7 -36 -32 52 -58 57 -53 -15 -220 -9 -62 -118 38 -39 -168 -65 -55 -46 -93 -11 128 -68
2042 -68 70 40 -116 91 56 74 -14 72 93 40 -73 -115 37 -47 -203 49 -55 116 27 -2 -77 44 27 -146 13
2067 13 102 -39 49 -104 111 -77 -60 -127 75 -26 -21 104 -103 97 67 -131 135 -99 101 22 -88 254 62
2090 62 -140 -108 126 -17 -50 -299 143 -46 0 -79 -204 95 -388 -77 -16 -109 81 -41 -7 -126 239 61 -88
2113 -88 -43 -148 -94 95 -18 134 130 -41 -91 -153 59 201 -96 255 81 53 25 65 -121 61 -100 -96 -121 -170 17
2138 17 -87 49 30 -44 174 204 1 192 170 86 99 0 -145 263 7 249 -99 -119 -104 -137 -6 128 -425 -76
2162 -76 -177 56 151 217 29 -172 34 -26 61 50 -262 -118 137 119 -20 206 76 -108 132 -17 -315 111
2184 111 103 -183 -87 -50 34 -54 37 28 -138 -24 307 -130 62 -179 -223 -206 -56 -98 -34 16 -34 149 94 -299 -290 201
2210B01j45Lp7JN2o7L6J2K45l27K70l92M0J41r5K9J11j03QJ22P4l19k5p6L61K0
2236A00K8k03K15Q4k17j68J49J24k3k7k43N6J90k15k6K19m23M18j02k0r4L51k65
2259i2J45j83K58l17J62O3k37K16q3j19K85j39N4j40m3m4K27K01k66J46k14J01
2281a9O3j94Q8J26J15k14Q8k58K69j81J06L0K86k05j63N5r8j41J67j7K6K12j27
2304A4N0p6%J74r0p0l53K91K20k49K08k30Q4l20K06K0L69l38l7J39J1k4J60l39
2328a80L46k8j33M1m0j7K15lj26j74J64k08J14R7j52J18Mj11n1L2r7l5L30j67
2352f1j38J82m5p7O5J06k48K04k14K50j5J53j26o2J12l1J52l54L78j33M2j91J19
2375F8nl70K98J34j9o3K9J4n5j53K83k94J3N9L07l08K29k0n1j23J70O1o9M9k72
$$ plain form
2210 201 56 59 -18 -17 35 -32 4 16 261 -66 204 -188 -148 -7 -102 -73 38 -65 -57 65 139 -180 -205 -281 80 100
2236 100 128 -75 140 224 7 -161 -12 112 89 62 -181 -125 65 -150 -176 43 -380 38 -64 -84 -178 173 -92
2259 -92 53 -130 128 -189 -27 36 -201 15 -68 -187 98 -41 13 -127 -170 -214 13 214 -52 94 -120 -19
2281 -19 44 -150 -62 64 179 -35 53 -205 64 -117 -11 19 305 100 -63 -8 -106 -247 -80 -97 -71 141 14
2304 14 64 -12 -12 162 72 2 -351 -60 160 -89 119 -111 -27 -347 -141 -121 248 -90 -127 12 23 -1 159 -180
2328 -180 166 138 5 46 6 -11 204 201 75 -99 65 -143 -29 68 -84 34 38 -73 -124 -92 -189 -224 106 -61
2352 -61 -199 -17 -62 -139 -74 32 -216 -12 -226 24 9 162 36 -26 86 55 207 -147 231 98 140 -51 68
2375 68 63 -307 -9 125 106 43 72 86 31 -122 161 -133 -120 -61 246 -62 167 147 96 -27 143 204 135 184 -88
2400h8q8L01j15n3K13k96K29m1l3j21K32k38J40q6O9K31l51lL5K54j15n5q1J72
2424A12l7j5n3J1o3L9J59l76K08m5k0K51m24J30J51k08J70J33k12J33o7l0j6l4
2448a03K9j10K24n4j69K53K07k86J62k07L5Kj56J79K0o2k05J90j60J05k5k1L09
2471A57r6M9l46K26Q1Ml19K46j9P3j27Q6l33J64K06j70K68l6l08J86J82k1Ol54
2495a95J25R1K94m05k2JJ98j67J30J9j50J37j61P9J9R7Q0l78L03J9j71n1K43j73
2519c8J28j03J79k13K27o5J30k08o1K87l13J74j35J66k65K50o8j96Rk15M27n4
2541D3M3k74m8J43J79r7K8k36K51K44l69J16k40K88n0o4k17J9PJ26J69j39O8j46
2565a56J52P2k22M00l85K09N5k35j21L15O3j14P2J50j54M2j3k48K41l8k14M0M2
$$ plain form
2400 -88 -176 125 10 -43 170 -126 103 62 29 -92 140 -98 42 -44 25 256 -95 -98 -63 191 76 21 -60 112
2424 112 75 60 7 18 -45 -6 153 -223 -15 -60 -80 171 -253 -123 28 -180 -10 123 -89 44 -23 -53 -69 -103
2448 -103 -74 -184 40 -14 -183 70 277 -9 153 -54 -19 -17 -173 6 26 -36 -241 -51 -211 -106 -131 -152 157
2471 157 61 110 -236 -10 71 75 -244 2 -17 56 -71 15 -318 -154 52 -118 150 114 -194 -8 174 153 159 -195
2495 -195 -70 21 315 -90 -112 -111 87 -80 50 69 -81 56 -105 -26 -7 90 170 -208 95 114 -57 -108 135 -38
2519 -38 90 -13 166 -47 180 115 245 37 -24 263 -50 124 -11 155 -110 140 72 -124 -115 -330 97 43
2541 43 86 -188 -236 -93 86 -11 17 -219 32 276 -93 23 -217 71 21 -43 -260 -241 -234 -108 61 -78 -10 -156
2565 -156 -4 68 -154 246 -139 70 125 -110 -231 84 147 33 105 255 101 143 130 -118 123 85 -129 -89 -47
2588d7M9j77L56l2m5N3m56L75j29L29j67q5o8q0O7N9J76oK8j32j63J27k0M1j16
2613f3k17L14J7j63P9J09k48J58K07l21J39k42K78j49J78j93R0J33k9r7J91j89
2635a8J53j24j0J71l10K09j51J0J7J03j58N42m39k45PK98J12j82j52J95j35J24
2657A7J08j48P2n5n3J06j88Q1J71J06q3j53j14K2K71j68J07K6o5r6MR6l21Q5J05
2682f7J59j23n7R3J19k36M1ML9j19J32Rj09J97J59k03n4p2j5J99q1m5Q2q0m1J54
2708H5K85m75J74N8j78k05K52m1j42K76j15J68j1l1j25Q8J04J00j41O6l17J63
2730C8k85M98k01K58m89J64k20K92j32j88M57j92j74M78n09j7L06O2k35J83r1
2751CL5M5Q0r2m5kj58L08k99N4K16l90J12J65o6J78L8q2j96K00k34J4l1l4K0M18
$$ plain form
2588 -47 2 -175 181 149 104 157 -299 76 -53 276 109 24 -44 -124 -57 2 178 172 200 68 -95 32 12 53 -63
2613 -63 -280 34 51 -112 -33 76 -172 -14 193 -128 11 -231 47 -102 76 -117 -27 106 77 -20 171 -18
2635 -18 135 11 1 172 -138 71 -80 -70 -53 50 -108 434 -5 -250 -243 55 167 -15 -167 28 -107 17
2657 17 125 -23 49 -6 -59 47 -141 -60 111 217 134 -19 -133 -111 160 -8 99 125 60 -36 -32 64 -257 -172 -67
2682 -67 92 -31 -88 5 124 -112 -71 -67 -28 -147 -15 -6 -115 82 241 38 -16 -88 -103 96 15 -30 52 -28 -69 85
2708 85 370 -105 69 127 -51 -256 -4 -45 -187 89 -26 142 131 100 -25 63 167 267 126 192 -125 38
2730 38 -247 251 50 308 -181 -17 -237 55 -77 -265 192 0 -174 304 -205 -222 84 146 -89 94 3
2751 3 38 83 163 71 26 24 -134 174 -125 -71 145 -245 -133 32 -34 144 182 100 -96 104 -130 -116 -147 -181 -161 257
2777B57k91j65K49k90L86j34j18K38j55n9P4k00K46k11L28j24j10P9O7j09J7J40
2799A15k09O8J04p3Qj32J8L15k23o3J0J99J8L8k95RJ81j70mM9J38l32J21r8O2
2824a46J89j27K18j49J3k3J86k89K90k43L38j94J12k2j36m6J30l8q0j11J74l5
2846A1O7k0l4m8j67J95k03p3J07K9L44p9o8j1j7j9q5K31r1j55Q7j72j2K60M0N4
2872A71j79J57j84j24J29K54j59rJ4j80K59l25m8K15J30J54j55l44K99J47l92
2893a70J96J04l95L67J0l32K71l8j74p2K00J76n9q9j32K48Q9l28l5J90j02L3r3
2916a35j07K84l8r4K9L9j85J91j37N5J54j0m3J00j90r4N9k1J10p0R4q7J70K2r8
2941bQ7rJ80j54o5oj28K12L4k86J87l1j45K65OJ02k47L6J45k35K59k88r9L30j36
$$ plain form
2777 257 -34 -199 50 -240 146 12 -106 132 -23 -82 -8 -208 38 -173 155 31 -79 0 67 -42 -25 115
2799 115 -94 -26 78 5 13 -119 -101 214 -9 -72 -62 137 155 193 -102 -93 88 -82 -86 -37 101 -231 -110 -208 -146
2824 -146 43 -84 134 -15 -2 -25 161 -128 162 -81 257 63 175 153 17 -29 101 63 -17 -128 46 11
2846 11 78 58 24 -24 -191 4 -199 -272 -165 -136 208 129 61 50 33 14 -71 160 69 -86 1 -171 -183 77 117 171
2872 171 -8 149 -35 -159 -30 224 65 56 70 -110 149 -176 -224 -9 121 275 120 -224 75 222 -170
2893 -170 26 130 -265 102 112 -220 51 13 -161 -233 -33 143 84 -5 -137 111 200 -128 -163 27 -75 -42 -135
2916 -135 -242 42 4 -90 -61 -22 -207 -16 -153 -98 56 46 3 103 -87 -181 -122 -143 -33 -103 -9 -96 74 96 -2
2941 -2 85 76 256 102 37 31 -97 115 149 -137 50 19 -126 139 145 247 0 36 181 -54 205 -83 -182 148 12
2966A2o8n6J06N6m03N13J5j49O3o4K3m8L4j94J42r5R9L45l43j16Lm8J94j42m4
2991a65J13Q9Qk65J82j4p1K91k57M3O2K01o2j40mK10k20K11p1n04L37J71k88j01
3015b44O58m70K97l49J31N9K40k04n0r4R1m7J06j73j09J38r9lL8j05O5J57j7p9
3039f3R9J31j04r9K89k21K79k81k8L13m91K08p4L6j70K70J6q3j77L16j40K46k83
3062a1k8jqN0K5n4P7n1k88K76J16k33r9L94j61J02J78j53k6M3j05L4J25m46L05
3087F1p3J5m0j83K23J82k05K14R7k91R6J1jk57J49j64R2j13R8P1j20P3m2L15j02
3112A06j53j40j48L82Nj12M1m1M0O7j2j52J58M1nj8K0J08j62RK34m81P6K54l9
3137G8q4j05J66Q3j28l6J0j1j40L95j25k90K85l5O3j30L4M7k35J44j1L00k07j19
$$ plain form
2966 12 -56 -112 -6 50 -353 160 175 26 89 25 48 0 34 -160 -18 -113 -14 331 -12 -128 -125 -173 21 -121 -165
2991 -165 -52 37 45 -220 -38 -52 -123 168 -89 -46 16 217 155 15 11 221 1 212 141 -363 -26 145 -143 -244
3015 -244 414 -56 241 -108 23 82 322 118 68 -26 65 18 124 -49 -158 -20 -119 -122 -84 -189 -124 33 16 -63
3039 -63 36 167 63 -36 253 32 311 30 2 315 -176 32 -42 -6 -176 94 110 27 -150 166 26 272 -11
3062 -11 -39 -40 -48 2 27 -27 50 -1 -289 -13 103 -130 -229 165 4 106 284 131 105 148 43 77 202 -244 61
3087 61 -12 3 -37 -220 3 185 -20 194 291 0 96 107 106 -151 -2 -166 -74 -187 -89 -18 -138 -65 -107 208 106
3112 106 -47 -187 -335 47 52 -60 -19 -60 -20 47 35 -117 41 82 77 59 79 187 25 34 268 -213 -137 117 78
3137 78 -6 -111 55 138 10 -26 -16 -27 -167 228 103 -187 98 63 126 -4 30 77 -158 -14 -25 275 68 -51
3161e1q7L31k49j76K02K03q2l18M31j79l4j7k70K92m9J72k6j59K10lj90J72o0
3184F3k52Q8J66j09j30M0k1l9n9O2K01O6m1J19j61J24r3l9J29oj14k1L9l01K81
3209hJ55l7k2l26L58j14o5P5k44K24Q5k63J67%M0p9M07l83J6j25K70m1p3K02k52
3234c3j49K90j21P6k83K07J10k18L78n37L51m3Q5k68J64q7L6K30k7k11R2o4J77
3257A55j81M3k44K11J05j72J50l51K4K10j17L7K63k3n4m6j09K05j77p3L82l55
3279a17K00j97M9l9J94j33L7l99L62L3j18J25K28j12k86K08q5P5j33P6j58K97
3301A07j19P5K29l52J5J96l84j83N44j28j56K41j39j29J98K27l00L42m35K33J29
3322B11p3j67J72k45k9K20m6M8M9J38l20P5L3m0l05K28j31M3K21P8jj05m6k9J70
$$ plain form
3161 -51 -138 193 -56 -232 -30 173 91 -227 204 25 -9 -26 -296 -4 -53 119 93 -66 144 141 -49 123 63
3184 63 -189 -101 65 -44 -174 -134 -155 -194 -253 -191 10 76 35 154 -7 117 24 -15 114 108 -6 -27 12 -289 -8
3209 -8 147 110 88 -238 120 6 -59 16 -228 -4 81 -182 -15 -15 25 -54 353 -30 -14 -139 131 90 17 219 -33
3234 -33 -182 108 -13 63 -220 -13 97 -121 257 -280 71 28 113 -155 9 -78 -42 188 161 -50 42 -22 155
3257 155 -26 17 -227 -16 89 -83 67 -284 -260 -50 -167 -130 133 110 56 10 -99 106 -71 -144 238 -117
3279 -117 83 -114 -65 -104 90 -43 -6 -405 -43 -10 -128 -3 225 113 -173 35 -50 25 -108 -32 -190 107
3301 107 -12 63 292 -60 -45 151 -233 -416 128 0 -156 85 -54 -183 15 242 -58 284 -151 82 211
3322 211 138 -29 143 -102 -131 89 43 91 140 278 -42 33 66 26 -279 -51 -182 -139 82 160 159 54 8 -21 149
3347A49%k61K26j57L00k06J13l8k3L8k07p4O1p1K81o3j32J07q3q1K86j48J32j39
3371A0Kl4qK06m23J28J34j28K63j19k03J40jp7p0L33q1k74J79K23k87N2K64k74
3395d5q3J29m8J52p4j31J42k05J65O0j98J34J61k12J86m08M10N50n58r8O73n14
3417A88k84j51K68l77J59l33K31O5M4K93l50M67l81k5J26J60k35K76M2lk5j62
3439gj70L57l38L13j18M7O9j3j26O3j26Q0k1k57J64Q9J16k76NL44l41q5k6K99
3463D2j80K07K4m4L5q0j0m3J05M5m5j52J27R4l65J28K27k81J80k03P4M2L24j80
3487G1o4L39l06L72m68K43j16k98J90k6J37p5O2j85K56m5L6p9j90J21j4J87j93
3510d5M2J16l03K7R1K29j74j8P9N9j56J84j22n2J97p0q7j40J35k25J40J07K73
$$ plain form
3347 149 149 -112 114 -43 257 51 164 126 103 141 -66 -140 -79 -150 131 68 -64 43 -40 -121 165 17 149 10
3371 10 12 -22 -30 176 -247 -119 15 -113 150 31 -172 -32 -33 -110 -180 153 72 -202 -23 200 -87 -35 229 -45
3395 -45 -128 1 -47 105 31 -100 42 -163 2 62 -136 -2 159 -53 133 -275 135 685 127 29 702 188
3417 188 -96 -247 21 -356 -197 -530 -299 -234 -190 103 -247 220 -161 -186 -60 100 -135 141 183 180 155 -7
3439 -7 -177 180 -158 155 37 84 153 140 14 77 -49 31 10 -247 -83 6 122 -154 -149 195 -146 -231 -257 42
3463 42 -138 69 93 49 84 4 -6 -49 56 101 56 -96 31 125 -240 -112 115 -166 14 -189 -115 -73 251 71
3487 71 7 346 40 412 -56 187 71 -227 -37 -63 74 -1 61 -124 132 87 123 44 -146 -25 -39 148 -45
3510 -45 -3 113 -190 -163 -72 157 -17 -35 44 103 -53 131 9 -43 154 84 -3 -143 -8 -233 -93 14 287
3533B87j18j89mR5n7N8j42k8Q3r0m8l9K46p5J30p6J08m8l0l81M09j34P0p2Q0o1
3559b6j67L09M8qj07K6l07M04k73j14L19j52L24k13p2O1q0l5L0K19j38lP4R5l58
3584a44K50m1n6M7j71RJ33j43P2K6K3P8k95L34l20M56l34J00l44K30K03m6J04
3607A71k26j99J61J80j6M9j08L9k75J93P7K7K3n8ml4j0L43k35p8l0O5o2n6n0K26
3633A13N3k56O0k8m0l4J2M2K19k68J44J08kj51J37j6JJ36m4k68K99l24J44P4q7
3658B4j53M7m9L34m99J67Q1j3O7L2J62j95J27l57K98j34K15j27q0q4K60j61j4
3681e2J96j18j35L57r9J7j27j84n2K86k73J59O8K01l76O0K81q6m01K31Oj9n0J5
3705i5m2J79L3j94J70q3J86l46K03J04k47j5J38j95L43r8J69l17Q9K69k41K05
$$ plain form
3533 287 169 -20 -24 71 14 72 -70 -98 -15 -105 -153 -192 54 -21 109 33 141 93 63 -318 91 -43 27 -45 35 -26
3559 -26 -193 116 164 156 49 75 -232 172 -101 -215 104 -48 276 63 -9 52 -28 -63 -33 186 48 45 119 214 -144
3584 -144 106 65 9 56 -115 -106 27 -116 -44 -18 5 83 -212 122 -198 258 -76 24 -320 -90 113 67 171
3607 171 -55 -254 -93 87 71 120 12 51 -224 -31 46 73 96 38 34 0 -10 333 98 20 -10 55 -7 -63 -113 113
3633 113 166 -90 -30 -58 -98 -132 -120 -78 141 -127 17 125 123 -28 109 93 94 230 186 -82 217 -107 37 111 24
3658 24 -129 -82 -131 203 -296 -129 -48 -61 6 38 200 5 132 -225 73 -61 154 27 -53 -137 123 -38 -52
3681 -52 144 26 -109 248 149 166 39 -145 -197 89 -184 -25 43 244 -132 -72 209 123 -278 -47 -41 -60 -110 -95
3705 -95 -137 42 75 -119 51 -32 154 -192 11 115 -132 -147 -9 -204 139 41 210 -107 -18 251 10 215
3727B15k50K1j60K78O5k39J61l93L57m3M4j13k36K51J77Q2l26J91m4p5j3R0j08
3750f8K25j95K26k09q7j33L35k42N6rL3M21m81K22Q2j27K63o9j99L4J3n9J09j02
3774C9J65l9p8l36k9K70j65K24j87K14k30Q8m9K77k76M8J76j5l93K24J63p7oj53
3798a45L77L1j85l2p5J8K88k33P9j67L52j88J4k26K25p9M1j66J27L1j30j5L03
3821B45j46j23J95r9qj15r9P9J83j18p6J00PK2j87K03J4k5l39LM27j51j43J42
3845io4k01N08k95Q8j92J72k53K63k6q8K81k98J17J97j9r5QJ05j97j30M42j96
3868A18n1j54J50R3k27j4LM1m4Q3pJ41k90K11j14O1R9j13JK2N6j07L59l91O9j54
3894a59R0j52L09j45q9M31k32j33P2K20j51j78J52K6o9Rk1P4j23K8m0J57p0k3
$$ plain form
3727 215 -35 -14 -174 104 169 -70 91 -302 55 12 56 -57 -293 -42 135 217 -109 82 38 -37 -50 40 -68
3750 -68 157 -38 188 -21 -108 -241 94 -148 -92 -101 -68 353 -128 94 176 49 312 243 44 78 91 32 141 39
3774 39 204 165 87 -249 -278 -8 -173 51 -136 78 -152 -64 -113 164 -112 -64 112 97 -296 -72 91 14 8 -145
3798 -145 232 263 78 46 -29 -11 277 44 123 -44 308 120 134 -92 133 54 95 -71 56 87 -43 -58 245
3821 245 99 -24 171 72 64 -51 -150 -71 112 -6 -82 18 25 47 -140 63 77 52 -287 -284 143 -8 -151 -9
3845 -9 -73 -274 234 -61 27 -165 7 -246 17 -9 -97 184 -114 3 200 181 86 94 199 2 -128 314 118
3868 118 67 -87 63 156 -71 -85 -82 -41 -85 -2 -9 132 -158 53 -61 0 99 -14 -13 9 65 -42 317 -74 -5 -159
3894 -159 -69 -221 88 -57 -146 285 53 -80 -8 212 61 -117 35 61 -8 1 -20 54 -69 -41 -81 76 6 -17
3918a7O2r0q0K22k13K06j4k40J08J46p8K6r7j31L22l1o4J4J3k2Op7kj98K9J36
3944f4J43k30J26K55k00N7k09K26l71L49k0Q5j47k27j00J47KQ8J33K21k72J12
3966A04R1l20R4l9O4%k40L13K18k18nj35p4OJ76R0j52J02J21j42R3m92K28l3J34
3991a6n7J65j69O8m3j29J37J2j74K98J25p2l07K37k1k72K38n7J91k21j33K14L0
4014D4K6M2m2R6J3n0k9J67j84J8J35j69J3l16M06p5j38j60M0M8MJ51mj47j43N20
4040B66l75K48k84Q0j3L35m86K05J44O3m6k67K97m1l2j5J36J4l0K6j88j18J04
4063B3j38M4J13j70k6L77j03k15J48J31kk03m1K52j31j01J33l58j3J98J56o3m4
4086c3K25j56P8k77R2J7q1K46m23J93J04K40j68l57J91J57P5L8j18Q1l62J68k0
$$ plain form
3918 -17 45 -45 -125 97 -116 90 76 -164 -56 90 12 38 -59 -190 132 101 37 51 64 42 48 -29 -31 -229 -200 -64
3944 -64 79 -151 -25 230 30 87 -122 104 -267 82 62 147 0 -227 -327 -180 -178 -90 43 264 -8 104
3966 104 195 -125 -31 -70 -6 -6 -246 67 285 67 62 -73 -147 -141 35 125 -27 75 196 54 147 -345 -117 -150 -16
3991 -16 -73 92 -77 -9 -52 -181 -44 -32 -206 92 217 145 -162 75 54 -218 20 -37 154 -67 -200 14 44
4014 44 70 112 70 166 179 129 100 267 83 101 236 67 80 -236 170 95 -43 -203 -163 -115 -111 40 36 -111 -254 266
4040 266 -109 139 -145 -65 -78 257 -229 -24 120 183 137 -130 167 126 94 79 215 229 199 225 37 -81 23
4063 23 -115 -71 42 -128 -154 223 120 -95 53 184 182 -21 -62 190 59 -42 91 -267 -280 -82 74 11 -33
4086 -33 192 36 114 -163 -71 -54 -135 111 -312 -119 -15 225 57 -300 -109 48 123 161 43 124 -238 -70 -90
4109i0K09L3J3k40j07K57q6p8n8J07R5j82M9J9k5Q6j97k5K49P2k61K26p0J27j09
4134A4m5O3j87K69r3O3q1K65p5j28j50Q0K8j46Q8k9Q6K1j92O0O1J16j65O7j99
4159b09K94m0Q9j07Q6l40l0L87J4J4J3l2k64R8n7mK08j39J97k25QJ39j01O2j37
4184g6J99J72k19k42n3J29K08k6j98L33l5k40p2j78L89l02Q9L03k26J52MN1m1
4207A21M0n0K1j37Q6J17mj73l3Q9l29K02lqpk63M04j32J34P1k11k42M37j73L9
4232dj01J22j09L0K68k39P7K0k9r8j5j14K97k41K22k12RJ69k29k5K70j50o0L54
4256B12k40K35j72j56J37l5O2q1J83q2j38k8J67k01J78m3j47M14n5j32o2J88j65
4279C9Qj10K59nj31o9j0j8Q2k01J62M7j46Q6K09R7j96r7Q6q3J6k28J71k0m8K13
$$ plain form
4109 -90 119 152 165 -75 -182 75 -11 -89 -147 -40 55 -127 -78 -59 -84 2 -195 -220 29 101 -160 66 -4 123 14
4134 14 -31 32 -155 114 21 84 3 268 193 65 -85 -5 23 -123 -35 -64 22 43 -149 -89 -28 88 -77 -10 -209
4159 -209 85 45 134 27 113 -227 -257 130 144 158 171 139 -125 -27 -84 -88 120 -19 178 -47 -39 100 -1 61 -76
4184 -76 123 295 76 -166 -219 -90 118 92 -106 227 192 -48 -120 -298 91 -211 -122 181 -45 107 111 162 121
4207 121 161 111 132 -5 81 198 194 21 -12 77 -252 -50 -53 -61 -68 -331 73 -59 75 146 -65 -307 130 -43 -4
4232 -4 -105 17 -92 -62 206 -33 44 64 35 -63 -78 -192 105 -136 86 -126 -117 52 -177 -202 68 -82 -142 212
4256 212 -28 207 35 -121 16 -19 43 -38 145 63 -75 -103 64 -137 41 -2 -149 265 210 78 16 204 39
4279 39 47 -63 196 191 60 -9 -19 -37 45 -156 6 53 -93 -7 202 299 103 6 92 9 25 -203 -32 -52 -100 113
4305A13q7j94J46K48j15M1j91k1K10Rk58K10P4k86M3M7r6R9j11J26j75J96l03
4328b75K02J43j60r2J07l3J72j49m2J85N9o8J10j32k31M5O4J66k61L65k17J32
4350I0J5k73K6o3J55O8p0J01k9q0J9N3j17J49J09j99Q8J28j71r1L7RK36j58L1
4375F3j65J6L88l82K57k29Q2o3K94k32o3K21j28l00J52K9L34k21Q4k7j07L4j34
4398i7R6J46j62Q1j10J51OJ20j87j49k4J82j41J7p4M8n2M27m07J88r6J86j89L5
4422en4l2J27m0N3k76K12J89k7j16o2J7lL70n77M14m01J42K38k13n4K02J8o0j43
4447h1J3J55n2%j58Q0kN7q0K46o2R4l18J57k29K63K38l19R2k35P9j08J49l3J1
4472d3J76p1Q3Kk42J25j52L24k65Np8J84k18L36j29J3K52m26K09R5j96J8l40K25
$$ plain form
4305 113 26 -168 -22 226 111 152 -39 -60 150 159 -99 111 185 -101 -58 -11 -107 -8 -119 7 -168 28 -275
4328 -275 -73 70 -90 -182 -75 -108 64 -85 -127 58 117 49 159 27 -204 -159 -95 71 -190 175 -42 90
4350 90 105 -168 -142 -205 -50 18 -52 49 20 -60 -41 12 -105 44 153 -46 42 170 -1 -92 -55 -46 190 32 63
4375 63 -102 -86 302 -80 177 -52 30 -33 261 29 -34 187 59 -241 -89 -60 274 53 137 110 3 37 -97
4398 -97 -1 145 -17 64 -46 105 111 231 44 -105 -129 53 -88 -71 -145 -97 -149 278 -129 59 -37 149 -40 -5
4422 -5 -59 -91 36 -4 49 -227 -15 174 147 31 -31 -14 -17 353 -224 190 -211 -69 169 -44 -98 104 122 62 -81
4447 -81 -68 87 35 35 -123 -43 -45 12 -68 178 116 210 -108 49 -180 83 321 2 94 -141 -62 -170 -21 -54 -43
4472 -43 133 62 145 147 -95 30 -122 202 -63 -58 -136 48 -170 166 37 50 302 -124 85 180 -16 2 -338 -113
4496a13Q5J63j99K18Jq1j1L4q7j20L2J65j09M9J85k33P5P3r8j98J65o2j8J24P6
4521A16l62L09k2q2J77j16J9n2J54l94K83Q3l5k05L20k08j75L92r7J4nj58M0K7
4545B3k70L25j67M41k33L5K7k15J02p3q9L2R6q4q4N9J51k31J4J53m0J00j59J60
4569G3j74K5J08J69k23O9N9q6j21K20N4k16j14R8J56k5M3J25j00l9j79l3n2K60
4593I7k89J71k65J82K47k05J11K5l03L01J49M5j80k77M99k56j29J16r3o3%K19
4615A02J78l87J49R8r2j03p7J6R2L06j97j69J02j37N7J87l23L44j27M2n7j15J43
4638C2N6L4k30Q0J38m34K76J36o2j35p8L18j50j0J86k18J40j37J7j23RP8J02J23
4662A48q7j99J03J73k68J31j01M7J54j56J30r2jJ96n3j38q9LQ6P2o8N6m6j78K06
$$ plain form
4496 -113 -28 135 -64 154 155 74 63 97 10 -110 -78 87 -22 27 212 -21 54 127 29 -169 -4 -66 -84 40 116
4521 116 -246 63 41 -41 136 20 39 -13 141 -253 30 113 78 -127 193 -15 -190 202 105 119 114 -44 -4 23
4545 23 -247 78 -89 352 119 154 181 -34 68 -5 -94 -62 34 -50 -134 -75 76 -155 -141 12 -28 72 -87 73
4569 73 -101 -76 32 201 -22 47 106 20 -101 119 173 -43 -157 -59 97 72 115 240 140 101 -78 -111 -163 97
4593 97 -192 -21 -286 -104 143 -62 49 74 -229 72 221 266 86 -191 308 52 -77 39 -54 -117 -117 102
4615 102 280 -107 42 140 48 -55 -132 -116 -24 282 85 -84 18 -119 -62 125 -198 146 19 61 4 -111 32
4638 32 88 122 -108 -28 110 -324 -48 88 26 -109 -187 131 -19 -29 157 -61 79 -58 -41 -164 -155 -77 25 148
4662 148 61 -138 -35 138 -130 1 -100 -53 101 -55 75 -17 -18 178 125 -13 -102 -99 -13 59 -9 47 1 -177 29
4687B9j0N0L18k38n7k08J87Q6j18l2J0K4k48K15m8J80j06J42o7K09k34j04K24
4710B04l13O9j33K2k0L1K00Q7n7Lj55J39N0j41o9J74p4n6J77k52N1K2n0o8K2Q0
4736e7J96k69J2j0n7J91m9Mj89J19N02l84j44L29j21k70O6L59l38L4Pr1Q8j24
4760a96K27J03j72q3J85K6k97j49L73j06J48p7m0P1j21j02L45j03j26J95j71o0
4782a30K15n7P8j25K21q2n6j24Q6o0np2M3L11j6j01m4j49K23M6j62q8K02j35J15
4807A34j16K03l23J11k83M66l46J69k84M18j7k99J88j10J11N3l1pL8k13L51k29
4829a6j64J82P7l75K37J85k76J70J25L0k92J59p7J1j4K57l17k3K49j77q7K58J00
4852B22j16mO3L5l44j9K5J63J22N2j65k02N8L03m4j13j7K5j44K3K17j94J48q4
$$ plain form
4687 29 19 69 387 149 92 -116 71 157 39 7 17 41 -207 8 -40 140 34 176 109 318 84 -20 204
4710 204 -109 -40 -173 -151 -171 -140 60 147 90 93 -62 77 127 -14 -83 91 17 -39 138 -114 -63 -41 -91 -159 -137 -57
4736 -57 139 -130 -118 -128 -185 6 -43 -39 -228 -109 393 9 -135 194 73 -197 -131 228 -110 -76 -69 -160 -72 -196
4760 -196 31 134 -38 -121 64 90 -207 -356 17 -89 59 -18 -58 13 -108 -210 135 32 -94 101 -70 -130
4782 -130 85 28 106 -19 202 120 64 -60 26 -34 -39 -111 -68 243 227 126 82 -67 156 202 40 -48 154 19 134
4807 134 18 221 -102 9 -274 192 -154 15 -269 149 132 -167 21 -89 22 75 44 37 75 -138 213 -16
4829 -16 -180 2 79 -296 -59 126 -150 20 145 175 -117 42 -35 -24 -38 219 -98 -121 128 -49 -136 122 222
4852 222 106 102 165 200 -144 -163 -138 25 147 199 34 -168 -110 193 149 36 19 44 -100 -77 140 -54 94 10
4876A0J08o1k76M03j52l0jq5R3l42K09P0O2K6q2M8n0J07j14J1j1L11j76j1qL3
4902I2j20L03M8k48k15K15J34O0l89m1K86q2o9M9K87n74K99O7j70j56K74Q4l04
4925a70J46J97j62k84K54J20L7k94K67j13M7m0k6j11N1O5O1J12j32J04k40J13
4947BN1k00P9J70l5O2q4j33K94j74L0n8J37l22M02k93J11j01J04l58R8K47ML1
4971F4l8k8K43k30l8k7J25n0r3j02K21q7KL1J04j28K4K04j78L8r9J38j10L04l89
4996i9k9j7J04p9L26l28J58j20J63Mp9J53r8J85k04k58J86k32L44j43OJ75l63
5019b45Q6J04j09K04J89k25j48l0J90L0K07p2j19j91pPPJ97R7k51o7K27j66l9
5043a24K27Oj94p5J15p1O0K1j9K46j47l1Lm0n5L77l97RJ77j56o1P6J42J1j27j14
$$ plain form
4876 10 118 57 -219 184 32 2 1 -84 9 -333 -124 -54 8 34 -48 0 -50 57 -57 -46 -57 254 78 67 59 92
4902 92 -28 275 323 75 -140 75 209 269 -120 -161 125 43 -26 23 310 -264 35 102 -68 -224 50 134 -170
4925 -170 -24 173 11 -273 -19 101 138 -156 111 -2 45 5 -21 -132 -81 -16 45 157 25 129 -111 2
4947 2 53 -147 -68 102 67 129 45 -88 206 32 62 4 141 -181 221 -72 39 -62 42 -316 -218 29 33 64
4971 64 26 -2 241 11 -27 -54 71 21 -72 -174 47 -40 -38 -7 97 -31 -7 197 19 57 -42 96 -14 290 -99
4996 -99 -128 -145 -41 -120 206 -122 36 -84 79 83 4 157 59 244 40 -218 -32 -264 80 -63 -57 118 -245
5019 -245 -159 -55 -164 40 229 4 -144 -174 16 46 253 181 62 -129 -136 -129 -122 75 172 -79 -146 81 -85 -124
5043 -124 103 109 -85 -160 -45 -116 -56 -35 -54 192 45 14 17 -23 -78 299 -98 -89 88 -68 -129 -53 89 100 -27 -141
5069a41q4J88K92l6j95N9j23N9K47j82n4nK78j75p4k7k32J04J48Mm2K36j95q5
5093c5j11K63Q4k02l50J99K01K5j7q0J55k72M7J05n9j2K24j83j43L7J54j87r5
5116b52K49j15L98m06K21j36K71j52L9J63k49m8p2K01j17j82K33k15K95O2k08
5137b0N4oO4J27k5l70K44k80K46L5l0j22J3r5J93Q1%k8q3O3q0l1n0j00L06k02
5163i6r1J2R9p4M77k33o6O7l99N08k28K38j42Q3q5j10O0J48k08p8O8J5Q0k15J20
5188e0k6LkL18l19O4l5O7k29mK73m9k19J76nPO7j87O2R0k14K62k2jR5r8J85k05
5216Dj62J93k2J14j98L8K14j56j40O7k13L55rr3J12l66K12r8N8J66j7o1m3J87
5240A42m09L26R5j50m1L9k32L53m7j72K08j23QP2O4l66P5l6K59q5J17J96l41R3
$$ plain form
5069 -141 -225 -37 255 219 24 83 -40 19 266 84 30 25 303 128 54 27 -205 -101 47 51 9 245 50 -35
5093 -35 -146 117 201 -1 -351 -152 49 74 57 -23 132 -140 -93 12 -47 -59 165 -18 -161 -124 30 -157 -252
5116 -252 -3 -118 280 -126 95 -41 230 78 117 280 31 -17 -89 112 -5 -187 46 -169 126 188 -20
5137 -20 34 28 92 219 194 -176 68 -212 34 69 39 -83 -70 -165 28 109 109 81 -2 61 -19 -50 -100 -200 106 -96
5163 -96 -187 -175 -76 -150 327 94 28 95 -304 204 -24 214 72 155 70 -40 20 168 -40 -118 -50 -35 45 -170 -50
5188 -50 -76 -73 -75 243 -76 -12 -47 20 -209 -213 60 11 -208 -32 -37 -30 37 -150 -88 2 -212 50 28 27 122 24 209 4
5216 4 -158 35 13 127 -71 -33 181 25 -115 -48 -261 94 85 -8 104 -262 -50 -148 -90 76 59 -2 -45 142
5240 142 -267 59 154 4 -37 2 -230 123 76 -96 112 -11 -3 69 133 -233 -158 -194 65 -20 97 293 -48 45
5264D5j34n8L21j38O3J47j75ok04L21k81k5L1J14M5j48K4J26l56M43j56o8j4O6
5288a7l1k3J72j78L4J03k01L45j41J06l16J17k58J88NQ8o1J78p0j22J46K0k62
5311a78L8r0J19J64N7j97J69j18o9K13j83O2L0m8L68j90r6l23J42J72nJ88l94
5334a69J24k30J91M9j65J07L2K33l98K81J87q8j95kk8J37q0K10k97K13l8p3P2
5357G3j5rj9j12jJ92j78L23k97J41j53K25j72J3P7n9j78J47j21K15l4k46O6K59
5381A37j06j06K92m41N2O7K08j7l81R2Q4QJ35R6m4J7j71J7J41q0l2J15k16J33
5405@J96k01N6j09j5N8P6r6j6K90m62J87J35j46M5R1j9k15J59k3j0K6j31J37k06
5430a93L1J53J74j81k59J46K49j08l10J82N0J50j45J08j40Q4L25m43K17n6J41
$$ plain form
5264 45 -89 -147 174 36 99 246 71 65 -139 182 -99 -124 -93 21 66 -82 -58 68 -288 155 -1 -69 -83 -17
5288 -17 -48 -71 101 -77 -43 60 -141 204 63 169 -147 -30 -288 -100 -95 -7 -68 110 40 -82 64 84 -178
5311 -178 -140 -230 -111 53 110 -87 82 -36 -105 108 -75 -13 17 -31 337 147 51 -272 -130 42 37 225 -169
5334 -169 -45 -275 -84 -35 -200 -93 -61 172 -226 55 242 154 -41 -43 -71 66 -14 196 -101 112 74 1 73
5357 73 58 49 30 -82 -83 109 -69 254 -43 98 -55 170 -2 11 88 29 -149 -2 -123 92 58 -188 -122 137
5381 137 31 -75 217 -224 -172 -105 103 86 -295 -203 -119 -111 24 120 76 93 -78 -61 80 0 -32 83 -133 0
5405 0 196 -5 51 -58 -73 -15 61 -35 -51 239 -223 -36 99 -47 -2 89 70 -145 14 -9 -19 7 -124 13 -193
5430 -193 -162 -9 165 -16 -275 -129 120 12 -298 -116 -66 84 -61 47 -93 -9 316 -127 90 34 175
5451A75j07r0K33k40N8n3J09p5m1n8K33nk79J86j38J28P3j27k59L77j32N8R8j48
5475b4L5M3q7r4L7K00l5p7j49J57l19N27l72R0l2j80M73m00M21j40l39J72K29
5498A36l35K87M6k12J79j10K1J67ol15NQ0N5P2j14R3k36K78k53k9J35J7Q0J63
5522B04m91L00p9j54N0J51oj85K07O6r8n8K55j64J26j53n3O7o6n4O7l4K04m1q8
5547b7m6j7nJ22P7k02K28q7j5K6j07j01q9M20j48j94M51l10r5M3nP3L2m4K0J17
5573A17o6pj82K81j99Lq8P2J50l46K33j3j93K66j59J50j6j57K92k59q2M20k44
5596b7o3R7p4r2rJ82p0J31Kk5%j71K39j11o4J34q0J7P7O9j67N4q2j5L07k11j35
5623h7J49j18k61M98k34K13K0j37J44j83J24k53J52l2M0J35j22m9j28L58k10Q2
$$ plain form
5451 175 68 -22 211 -29 29 -24 85 10 -31 -89 144 139 -140 46 -92 36 109 -18 -277 100 -32 26 124 -24
5475 -24 11 54 -33 -127 -90 110 75 -2 -151 6 -313 214 -158 -68 -100 -280 193 -207 214 74 -265 -93 136
5498 136 -199 88 134 -78 101 -9 12 179 173 -142 -137 -57 -2 70 -44 49 -187 91 -162 -191 -56 -39 41 204
5522 204 -287 13 -66 -220 -170 -19 -25 -210 -3 63 -35 -93 162 -2 124 -29 -82 -15 -81 -135 -68 -102 102 61 -27
5547 -27 -73 -90 -95 27 104 -98 130 43 28 54 -53 -154 -243 177 29 -165 286 -24 -119 -76 -81 -8 24 -20 0 117
5573 117 51 44 -138 143 -56 -53 -141 -69 81 -265 -32 -45 -238 28 -131 19 3 -154 138 -121 -203 217 -27
5596 -27 -90 7 -67 -159 -168 14 -56 75 77 52 52 -119 120 9 -55 79 -1 16 93 162 -5 49 -33 -48 259 48 -87
5623 -87 62 -56 -317 181 -53 160 180 43 187 4 128 -125 27 -5 35 170 48 -1 -129 229 19 101
5645A01P2j37j43J47k10K83k12K34j58QkL70j91j92R4R8j65n7J56k13J02K55k25
5668A5p6L2k86N90k46Oo4N6J16j58J01M9q2k11K12O1K20j66m01M01k9k78J11j54
5692a81J84j25j32R7L27j88J11m87N64r8qj03Q5k51K36K38k48J74l11O7P6jj37
5715a11J90J01k78pJ45M8k33N36m43J18p1p2j52L06j79r2N3j83L74r4j14R6j3
5738g5K37k86K05j23M6j39J79j4K67m57PK95l17J34N4K07j49j09j00J14l21J42
5760b03K37%r5n1l4J08j03K84k67j01J35J07M9m0Qk21J79km9K64k03j49K31P7
5784A61j89P3J14j99J44J29k63Np7%J51r2m1J50l4p8k35J68J5L15l01j43K21J76
5808A70j07k7j99M0LK0J03j27K65J2j41n3P4J16l56L72P3l73K82l32L48N1k40
$$ plain form
5645 101 173 36 -107 40 -170 113 -99 135 -23 -15 -17 353 162 -30 64 162 -3 -60 96 -117 -15 240 15
5668 15 -61 -29 -315 275 29 35 -29 27 143 -15 86 135 53 -158 54 115 335 169 -232 169 140 -138 -27 -181
5692 -181 3 -122 -254 -157 170 -18 93 -394 170 72 64 -39 46 -205 31 269 21 195 -116 -49 27 26 -111
5715 -111 79 180 -98 -105 40 88 -145 391 -52 66 -5 -77 -229 77 -102 -194 -141 -324 50 -44 -158 -62 -75
5738 -75 162 -124 81 -42 4 -135 44 30 297 -160 -153 142 -175 -41 13 220 71 -38 -138 -24 -345 -203
5760 -203 34 34 -61 -112 -146 -38 -141 143 -124 -225 -90 17 66 26 34 -187 -8 -10 -59 205 2 -147 84 161
5784 161 -28 45 159 -40 104 233 -30 -25 -102 -102 49 -43 -84 66 32 -46 -281 -113 -98 217 -84 -227 -6 170
5808 170 63 36 -163 -123 -120 -100 3 -124 141 153 12 -41 33 149 -207 165 238 -135 147 -185 163 214 -26
5831b6K8J41j82R5r5P9j00K25l96M06k60J67R1j87j85M55l18J97k6K1r2ol0k5
5855b3j48L76q7k34p6J29rp1K13l38M75k38n1J92k37P7r8K28K2k35j23N15j42
5878A17k37j75P7K71j39K20kL2j91K05r5j85J31J4k2J6k03K08Oj5l8J69m22K41
5902a7Q3l59L21n3j01J76j14J89p8l53K47L9j19J57K4J0Q7j28j09J6J80l80L28
5925D6m6j72K34Q9p2k1r5J86j28l5J63j58n3J53J45m32K60J12k54P4j8q0J51p7
5949b8j02J84J59k03p8Q3l0k47K27L57j47r3QK0j55j86L5K98k44K0K00j42K54
5972A90l83N5K33k45o0K56j44L28k18Kj1j30N3l1J39J1k11n7L3l2L40j59j4J18
5996F3k02J17n3rj18r7N30l86Q8LJ09q3R3j25J42j68J34P5j47K42j8k14R7JR0
$$ plain form
5831 -26 2 143 -39 56 -39 40 -60 165 -231 175 -85 82 173 -14 -199 256 -62 135 109 130 38 32 2 -23
5855 -23 -171 205 118 -116 -192 -63 -72 -143 70 -268 207 -31 -82 110 -127 -50 -148 80 102 -133 -256 259 117
5878 117 -120 -295 -218 53 -86 134 132 164 -27 178 83 -102 29 43 21 37 -166 42 48 33 -5 164 -258 -17
5902 -17 66 -293 28 -25 -126 50 -64 125 47 -306 -59 -20 -139 18 42 52 139 11 -98 -82 98 -282 46
5925 46 0 -172 62 151 79 58 -37 149 21 -14 149 -9 -62 91 236 -196 64 176 -78 -4 -22 -102 49 -28
5949 -28 -130 54 213 10 -68 15 -15 -262 -35 322 175 82 90 110 -45 -231 -196 102 -142 -122 78 -64 190
5972 190 -193 -138 95 -150 -210 46 -98 230 12 14 3 -127 -74 -105 34 45 -166 -223 -190 -222 118 -41 -55 63
5996 63 -139 -22 -75 -84 -202 -299 231 -155 -67 -64 45 -38 55 -70 72 -96 38 113 -34 208 190 -24 73 74 164
6021A64q4k86K92k5j53k6Q1K4Q5J00m3j57J41p5R5j69J23p6n6R9j15M0J53j59
6045b7L0lP6j82p8L59K0n8j41J25J64m37K59k78L1O4q7L33k99J25m6o9K31k16
6069a04N2J42pj88J03J82N1j12R2k7j16N6J86m23J90l4k5j36j9J13J69k38N5M0
6093Bm1n7R1N2O3j92P1M1j54K17Mj91L37k34n0j83J57KJ26J4O6m02J15K05k6O2
6119I5k07Q8J57J3k18r4RJ25q6O8N1J96N1j16j11Q8k63L88n4k88j7K07P8l0j39
6144ir9p1M3P2J80o7l0J80k99RK5o6K32j36K70m29K83N0j64N6k2M0r9J82l47J29
6170h7JJ92l4J14k76n4K51j93j2p4L02R2l57M5Q1p9j30j9L90j75j69J25N3o0O
6195f7L8LK14j87Q2k12J2K33l27K13k02K62j91J76j41L20m03K73J06l56P9R4R4
$$ plain form
6021 164 80 -206 86 61 -92 -118 -37 -13 72 172 129 -28 113 38 133 -36 87 11 -45 54 -61 -21 132 -27
6045 -27 3 0 76 -106 -184 175 195 137 -4 121 285 -152 107 -171 -140 -76 -163 170 -129 -4 -50 -119 112 -104
6069 -104 -52 90 83 -105 -2 180 231 119 211 184 68 124 310 -113 77 43 18 -118 -137 -24 145 -93 -38 2
6093 2 -39 -96 -5 47 110 -82 -11 30 -124 93 97 -94 243 9 -41 -224 -67 -65 61 75 141 -261 -146 59 33 95
6119 95 -112 -24 133 146 -72 -166 -157 -32 -118 -50 1 197 248 132 21 109 -154 234 180 -108 -125 82 160 130 -9
6144 -9 -108 -179 -136 -64 116 49 19 199 -100 -91 -66 -132 100 -36 234 -195 88 138 -26 30 8 48 -51 131 -216 -87
6170 -87 -86 106 72 186 -90 -144 107 -86 -98 -172 130 222 -135 -90 -9 -88 -218 -237 153 -22 -191 -66 -13 -73 -67
6195 -67 -29 -26 188 1 83 -129 -117 116 -211 2 -200 62 -129 47 -94 226 -177 96 202 -154 -75 19 113
6218A13m13L79l42K80j17K49k16q9N6j40J21J14J72k79K17k78J44j05R4J1J03
6239G4J48l80K06rP7k28m4K03J80k97J06N1j65J74O0k50J24j91K50l67L75j11
6261a4J40j73l47L71oj24j66N26l48K22j46K61k21l9k4J02q9J40k1k47K61n63
6283e05N63J53j10n8k12K42O0j28J63k2j45J13k22J17J50l6n4j67K11j31K5K05
6305B12k9k05J02k84L42r2k2p9pJ37j14L2j44K88j8j38l40L05q4J3O5J37m0q2
6329d5l4O3j57K2M9o5J03J72l8J07j76o2K9J39k44L28k28l9J32j23R1or4o7K11
6354F8J54n1k39K9QJK9J14j42Q7r1q3r7K07N3J28k52O5J57k26Q1j15q4L29k74
6379a44RK58k62J21j26J54Q4j03o9K11j82J45r0N2k20l7J62L1J14N0j94K29k62
$$ plain form
6218 113 -300 79 -263 17 -100 149 -67 -156 -100 -240 -119 -5 167 -112 105 -173 -29 -134 -40 -29 74
6239 74 222 -158 48 39 116 -112 -156 47 227 -70 36 87 -78 96 156 -94 30 -161 89 -278 97 -14
6261 -14 126 -47 -394 -23 -29 -153 -319 207 -141 81 -65 196 -25 -64 -88 14 -75 65 44 -203 58 -505
6283 -505 58 211 101 43 -169 73 133 5 168 146 1 114 -108 9 159 123 69 -98 113 -18 7 212
6305 212 183 -22 80 -204 138 46 24 -55 -62 75 -39 -7 -151 137 119 -19 -359 -54 -138 -125 -60 77 37 -45
6329 -45 -79 -16 -173 -151 -102 -167 -64 108 70 177 1 -61 -32 107 -137 191 -37 -76 56 -67 24 18 -76 -143 68
6354 68 222 171 -68 -39 -31 -30 -1 113 -29 58 -33 -116 -213 -6 47 175 -77 -12 145 -81 0 -115 -199 130 -144
6379 -144 -135 123 -139 -18 -144 10 94 -9 -78 133 -49 96 6 58 -162 -199 -37 -6 108 158 -36 193 -69
6402f9Q9q4M03k63l69L96j93K32k16j4J34p8J19k11J96R3l12J77J39l49K19j03
6424f4%Q6j14O2J48k39P6j81K73k3r8K60j57j74J90k33R2P2L7j87K92qk16J45
6448C9lP8n4K3q6m9j1J63l5kj3om4j7p0K90l16j0m1J52o0M0R1j71J84p2K53j46
6476A07j71J49k3k6l05L66m3J6n9l59J30L02N5k08k27L98j30J98m70L29m4Q8J92
6499B65r3p4j32j07J01l2k29J93J23Kj30n5J38Q9L1r4J81k99L02p7r8Q3q2Q0k47
6524a61K10m5j30K05j17k48L13P6j27M9J52m51L74j75J57M2j53j26J77j40J62
6545D4L0j07J76J5P9P0l25q4m5j02J89K43j84P3k18K30j55K68l37R5J92j95j23
6568a71l9J83J40k4j42j98L12N2n0J06j63j92K52l1k1M5p2J95m3J05k26j43K10
$$ plain form
6402 -69 20 -64 339 76 -293 103 -90 142 -74 -88 46 -32 87 -124 72 165 -147 30 169 -180 39 -64
6424 -64 -64 22 -92 -30 118 -121 -45 -226 47 24 -74 186 29 -145 45 -188 -96 -24 13 -174 118 110 -106 39
6448 39 36 114 60 83 -3 -52 -63 100 65 63 50 44 0 -17 -87 203 -113 -123 -164 -12 -72 -32 59 -112 72 0 253 107
6476 107 -64 85 62 36 -269 97 54 70 11 -348 -218 84 139 -69 -296 102 -28 170 -300 29 -15 73 265
6499 265 172 98 -34 -141 -40 -72 -301 -108 15 17 -113 -168 -30 59 90 -4 177 -122 180 103 5 88 6 86 -161
6524 -161 49 4 -126 79 -38 -286 27 103 -24 25 177 -274 100 -75 82 124 -29 -155 22 -118 44
6545 44 74 -33 143 158 237 307 -18 -102 -147 -249 -60 183 -1 72 -146 84 -71 197 -140 -45 147 -48 -171
6568 -171 -210 -27 113 89 -53 -251 61 113 63 169 6 -186 66 35 14 59 -13 182 139 244 18 -125 85
6591H5k75J07K62k37k27L40j38N1J07j20L8N3O7l29R8m9L36j57J5l0j60K90K0
6614A47l38Q9J43k31J89J05k23J80r6o8Mo1R3J07j34K37M1j91l6pJ22k04P2n4
6638a14K5j18K29R1j80K3J50k69J75J64q5j76p9L93l64O6J20j81J47r9N7J89j29
6661C5k1K21N3j58k6J0j70J87j10k7r3k6J12J4j69J29P7P6j07k7j14M51j42K19
6685C94m88J53M6j83K02r9k6j24J33Oo4J30k6k20k3L32Q7k46j16R4k2o5J53j45
6709a17M9L94l82Q3o6M0m7J51M5J11l15j79K26J3J63l00J73L3q4j36J83n8n1N4
6733a7K33j90l5K9J89k63M5N5J35m1o2nm2L8J31j84L8k48j24K82J45k01J65m0
6757C3J2N7j24Q5j52LK02j42l4L95m36J47k4n4K53j71J44m41M37j74j25L50l48
$$ plain form
6591 85 -190 -83 179 -58 -285 55 -83 -32 75 -45 -7 46 113 -216 -118 -167 169 12 27 -3 -163 127 147
6614 147 -191 -102 41 -190 -1 104 -119 61 -35 -103 -99 -160 -67 40 -94 143 184 -7 -43 -50 72 -132 -60 -114
6638 -114 -89 -207 22 113 -67 -44 106 -163 12 176 91 -85 -164 229 -135 -69 51 -130 17 -82 -25 164 35
6661 35 14 235 288 130 104 114 -56 131 21 -6 -99 -125 -13 1 -168 -39 38 114 7 -20 -134 317 175 394
6685 394 -94 59 105 -78 124 25 -1 -125 8 14 -50 80 54 -166 -189 143 230 -16 -132 -38 -60 -125 28 -117
6709 -117 -68 326 -56 27 -39 1 -46 105 150 261 -54 -233 -7 6 169 -131 42 75 -9 -145 38 -20 -71 -17
6733 -17 216 26 -9 20 209 -54 -9 46 181 140 78 73 31 69 200 16 54 -194 -318 -36 109 -92 73 33
6757 33 45 102 -22 63 -89 -86 116 -26 -60 335 -101 46 22 -32 221 50 194 -247 190 16 -109 241 -107
6780a07K85j46j3q1L89k92q7J44l6JOJ3k63P9K4K30j97J66j48J31J52l44M8M3
6804cjk88L17j6j62J37r4J16L7oJ00l27K65k79J60R3j03O6p3J59j19p5J53M6J0
6829A13j86Q0%j70J45J65j89P6L7k77k0K04j86J36j95M20q1kk68L32j53M1K85
6852C07l02p5oJ02j19J35l4l2l0K88k01L9J49k16J47p5n7k16K90j14R9j44J27
6875F2J12Q4k09J5j24K3lM1K10k03k2p1k75N14j49n2k3R7N8R7k0k11j4J03M5l66
6901b81L58j76j4K4P7N4o5J01k33j1J25J17j91O1Q4N6R1m8M6j55Q6k11J43J95
6925B33r6k97P2J51Q3k1K1k50K91l89P8J86J48r8p4K1P8j98K39k08k36J40M65
6948C39l57M9N7j36J76j33O4j64K12l05L26N8j65m4p2r3J37K1k32K69j02K8K21
$$ plain form
6780 -107 178 32 19 -62 327 35 -52 92 56 57 63 76 -187 -108 -84 146 -51 115 -33 98 250 -94 -46 -3
6804 -3 -4 -292 25 9 -153 -16 -110 6 43 37 137 -190 75 -204 -44 49 -54 12 -61 98 -21 -96 57 103 113
6829 113 -73 7 7 -163 -18 147 -42 34 71 -206 -226 -22 -208 -72 -267 153 72 70 -198 134 -19 22 307
6852 307 5 -70 -76 26 -93 42 8 -24 -54 234 33 72 221 5 152 77 20 -196 94 -20 79 -65 62
6875 62 174 258 49 64 -60 -37 -40 1 211 8 -14 -85 -360 154 5 -47 -70 27 85 182 162 -49 -63 40 85 -281
6901 -281 77 -99 -113 -89 -12 42 -23 78 -155 -166 -41 76 -115 -54 30 86 177 129 175 20 106 -105 38 233
6925 233 137 -160 -88 63 146 125 146 -104 187 -202 -124 62 210 112 38 59 137 -61 178 -30 -266 -126 339
6948 339 -18 31 88 -48 128 -5 59 -105 107 -198 128 186 21 -23 -95 -188 -51 -30 -262 7 -95 -67 154
6971A54l05N2J73j97J29k62K35J3J0j13r0L37j15o6j86L09j69n0K51j94m7K9O8
6994c4N3k15L37j16J98k46p2K09n0j50K05o8Q4l50K86j20J53Q3l89L19p6k61L43
7017A23J28l31k70L83Q8p8J87l00K30k03J6Q0j36P2K50k95K42k3n2j21k87P06
7039D09l96n8j5J21L8j08p4J09p9J79j68P9j05J6p7K79j75J62j90L4K13j0k15
7062c1J49j92n6L73l42M3K6J5j21K30k16J80M1r8J35N0k36M24m66R7j39R6k8L36
7086B70n40L34k25N9K72k27J19j54K79m63M91k58J93k37j00P2O3j39M31l67j40
7107b67L67k09J4q0K1M2l8J3K94k07K0J2r2K21j25q8J19l0qj35J59n9j98J69J19
7132C4r7j05p0L54j14j01O9J67Lj11n9J03l06J53J90j87L8j38J95J34o1o7j65
$$ plain form
6971 154 -151 -99 74 -123 6 -256 -21 -8 2 -111 -201 136 21 -45 -231 78 -91 -141 110 -84 -131 -102 -34
6994 -34 19 -196 141 25 223 -23 -95 114 64 -86 119 51 135 -215 71 -49 104 187 -202 117 41 -220 123
7017 123 251 -80 -350 33 121 43 230 -70 160 -43 -27 53 -83 -11 239 -56 186 163 111 -10 -297 409
7039 409 13 -45 -60 61 99 -9 -83 26 -53 126 -42 37 -68 -52 -129 150 -25 137 -53 -19 194 184 -31
7062 -31 118 -74 -130 243 -99 -56 -30 -15 -136 94 -122 58 99 1 136 186 -50 374 -92 5 -134 -38 -66 270
7086 270 -270 64 -161 -102 170 -57 62 -92 187 -276 215 -43 150 -87 -187 -115 -52 -191 240 -127 -267
7107 -267 100 -109 -95 -175 -154 -112 -150 -137 157 -50 -30 -18 -110 111 -14 -102 17 -13 -21 -156 3 -56 -254 -85 34
7132 34 -63 -168 -238 116 2 -99 -30 137 140 29 -30 73 -233 -80 110 -77 -39 -177 18 152 91 24 -141
7155a41K72p5Ok64K32j34NO7Q3r2L01j81j99J00P7q5J15j96K04M5q2O6j17J54
7179A61r9k4j39O1J15k96K85O9J68m33J00J86j57j7J05j68M3j8R8J02l1j94k74
7202c57K75J23k6M4Q9k16R8k42L33j44j49R7M14n12J28M7RJ4j18l5J75r8j95L67
7226A21j80K40k20p1K51j81k22K38j3J39K1N1m3j15Kl2J70k83J49j3Q4j45o4j50
7250b66L08mq4J66l29P4J46j07l0N9J00M8k31J98N8R7j14p2Rm0j28K45j55K6o1
7275h7L2J36N0j89J67l29j3J56J3o1K44j74J09k6N1J00q1j01k10L66j19q7K05
7298A52O5k70k62L44n7J75j20o9P6J01n2p9jJ02k10lO1q2K54j32L5J81n4k36j55
7323b36J65m7%L8p5P0J53q8j00j1M4L8K40l99M37l24K22q9L7R1k72p8J76o8J38
$$ plain form
7155 -141 131 56 62 -202 30 -104 -99 -32 51 -41 260 79 -120 -20 57 -28 87 -109 95 140 58 124 7 161
7179 161 62 38 -101 -40 75 -221 64 133 301 -132 -32 154 -3 -20 85 -83 -40 -58 40 142 111 -83 -357
7202 -357 -82 41 15 59 148 -68 30 -212 121 -23 -172 -75 339 -173 -45 2 11 25 -93 -128 47 -51 -246 121
7226 121 -59 181 -39 -110 141 -40 -262 -24 -37 102 123 174 131 16 18 -14 156 -127 22 9 93 -52 -116 -266
7250 -266 42 38 -46 120 -209 -135 11 -96 -126 -67 33 81 -150 48 106 203 89 17 26 -14 -142 103 -52 -26 -87
7275 -87 -55 81 131 -58 109 -220 -233 -77 -64 -125 119 -55 54 28 79 179 98 -3 -213 153 34 -53 152
7298 152 217 -53 -315 29 -28 147 27 -42 34 135 83 4 3 105 -105 -108 -47 -129 125 -7 28 209 155 -81 -236
7323 -236 -71 -118 -118 -80 -155 -85 68 -20 -120 -131 -87 -49 191 -208 229 -95 127 38 75 166 -106 -184 -8 -76 62
7348F2l2k68L55K9n9k0k00L9L32j93R2l16K66k40J5J83Nr0J97j33k06K62k25J74
7372B9J74k73K63k20k3P7J4R7j31L0j68J61j07K82k53m1j72N5K82k88L06q8J05
7395A11j77J94k78J36M4j23L3M8J25o9k46L06k21O5j14J08qJ97q1l76L17J40j50
7418a9k21K78k09J98j32pJ83j03J8o9J32j18J84j27k25P1j21K40q9O5J5n9O9K8
7442a8j11J55J63K6j68j22K7R7k82L0L56j82O1j67Q8P3K9j0q4N2j42M6k10L85
7466I2lj38N8J13J6k52J39J69j91j80L7q2L63m9k48K58q5K75k32J03P0k22o3n8
7490a10Q6K49j87O9J4K0j31p7K9P2J3o2j22O9N3J82Rk89J78%r2p7K32p3j14M8
7516a1j95K54j81K3j8J00J79l02K56J23m44P5J16Q4n1O0l9J09j07N0k55R7J67
$$ plain form
7348 62 30 -238 117 146 87 67 -133 -94 238 45 137 -179 87 -153 -138 45 50 -40 157 24 -182 80 -145 29
7372 29 203 -70 193 -27 -50 27 41 138 7 37 -131 30 -77 205 -48 -89 -261 -206 76 -212 94 6 111
7395 111 -66 128 -150 -14 30 -93 -60 -12 113 44 -202 104 -117 -52 -166 -58 -66 131 50 -326 -9 131 -19
7418 -19 -240 38 -171 27 -105 -112 71 -32 -14 -83 49 -69 115 -12 -237 -166 -287 -47 -136 -71 -56 -115 -46 -18
7442 -18 -129 26 189 215 47 -75 -48 49 -233 -203 153 -29 32 -135 -47 26 55 45 -39 13 -129 -83 -293 92
7466 92 89 -49 9 122 138 -114 25 194 3 -177 -140 -222 141 92 -156 102 17 292 60 163 233 11 -52 -110
7490 -110 -24 225 38 107 121 141 10 -67 -38 34 47 -15 -137 -68 -15 167 176 -113 65 65 -27 -104 128 55 -59 -11
7516 -11 -206 48 -133 -110 -128 -28 151 -151 105 228 -216 -141 -25 59 8 68 29 138 31 81 -174 -77 90
7539I0P1j58N6j48j55K34k3P0k7k91L97l9r6m6j7J88j43J09j41Q0o1j20J53L5
7563A8j39K9Q2M2j37N7K23j77K8n1J64l8m39K91j5k6K03L3k18K4n5K03l24K40
7587A8J4o0J67k11Q9r7P6qJ03j27o8K84r8j03j06J62R3j22o1J85k63p2J98J09
7611A02m2k53L88Q7q9k04j47K14r6j38J25N1o5q1K64l13K7K34j21J5k41N29k61
7634a5j11K55l24O4J35j8j71j3J38J86j6k24K5J89j56p7J53L0o4r3K77m00J51
7657g9K14j53J71l0J67o87M34k0O6P2j26n9L0J58J82j98Jj15j03J35M2o3r2O6
7681A3k08J96j80K92q3l14M76j30L0j83N1J79l14J19Q2J22k68M1L00j33o4J40
7703A64j75J29j24j55J41J24j09J31k15L50k47j19N9k4J58j67j2l3J76j52K15
$$ plain form
7539 90 161 3 59 -89 -244 -10 -33 37 10 -281 116 77 -19 -65 -82 106 -37 72 -69 11 -50 -170 -17 18
7563 18 -121 -92 -10 32 -105 -48 175 -2 26 -25 139 101 -338 -47 -62 -88 115 148 -70 -46 -101 102 -222 18
7587 18 32 -28 139 -72 17 -80 -4 -12 91 -36 -104 180 82 -21 -127 35 128 6 -55 130 -133 -205 -7 102
7611 102 60 -193 195 282 193 -11 -158 56 -40 -178 -53 -2 -67 -148 116 -197 -170 64 -57 -42 -283 246 -15
7634 -15 -126 129 -195 -131 4 -14 -185 -198 -60 126 110 -114 -89 100 -56 -133 20 50 -14 -107 170 -230 -79
7657 -79 135 -18 153 123 290 -397 37 17 83 155 29 -30 0 158 340 142 143 28 -75 60 102 39 -53 13
7681 13 -195 1 -179 113 30 -284 192 62 92 -91 -40 139 -175 -56 26 148 -120 -79 221 88 24 164
7703 164 -11 118 -6 -161 -20 104 -5 126 -89 261 14 -105 -46 -70 88 -79 -91 -124 52 -100 115
7724A15j43J45l05P6KO7J00o2k82K19k4L38l91K77j58j7K0K85k18K62n09KM07
7747B06l51K01J28l4l03K44l24K70j32l7R3Mj79J94p4q9J92j53J52k0o4q2K03
7770D5j33J03L55l81j8rP3l20L10l74L39k2M8j80M6O2n3K03m4j30j88L57Lk37
7794a45R5Q4O9r7j38J52J0j11j18J73J90m04J73j6J25j11P0J2O3m5J72j49K11
7817B65l36j43J86j78J87mL02l13j94J08J70k8m1J38m8L2k2k36K53n8N2rj47J06
7841D2J63k78pO1j85K48K38p5k53J07j10R7j35j13J85m1O0P9j0k77K74j47K77
7864B00k32o2R2P4m7n6n5P7j2k5L7p2j88L06J13k04J70p6j31k63M38j57k2mP2
7889b7r2O7K59J49j51m3M6j43j4K2j99L43l12LL5L0n8o5K60l68J66O1N8j54j06
$$ plain form
7724 115 -28 117 -188 -112 -110 -43 57 -5 -287 -68 -92 246 -145 132 -26 -43 -23 262 44 306 -203 -201 206
7747 206 -145 56 184 150 -153 91 -233 37 -95 -132 -39 -35 -214 -20 -94 -183 9 -144 8 -12 -76 -158 45
7770 45 -88 15 370 -11 -29 -38 35 -285 25 -349 -10 -32 16 -164 -118 -56 -109 94 50 -80 -268 89 92 -145
7794 -145 -50 34 103 6 -132 20 30 -81 -199 -26 164 -240 -67 -83 42 -69 1 13 76 31 203 54 265
7817 265 -71 -214 -28 -206 -19 -23 279 -34 -228 -120 50 22 -19 119 71 103 81 -155 98 40 92 83 -64 42
7841 42 205 -73 -80 -19 -204 44 282 207 -46 61 -49 48 -87 -200 -15 -56 4 83 73 -204 70 -77 200
7864 200 -32 -94 -2 72 25 -31 -86 -9 -21 -46 -9 -81 -269 37 150 -54 116 40 -91 -354 84 -73 -95 -99 -27
7889 -27 -119 -52 207 356 205 162 208 65 51 73 -126 217 -95 -92 -57 -27 -85 -150 110 -258 -92 -31 27 -127 -233
7914b33J59R1r8J81j32P8j24J78l16N29l79J08j41O9J67l31J76Qj02J79J30j46
7936E1l25J71J24k02P1l9J0M5M09k44j06k6R7Q5j12o5J54j41R3o6l5L3o8K56j34
7961C6qr9O2k7J03p1N4j21J36r9p6J23J91l41P1k3K15q5j46M3l2L09k56%r0K35
7987A04k17K71j24J30k04Q7m33O34l06J39j41j7K28n7k9o5P1j04K41m26K25q9
8009h2j14K81j40L1j18R9J9r7K04J02k31J14j93M1J81n4k11P1K26k10j96L48j63
8032i2P1j31J55J19j23j49J79j48J36j43J38r4J05l0j55J89j74J72q7r2N9m1L26
8055A90j59P7l4j23K50m5j43K28k50J24O0J0j19N1j07L9j11K35k25J77J4j31J0
8078A8J39j38Ok68L54N7j34J56n2k82J84J02p6j46r7J34J28j23K77j06J05q8j60
$$ plain form
7914 -233 -74 17 -81 100 -32 46 -78 100 -216 313 -66 42 -99 -30 137 -194 -18 -10 -112 67 197 51
7936 51 -274 -103 21 -181 -110 -149 -139 -94 315 71 -35 -61 36 121 9 -56 98 -43 50 -16 -51 -18 -86 170 36
7961 36 28 -71 -9 -36 67 -4 50 -71 65 -34 -110 13 204 -137 -66 -89 126 41 -105 -62 -94 215 -41 -41 -131 104
7987 104 -113 158 34 164 -40 47 -386 248 -58 81 -60 -77 151 94 65 0 71 -33 208 -218 7 -82
8009 -82 -196 85 -55 -24 -142 -43 -24 -121 83 185 -46 68 -125 -84 97 43 -168 -97 129 -81 -277 71 -92
8032 -92 -21 -152 3 122 -1 -150 29 -119 17 -126 12 -82 23 -7 -162 27 -147 25 -62 -154 -95 -136 190
8055 190 31 108 74 -49 201 156 13 241 -9 115 175 185 66 117 10 49 -62 173 -52 125 139 8 18
8078 18 157 19 25 -243 111 168 34 190 138 -144 40 142 66 -80 -177 -43 85 -38 239 133 238 150 -10
8101a0j31N0L5j4J65l32K65o2J05j0ol9Q0j09Q5j41P5M6r6J62k78J33o5j1K52
8126A49j47j00k2J74L8o5j89J29R1l06L22j3l03K16Or6j5J25K39K9j87p8J0j65
8150a58J12N4N3J62k05q1PK60k34J4J72k96R4M5p0q7K76J02j8k25%J4Q8J1j69
8175g9L6O1L34r8j45L4j5J23k13j81J85r2r0L76k65J43
$$ plain form
8101 -10 -141 -91 -56 -70 95 -237 28 -34 71 61 55 16 96 -13 72 -69 6 52 -44 118 -160 -27 -92 -103 149
8126 149 2 -98 -120 54 92 27 -162 -33 58 -248 74 61 -242 -26 -20 -116 -131 -6 233 262 75 -3 7 -158
8150 -158 -46 8 61 223 18 -63 -56 204 -30 -16 156 -140 -46 -1 -71 -158 118 220 202 -23 -23 -9 79 90 -79
8175 -79 -43 18 352 254 109 143 128 251 38 -143 42 -50 -140 236 -29 114
8191A14
$$ Imaginary data points
##PAGE= N=2
##DATA TABLE= (X++(I..I)), XYDATA
0@%%%%%%%%%%%%%%%%%%Oj4J6j6J6j6J8k6L2l3M0m7N2o0O9p8Q8r9J10j23J38j54
40h1J73j93K15k38K62k91L22l57L93m32M76n23N76o36P02p77Q61r57J070j200
60f35J356j545J780k084K492l073L969n563R277l8094p504M0657J3783R475o909
75A7382k749o346m557j1845p957k335J0931J5589J4910K522r110j8246j4874p161
89b3846K639N594P049Q745J2380J0503J883j0052j5349j2028l743L104O524O768
103A71O736M698L64n249q608r017n076J549P083J0086Q623L876j496n415n839
118B486p067o291l136K972P852R182N261o33m399n571n091l595j361J869M917
133b605O573N051J375k166n428o330m759r52K611M092M815L878J828q49l616n330
$$ plain form
0 0 0 0 0 0 0 0 0 0 0 0 0 0 0 0 0 0 0 0 6 -8 8 -8 8 -8 10 -16 16 -17 23 -24 28 -32 37 -41 47 -52 58 -65 73 -81
40 -81 92 -101 114 -124 138 -153 169 -188 205 -227 249 -274 302 -334 368 -409 452 -505 565 -635
60 -635 721 -824 956 -1128 1364 -1709 2260 -3303 5974 -32120 -39624 1033 14816 24291 17382
75 17382 14633 8287 3730 -8115 -16072 -18407 -7476 8113 23023 25545 16435 -1811 -16685 -23846
89 -23846 -21207 -15613 -8564 181 12561 23064 24947 14895 -454 -12482 -16225 -13121 -6597 171
103 171 6907 11605 11969 6720 -1888 -10905 -15981 -14432 -7349 2737 11360 15236 13740 8325 2486
118 2486 -4581 -10872 -14008 -11036 -3184 5998 11259 10626 6227 656 -4435 -8030 -9391 -7522 -2605
133 -2605 3968 9019 10394 8228 2800 -3530 -8289 -9241 -6630 -2538 2277 6155 7983 7134 3518 -1812
149a812m599j956J658L823M406L567J850k35l066m214l915k280P78K584L873L404
165C866K158p39k427l260l194k010J04J977L467L476K083j16k148k853k915k010
181d541k82J120K972K760J968L68j185k455k636j959n71J428K080K776J959L47
197D149r35k108k587j741n22P20J638K291J979L37k84j449k225j928o19M85J336
214a463K158J662P06l64j331j913j541o37L31Q07J913J462R40k55j216j592j050
231a383r80L0R53J381J189J032J67q82j423j252q98j10P22J055J358Q31J67l87
249A570j169j261q41l68P76R52J302N40K85k49j066j071q92l15M96O27J202Q28
267A346J88j0j123o40r13k00j10N92J160P74K45l40l80o89p43n59K70M31O54J041
$$ plain form
149 -1812 -6411 -8367 -6709 -2886 1520 5087 6937 6702 3636 -578 -4493 -6773 -5995 -3411 462 3866
165 3866 6024 5285 2858 -402 -3596 -5606 -5502 -3525 -58 3418 5501 5385 3237 384 -2531 -4541
181 -4541 -4823 -3703 -731 2029 3997 4365 3180 725 -1911 -3870 -4441 -3013 -933 1843 3802 4149
197 4149 3214 1106 -1481 -3222 -3744 -3024 -1386 905 2884 3221 2937 1488 -737 -2665 -3284 -2799 -1463
214 -1463 695 2357 3063 2699 1368 -545 -2086 -2723 -2392 -1585 328 1790 2730 2475 1259 -333 -1383
231 -1383 -2363 -2333 -1380 1 1190 2222 2389 1507 84 -1168 -2066 -2176 -1454 -399 959 1790 1957 1570
249 1570 401 -860 -1701 -2069 -1293 -341 961 1501 1786 1537 471 -600 -1492 -1807 -1311 -684 518 1346
267 1346 1534 1524 401 -239 -1152 -1352 -1462 -870 290 1064 1309 969 589 -100 -843 -1402 -1132 -701 -47 994
287I94K78j4n99n90r50j25j28L95P38N23N55Ll57o95p52n41Q9N54L50N56N03J36
309I23k04o16n23m07q1K40O06L43N65J02k15n20l30m75n16O61J65L67M74M20n00
330D79k97m52r1n08J97M62J30M37M29k22j83n64l15oj77L20L52N12j64K12m36
351A15j11k95j37j48J43K32M98L17p0k5o77k59j77K54K42k77M83K00J95k05o5
372B33m85q8J63k93N33J70l0K56k8k84l38j92L5J88m3N64j62l1J58Jl32k73J9
395b59K9K51P3J98Ll6j51k4l96M9J5K05J83q5J54J81j54r0l65M6J5q3L95k40L78
420B92j37M5p9j8l38m9mJ03J44K62k00O4P4j53r5j34K41j69K30K15j70K6J13l45
444h2k18K42J59j47K84kj01j47L84m58K34k51n5L82n4K2O3J61m53J53q8l01J07
$$ plain form
287 994 1272 1258 659 69 -881 -1006 -1134 -739 -1 522 1077 1080 723 28 -724 -1265 -1176 -622 -272 284 787 923
309 923 719 103 -420 -827 -908 -668 -62 281 846 948 733 213 -117 -592 -1108 -447 -282 85 559 979 479
330 479 182 -270 -361 -869 -672 -210 -80 357 786 564 381 -183 -498 -504 -681 -361 -9 503 339 551 115
351 115 4 -291 -428 -576 -433 -201 297 614 544 519 -158 -417 -594 -340 -98 -375 108 308 503 298 233
372 233 -252 -340 -177 -470 63 233 203 459 431 147 -191 -383 -348 -160 -203 361 199 168 326 327 -5 -278 -259
395 -259 -230 21 94 292 295 259 108 84 -312 -263 -248 -43 140 55 209 390 236 146 -219 -173 -158 -241 154 -86 292
420 292 155 200 121 103 -235 -284 -288 -185 -41 221 21 85 159 6 -89 -223 18 -151 79 294 124 150 263 -82
444 -82 -300 -58 101 -46 238 236 135 -12 372 -86 148 -103 -158 224 170 192 255 416 -37 116 28 -273 -166
467a66K35k8j36M8l4J56k45m9m9R0R1N0J26m0N4k21QK9k04L00j35J71l0K64k91
492fm2J60q4j18j66K95j83K6J69L44l13j2J38k85n1K7K73L8j52m2M8p4oj48Oj45
518c03J48J93o5j4L09k11K65m43m9O0j38L57Q9m9k22J24n0ll0p7J57n1J83oj61
543A3O9p9N8q8N7r8j5m5K97O7k77jr4P0O0j54J22K7J36m18J69K45J7n26M33k35
569a90K30j08K23J94k47j37J9J29l35J99q6K1K6rJ35J87k32j83J88n1r8M03l70
592i2K11k15J83j18j46K9o7N49j52k13Q4K2j27o7J85J60k82R3N0j26l1J40k29
615a59J53k30K26J5r3M9j52K60J7r8j07P8j17R9J2j56j22K76K35j92K34j15K7
638A40k06K09l68J74N6j01J79k01J00R7j83kN1K57k94n6J5J77N8o2l05K03P5j85
$$ plain form
467 -166 69 41 -95 -47 -81 75 -170 -219 -268 -178 -87 -37 89 49 103 -118 -110 -81 -285 15 -120 51 21 285 -6
492 -6 -48 112 28 -90 -256 39 -144 -118 51 395 82 70 208 -77 -128 -101 172 210 58 16 64 -10 -16 -164 -158 -303
518 -303 -155 38 -27 -41 268 57 322 -121 -170 -110 -248 109 198 149 -73 51 1 -2 -32 -109 48 -3 180 174 13
543 13 82 3 61 -27 30 -68 -83 -128 169 236 -41 -42 -136 -66 -6 -160 -38 -11 125 -293 -124 121 138 -388 45 -190
569 -190 40 -68 155 349 102 -35 -16 113 -222 -23 -109 -88 -62 -71 64 251 19 -164 24 -27 -125 278 -92
592 -92 119 -96 87 -31 -177 -148 -215 334 182 -31 53 75 -52 -119 66 226 -56 37 87 -39 -70 70 -159
615 -159 -6 -236 -10 5 -88 -39 -191 69 86 -12 -119 -41 -158 -59 -47 -203 -325 -49 186 -6 228 113 140
638 140 -66 143 -225 -51 5 -96 83 -118 -18 79 -104 -106 -55 202 -92 -148 -133 44 102 40 -265 -62 13 -172
662a72J28j7K46n2k61J05m8K39l92M35l46j1J69j97K39r5Q5J84m41J81O8m4j82
685a79J09J34J17m2r9m0N8m3J31k0k1j68k3J06m2q6J32N4N5K47n19K29j61J4J65
710A08j72Q8N7j27KO7O4N4J46k54J28j02j30M17n11L23j57J2J21k78K20Lq4l9
734d4j3J45J4k32K47j49m2J22R4j32L4K8l32K47q4J26j9KL2j47q7J51L27l42K73
759B19k97J5M2Q9P4k32R4oq2J31K0k9k6j26L16j23R1R2j29p3k96L69q4k80M20
784A89l60p5L12k81L27j39L4K9k44M24R3m61J95j45J26j33L30n38J87r9J01J19
806iJ82j1m31L05K3j81J46j9q3J70k83K71j89K92j14j1j49J74j48q0J21m7K10
829A39k50M4J10k13j05K36J06j08J3k3J03j69kJ76l11M45l33J58k8J15j89J96
$$ plain form
662 -172 -44 -61 185 133 -128 -23 -71 168 -224 211 -135 -146 23 -174 65 -30 55 239 -202 -21 47 3 -179
685 -179 -70 64 181 139 40 0 58 15 146 126 105 -63 -86 20 -22 -108 24 78 133 380 -139 90 -71 -57 108
710 108 -64 24 81 -46 -44 23 87 141 287 33 161 59 -71 346 -165 158 1 13 134 -144 76 79 -5 -44
734 -44 -57 88 102 -130 117 -32 -74 48 142 10 44 72 -260 -13 -97 29 10 12 44 -103 -190 -39 288 -54 219
759 219 -78 -63 -21 68 142 -90 4 -2 -84 47 67 38 12 -114 202 79 170 262 133 60 -236 133 49 -231 189
784 189 -171 -246 66 -215 112 -27 7 36 -208 216 309 -152 43 -102 24 -109 221 -317 -130 -229 -128 -9
806 -9 173 162 -269 36 59 -122 24 5 -78 92 -191 80 -109 183 69 58 -91 83 -65 -145 -24 -71 139
829 139 -111 -67 43 -170 -275 -39 67 -41 -28 -51 52 -117 -119 57 -254 191 -142 16 -12 103 -86 110
851A10O3j46J10rk61P4J0M3R2l9j45L9Q8J27j44k76K79Q6j42q5O2N5J0j2R0Lk6
878E6n0k0J9J47M7k26r2L37J0j19o1j5k87K47Q4M5j11m4J20J3j33n2j49J38j13
903b09K36p1L06l57O4m2N3P6L8k75J39k8q7j46K58Q1K5R5j7j78M22l81l86M02
927A8n8p6J44J18L4l05K53j47K63l59J96j63J36r5J27k63K36J9k55M16l57L29
949B11k61p2j0K56Pk1RN0l8K7J0l11K97j96J04J90l5l44J89j97J97o3r4P3Q6j08
975d4j82J91jJ31j59J23j94L10l27K86j26J9j55M0m2K88l28J29n5O9O0j04OL2
999c3L5q1rJ47P7K5j05J59q1j27N3P6o2k3Nj46J84k62K36k37k1q8J51K95k81K19
1025A06j41P3j78l5Q1J21J1K11o0k06j11q7N9K27p2j38o9K64J22k89L65j53j72
$$ plain form
851 110 173 27 137 128 -133 -59 -49 -6 86 47 -98 -59 29 156 12 -264 15 101 -41 -126 -64 -9 1 -11 79 82 56
878 56 6 -14 5 152 199 -27 -119 218 228 109 48 33 -254 -7 77 122 11 -33 87 100 -33 -85 -234 -96 -209
903 -209 27 -44 262 -95 -31 -73 -20 56 94 -181 -42 -70 -157 -303 -45 36 61 156 139 -39 383 2 -384 18
927 18 -40 -116 28 146 180 -125 128 -19 244 -115 81 -82 54 -41 86 -177 59 78 -177 239 -118 211
949 211 -50 -122 -132 124 131 110 119 169 131 158 168 -143 154 -42 62 252 217 -127 62 -135 62 -1 -95 -22 64 -44
975 -44 -226 -35 -36 95 -64 59 -135 175 -152 134 8 27 -128 -88 -130 158 -170 -41 -96 -27 33 -71 -65 -33
999 -33 2 -79 -88 59 136 161 56 215 134 7 60 136 74 51 56 -90 94 -168 68 -169 -190 -278 -127 168 -113 106
1025 106 -35 38 -140 -175 -94 27 38 249 189 -17 -128 -215 -156 71 -1 -139 -208 56 178 -111 254 101 -71
1048g1L05j11M8j89K31l83L50j96K13j58Nq5k48O44k57L9j75O8J29k85J27J99
1070B00k37J34j59P6N6o5P0j46J39L6j9j70J32J78j55j72K82l96J15j82M02j25
1092fK53j92k31M20k17J05N2n4n11L62NO5J88j62j66K54N5k88K96k62R8R6k19
1115e9J0k41K57j22J16L4J6J7K2j83J8J8J96j0J52n1q6j39k2L2J15Q9j72L5K4
1140F6m4l59L93J44k59J44p4p4J63O0k21N3Kn4J20j24J17m3N1j1l85L70k78K45
1164BP6J19m07J80o3J03N9j77O5J00J68j6j03j40k27M31l57p9L11j49J02p1J58
1187H5K27l5m53J84o0j87J80O2k0J1K01k0J09k19qJ7Q6o0j99J58j63J66Q7j30
1211A9j34m0M61j75j83M3J61k91o9L81p7k21J10J55l03J73j4L11k89j99M3J70
$$ plain form
1048 -71 234 123 171 -18 213 -170 180 -16 197 39 44 -41 -289 355 98 137 -38 30 159 -126 1 200
1070 200 -37 97 -62 14 70 5 75 -71 68 104 85 -85 47 225 70 -102 180 -216 -101 -283 119 -6
1092 -6 247 55 -176 244 27 132 184 130 -381 -19 -14 51 239 77 -89 165 220 -68 228 -34 64 160 -59
1115 -59 -49 -290 -33 -155 -39 -5 11 28 50 -133 -115 -97 99 89 241 190 104 -35 -57 -25 90 179 7 42 66
1140 66 22 -337 56 200 -59 85 11 -63 100 160 -61 -8 -6 -60 60 -64 53 10 61 50 -335 35 -243 2
1164 2 78 197 -210 -30 -93 10 69 -108 -43 57 225 209 106 -34 -261 170 -187 -266 45 -104 -2 -73 85
1187 85 312 277 -176 8 -52 -239 -59 3 -17 -6 195 175 284 65 57 74 160 100 -99 59 -104 62 149 19
1211 19 -115 -155 306 131 -52 -9 152 -139 -208 173 96 -125 -15 140 -163 10 -4 307 18 -181 -138 32
1233C2M5j20r3L25j22J17r0K31m19J24rqqL04j76j79O4J04l1j38l0P3J55j62j03
1258a14K5K78l26J72M5J30k67j50P7J67K7j68L46k58L6j67M22p8k99pM04l12J35
1281A18k60k5L81k00j41j7K66n0m0Q5j99l02L20P1m8N8l3r4j21L94n90K71JJ12
1305d3J60k27J49k02K01r8Q3J17l19J55j12K5P0J05K03j70p9r5K16j41J5J58l03
1328a32R9J84j52R9o7J60j97j87J68J8K85j56k8r4k1K57l69L07n3L0l17k9J97
1351Boj34O5M9K54j69j18j25K84j16J45k66J93O8j07k32J72L3j21M9K52o4j74
1374f6N9l32K67M5J2J29K1l03J76k45J5L30mq8J60k82rJ01K55l19L05m14M58j90
1398H1k01J03l5Q1j00Q8J98k96r7J88o8J17J95j05j17J40k40K72l32L53k19p4
$$ plain form
1233 32 77 -43 -136 189 67 184 94 325 -94 30 21 13 5 309 133 -46 18 122 91 -47 -77 -4 151 -11 -114
1258 -114 -89 189 -137 35 80 210 -57 -207 -130 37 64 -104 242 -16 20 -147 275 197 -102 -109 295 -17 118
1281 118 -142 -167 214 14 -127 -144 122 72 32 117 -82 -384 -64 7 -41 17 -16 -110 -231 163 -427 -156 -155 -43
1305 -43 117 -110 39 -163 38 -60 23 140 -179 -24 -136 -111 -41 64 267 97 18 -77 139 -2 13 171 -132
1328 -132 -33 151 -1 98 31 191 -6 -193 -25 -7 278 122 94 0 -21 236 -133 174 121 151 -166 -195 2
1351 2 -4 -138 -73 -24 230 61 -57 -182 102 -14 131 -135 58 126 19 -213 -41 -8 -129 -80 172 108 -66
1374 -66 -7 -339 -72 -27 -15 114 135 -168 8 -237 -222 108 104 16 176 -106 -115 -14 241 -78 227 -187 271 81
1398 81 -120 -17 -52 29 -71 17 215 -81 -178 10 -58 59 254 149 32 172 -68 204 -128 225 6 -68
1420f8L49j65j66j16K29j05r8o2L47l26M7K51l05mK89l24L44k83j70J0N62m6r8
1443I2j35j21K39j92K65l13J83O1j79m9P3J92k29M5R7L5r8K5M4J1k00J5J16J44
1467A21l67J79K51l14K7K92k18O1K3J37l52N7K79k07j08k50O45k24L8J53q9j11
1489B3J02n0l5j64K15%k22j50J1L09j93K50k06J02O1k6k1j95K91q4n8L3j1q7R1
1514a4K0J60m03M55k22k14K09j27J28k89L71l87M84l4k35K72l70l7O2J95J2J0
1536D6J31p5j94O5j33O8N0K03l06K7K85l6k52j30J31M8K78o7pk20Q7J99l51J24
1560b9m3K8Q9jk7j0K2n7k9M1J9k2j5M6N7m6r5O4J54p0J89l92J21J1n5K6j31K42
1588H7j11q6J63P5n6P6l68J30K24k77Q0K95j89j98J84j45K4R1k5m3K53J32m02
$$ plain form
1420 -68 281 116 -50 -166 63 -42 -140 -202 145 -181 -134 117 -188 -192 97 -227 117 -166 -336 -326 236 190 92
1443 92 -43 -164 75 -117 148 -165 18 79 -100 -149 -76 116 -113 -68 29 64 -34 -9 35 46 -154 -139 -23 121
1467 121 -246 -67 184 -130 -103 189 -29 32 55 192 -160 -103 176 -31 -139 -389 256 32 70 223 134 23
1489 23 125 75 40 -124 91 91 -131 -281 -270 39 -154 96 -110 -8 53 27 6 -189 102 18 -40 -7 -18 -105 -14
1514 -14 6 166 -237 218 -4 -218 -9 -136 -8 -297 74 -313 171 137 -98 174 -196 -233 -171 24 36 46
1536 46 177 102 -92 -27 -160 -92 -42 161 -145 -118 167 131 -121 -251 -120 -72 206 139 132 -88 -1 198 -153 -29
1560 -29 -72 -44 45 44 17 7 29 -28 -57 -16 3 -19 -34 12 69 23 -72 -8 146 76 265 -127 -6 5 -50 -24 -155 87
1588 87 -24 -110 53 128 72 148 -220 -90 134 -143 -63 232 43 -155 29 -116 -92 -1 -26 -69 184 316 -86
1611h6j8K35k82M00k48j30J39Q2J3k53O1j63M17j17k76K64j9j87J61K61j26k97
1633a69Q4J95k32k00K40k05L55k20J80K0q9K98j51j71pR0j20K5o3J18j70N7J35
1656@k42K23K9j5N9J84m15J20J54oR1k71J72Jk03M5o5q2Q4J34l4J64j60j1J65
1681A21j09J63n24N29j90R0k03J47K8j52q3J04J45j85J10R8J34l47M38k42j42
1702g0r3L2J87j67m2J87m2m5J43j78N5J14R8j29j11Q9j02J26n7J17j08O5Q3j07
1726D5j43J09l6j48R4m5k2j1R6P2O0R7k22j12J75J57k84J11RK82k77J49l02L19
1750A73m12J34lK47lj24j1%l8o9o1K79j57j83L74J1M0k74O7J54k17oO5N7R0j03
1776C0j42Q4K2k56J74K89j89k15J80r4J33k3n9N2L13l64J20p1r8J70J01k10L57
$$ plain form
1611 -86 -104 131 -151 249 1 -129 10 92 105 -148 -87 -250 167 50 -226 38 19 -168 -7 254 128 -169
1633 -169 -85 110 -122 -322 -82 -287 68 -152 28 48 -41 257 106 -65 -72 18 -102 -77 -140 -22 -192 -135 0
1656 0 -242 -19 10 -5 54 238 -177 -57 97 91 182 -89 83 84 -119 -74 -139 -221 -137 -3 -37 127 -33 -44 121
1681 121 12 175 -349 180 -10 80 -123 24 52 -100 -183 -79 66 -119 -9 89 223 -124 314 72 -70
1702 -70 -163 -131 56 -111 -153 34 -8 -53 90 -88 -33 81 179 50 -61 28 -74 52 -5 112 4 69 152 45
1726 45 -98 11 -25 -173 -79 -124 -146 -157 -61 11 71 168 -54 -166 9 166 -118 -7 2 284 7 156 -146 173
1750 173 -239 -105 -108 139 136 12 1 1 -37 -106 -167 112 -45 -228 146 157 197 -77 -10 144 -73 -79 -14 43 133 30
1776 30 -112 -28 -6 -262 -88 201 12 -203 -23 -117 16 -7 -66 -14 299 -65 55 -16 -114 56 157 -53 304
1799C04k88r1l8P7o3M5J51p0j35J22M8o5L10m14J24m67K15J44mK1K15M3j77q2
1823g5J22k99L87j63M1q5J88l9J34j73k11j6K36Q7n7J80j83j5j24j18P3P0N4L6
1847E0r8j09j11L14k40J31J06m3l0K0J47n8m46L84m0l2J48L09m07J24k5j20J23
1870I7j13J56j92K16k51K50k07J16j2p7R2J86k63o3J81J4j95M3j04M0L70l30J12
1893F6j75R3q2L01j13j98K20J90l39L7K68k28r9q0n3J57J05O4L3J07k69J17j40
1916a8M3rN0Nk82J68J4p6N4M68q1l14nk6p2j09J46R6j05J39q7J66q0J6j64N6o0
1943f7K35k83R9j22Q2J28m9j94L07Ln8J10p6l43L21j33q8j18N06k81j45L04pj7
1967A14q6L7k81K28p2q9Q1R8j62N26k50j84J06R4m7j22J2m2J39k28N5K67j67m8
$$ plain form
1799 304 16 -75 -113 -36 -99 -54 97 27 -108 14 62 -3 307 -107 17 -450 -235 -91 -95 -74 141 184 7 -75
1823 -75 47 -252 135 -28 13 -72 116 77 211 38 -173 -189 47 134 77 257 74 59 -65 -183 -110 -40 14 50
1847 50 -48 -157 -268 46 -194 -63 43 0 -30 -10 137 79 -367 17 -23 -55 93 402 -5 119 94 -26 97
1870 97 -16 140 -52 164 -87 163 -44 72 60 -17 75 261 -2 -65 116 130 -65 -22 -126 -86 284 -46 66
1893 66 -109 -16 -98 203 90 -108 112 302 -37 0 268 40 -59 -139 -192 -35 70 134 167 274 5 122 -18
1916 -18 25 16 66 71 -211 -43 -29 -105 -51 417 336 22 17 -9 -81 -190 -44 52 -53 86 -1 165 85 101 -63 -7 -67
1943 -67 168 -115 -16 -138 -56 72 23 -171 136 139 81 191 115 -228 93 -40 -128 -246 260 -21 -166 138 131 114
1967 114 28 65 -216 12 -60 -149 -68 30 -132 394 144 -40 66 160 113 -9 3 -39 100 -128 -73 194 27 -21
1991b1O0Q6j37j78K54n4PL8q7J06m0j93o0r2J00J72M6O1k57L63m11K56j47p6J15
2016h9m2J60j45L6o8J72rk2j15J75k82K45J68K0q6O6k96J61j97Q2J57N9k81J57
2040B6j1J01Nj28k1k58K63r4L7k09J46k3P2J78R1k12J45k89o9J81J37j61R8k9
2064b4m7P5O5k09l8K03n9p0J48m0p8J82j15N1J9O6p2j98Q9m7j18O02l96J36j51
2089b6qj22R6J39o9K68k95k70L43K2j89J79K44k85j72l5J69j75J56J74o8j39j41
2112b04K39q0o8J84ol11L68j60n9l7P5J32L9k79J71Nk15J13K14j71n2J84p8P5
2136G9n4J11m38K40M9j2L7k69M86k41Q6j64k03K00J25j73J68%l4K57J24m33J3
2159d6P2R2j02j77K92MK9K9j76J13l8k33J74k61M06L6j40Lj64k38K93K12k41N6
$$ plain form
1991 -21 39 125 -12 -190 64 10 17 55 -32 74 34 -159 -219 -311 -211 -39 7 68 -189 174 -237 19 -128 -204 -89
2016 -89 -131 29 -116 -80 -148 24 15 -7 -122 53 -229 16 184 204 118 184 -112 49 -148 -66 91 150 -131 26
2040 26 15 116 121 -7 -28 -286 -23 -117 -80 -289 -143 -166 -94 84 175 -37 108 -181 -250 -69 68 -93 5 -24
2064 -24 -71 4 69 -140 -178 25 -34 -104 44 4 -74 108 -7 44 63 129 57 -141 -52 -99 -217 385 -11 125 -26
2089 -26 -34 -156 -60 79 10 278 -17 -287 56 78 -111 68 312 27 -145 -180 -11 -186 -30 144 76 -63 -204
2112 -204 35 -45 -113 71 65 -246 122 -38 -97 -134 -59 73 112 -167 4 9 -206 -93 121 -50 -102 82 4 79
2136 79 25 136 -302 -62 -13 -25 12 -257 229 -12 74 -90 -293 -93 32 -141 27 27 -7 250 374 -59 -46
2159 -46 26 118 16 -161 131 135 164 193 17 130 92 -141 33 -228 178 214 74 77 -87 -325 -32 180 -61 -5
2183eO0j53J34r2Q9j51J80l75K36K76k53L0P5l04K71k39J46L17j78j44J01o1L71
2206C31m23L71k67k84K24j05O5m7K99k88K80k30L0J47J17l54rL53m34K85j42O8
2228a3m1j0n0jQ8M4N9o3J44m9j59J87k16K84j89M0k37J62M3O3Q0k65k3K22J6k43
2254a27K03j19j48m0L58jj53ok29J46K30l2J71l89J49l2r0K6R5j10M31l26K54
2277B61n32P2N7J78K45j71r5k5J27j87J18j51K29r6j6m9K1K1k6N6k22J68r7L0
2301h4J62j74k4J87J6n7k83J59K55k23j31K16j19J5K5J58p1k17J21J0R9%Rk19
2325a70N6N3K60n5j70n8rqj08M10n15M62k98OK91Q8l75J33PK49k29q1K10q0j51
2350h2O9m7M15k42j73K8O7q2K0n3L9n3J17j19L4J84k15M15j15j58N1k65PN3M3
$$ plain form
2183 -5 55 -98 36 -56 33 -118 62 -313 -77 199 -54 -24 51 -253 18 -221 -75 242 64 -80 21 -40 331
2206 331 -92 279 12 -272 -48 -153 -88 -135 164 -124 156 -74 -44 103 220 -134 -143 210 -224 61 -81 -13
2228 -13 -54 -64 -114 -115 -27 17 76 13 157 108 -51 136 -80 204 15 55 -182 -20 23 86 166 -99 -122 100 116 -127
2254 -127 76 -43 -191 -231 127 126 -27 -33 -262 -116 114 82 253 -136 13 -19 -109 -83 12 -98 333 7 261
2277 261 -271 -199 -142 36 281 110 15 -10 117 -70 48 -103 126 30 14 -35 -14 7 -19 37 -185 -17 -114 -84
2301 -84 78 -96 -120 67 83 26 -257 -98 157 -66 -197 19 -100 -85 -60 98 27 -190 -69 -59 40 40 49 -170
2325 -170 -114 -61 199 144 -26 -84 -93 -101 -209 201 -314 148 -150 -144 147 235 -140 -7 0 249 20 -61 149 69 -82
2350 -82 -13 -60 355 113 -60 -32 35 -47 -27 -80 -41 -94 23 -96 -62 122 -93 322 207 49 100 -165 -158 -105 -62
2375f2OK33j76l69N13q5j45j29K91J58l16K0J70R9j51r5L52k64q7r6J31J2J26
2398A36k17J75n5j1n4l2O0J13j66P5j04J36J87k73J59j53R8K4l59M75q5J2J56
2421B97m95J38j37L19j47J48M1j31K97m03j86P1J66K0n7k77K68J03N7J18l16o1
2443a67K95l02J85m4j6J78k36J37j28R0q8K79k22j17J19pQ5r9J28j25M5j04K44
2466A30j86K08k55j37K12K15k67J51j03l5J04j83J2R1j15M13l00Q1j0K4R5l76
2488b31J87N5r9J71q6j19J64k37J56p8J79q6J32j08J54p9N0j69m8K23j46q3M4
2511e4n7R8j97J70Q2J42k18j45Q5J65p8q4O6j46N0N8J92j12j85J90J07k56K30
2534A03m5J5l30P4K35k51K9K88k27j2Q8L1M0J27mj05J7jj02k5J33N5J4o0j52J8
$$ plain form
2375 -62 -56 177 1 -368 145 60 -85 -214 77 235 -81 -61 109 208 57 -38 314 50 -37 -133 -2 10 136
2398 136 -81 94 39 28 -26 -58 2 115 -51 24 -80 56 243 -30 129 -24 74 98 -261 214 129 141 297
2421 297 -198 -60 -197 122 -25 123 164 33 330 -73 -259 -188 -22 -2 -59 -336 -68 35 92 210 -106 -167
2443 -167 128 -174 11 -33 -49 129 -107 30 -98 -8 -96 183 -39 -156 -37 -44 41 -58 70 -55 -10 -114 130
2466 130 -56 152 -103 -240 -28 187 -80 71 -32 -67 37 -146 -134 -43 -158 255 -45 36 26 50 145 -231
2488 -231 -44 11 -88 83 -3 -122 42 -195 -39 -117 62 -24 108 0 154 75 125 -44 -92 131 -15 -98 -54
2511 -54 -111 -13 -210 -40 42 184 -34 -179 -94 71 -7 -91 -25 -171 -121 -63 129 17 -168 22 129 -127 103
2534 103 58 73 -257 -183 52 -199 -170 118 -109 -121 -33 -2 38 165 161 56 73 72 -30 -55 78 133 147 87 -65 -47
2560d7J08l70J27L14Q7l9Rm40K06k61K44n6l3J72K3j24N8J48R7j73j06J80m5j39
2584f0J19j54j8P2K56k31l03L40K07k02k58R6K00p9k10K52j21K56L8m33K14Q0
2606F1NK9j3L4K0j83J27K13m67R4K21l21J35M4m8J70L3q8l27j63L92JR9j67j85
2631b84M14k07K17k23JK42r4k54J76K15r5J15k93o5L81l51o1K11l05J45K36k65
2653a44K24%j73Q9j3j94K28P5j91L14k82m0M0L3j38m7J44J02o4J58j22j20K11
2676I0k56J49j14N8qL26k80J41j56M5J61j67J50m2M3l23J91J01j29j68K95j59
2698e2K77k94J98j93K30K8J7j72k06J11mj0M2j60J1N9Q3k18M43lj59k87J41J84
2722F6r3J12k29K87j21l9j71M70m20K17j18J26j79k2L5K22l64Q1P8J67j5j02M9
$$ plain form
2560 -47 61 -309 -182 132 219 180 189 -251 -45 -306 -62 -118 -151 21 44 -80 -22 126 223 50 -56 124 79 -60
2584 -60 59 -95 -113 -41 215 -16 -319 21 228 26 -232 -136 64 -15 -225 27 -94 162 200 -233 -19 61
2606 61 66 95 82 116 136 -47 80 293 -174 -80 141 -180 -45 -1 -49 121 154 66 -261 -424 -32 -31 68 -99 -284
2631 -284 130 -77 140 -83 -82 160 66 -188 -12 203 108 223 -70 -135 246 -105 -166 45 -260 -115 121 -144
2653 -144 80 80 -93 -4 -17 -211 17 92 -99 215 -67 -107 -67 -34 -172 -219 -75 27 -37 121 -1 -121 90
2676 90 -166 -17 -131 -73 -81 245 -35 106 -50 -5 156 -11 139 97 140 -183 8 109 -20 -188 107 -52
2698 -52 225 -69 129 -64 166 194 211 39 -167 -56 -60 -70 -28 -188 -177 -118 -35 -253 190 187 28 -259 -118 66
2722 66 -27 85 -144 143 22 -17 -188 282 -138 79 -39 87 -92 -114 -79 143 -221 -140 -62 105 90 -12 37
2745C7j36J33m6j97J39J00K26l63M2j34K59o2j58j71M75k15k7o4J06J8n3J67j97
2768a21K24l38J40k59K60j0K6J9J76j21O0mk72J73J32J6k79M39m14J56R3j68L12
2791B40j33j91O3Pj95J99p0J97m65M13m0L3M3k15J12J40k82K18n3o5M8j33q6K72
2815E7j22L6n2NQ5l06N30l42LO4r5q6L30j67K22j66j5o6j4Q8k12R9j4J65J20r9
2841D8J20m1j31pj2Q1q3J17N7j0j35R1j58LJ03J27j81n4n0K11l18M40j85n5K7
2866Ek27R9J45N9k57P1J44oK0J57j95o2J21O0k26J13jJ1L6j96J75q4J60m16L45
2891E1j37k54K43K10j25rL9j07k8j85J68J77j25K12m9j94O6J36o8p4j47L41j48
2914gl0NO5Q1k11m3J81p0k8j8j43M32K9q9k62K3j03M74l69K04l0j98j51K32k9
$$ plain form
2745 37 -99 34 -12 -209 -70 30 256 -107 -65 -199 60 -2 -160 -331 144 -71 -98 -162 -56 -38 -91 76 -121
2768 -121 103 -235 -95 -354 -94 -104 -78 -59 117 -4 56 52 -220 -47 85 101 -178 261 -153 3 96 -72 240
2791 240 107 -84 -21 -14 -209 -10 -80 117 -348 65 25 58 101 -114 -2 138 -144 74 21 -44 4 -129 -215 57
2815 57 -65 -29 -81 -76 9 -297 233 -109 -106 -42 -137 -223 107 -60 162 -4 -19 -85 -99 -11 -223 -124 -138 27 147 48
2841 48 168 127 -4 -11 -23 58 -25 92 149 139 4 95 -63 -60 43 170 -11 -65 -115 96 -222 218 33 -22 5
2866 5 -222 -123 22 81 -176 -105 39 33 53 210 15 -47 74 134 -92 21 20 31 67 -129 46 -38 122 -294 51
2891 51 -86 -340 -97 113 -12 -21 18 -89 -117 -302 -134 43 -82 130 81 -113 -47 89 21 -53 -200 141 -7
2914 -7 -37 -32 33 114 -97 -140 41 -29 -57 -75 -218 214 243 154 -108 -85 -188 286 -83 121 91 -107 -258 -26 -55
2939e5L93m21L6j60J56p0j8J37q5k37M79l49O3N1P7j0j0Rq0J68q2l4n9K44j60
2964a7J90j85J69l29K05r0K08l07p0J72J31j17J50j60j07J00J48j28j27M6L30
2985B12l27m6K31k19K25j65J56j1j07O3%k23K74q3Q4J8l39J76N1R2M9j7L7R5j75
3010E1r4l4p6J67k4O2J42m09K76Q4L7Pj08k13L0j5R3j24K57j14m7j90M69j41N1
3035A37k35J90J37l63J87j93P6J00l1k8k72K03J31l30K80O0l1J44m26K25L6J04
3057A01o7k84J28L01n1k73K60k46J62J14l59K42J34k19q8K80k51J82j2J1j71J07
3079AR5O3k04K61Q2j06M8k89m6J79j21n4J58k31J27j61J95O7j7J53m28K05M3M
3103B4j31K65l20J27R5J3oj76L1J05j30J34J11J76k51Q0L2l25J61r7J68o8n1j15
$$ plain form
2939 -55 338 -83 -47 -207 -51 -121 -139 -2 -87 -324 155 -194 -131 -80 -3 -13 -23 -14 -94 74 -8 -42 -101 143 -17
2964 -17 173 -12 157 -172 33 -57 151 -156 -226 -54 77 -40 110 -50 -157 -57 91 -37 -164 -118 212
2985 212 -115 -161 70 -149 76 -89 67 56 -51 12 12 -211 63 -20 64 82 -257 -81 -30 62 111 94 131 226 51
3010 51 -43 -77 -153 14 -10 52 194 -215 61 145 182 189 81 -132 -102 -117 -24 -148 109 -5 -52 -242 227 86 137
3035 137 -98 92 229 -134 53 -140 -64 36 5 -23 -295 -92 39 -291 -11 49 18 162 -264 -39 -3 101
3057 101 34 -250 -122 179 128 -145 115 -131 31 145 -214 28 162 -57 -145 135 -116 66 54 65 -106 1
3079 1 96 159 -45 216 298 192 240 -49 -95 84 -37 -91 67 -164 -37 -198 -3 64 47 200 -228 -23 20 24
3103 24 -107 158 -162 -35 60 73 67 -109 -78 27 -103 31 142 318 67 147 179 -146 15 -82 86 18 -33 -148
3127a48J82J52m21J94J33k44j73O19l28K6J84q8j84J71m6n2m6M2l0P1M3O9O5O0
3151B51l54L03k27j02O7l3P5j86k4OJ20K11j2l5j02O1J30j51O0k74K55j02J67
3174A04p2J78k71J30k93J40K13K20n05J17m6L0N7J86L5Pk93k35K60PJ16k52j17
3197b84L46L6n3J2Q4J7l98L37l1k32K80j61Q9j7R2j66N7K49k26P6mJ44l14J25
3221E8m0J76m45K08jK86j06j26R6r5O9k01N0J63j29MK18j53N7r0J30j71k93K94
3245d1j9o1Q3J2J8k3Lj35J96k19K62O5J44k44j45L05l96J38K23k88R6p5K16R1
3269B06k89oM2N2k43K62k32K72k87K53l3q7K4J92l53J40r9M99J75q23M31q7k8
3292a9J10P1k15%j3j11q9L75j49Q2mj69J27K57n26L71k5j55k56J86L00q3j10j2
$$ plain form
3127 -148 34 186 -235 -41 92 -152 -325 294 -34 -8 176 88 -96 75 29 -23 -69 -27 -57 14 57 126 191 251
3151 251 -103 200 -27 -129 -62 -95 -20 -206 -230 -224 -104 107 95 60 -42 19 149 -2 58 -216 39 -63 104
3174 104 32 210 -61 69 -224 -84 129 349 -156 -39 -85 -55 2 188 223 230 -63 -298 -38 -31 85 -167 -284
3197 -284 62 98 45 57 141 158 -240 97 66 -166 114 -47 42 25 117 -49 8 257 31 107 103 247 -67 58
3221 58 18 194 -251 -43 -44 242 136 10 106 11 80 -121 -71 92 -37 -33 185 32 89 -1 129 -42 -335 -41
3245 -41 -60 -121 -38 -26 -8 -31 -28 -163 33 -186 76 141 285 41 -104 201 -195 -57 166 -122 -26 -101 115 206
3269 206 -83 -89 -47 5 -238 24 -208 64 -223 30 -3 -90 -66 126 -227 -87 -186 313 488 -335 96 9 -19
3292 -19 91 162 -53 -53 -66 -177 -266 109 -40 42 38 -131 -4 253 -273 98 73 -82 -338 -152 148 65 -45 -57
3316e7J36k14K64j08p8O0NJ00k50J61l52M28j86O5P1q0J22M0j81K85j23j4k67
3339a73K43j48o5K57k40L02l19q6J55J12j18K00j14K87m45q6L71K8j63j13J7J74
3361G6l65L10Q1j84K65o2J91l23l23L75jj45J89j9L8no7k5pJ2j23j8R7JO2l6N4
3388D8Q5l89K51K26j92J40j32M9Po6k7j98J92k53K51R2R9k63K91j23j60O8r8J16
3412A4l5J30k42J61M05n79j77K46LM97k19n00j78N16k18M72l02j18J84K24l11
3433b7k9JM04k72j16l0n2J8J44j13K4j4K23p5n9K42j72n4o3r1J45q6J79r2M3j01
3459b3P0KJ15K3k76M4n8j00K38k25K92j69L97m07o8J83j12K10k31J2O6J56K09
3482C48m65K78l39Q8K87j33o7N7j9J22J95m05j64m7L63n4k62Q2K4J57j86J65P2
$$ plain form
3316 -57 79 -135 129 21 -57 3 8 108 -142 19 -333 95 -91 -26 45 -35 87 127 -54 231 108 94 -173
3339 -173 70 -78 -143 114 -126 176 -143 -229 -74 38 -80 120 6 293 -152 -238 133 161 -2 -115 -98 76
3361 76 -289 21 102 -82 183 121 312 -11 -334 41 40 -105 84 65 103 98 31 6 -1 11 -112 -130 -33 -32 30 -6 48
3388 48 133 -256 -5 221 29 169 37 86 93 27 0 -198 -6 -259 -8 84 183 -80 211 88 -72 -4 -102 14
3412 14 -21 109 -133 28 433 -146 -323 -77 -74 423 204 -296 -474 42 -176 296 -6 -124 60 284 -27
3433 -27 -56 -55 349 77 -39 -69 -121 -103 41 -72 -48 -62 161 86 27 269 97 43 -20 -111 34 -52 127 35 78 -23
3459 -23 47 49 164 187 -89 -45 -103 -203 35 -190 102 -67 330 -77 -145 38 -74 136 -95 -83 -17 139 348
3482 348 -117 161 -178 -90 197 64 -3 54 35 157 352 -53 -217 -264 99 45 -217 -135 -111 46 -140 25 97
3505I7m10N38k87j68K10J10K2m3K53l30k4nj58J69k5J0O9K3k14O1l3K46j53J35
3529I3k39J07r2M6o0K40L8j18j34nN6J14j10o5L88m70M8l1J73k16K31j30L23l38
3553a51K31p8Q2j49K41j58J50k99J38m7k9j9m9J72K47l33J9J11O1o7k20J89j99
3576a57J98j72K29N6j52k52K13k2K7J6j58Q0R0j7l0j7n2J34q8OL7M7P5q1l0p9
3602i9L6l2M7K49l25J82k63L3M48%k66P5j14m4Q9o0J38j56M9K14k52okm3K66j20
3628D4J03l74L01L8R5j73p4j9l1P7j20J82P0k85kn9K57M7k63J63M6o9q8MK85o3
3654I2n2J27k47J81k41K70l13N5k5K26J78j94j07K3K04k97j2Q7K51k01q1J05P3
3677A02j11R2k4J77j45J48k40J48j81m2L09n07O10m65M10k24q0l1j7m0K44j49
$$ plain form
3505 97 -313 225 -62 -230 -20 90 112 69 322 -8 -32 -37 -195 -26 -51 -41 28 51 -163 -102 -135 111 -42 93
3529 93 -146 -39 -131 -85 -145 95 133 15 -119 -124 -68 46 -64 -129 259 -211 -163 -194 -21 -237 -6 -136 187 -151
3553 -151 80 2 84 -65 176 18 168 -131 7 -40 -69 -88 -137 35 282 -51 -32 79 140 73 -147 42 -157
3576 -157 41 -131 98 154 2 -250 -37 -59 -32 -16 -174 -94 -4 -21 -51 -68 -120 14 -74 -68 -31 16 91 10 -20 -99
3602 -99 -63 -95 -48 201 -124 58 -205 -172 276 276 10 85 -29 -73 16 -44 94 -62 -13 201 -51 -57 -59 -102 164 44
3628 44 147 -227 74 112 207 34 -40 -59 -90 -13 -133 49 119 -166 -168 -227 30 77 -186 -23 23 -46 -134 -130 155 92
3654 92 40 167 -80 101 -140 130 -183 -128 -153 73 251 57 -50 -27 177 -120 -132 -45 206 5 -76 29 102
3677 102 -9 83 59 236 91 239 -1 147 -34 -76 233 -274 336 -129 281 57 -23 -54 -71 -111 133 -16
3699a6J52k73J40P3k26J82O0j07j3o5R6K8q8M46m16K6k01J07Q5j20J29K65j25
3722A39m93K27L7J57j41L4n5M6j17L34o3K5j20o1j65J30J26J11q6L1l54M55j90
3745GM8k48L18j40j44m5K15j5k56L74q2j82J56j13K37m3k73J65P9R5J1k00K4J
3769a1Q0R1k36P7L3k12L72j45l3p7M7J10j69n1J63N0j71M2K02k48J13q1j26L88
3793B08j15l6j7l0M2J08L5k23R5j03J14Q6l3j4n52L31O0m2n3K1K8R4J2r0l5K24
3819A15j41m6j68K69O9lk5Q0m5q8k13J69r2n7J84j55q8J56m1J74j69K09q5j93
3843a84K28k69r8L31N2Q7l4k08J24J61n1o0ll09K84j08j06J64K25l30K40k79m1
3866a84J40L39j22j6k0j90N9k43J54K0j02K28RO4J07k42l9n6N7K32j59K6J65j48
$$ plain form
3699 -16 136 -137 3 76 -150 32 92 -15 -28 -93 3 31 -57 389 -27 -1 -202 -95 -10 -130 -1 264 139
3722 139 -354 -127 -90 67 -74 -40 -95 -49 -166 168 105 130 10 -51 -216 -86 40 151 65 96 -258 197 7
3745 7 55 -193 125 -15 -159 -204 11 -4 -260 114 32 -150 6 -107 130 87 -186 -21 58 153 164 -36 -12 -11
3769 -11 69 160 -76 1 34 -178 194 49 16 -61 -14 96 -73 -124 39 89 -82 -40 162 -86 27 -54 -180 208
3793 208 93 57 40 10 52 160 195 -28 67 -36 78 164 131 117 -435 -104 -44 -86 -139 -118 -90 4 16 -74 -109 115
3819 115 -26 -72 -240 29 98 95 70 150 105 17 -196 -27 -119 -176 8 -147 -235 -79 -120 54 -115 94 9 -184
3843 -184 44 -225 -323 8 60 147 113 -95 29 190 139 79 76 -233 51 -57 -163 1 226 -104 136 -143 -184
3866 -184 -44 295 173 157 137 -53 6 -237 -83 -63 -165 63 72 136 243 1 -38 -94 -37 195 36 62 227 79
3890G9l9k24M44k64R6K01k58o7L9R2j60r5q4P8J24M0P2n6J43l5j39K4M1j60jL27
3916B18l6j54M1l31J24L07j73J05L2k83K65k52R0J31k72n9Q3M6J23j4J30p1j78
3939a28J37l5J98r3K1k6j44j00K14j39K23m14L15m7q0J17J2j29L71k92k5J96l50
3962a98K04j71R8M2R4n6k03J70R2j1j03j0K2k0M0P0j86J79q3K4l7OK35J07l52
3987d7qK20j35j31N9J86k22M73o70J43O7JR0k3ok43L69j68N8k29L4K11o4j66J02
4012i9P3K4K20k76N0R8j8j53o1J33j04J34J96l06o6J85k3n5j22O7J38j30%J18
4036B3j28L8K46l75Q7j1J76p5j06q2K16O4J59j27j21J14kk34K51o7j88J17J36
4059A11j70L7J86k93j41L57j51J03j87Q4J64K7l58L11l6p0k8J15O3mj33j41P3
$$ plain form
3890 79 40 -184 260 -4 92 293 35 -32 7 99 -61 -156 -240 -162 -38 2 74 18 161 126 -13 11 52 -108 -109 218
3916 218 182 28 69 -262 -138 169 -4 101 133 -150 115 -137 -47 84 -188 -247 -164 -118 5 -9 121 50 -128
3939 -128 9 -26 172 79 100 74 -70 -170 44 -95 128 -286 29 -18 -98 19 31 -98 273 -19 -44 152 -198
3962 -198 6 -165 -67 -25 69 13 -190 -20 72 61 -42 -52 -30 -50 -10 60 -126 53 -30 -6 -43 -37 198 305 -47
3987 -47 -55 165 30 -101 -42 144 -78 395 -275 -132 -65 -64 26 3 -3 -246 123 -45 13 -216 -182 29 -35 -201 -99
4012 -99 -26 -2 218 -58 -8 90 72 -81 -142 -9 -113 21 217 -89 -155 30 7 -48 -170 -103 35 -95 -95 23
4036 23 -105 -67 179 -196 -109 -120 56 -19 -125 -207 9 73 232 105 -16 98 96 -138 113 46 -142 -25 111
4059 111 -59 -22 164 -129 -270 87 -64 39 -148 -64 100 127 -231 80 44 -26 -54 61 124 120 -13 -154 -81
4082h1j92M73l98K94q7j3j79M09l57L48l43J42M0k08j49K99k31L51o6J46j08p1
4104A9k5k6P4j72j45L76Q3k36q5O0J78j86Q8P0K2j58J56j71J39J42n29L96j84
4127a14m9J38L0o9N7m6J05j14J80j56J98k35M07l82p2j67O67l63L8j2k2r2J1J14
4151E2j93K14j7l10J45oK29j43n7r0J54R4n2m7J30j75J85l43J69L84l73j18J14
4174e4J64l43J77O5P2RL4j16ko0p6P4k27K62m5j09K14j34K25j83Jm0K87r3k04
4199a02P4o0J45J05n11K47M61m04o4j50K46oj3j18J71o%k8j7Q9l9j67K38j73J
4224h1j60J21R9j17MJ34J38J5Mk20R2m1K1j74K86j76J67k40M8K08k60J43J05l92
4248b76K25k41M25J5J0k61N1J82j99K44j72j80L35j54j2m9%qR4j14J39K16m85
$$ plain form
4082 -81 -273 200 -198 96 9 -4 -183 226 -131 217 -126 16 56 -152 -301 -2 -233 118 52 198 90 19
4104 19 -6 -32 42 -130 -275 101 184 -52 -137 -77 101 -85 3 73 95 -63 93 -78 61 203 -326 70 -114
4127 -114 -163 -25 5 -64 -7 -53 52 -62 118 -38 160 -75 332 -50 -122 -289 378 15 53 41 19 -73 -62 52
4151 52 -141 73 56 -254 -109 -115 114 -29 -86 -176 -22 72 20 -27 103 -72 113 -230 -61 323 -50 -168 -54
4174 -54 110 -233 -56 9 81 90 124 8 6 -54 -130 -56 -283 -21 -66 -175 39 -95 130 -53 -52 -92 195 102 -102
4199 -102 -28 -88 57 162 -349 -102 359 -45 -109 -259 -13 -19 -32 -150 21 15 15 -13 -30 59 20 -147 91 -82 -81
4224 -81 -241 -120 -21 -138 -134 0 138 153 157 -63 29 -12 9 -165 121 -55 112 -128 -80 128 -132 11 116 -276
4248 -276 -51 -292 133 148 158 -103 -52 130 -69 175 3 -177 158 4 -8 -57 -57 -65 29 -85 54 270 -215
4271b15J54j39j04J11L43j30J12j57j17R2R7Q4j81kK49m13K07K37k32Rq6J3K15
4294A47l60J16L6r7Q7K97k83L1J68k04Q9j76L25j24k75J70J2J36r9J30p4o1k10
4317b19M03l27K63j51J49J81m53O0J75K52l73q2R2n1K46l40K17j01p1L57j72m8
4339GpK44j28l30k6K12J31l56N23l91J35m9j63K99J07l19oj70K78j45J25r4J82
4362E9jJ62n0j53J66l00r4K55j0RM2j07O7J59j96m1q0r8L10m24M10L1k10K53l89
4387b30M27k16j43J10j13K71J05k03j26J52j82J69J90L1j54j04j1o4J34P7K9J46
4409B95m38K77l16J79K7K60k39jJ01m4qj98J39o9r5K39M1k91Q0J03k1J39j83k3
4433d6n6K36j51o1M6J12k74J11k22L67j44l5k5K38K18p4m03K29k44N0R2J08j46
$$ plain form
4271 -215 -61 -200 -304 -193 150 20 132 -25 -142 -50 47 131 -50 -52 197 -216 -9 228 -4 5 -81 -68 147
4294 147 -213 -97 -61 -158 -71 226 -57 -26 142 -62 27 -149 176 52 -223 -53 -41 95 -4 126 52 -9 -219
4317 -219 184 -143 120 -31 118 299 -154 -94 81 333 -40 -122 -30 -81 165 -175 42 -59 -130 227 55 7
4339 7 0 244 116 -214 -240 -28 103 -253 270 -121 14 -35 -198 101 208 -111 -117 -287 -9 -154 -29 -123 59
4362 59 58 220 170 17 183 -117 -211 44 34 43 85 -22 45 204 8 -33 -113 -211 99 -325 85 116 -94 159 -230
4387 -230 197 -19 -162 -52 -165 106 211 8 -118 34 -148 21 211 242 88 -16 -27 -91 43 120 149 295
4409 295 -143 134 -182 -3 24 284 45 44 145 101 93 -105 34 -35 -130 109 150 -141 -61 42 21 160 -23 -46
4433 -46 -102 134 -17 -78 -32 80 -194 -83 -305 62 -82 -117 -142 96 314 240 -163 66 -178 -128 -36 72 -74
4456g4K11j69j71M59j98qk00K00j75J18l3j22j0K07K6j03R6q5o7l5R6N4J22k04
4480f5k8L40k48k0pj20J33K55k3j54k58K50l2j11J56n1J19k8j29j62L27q6R5j42
4504A1j9k26L61j24j49O2j22J70Q6K5k24L21l06J7K48q6j4J03j58j58M4O6M3j8
4528d7L4q2J26j32K93r6n5j75R2J32K9j24j7J75j51Q2%J56j65n1q5J1m6L35K9
4553B68j90L3l16J35J17K05l18R2K4P9m2k1J59k81L0n1m6R9QQj02J45j3p0K8m3
4579f3J27N4j70N2l0O6k18K96q3P6k25R3J03m18K90J26k2j19J69J10j86q7J36
4602G7k11Q2L06l16J25p8l7J7P0j84P8J93l63K39J68N4k47K38k78K7K83k44j26
4625a27J45j81J68K08l16L75k68m7J22j57m5j63M30j12Jk17L38j34m8l3Q8qJ33
$$ plain form
4456 -74 137 -32 -203 256 58 50 -150 50 -125 -7 -40 -162 -172 35 61 -42 54 -31 -98 -133 -37 17 139 -65
4480 -65 -93 247 -1 -21 -28 -148 -15 240 217 63 -195 55 23 -88 68 17 136 108 -21 -183 144 58 153 11
4504 11 -8 -234 127 3 -146 -84 -206 -36 50 75 -149 172 -134 -117 131 45 31 134 -24 -182 -138 -72 -29 -47
4528 -47 -13 -95 31 -101 192 96 41 -134 -42 90 119 -5 -22 153 2 84 84 240 75 24 -61 -50 -96 239 268
4553 268 78 111 -205 -70 47 252 -66 26 50 129 87 66 225 -56 -26 -77 -123 -24 -16 -8 -110 35 22 -48 -20 -63
4579 -63 64 118 -52 0 -30 36 -182 114 31 107 -118 -25 78 -340 -50 76 54 -65 104 214 28 -59 77
4602 77 -134 -52 254 -62 63 -15 -52 -35 35 -149 -71 122 -241 -2 166 220 -27 211 -67 -40 243 -1 -127
4625 -127 18 -163 5 213 -103 272 4 -43 79 -78 -123 -286 144 32 33 -184 154 20 -28 -61 27 19 152
4648A52j44R1j34r2J4L07j59mJ6k56J9J30P7K0L4q9j05L43j16j38R5L9r0j9K80
4673B71m34J3R0N3o9j50J18j04J31J20o7Q4j64J01oK96l92J45J86l09J72O1O4
4696B10j72n6M9O4k22j35J29O1n3J63N9J6k07K58j85r2J82L3j09j70J80l64M86
4719A25O6j59R5K0k29J4M9J14J45k91j99L62k97M11n03J67Q1J1K7o2K72l78l0
4742a89O0K22j01o0J91j98J32J10Q4l11j56N2J58m5q0P3Qk26K26L28m1j67l37
4765b67J00K15K4j98R0j95M16r3j62j18J61M3O0p8k9JP6n6J15P4k13O0JL1J73
4790B31k04OJ48j81N0Q0J7k15M7k68j0L20N6j32J31j39J87r1N1om8Nj95P0o8j2
4816a70K3K51J8K5j00k4Q5p8j39rJ47L3k31J41j31K66j68K6K13k31J09O1k76j17
$$ plain form
4648 152 8 99 -35 -127 -113 194 35 31 47 -209 -190 -60 17 37 71 -18 -123 220 104 -34 61 100 10 -9 271
4673 271 -163 -150 -60 -7 -76 -226 -108 -212 -81 39 -28 56 -108 -7 -13 283 -109 36 222 -87 85 146 210
4696 210 38 -18 31 95 -127 -262 -133 -72 -125 38 97 113 -94 164 -21 -113 69 102 -7 -177 3 -361 125
4719 125 191 32 127 147 -82 -68 -19 95 240 -51 -250 112 -185 226 -277 -110 -29 -18 9 -53 219 -159 -189
4742 -189 -129 93 -8 -68 123 -75 57 167 251 -60 -216 -164 -6 -51 -131 -58 -50 -276 -50 278 237 70 -267
4765 -267 -167 48 72 -126 -36 -231 185 92 -70 -188 -27 16 76 -2 -31 -30 46 -10 105 179 -34 26 27 58 231
4790 231 27 33 181 0 50 130 147 -68 -21 -289 -299 21 77 -55 76 -63 124 33 84 78 30 35 -160 -90 -158 -170
4816 -170 -147 104 122 147 47 23 108 30 -109 -118 29 62 -169 -28 -159 107 -61 -35 178 -53 56 117 -159 -276
$$ [...]
8191b22
##END NTUPLES=NMR FID
##END=
