##TITLE=1H_DE-27k2
 D2O
 8 sc, 
 9.10.2024
##JCAMPDX= 6.0         $$ Bruker NMR JCAMP-DX V2.0
##DATA TYPE= NMR FID
##DATA CLASS= NTUPLES
##ORIGIN= UXNMR, Bruker Analytische Messtechnik GmbH
##OWNER= root
$$ XWIN-NMR		Version 3.5
$$ Wed Oct  9 15:45:42 2024 Russian Standard Time (UT+4h)  she@DPX200
##.OBSERVE FREQUENCY= 200.1318
##.OBSERVE NUCLEUS= ^1H
##.DELAY= (6, 6)
##.ACQUISITION MODE= SIMULTANEOUS
##.ACQUISITION SCHEME= undefined
##.AVERAGES= 8
##.DIGITISER RES= 18
##SPECTROMETER/DATA SYSTEM= spect
##.PULSE SEQUENCE= zg30
##.SOLVENT NAME= D2O
##.SHIFT REFERENCE= (INTERNAL, D2O, 0, 15.7039)
##AUDIT TRAIL= $$ (NUMBER, WHEN, WHO, WHERE, WHAT)
$$ ##TITLE= Audit trail, XWIN-NMR		Version 3.5
$$ ##JCAMPDX= 5.01
$$ ##ORIGIN= Bruker BioSpin GmbH
$$ ##OWNER= she
$$ F:/spectra/data/she/nmr/H-F/1/audita.txt
$$ ##AUDIT TRAIL=  $$ (NUMBER, WHEN, WHO, WHERE, WHAT)
(   1,<2024-10-09 15:44:11.73 +0400>,<she>,<DPX200>,
      <created by zg, POWCHK disabled, PULCHK disabled
       configuration hash MD5:
       00 E9 B6 7A A2 85 ED C7 34 08 36 98 17 FE 4E 26
       data hash MD5: 16K
       0F 4C 28 0A 80 08 C2 1F 37 32 F3 00 40 43 68 58>)
$$ ##END=
$$ 
$$ hash MD5
$$ 1F E3 6F 57 57 E8 47 C5 AA 92 D0 91 54 46 2C 57
##$RELAX= 
##$RELAX= 
##$RELAX= 
##$RELAX= 
##$RELAX= 
##$RELAX= 
$$ Bruker specific parameters
$$ --------------------------
##$DU= <F:/spectra>
##$EXPNO= 1
##$NAME= <H-F>
##$PROCNO= 1
##$TYPE= <nmr>
##$USER= <she>
##$AMP= (0..31)
100 100 100 100 100 100 100 100 100 100 100 100 100 100 100 100 100 100 
100 100 100 100 100 100 100 100 100 100 100 100 100 100 
##$AQSEQ= 0
##$AQ_mod= 1
##$AUNM= <au_zg>
##$AUTOPOS= <>
##$BF1= 200.13
##$BF2= 200.13
##$BF3= 200.13
##$BF4= 200.13
##$BF5= 200.13
##$BF6= 200.13
##$BF7= 200.13
##$BF8= 200.13
##$BYTORDA= 1
##$CFDGTYP= 0
##$CFRGTYP= 5
##$CHEMSTR= <none>
##$CNST= (0..31)
1 1 145 1 1 1 1 1 1 1 1 1 1 1 1 1 1 1 1 1 1 1 1 1 1 1 1 1 1 1 1 1 
##$CPDPRG= <>
##$CPDPRG1= <>
##$CPDPRG2= <>
##$CPDPRG3= <>
##$CPDPRG4= <mlev>
##$CPDPRG5= <mlev>
##$CPDPRG6= <mlev>
##$CPDPRG7= <mlev>
##$CPDPRG8= <mlev>
##$CPDPRGB= <>
##$CPDPRGT= <>
##$D= (0..31)
0 1.2 0 0 0 0 0 0 0 0.06 0 0.03 0 0 0 0 0.0002 0 0 0 0 0 0 0 0 0 0 0 0 
0 0 0 
##$DATE= 1728474251
##$DBL= (0..7)
120 120 120 120 120 120 120 120 
##$DBP= (0..7)
150 150 150 150 150 150 150 150 
##$DBP07= 0
##$DBPNAM0= <>
##$DBPNAM1= <>
##$DBPNAM2= <>
##$DBPNAM3= <>
##$DBPNAM4= <>
##$DBPNAM5= <>
##$DBPNAM6= <>
##$DBPNAM7= <>
##$DBPOAL= (0..7)
0.5 0.5 0.5 0.5 0.5 0.5 0.5 0.5 
##$DBPOFFS= (0..7)
0 0 0 0 0 0 0 0 
##$DE= 6
##$DECBNUC= <off>
##$DECIM= 24
##$DECNUC= <off>
##$DECSTAT= 4
##$DIGMOD= 1
##$DIGTYP= 9
##$DL= (0..7)
0 120 120 120 120 120 120 120 
##$DP= (0..7)
150 150 150 150 150 150 150 150 
##$DP07= 0
##$DPNAME0= <>
##$DPNAME1= <>
##$DPNAME2= <>
##$DPNAME3= <>
##$DPNAME4= <>
##$DPNAME5= <>
##$DPNAME6= <>
##$DPNAME7= <>
##$DPOAL= (0..7)
0.5 0.5 0.5 0.5 0.5 0.5 0.5 0.5 
##$DPOFFS= (0..7)
0 0 0 0 0 0 0 0 
##$DQDMODE= 0
##$DR= 18
##$DS= 0
##$DSLIST= <SSSSSSSSSSSSSSS>
##$DSPFIRM= 0
$$ [...]
##$SUBNAM2= <"">
##$SUBNAM3= <"">
##$SUBNAM4= <"">
##$SUBNAM5= <"">
##$SUBNAM6= <"">
##$SUBNAM7= <"">
##$SUBNAM8= <"">
##$SUBNAM9= <"">
##$SW= 24.0689170037331
##$SWIBOX= (0..15)
0 0 2 0 0 0 0 0 0 0 0 0 0 0 0 0 
##$SW_h= 4816.95568400771
##$TD= 16384
##$TD0= 1
##$TE= 0
##$TE2= 300
##$TE3= 300
##$TEG= 300
##$TL= (0..7)
0 120 120 120 120 120 120 120 
##$TP= (0..7)
150 150 150 150 150 150 150 150 
##$TP07= 0
##$TPNAME0= <>
##$TPNAME1= <>
##$TPNAME2= <>
##$TPNAME3= <>
##$TPNAME4= <>
##$TPNAME5= <>
##$TPNAME6= <>
##$TPNAME7= <>
##$TPOAL= (0..7)
0.5 0.5 0.5 0.5 0.5 0.5 0.5 0.5 
##$TPOFFS= (0..7)
0 0 0 0 0 0 0 0 
##$TUNHIN= 0
##$TUNHOUT= 0
##$TUNXOUT= 0
##$USERA1= <user>
##$USERA2= <user>
##$USERA3= <user>
##$USERA4= <user>
##$USERA5= <user>
##$V9= 5
##$VALIST= <valist>
##$VCLIST= <CCCCCCCCCCCCCCC>
##$VD= 0
##$VDLIST= <DDDDDDDDDDDDDDD>
##$VPLIST= <PPPPPPPPPPPPPPP>
##$VTLIST= <TTTTTTTTTTTTTTT>
##$WBST= 1024
##$WBSW= 4
##$XGAIN= (0..3)
0 0 0 0 
##$XL= 0
##$YL= 0
##$YMAX_a= 194821
##$YMIN_a= -187796
##$ZGOPTNS= <>
##$ZL1= 120
##$ZL2= 120
##$ZL3= 120
##$ZL4= 120
##$ABSF1= 10
##$ABSF2= 0
##$ABSG= 5
##$ABSL= 3
##$ALPHA= 0
##$AQORDER= 0
##$ASSFAC= 0
##$ASSFACI= 0
##$ASSFACX= 0
##$ASSWID= 0
##$AUNMP= <proc_1d>
##$AZFE= 0.1
##$AZFW= 0.1
##$BCFW= 1
##$BC_mod= 2
##$BYTORDP= 1
##$COROFFS= 0
##$CY= 11.3945322036743
##$DATMOD= 1
##$DC= 2
##$DFILT= <>
##$DTYPP= 0
##$F1P= 15.6554695791079
##$F2P= 12.8336369535428
##$FCOR= 0.5
##$FTSIZE= 0
##$FT_mod= 4
##$GAMMA= 1
##$GB= 0.15
##$INTBC= 1
##$INTSCL= 1
##$ISEN= 128
##$LB= 0.24
##$LEV0= 0
##$LPBIN= 0
##$MAXI= 10000
##$MC2= 0
##$MEAN= 0
##$ME_mod= 0
##$MI= 1.114404
##$NCOEF= 0
##$NC_proc= 0
##$NLEV= 6
##$NOISF1= 3.799351
##$NOISF2= 2.8
##$NSP= 1
##$NTH_PI= 0
##$NZP= 0
##$OFFSET= 15.70392
##$PC= 1
##$PHC0= -26347.22
##$PHC1= 12.38743
##$PH_mod= 1
##$PKNL= yes
##$PPARMOD= 0
##$PSCAL= 0
##$PSIGN= 0
##$REVERSE= no
##$SF= 200.130013532006
##$SI= 16384
##$SIGF1= 3
##$SIGF2= 2
##$SINO= 400
##$SIOLD= 16384
##$SREGLST= <1H.CDCl3>
##$SSB= 0
##$STSI= 0
##$STSR= 0
##$SW_p= 3612.71676300578
##$SYMM= 0
##$S_DEV= 0
##$TDeff= 0
##$TDoff= 0
##$TI= <>
##$TILT= no
##$TM1= 0
##$TM2= 0
##$TOPLEV= 0
##$USERP1= <user>
##$USERP2= <user>
##$USERP3= <user>
##$USERP4= <user>
##$USERP5= <user>
##$WDW= 1
##$XDIM= 8192
##$YMAX_p= 0
##$YMIN_p= 0
$$ End of Bruker specific parameters
$$ ---------------------------------
##NTUPLES= NMR FID
##VAR_NAME=  TIME,          FID/REAL,        FID/IMAG
##SYMBOL=    X,             R,               I
##VAR_TYPE=  INDEPENDENT,   DEPENDENT,       DEPENDENT
##VAR_FORM=  AFFN,          ASDF,            ASDF
##VAR_DIM=   8192,          8192,            8192
##UNITS=     SECONDS,       ARBITRARY UNITS, ARBITRARY UNITS
##FACTOR=    0.0002076,     1,               1
##FIRST=     0,             0,               0
##LAST=      1.7004516,     0,               0
##MIN=       0,             -187796,         0
##MAX=       1.7004516,     194821,          0
$$ Real data points
##PAGE= N=1
##DATA TABLE= (X++(R..R)), XYDATA
0 0 0 0 0 0 0 0 0 0 -1 8 -8 8 -8 15 -16 17 -24 27 -32 40 -47 54 -62 72 -83 96 -109 123 -139 160 -179 200
32 200 -227 253 -282 316 -352 389 -433 481 -532 590 -650 722 -800 887 -984 1094 -1219 1365
50 1365 -1536 1739 -1984 2288 -2678 3193 -3918 5017 -6884 10897 -39936 116440 165286 -16419
64 -16419 -51537 -85992 -80824 94207 194821 -20243 -160107 -34877 65801 58023 83737
75 83737 1029 -153410 -69709 142206 103999 -49714 -68286 -62648 -50227 91782 134420 -62631
87 -62631 -158601 -23379 54773 44577 65441 -11486 -142765 -52914 121645 83632 -27089
98 -27089 -32042 -46888 -39132 88327 117652 -46800 -111047 -2025 50728 44106 55572 -28100
110 -28100 -131825 -32034 117348 67873 -41038 -58681 -69379 -32127 98916 101495 -67793
121 -67793 -119960 -11924 46866 56775 57424 -40060 -118638 -4447 118988 57864 -36335 -47445
133 -47445 -44730 6488 105749 67172 -84585 -97392 15379 61124 50186 22472 -70062 -108955
145 -108955 15862 109402 32237 -51595 -55407 -46312 11199 93820 43123 -80567 -69901 23170
157 23170 48829 41086 18783 -55512 -69189 40006 93754 16142 -45020 -40791 -26978 28005
169 28005 85634 20031 -85347 -62415 21831 44460 38319 7299 -69692 -72762 34544 78478
181 78478 9319 -38770 -40237 -30156 29380 78924 11032 -73323 -38983 32004 45786 37079
193 37079 -323 -66493 -47045 55094 75975 -912 -45792 -43572 -22653 40993 73908 -6661
205 -6661 -82180 -39305 26561 37726 30713 -9058 -68528 -38721 53921 58069 -10319 -37708 -30295
218 -30295 -8646 47625 62037 -18799 -69536 -15362 39602 41306 25772 -19593 -66732 -22960
230 -22960 60787 51406 -16651 -41259 -35169 -10580 45460 51361 -27845 -65889 -12578 30430 30210
243 30210 18386 -22539 -57879 -7588 61753 38413 -22002 -34858 -23131 5930 54941 42903
255 42903 -36752 -59364 -521 37227 33431 15916 -30386 -58925 -2701 57650 27833 -25872
267 -25872 -33642 -24705 2678 46396 29281 -41951 -48915 8586 33621 24119 8034 -31985 -46433
280 -46433 14598 61380 20021 -28651 -29556 -16333 13842 52563 24131 -45287 -44780 11086 31002
293 31002 21920 5449 -34623 -45308 15109 51088 8006 -30819 -25674 -12775 14858 44765
305 44765 10793 -48441 -33647 21411 33869 19590 -701 -36649 -34693 27750 53603 5510
317 5510 -30448 -24428 -10303 18864 43745 5963 -47429 -28850 19643 25781 11907 -5745 -35830
330 -35830 -28345 28625 42634 -5803 -32112 -19354 -2999 23806 39295 -3512 -47633 -20062
342 -20062 27253 29223 13159 -6950 -35049 -21867 32674 40411 -7525 -29325 -16735 -2527
354 -2527 21436 31944 -9395 -44931 -13375 26380 21520 4386 -13818 -33951 -13034 36487
366 36487 33494 -14879 -30796 -13371 4403 27709 30699 -13870 -42244 -7305 28838 22146 5485
379 5485 -13102 -30745 -8009 34745 25628 -17790 -27014 -9463 5694 23569 20088 -21421 -38579
392 -38579 -277 28876 17306 -681 -17694 -29119 -744 37780 22578 -19015 -24602 -7456
404 -7456 8084 26371 19523 -20857 -32719 3834 26433 13874 -1683 -17027 -24985 3937 34466
417 34466 12942 -23924 -22736 -3993 10712 24745 11697 -27923 -30709 8820 27394 12701
429 12701 -3452 -19422 -22689 9467 35503 10908 -22547 -18358 -1525 11613 23702 7625
441 7625 -27018 -23524 13571 24105 6871 -7711 -20455 -18335 13926 31742 2007 -26213 -17475
454 -17475 826 14096 22650 2553 -28946 -19873 15544 22944 6850 -6554 -18404 -13965 16768
467 16768 28808 -790 -22607 -11542 3348 14120 18844 -2920 -28661 -14022 18516 19588
479 19588 2146 -11011 -20704 -11309 19916 25912 -5824 -23892 -10816 3926 15571 18516 -5022
492 -5022 -27087 -8880 19912 17137 1043 -9605 -17056 -6059 21552 20868 -9947 -21989 -6585
505 -6585 6951 15429 14236 -10886 -27851 -5392 20326 14610 -1467 -12341 -18327 -3776 22453
518 22453 17882 -11400 -19281 -4871 6547 15388 12198 -11490 -22798 549 20728 11791 -2780
531 -2780 -11919 -15083 1423 23267 13051 -15040 -19112 -3309 8644 15584 8829 -15583 -22774
544 -22774 2174 19514 9605 -3919 -12180 -14289 3617 22166 9156 -14910 -14990 232 9672
557 9672 14715 5599 -16542 -17596 7630 19707 6839 -6548 -13331 -12051 6822 21865 4791
570 4791 -17782 -14212 252 9141 13771 2804 -17918 -15354 8672 16896 4232 -6302 -11862
583 -11862 -9202 9815 20024 1685 -16727 -10016 4026 10719 12749 7 -18430 -12313 11513
596 11513 15947 2686 -7494 -13222 -8695 10696 18180 -1698 -16892 -8929 3099 9464 10920
609 10920 -2273 -17888 -8235 12833 13311 371 -7708 -11300 -4784 14012 16543 -4443 -16320
622 -16320 -5910 5290 10749 10448 -5109 -18445 -6240 13471 11386 -1027 -7648 -11769 -4163
635 -4163 13665 12911 -7191 -15014 -3748 5671 9949 8169 -6868 -17010 -1779 15313 10108 -2255
649 -2255 -8592 -10528 -468 15916 11833 -9322 -14294 -2434 5978 9810 7008 -9179 -16624 187
663 187 14426 6861 -3906 -8285 -9313 1047 15411 8027 -11272 -12194 1009 7473 9260 4681
677 4681 -10744 -14114 4168 15311 5491 -4744 -7990 -8227 3368 14950 6037 -12327 -10372 1251
691 1251 5991 7978 2783 -11171 -12418 5034 13040 2577 -5633 -7300 -6479 4789 14708 3229
705 3229 -12515 -8614 2657 7373 8298 2124 -11512 -10888 6900 12996 2155 -5250 -7502 -6184
719 -6184 5447 13588 1042 -12716 -7448 3250 6547 6734 -321 -12555 -8677 8916 12292 131
733 131 -6603 -7373 -3880 7788 13328 -863 -13064 -5830 4862 7439 6412 -1380 -12214 -6131
747 -6131 9520 10136 -1429 -6549 -6591 -2482 8117 10442 -3874 -12703 -3414 5561 6397 4302 -3480
762 -3480 -11603 -3666 10297 8835 -2170 -6302 -5906 -1182 8580 9605 -4211 -11132 -2210 5402 6191
777 6191 3943 -3791 -10829 -2329 9603 6999 -3333 -6678 -5425 -388 8738 7138 -5697 -10562
791 -10562 -1166 5763 6068 3406 -5029 -10327 -660 10812 6354 -3433 -5990 -4525 926 9186 6527
806 6527 -6930 -9296 254 6150 5173 1672 -6296 -9195 1289 10519 4441 -4838 -6331 -3958 2461
821 2461 9353 4218 -8080 -8172 1455 6375 5198 1082 -6375 -8069 2786 9823 2608 -5234 -5317 -2853
837 -2853 3124 8738 2479 -8532 -6918 2607 5776 4339 146 -7369 -6685 3941 9257 1662 -5272
852 -5272 -5330 -2574 3901 8787 1279 -8824 -5510 3340 5858 3587 -706 -7137 -5276 5038 8554
867 8554 241 -5651 -4813 -1471 4378 7800 -510 -8892 -4454 3847 5876 3244 -1646 -7476 -4102
882 -4102 5960 7454 -517 -5187 -4202 -990 5234 7070 -1597 -8381 -2969 4514 4876 2573 -2450
897 -2450 -7065 -3001 6812 6587 -2008 -5742 -3797 413 5689 5923 -2836 -8693 -2108 4682 5000 1880
913 1880 -3034 -7243 -1586 7185 5668 -2485 -5548 -3030 839 5824 5208 -3740 -7903 -388 4995
928 4995 4098 1025 -3880 -6848 -405 7459 4440 -3506 -5137 -2650 1321 6170 3669 -4769 -7302
943 -7302 257 4937 3779 424 -3963 -5989 1055 7364 3417 -4115 -4645 -1793 1982 5996 2970
958 2970 -5498 -6173 1554 5323 3023 -151 -4396 -5446 1944 7707 2019 -4189 -4389 -1541 2627 6007
974 6007 2098 -5970 -5188 2191 5221 2308 -1087 -4796 -4269 2909 7049 1330 -4999 -3783 -909 2894
990 2894 5309 873 -6329 -4380 2814 4494 1952 -923 -4615 -3629 3502 6531 -42 -4666 -3288
1005 -3288 -109 3344 5057 6 -6140 -3176 3322 4497 1298 -1777 -4787 -3007 3967 6072 -768
1020 -768 -5051 -2875 232 3401 4546 -955 -6166 -2717 3799 4139 1063 -2090 -4773 -2048 5025
1035 5025 5063 -1363 -4795 -2269 927 3832 4237 -1881 -6156 -1510 4305 3615 417 -2499 -4684 -1068
1051 -1068 5176 4345 -2146 -4731 -1544 1429 3617 3354 -2582 -5622 -571 4232 3009 -353 -2524
1066 -2524 -3770 -487 5249 3452 -2692 -4147 -854 1658 3609 2441 -3261 -5055 200 4298 2593
1081 2593 -487 -2437 -3918 247 5229 2681 -3009 -3597 -248 1528 3917 1987 -3472 -5005 744
1096 744 4468 2036 -1196 -3147 -3589 993 5302 2252 -3679 -3839 -479 2071 3894 1697 -4137 -4580
1112 -4580 1394 4600 1739 -1260 -2996 -2951 1634 5334 1547 -3971 -3083 154 2509 3207 567 -4564
1128 -4564 -3651 2329 4139 959 -1595 -2874 -2232 2139 4759 139 -4056 -2150 538 2522 3186 196
1144 196 -4386 -2581 2535 3816 276 -1778 -2948 -2027 2617 4424 -412 -3912 -2229 449 2490
1159 2490 2974 -245 -4434 -2395 3037 3480 425 -1924 -2996 -1501 3119 4012 -837 -3784 -1955 821
1175 821 2643 2709 -972 -4197 -1360 3187 3203 284 -2137 -2902 -681 3959 3378 -1855 -3785 -1128 1306
1192 1306 2824 2575 -1665 -4354 -782 3567 2653 -389 -2240 -2426 -441 3194 2983 -2050 -3462 -332
1208 -332 1643 2447 1563 -1979 -3747 -24 3390 2586 -773 -2432 -2513 238 3684 2339 -2287 -3061 -354
1225 -354 1781 2569 1132 -2401 -3501 598 3376 1858 -779 -1888 -2353 417 3761 1854 -2738 -2843
1241 -2843 -139 1826 2688 867 -2451 -3536 1099 3610 1148 -1559 -2230 -1958 996 3802 1087 -3067
1257 -3067 -2748 529 1860 2384 437 -2778 -2897 1603 3359 778 -1659 -2198 -1371 1739 3451 701
1273 701 -3040 -2242 783 2166 1940 -42 -3036 -2575 1925 3034 298 -1778 -1970 -1095 1775 3120
1289 3120 -356 -3147 -1678 941 2058 1843 -613 -3208 -1811 2177 2752 382 -1708 -2092 -810 2512
1305 2512 3087 -460 -3179 -1435 1237 2000 1746 -814 -3374 -1199 2517 2332 -212 -1885 -1829 -609
1321 -609 2451 2769 -974 -3121 -1040 1315 1900 1575 -1273 -3064 -678 2714 2331 -436 -1762 -1953
1337 -1953 22 2634 2361 -1533 -2854 -392 1521 2096 1073 -1329 -3021 -375 2756 1733 -646
1352 -646 -1714 -1592 210 2360 1849 -1921 -2810 -189 1726 1456 1072 -1870 -2690 538 2883 1503 -1183
1369 -1183 -1758 -1140 590 2716 1107 -1924 -2352 -28 1684 1622 430 -1965 -2428 950 3047 1193
1385 1193 -1257 -1979 -918 944 2910 961 -2076 -2358 573 1700 1672 39 -2240 -1934 1071 2788
1401 2788 499 -1354 -1653 -899 1128 2520 220 -2609 -1460 612 1816 1028 -146 -2071 -1402 1371
1417 1371 2425 323 -1500 -1270 -727 1320 2387 209 -2598 -1301 937 1497 1196 -142 -2141 -1136
1433 -1136 1783 2220 -267 -1584 -1450 -380 1704 2173 -211 -2203 -986 830 1473 738 -796 -2036
1449 -2036 -906 1855 2235 -645 -1686 -1282 -261 1824 1808 -1003 -2688 -582 1130 1662 799 -1019
1465 -1019 -1937 -296 1869 1672 -749 -1478 -1154 415 2023 1604 -759 -2329 -231 1157 1416 667 -944
1482 -944 -2202 -136 1902 1524 -834 -1522 -1138 706 1604 1324 -1517 -1811 -237 1517 942 439 -1329
1499 -1329 -1654 376 2079 985 -1007 -1311 -725 639 1879 836 -1751 -1667 -119 1546 897 -43 -1388
1516 -1388 -1553 434 2291 781 -1064 -1426 -444 590 1731 539 -1822 -1478 523 1599 946 25
1532 25 -1564 -1575 1025 2209 830 -1295 -1146 -450 745 1653 242 -2003 -1089 806 1316 891 -156
1549 -156 -1504 -1228 785 1756 182 -1228 -867 -110 924 1659 -25 -1961 -939 725 1345 668 -136
1566 -136 -1157 -786 1080 1730 -112 -1411 -1026 -141 920 1528 -448 -1582 -662 981 973 640 -864 -1358
1584 -1358 -550 1211 1855 -438 -1326 -683 -90 1183 1544 -528 -2013 -835 1164 1460 241 -660 -1307
1601 -1307 -310 1528 1531 -458 -1230 -694 60 1042 1425 -701 -1843 -330 1379 993 185 -651 -1461 -152
1619 -152 1612 1287 -788 -1337 -471 548 1047 1058 -881 -1847 193 1199 553 -16 -646 -974 107 1629
1637 1629 889 -948 -1129 -415 436 1049 758 -1227 -1420 244 1407 510 191 -1060 -1096 538 1519 744
1655 744 -897 -936 -135 506 965 410 -1299 -1140 384 884 493 -95 -966 -1054 583 1481 434 -1058 -751
1674 -751 -354 489 1051 127 -1268 -734 544 1357 407 -118 -948 -658 647 1501 285 -1003 -648 -30
1692 -30 489 769 344 -1433 -773 699 835 352 -400 -1140 -436 815 1436 -36 -1287 -548 91 891 1018
1711 1018 -145 -1235 -619 1157 997 276 -598 -1203 -252 1069 1331 -385 -1277 -449 267 475 741 -125
1729 -125 -1191 -362 538 732 73 -741 -1179 -211 1114 1048 -290 -1098 -403 566 842 816 -555 -1145 -230
1748 -230 662 732 -65 -521 -728 -113 779 663 -1003 -1132 -254 357 599 740 -578 -929 9 642 602 -112
1768 -112 -494 -465 18 1169 169 -857 -1038 -258 374 599 348 -553 -910 182 945 641 -372 -568 -719
1787 -719 125 892 541 -1030 -923 -47 592 943 171 -723 -673 572 909 316 -206 -620 -711 556 1061 495
1807 495 -897 -244 243 785 886 64 -874 -685 191 1183 239 -521 -478 -184 497 1150 -94 -844 -626 142
1827 142 520 618 -269 -1021 -450 596 688 -19 -601 -644 -71 580 908 -215 -734 -573 256 493 559 -291 -857
1848 -857 -270 707 355 203 -556 -608 -232 558 984 -133 -837 -332 252 586 568 -524 -721 -335 705 769
1868 769 -103 -536 -314 -72 708 750 -334 -918 -272 540 546 639 -244 -883 -326 619 802 -98 -472 -519 -47
1889 -47 654 696 -466 -943 -312 582 557 69 -568 -535 0 856 608 -141 -476 -494 -159 906 466 -317 -772
1910 -772 -89 513 282 197 -803 -693 75 589 351 -360 -629 -229 204 889 406 -644 -548 -169 33 883
1930 883 -16 -755 -622 401 721 580 -412 -471 -103 235 876 236 -679 -688 421 225 306 79 -510 -312 346
1951 346 516 -78 -279 -447 -238 291 658 -131 -506 -328 506 704 200 -209 -868 -307 454 758 44 -559
1971 -559 -279 -88 373 461 -184 -799 -162 524 555 -64 -246 -510 -514 362 530 -4 -429 -421 -327 691 404 -218
1993 -218 -669 -62 453 373 228 -496 -804 -391 448 117 -273 -327 -333 -139 668 326 -269 -657 -245 539 192
2014 192 193 -336 -570 82 425 434 -251 52 -22 155 660 120 -424 -659 133 314 622 -130 -453 -583 -438 793
2036 793 418 -457 -301 -158 282 736 352 -216 -241 -71 579 409 -477 -311 -493 189 646 651 -397 -539 -192
2057 -192 242 514 -33 -418 -423 -79 465 195 186 -565 -135 47 302 9 -311 -55 -439 360 580 215 -562
2078 -562 -431 224 549 131 78 -188 -463 307 503 -24 -500 -428 -23 374 398 -107 -633 -156 198 320 113
2099 113 -19 -384 -408 329 652 31 -205 -189 -130 356 543 21 -553 -72 20 474 206 -36 -465 40 243
2120 243 262 -121 -512 -135 219 278 506 -292 -658 -120 410 391 -145 -336 -317 -270 388 414 -149 -430 -78 60
2142 60 464 467 -577 -148 4 578 232 159 -526 -471 248 538 238 -396 -410 20 97 392 253 -109 -190 12
2164 12 342 -72 -165 -166 -92 -174 193 282 -281 -239 -233 195 416 56 -168 -419 51 78 323 227 -528 -553 71 482
2188 482 -101 -528 -546 204 68 571 17 -272 -413 143 488 219 42 -371 -150 338 671 -186 -348 -274 141
2209 141 235 532 -28 -732 -345 216 -5 92 -124 -234 -129 406 484 91 -77 -202 88 413 336 -193 -228 -128
2231 -128 214 220 94 -319 -182 -393 247 240 -77 -538 -393 -171 231 261 -14 -194 16 489 37 -112 -39 -453
2253 -453 233 293 91 9 -207 -45 -29 255 237 -378 -508 197 242 278 -87 -207 -56 99 109 229 -320 -281 27
2276 27 47 188 224 -455 -150 -72 310 -7 -249 -170 -311 146 547 65 -287 -330 -113 86 231 290 -265 -152
2298 -152 151 475 102 -312 -277 -189 22 321 -59 -235 -72 38 30 282 -4 -369 -84 295 424 -240 -47
2319 -47 -291 -82 151 668 158 -94 -213 117 360 268 6 -536 -122 390 -37 -358 -100 44 353 68 133
2340 133 -74 -728 -334 -193 382 282 -72 -215 -34 82 359 -23 -228 -239 240 304 502 -151 -190 -273 62
2361 62 302 63 75 -333 68 475 252 -62 -4 -160 27 461 138 -409 -358 -150 190 136 -323 -346 -395 -1
2383 -1 190 -51 227 -327 -53 79 484 111 18 -15 139 115 -42 50 -145 -234 14 176 4 -375 -203 -134 64
2406 64 295 393 -210 -124 -259 -8 157 -185 -240 -77 374 297 213 -108 -329 -138 -3 498 -23 -156 108 48
2428 48 -11 13 -54 -23 -158 -31 392 -73 -185 -164 210 6 419 67 93 533 91 146 102 -100 63 -83 294
2451 294 79 -51 -186 14 29 373 -116 -206 -169 -138 411 330 252 -51 -426 -59 40 88 -228 38 105 127 204 157
2475 157 203 -320 277 -79 193 -2 -330 17 -325 158 479 0 240 -133 -9 76 210 -296 -202 -159 193
2496 193 224 -188 -420 -319 16 48 99 -229 -12 9 -58 323 162 -80 -103 296 251 148 -105 -252 127 -141
2518 -141 360 -35 -236 39 -247 296 41 -84 -3 -42 103 -10 304 -254 -445 -324 -16 116 65 29 -81
2539 -81 -25 178 105 271 -194 -256 127 136 -53 208 -91 158 260 121 243 -115 249 -615 -97 321 138 -53
2561 -53 56 179 148 49 -251 91 159 106 479 107 -324 -57 -72 221 71 -92 -174 -422 16 236 -250 223
2583 223 -170 -87 299 260 -68 -110 -97 -44 306 213 222 -31 -140 281 -132 220 226 -402 161 220 151 -135 75 -20
2607 -20 104 -5 88 157 -37 392 174 565 470 -195 -290 160 1 5 152 -77 55 -53 -192 239 -137 -323
2629 -323 -132 4 198 95 -161 -212 -276 308 12 -343 -269 -116 30 322 -3 248 -343 103 328 -44 -157
2650 -157 -182 -212 88 199 287 58 -197 -165 -391 234 -163 -97 -103 -256 266 249 114 -31 -236 -30 409 117 16
2673 16 -168 -34 159 490 -186 -185 -139 48 -176 10 207 -259 -299 116 252 -322 -83 -145 185 216 152 -9 -138
2696 -138 0 391 124 -7 -116 -222 25 -199 319 -123 -210 -178 91 687 -155 -24 8 -68 1 210 27 7
2718 7 -53 -97 538 121 124 -231 -174 -177 -192 161 65 -431 -32 155 151 -253 125 -354 -296 178 28 -105 -267 -178 -39
2743 -39 -177 -42 -165 -376 78 -52 -13 -152 -336 -149 10 71 8 -170 -178 189 82 -92 340 -290 -315 15
2765 15 27 420 196 25 28 224 -3 -153 99 -118 272 128 119 52 -169 -2 207 122 339 -10 -51 -386 -155
2788 -155 -26 60 60 6 -292 -199 376 93 -270 -71 277 495 244 99 -202 139 -28 138 354 -212 -12 -172
2810 -172 44 -252 -256 19 64 9 -81 -63 15 -352 -4 67 260 -226 -174 254 -43 71 64 -121 -121 -105 336 114 -112
2835 -112 -146 147 -14 -32 15 147 -271 87 198 291 -30 37 -89 -142 243 -81 -37 -121 -318 112 195 -59 30
2858 30 153 -123 54 423 140 -211 -248 -97 90 293 -215 -473 -101 169 56 24 -100 -290 41 246 169
2879 169 -183 -103 -115 40 259 -42 -43 -142 -149 245 154 -198 24 -134 117 437 -128 -152 82 -38 -60 315 23
2902 23 85 187 42 130 -78 -101 -80 -104 -82 154 80 -261 -228 -60 10 104 -21 -240 267 -122 125 92 -98 91
2926 91 -35 -151 -25 248 19 167 44 9 311 -13 276 170 -216 163 -203 102 -59 104 73 146 69 -71
2948 -71 33 -108 325 44 -84 -283 105 142 465 192 -20 -284 -10 138 80 -21 -126 -199 -90 185 118 12
2970 12 -196 292 228 56 -41 -33 20 172 -38 217 157 56 18 109 195 310 -308 -182 -282 20 -82 -281 -117
2993 -117 -229 70 64 366 90 -165 15 26 19 -65 -31 72 0 69 356 285 -13 -311 58 68 9 190 -141 -87
3017 -87 17 187 -216 -95 -357 319 30 283 33 -412 -192 -125 -208 10 -219 -80 0 -21 0 -96 53 -93
3039 -93 -33 -133 79 -267 -52 -21 41 187 290 -24 2 151 241 338 277 -26 143 176 357 187 -345 -133 -242
3062 -242 116 164 22 -60 -147 -38 363 261 200 -314 267 27 62 75 -216 162 107 120 -51 107 -92 150 -12
3085 -12 25 -6 -317 -257 -109 40 -34 -101 -180 96 111 19 98 -208 -164 263 -20 137 78 -376 -54 -66 47 57 -89
3110 -89 -68 -324 -2 24 131 122 60 -106 -99 47 -134 191 -136 -109 -26 161 121 95 -23 56 -2 216 -27 -211 17
3135 17 12 -100 -4 -193 -93 -56 72 92 -153 -98 94 138 36 71 130 -393 -140 315 -116 30 -217 -197 -13 104
3159 104 -58 -187 97 -121 24 -69 -134 -65 33 257 115 113 86 -239 -40 372 265 -59 -85 18 -8 364 -163
3182 -163 -191 -208 -95 -215 1 63 -220 -173 -142 68 -37 -185 -33 -41 211 -21 -201 -39 -166 -117 -77 -49 -197
3205 -197 21 66 70 160 9 -158 -45 -193 184 225 159 -259 161 -208 -17 155 -188 45 300 6 121 18
3227 18 -233 -136 -121 -40 -311 -145 -208 -422 -12 -25 335 -32 -286 142 45 138 -11 16 -1 12 300 -55 226 -201
3251 -201 247 113 55 -63 107 -16 -292 204 158 187 -91 29 25 -125 82 -79 -210 -113 -17 5 -121 41 -498
3274 -498 99 -121 -24 -391 -78 5 -121 28 -194 127 -39 99 4 -58 -97 -211 151 340 360 36 -34 -214
3296 -214 -210 69 -29 -33 -163 100 -8 37 129 -101 16 -4 -66 196 303 -270 -109 148 -9 -94 79 -331 -61
3319 -61 219 -14 175 -67 -108 -163 100 213 -114 -286 -270 202 -44 159 -119 75 -287 339 335 141 133 154 100
3342 100 157 33 470 -297 -123 -120 -111 -119 -96 200 -74 360 -125 -83 158 -279 97 38 -50 20 -171 -53 -84 30
3366 30 151 -10 132 -142 280 112 -5 -183 -246 -77 318 99 -36 31 164 265 74 -79 -297 -177 -32
3387 -32 181 -149 -53 -95 -286 322 40 -161 -34 -219 -199 18 -66 144 37 -185 -82 137 105 93 -55 18 160
3410 160 -136 162 -58 -332 -181 -306 -29 176 -117 -310 -49 -89 -52 -116 -165 174 -77 -1 11 8 -154 -44 27
3433 27 -15 58 -178 110 -4 -97 236 40 -32 424 -142 92 -48 -174 298 -11 254 56 -43 -170 -3 146
3455 146 354 148 -143 -466 -119 79 47 53 -40 -58 200 123 -203 33 76 16 222 143 159 -301 -74 -166 286 -57
3479 -57 -192 104 218 24 121 240 8 -97 -11 -90 128 -17 285 -90 -215 236 128 -122 -1 -7 -81 59
3501 59 70 -48 139 -45 -52 160 -16 -116 -339 306 -95 68 102 -334 -166 130 170 -176 -73 -210 -113 200
3523 200 -30 6 22 103 33 236 -290 -152 219 -167 137 22 -91 -202 -302 420 54 -212 -109 -69 -7 1 105
3546 105 -24 35 -108 25 155 21 -127 -319 -169 164 -191 -30 75 -249 33 67 -156 -85 -338 -32 305
3567 305 118 305 -47 -25 137 145 226 -14 -77 -101 -228 -88 -91 389 59 -476 89 -269 271 -402 -5 400 27
3590 27 219 -11 3 -456 107 121 -75 -79 -210 -68 -20 354 -233 -210 -495 -52 76 149 365 -194 -46 -45 475
3613 475 6 -20 -234 -103 82 70 -62 -476 -272 277 130 162 18 -177 -282 -25 19 284 -101 -84 71 5
3635 5 128 -143 -290 -184 5 317 119 -335 -58 -269 190 416 -117 -20 -151 77 213 107 -31 -200 -492
3656 -492 213 185 202 27 -301 -79 341 4 -279 64 19 277 313 305 -38 -163 -227 126 273 267 -161 -103 -197 35
3680 35 -12 -62 -112 -190 -49 -89 -6 61 -347 256 138 -50 -111 -104 -86 -288 185 63 307 -70 -233 156 204 -121
3704 -121 -108 -445 85 104 8 157 -209 -84 23 177 314 -281 -86 -3 110 308 -214 -265 -168 43 374 149
3726 149 83 -228 -203 386 111 25 -150 -17 83 114 386 -163 13 -87 -162 199 99 51 -51 -217 -342 92
3748 92 -95 147 -232 -15 -2 247 126 -352 -113 -26 -76 -36 84 -225 327 -91 74 -11 0 -141 -302 257
3770 257 27 197 -248 152 21 -199 3 -225 -94 -198 213 278 -28 61 86 100 277 -145 -227 -173 54 301
3792 301 8 -203 -48 -16 104 283 138 -12 -37 -169 65 162 -119 -166 -191 -365 344 7 -286 -173 -177 20
3814 20 6 -6 39 -439 46 124 194 122 -191 -393 142 136 -130 -42 -30 -205 112 31 -168 449 -165 -46 253 190
3838 190 60 -81 -20 -111 223 263 -62 -112 -138 166 120 18 -12 -6 85 -203 177 -226 -312 -95 138 155 31 -244
3862 -244 32 159 -132 -50 34 -212 -204 526 385 130 -38 -132 143 313 157 -136 205 -291 -97 146 302 -37
3884 -37 74 256 237 -242 9 -271 -104 -53 30 87 -18 -492 -312 101 335 255 -56 -139 -131 -32 129 354 -89
3907 -89 -148 -172 361 444 47 -13 -241 -126 231 10 78 -80 -9 -140 69 -14 -220 -293 -80 -45 153 -6 17 -75
3931 -75 -32 -42 107 -142 -479 45 70 170 288 -269 -258 -12 -63 12 -53 -31 -183 -37 390 83 111 -80 30
3954 30 165 140 -83 421 141 -29 327 -189 -170 -366 -48 89 154 35 -212 -379 -102 -151 91 54 44 -86
3976 -86 204 19 108 184 -367 -190 43 350 43 -245 16 -82 -20 80 -107 -308 64 94 225 329 65 80
3998 80 -176 275 329 107 -45 -263 192 102 207 370 -127 105 -256 222 30 -217 -258 11 -174 -20 37 -127
4020 -127 -71 16 -129 -23 90 -12 45 91 183 -113 -112 -215 -77 -30 -152 -276 106 206 172 335 -203 -133 10
4043 10 -83 -32 152 -27 188 -35 96 61 322 -20 176 176 -41 59 -329 -130 -93 90 319 -116 -55 -93 -194
4066 -194 -56 267 55 34 -206 -245 117 96 155 -193 91 58 -41 50 -74 -1 84 -128 84 421 94 -106 14
4089 14 -78 -10 107 -259 -42 68 -223 125 -362 0 -299 54 97 56 -158 -329 201 0 -212 12 -90 -391
4111 -391 90 146 -39 -310 -224 7 -48 332 221 -344 -128 69 53 206 237 -75 -141 -135 431 471 267 -17 -24 -5
4135 -5 -268 -44 -7 8 -35 158 106 -113 -420 -30 56 189 -98 -18 -195 13 184 159 -226 -33 -46 117 56 -52
4159 -52 -136 -79 -126 -45 96 125 -101 -189 -242 -50 -31 -68 -95 -271 -9 217 100 -43 80 136 -12 27 164 -25
4183 -25 -307 -13 52 -128 219 -185 131 -94 -473 266 -119 -33 -257 160 448 168 99 147 271 234 625 87
4205 87 -30 39 11 30 140 97 -324 -159 -169 100 -52 -169 -41 -42 178 57 -59 263 -90 -48 424 4 92
4228 92 130 114 124 25 -195 -26 69 -148 154 18 -90 241 15 43 277 -8 -58 -63 -50 61 -290 -198 -110 -111 -45
4253 -45 196 -92 -13 35 36 -160 98 -86 -267 43 -28 241 53 -102 247 -345 -211 -77 -3 -196 -340 231
4275 231 130 279 -31 -191 168 261 388 -103 6 -64 -123 530 -26 75 -261 -184 78 -119 213 -113 -44 68
4297 68 58 -163 102 -89 -357 -83 -107 -170 285 102 -73 123 352 98 136 -297 52 128 348 357 -211 -496 -110
4320 -110 -41 146 -86 -143 11 61 141 162 -293 128 -205 42 267 91 -60 50 -10 40 314 78 -143 -48 132
4343 132 102 -20 -391 200 69 216 20 23 -116 73 254 62 -75 -100 34 -273 -118 -128 -219 2 -112 -216
4365 -216 74 139 -95 -105 -138 76 331 208 -94 -313 -143 144 206 113 -116 -13 71 596 -3 40 320 -77
4387 -77 -16 342 48 -81 -74 258 71 351 54 99 -81 -41 434 -294 76 -88 -115 -576 150 -15 -77 233 -106
4410 -106 152 -132 -99 -113 -251 -107 159 75 19 -55 -18 -76 155 179 41 103 64 149 131 -120 -173 46 108 -88 35
4435 35 56 17 151 207 -17 -52 0 74 -54 75 91 70 -48 166 201 195 -105 -22 174 165 147 93 59 -98 -23 -15 125
4462 125 27 -130 335 -233 85 239 124 -539 -161 158 32 365 160 20 83 131 32 -7 -28 -164 -104 80
4484 80 -50 -314 205 -14 95 103 -96 36 -221 90 271 -75 23 -3 -172 255 103 4 64 -255 -100 150
4506 150 79 54 -16 -219 -337 66 124 -153 -269 153 -9 -100 77 22 42 -67 72 296 -94 42 -127 -53 201
4529 201 68 -159 -15 -246 -328 -7 149 197 -229 -191 -271 191 -129 -141 -27 31 -222 28 -142 -258 58 54 83
4552 83 128 -242 149 306 174 228 144 -243 -210 53 -88 287 -95 -66 -59 60 -14 57 -130 -143 -82 -5 -26 43 -21
4577 -21 172 -64 -31 -33 98 -347 -466 153 247 1 -238 86 286 144 130 -47 -308 26 8 296 -93 -142 -69
4600 -69 -245 238 54 73 -238 -121 246 85 244 155 -226 -40 225 74 50 -496 -72 25 137 280 -51 75
4622 75 25 -42 306 84 4 -263 -70 214 4 -225 594 51 -214 297 276 32 -59 93 -97 43 123 20
4644 20 -265 -181 -52 74 -92 17 -71 -43 78 244 59 -113 218 129 13 69 -142 -179 -110 193 156 134 -61
4667 -61 -209 222 -43 98 160 -46 127 126 -50 122 -188 -277 21 -310 158 109 -246 81 65 195 168 -69 -63
4690 -63 -110 -144 -186 80 -144 27 -169 95 233 137 -31 -234 -30 83 47 -174 89 338 -130 -1 57 430
4712 430 -293 154 -48 -33 0 -47 54 75 -53 170 -195 0 68 95 -119 17 152 -205 189 30 -144 -255
4734 -255 -307 -425 -78 141 126 -183 -74 -156 490 319 -137 122 -218 260 128 -12 160 1 255 98 128
4755 128 136 -276 -530 161 373 193 115 -275 124 93 43 63 -172 -47 10 -53 243 -146 114 10 278 165 176
4778 176 137 109 65 -73 -112 -189 -207 140 233 -190 4 -139 -179 56 204 266 359 -85 84 144 -20 252 -102 -249
4802 -249 138 159 34 -86 -200 17 -85 53 309 -104 -184 -5 208 98 -62 81 40 46 -108 243 -58 291
4824 291 -391 -151 17 -171 120 285 -291 17 281 169 81 -84 -144 142 311 -268 -252 -228 -130 319 -161 -57
4846 -57 14 -28 104 491 185 99 190 -115 -125 67 90 -147 -181 -84 -22 71 212 -217 -204 151 121 410 208 -166
4870 -166 -160 26 293 -61 -35 -47 -40 67 70 -158 145 -109 -139 130 -21 -97 -126 289 -15 17 -155 -15 -26 -14 92
4895 92 -92 39 -196 -127 305 64 -48 -268 -206 136 154 -60 -170 -6 -148 51 -3 -226 24 143 -43 -270
4917 -270 60 22 -173 -93 10 57 138 212 -316 -84 138 -57 -110 -226 -173 -7 268 270 -13 -316 -271 187 73
4940 73 69 -93 -249 -194 139 353 57 -329 163 91 -71 -325 -66 -73 -101 282 107 109 22 -211 53 389 130 243
4964 243 -106 -105 113 338 101 -177 -23 -227 156 380 18 -116 214 15 -270 -16 101 -135 140 22 222
4985 222 223 -221 -136 -122 -153 318 -209 -40 0 -141 368 93 -6 42 -140 -158 -39 -214 242 -156 227 47 404
5008 404 -31 -203 46 -146 212 26 129 26 -129 218 -179 10 177 -138 319 393 -145 -309 -471 58
5028 58 8 68 119 -247 299 54 -60 242 86 -200 -259 455 5 163 -27 -336 -527 -9 129 -3 -257 -17
5050 -17 -99 -56 -19 -178 -108 -306 178 -12 -147 -23 -90 -24 377 58 -211 -108 -101 15 11 -215 -61 33 -21 -64 74
5075 74 -59 141 -199 -162 -13 -32 -40 75 -245 -125 -4 20 -55 -101 -120 162 -216 120 -232 -57 -158 139 26
5098 26 -255 -229 -100 12 71 -50 -27 -172 -38 317 -165 102 -518 37 -63 18 10 -111 115 132 2 408 -110
5121 -110 -105 -166 53 38 166 -188 23 42 -148 251 72 -154 102 244 7 163 27 -368 -140 -97 -92 -216 -138
5144 -138 -177 134 -119 -6 -27 -140 -81 -28 111 70 194 -163 114 107 128 -45 59 -47 336 85 67 54 -51
5167 -51 118 81 55 75 179 -56 -31 45 -65 -19 -15 -142 45 68 195 211 -78 -109 86 404 -107 -185 -95 -160 -22
5192 -22 194 -15 -240 4 222 -36 5 56 -192 -53 -144 249 183 -183 -80 162 325 103 143 -283 -57 -241
5214 -241 145 181 -274 -144 -146 340 326 -17 -171 237 -140 -40 -154 -338 48 -86 199 234 50 72 -162 24
5236 24 117 -271 36 51 195 -94 350 -35 23 16 131 193 -70 -69 63 -135 228 210 -149 67 -136 173 105 137
5260 137 -152 -91 -181 -146 168 426 281 -45 -256 76 159 -66 -2 -73 -70 73 70 231 -310 -184 -74 411 76
5283 76 -336 159 -138 32 129 107 249 36 213 -96 28 98 -172 141 223 6 280 -212 -210 -85 -17 259 209
5306 209 72 3 36 112 301 -254 -321 -155 -13 25 178 24 208 -10 -259 131 20 -115 -211 113 -160 -21
5328 -21 37 -173 -42 -434 -24 -135 -127 -313 -18 52 195 -11 166 60 -36 -24 87 -224 -79 5 51 92 207
5351 207 -84 18 104 -267 97 19 40 -171 -156 220 88 218 145 -9 86 152 65 -245 -380 111 107 -137 163
5374 163 -57 -48 252 121 -13 297 -124 -105 -55 312 -59 -74 -263 -134 -9 150 23 -191 33 22 261 585
5396 585 -97 -6 -259 25 58 158 39 24 42 180 61 -268 16 -50 -192 -83 173 -110 -22 -143 28 -110
5418 -110 -59 25 -238 -6 214 64 -331 -233 -219 38 -246 269 3 -53 178 68 19 265 51 41 62 -2 279
5441 279 -167 -56 298 -12 215 103 -97 125 -125 10 267 -221 0 -18 -15 -207 152 -263 -211 -60 127
5462 127 -37 -88 438 -202 -19 283 101 -25 374 193 78 73 66 -116 -252 -123 -89 97 11 -381 277 7
5484 7 -65 128 -161 -75 -82 -63 144 -67 96 -89 109 -6 -310 81 -212 -67 -181 170 214 -111 0 119 -206
5507 -206 -27 -202 -186 -206 178 -190 254 -118 7 131 -13 79 -52 271 22 292 265 162 -72 -128 -100 -156
5529 -156 447 -133 -6 8 -137 53 -204 -164 -186 93 -253 22 -67 110 122 -64 181 276 -218 197 250 -258
5551 -258 -33 210 100 -113 335 -32 -66 83 0 -144 133 -85 -191 208 -156 6 -212 -4 -60 120 -16
5572 -16 29 -114 -22 85 -162 -94 -186 127 125 -208 -39 276 76 -102 264 -52 -210 345 -180 -305 226 96
5594 96 -131 48 -302 -45 259 -121 -9 -7 225 -42 68 -36 119 -71 168 85 52 -72 -305 93 182 340
5616 340 -142 -271 54 94 -192 -321 -290 22 67 -286 43 101 -178 137 -127 -99 49 173 -195 29 -110 83
5638 83 -9 109 -112 222 26 -184 -51 -120 314 135 7 93 136 -106 315 62 343 31 25 7 -93 343 -74
5661 -74 -137 -193 158 151 20 -98 -97 146 219 151 18 -254 -329 11 218 228 231 -94 -55 212 -310 168 423 -339 -366
5686 -366 143 187 -210 -190 -49 -226 -124 -215 -58 -285 119 98 30 -50 92 4 -75 58 58 -80 52 -52 242
5709 242 394 214 154 129 156 96 -209 165 147 -137 129 58 2 18 221 -128 233 59 -119 -114 -328 20 19 66
5733 66 -126 -215 -20 57 79 -194 -278 -101 -183 -24 -135 200 189 28 96 -20 -271 212 -164 81 63 40 -14 96
5757 96 -421 -147 95 38 41 -27 41 172 117 199 240 67 -125 282 -5 91 -83 -23 -158 234 285 170 -3 -228
5781 -228 -32 53 51 -68 -101 -16 37 -154 -141 -391 101 -19 -43 -226 222 -131 -156 133 -7 89 -236 252 330 73
5805 73 328 -53 -22 -297 87 71 -85 76 21 -40 -306 291 46 -78 -153 -112 -7 152 64 -31 -61 -95 232 22
5829 22 283 -63 -282 281 -2 -112 -57 53 -80 81 178 -3 -54 -432 -381 209 133 -152 148 32 -72 4
5851 4 140 94 26 176 -102 156 139 43 -18 6 -146 14 -63 -185 1 -157 46 -62 -266 -12 -89 24 -224
5874 -224 186 5 -87 134 57 168 -167 -298 129 -9 -13 -185 23 8 176 283 107 80 -154 -133 96 -71
5896 -71 93 -112 -230 128 -92 323 3 -243 72 92 -146 55 224 -141 121 20 202 147 -211 -87 -9
5917 -9 -53 49 -306 -57 15 83 352 37 54 -104 86 37 -190 49 2 316 191 252 -55 -213 -96 119 -49
5940 -49 103 -219 209 -95 316 -62 107 16 68 362 153 -10 -263 38 99 -222 -128 334 189 141 -28 42
5962 42 253 -48 -299 -102 -124 -32 153 -66 -206 97 395 6 -208 -162 -59 325 33 -9 -235 -136 48 -127
5984 -127 -4 -5 22 -232 162 68 93 -33 -66 -75 -281 365 38 71 37 123 84 334 20 52 -14 -160 146 -96 16
6009 16 194 -520 -4 -100 113 -144 79 -11 -128 167 -50 -162 128 -227 -306 96 -102 -168 -44 -153 -7 347
6031 347 72 -80 -19 -23 26 -262 193 181 -67 0 -220 -76 52 54 370 -80 1 137 -87 -155 -314 -92 -181 264
6055 264 -53 -95 -148 35 -121 90 -161 -264 -46 217 -134 -31 279 241 -63 -209 -221 -166 -159 -51 -74 -122 -203
6078 -203 -7 197 -218 162 -207 -129 33 -68 -126 93 -147 -11 -55 122 209 30 115 -26 -108 200 -193 -62
6100 -62 -244 45 161 206 165 -120 28 14 93 -304 129 -97 -2 -200 167 -102 65 127 75 69 -35 129 5
6123 5 -217 -11 6 -64 271 39 55 47 326 92 -256 -179 -238 -69 -253 -60 -164 -150 19 88 -25 -169 13 -339
6147 -339 179 191 -152 -112 7 250 217 138 -57 -88 36 390 249 66 -34 156 12 14 413 40 -28 71 50
6170 50 158 104 327 62 135 -121 19 -46 -163 236 289 100 249 -5 99 28 185 -223 55 -95 -7 120
6192 120 43 -196 3 -155 52 403 158 -112 -131 -100 -51 -133 27 108 49 10 174 137 -152 63 -120 -111 110 113
6216 113 -53 36 -40 44 -34 -234 -133 -138 -70 295 338 139 -153 11 114 -269 297 -55 57 -194 -255 140 -99
6239 -99 -269 -20 -137 -39 20 -374 44 -272 -171 65 164 -227 74 73 69 206 130 -165 159 57 4 -192 -107 23
6263 23 97 85 100 -70 -162 222 138 -46 -29 -208 -239 -147 -61 269 299 26 92 39 48 -250 -84 -212 27 136 126
6288 126 -46 54 -57 41 179 -269 -230 80 -257 54 11 288 89 96 34 89 359 -25 -188 -32 -120 -126 32
6311 32 -200 0 -248 57 -200 -94 77 -4 -87 36 171 180 -32 177 17 -17 82 -30 -47 -187 160 160 40
6334 40 307 2 -140 -39 262 -21 -90 -48 17 -384 -171 147 99 -192 -29 39 -149 -39 369 246 140 -1
6356 -1 -207 -158 169 -42 255 149 112 45 -13 -70 41 331 -10 -216 466 -26 -184 53 15 -175 -47 -34 -78
6379 -78 -156 233 -115 -101 -11 437 333 -103 115 -100 196 -4 -222 108 20 -139 -183 119 -330 -48 51 -15 -274
6402 -274 68 -42 -71 -199 58 -197 223 -163 -25 55 194 -42 20 -68 -34 72 76 -39 -55 212 -73 -18 -81
6425 -81 97 5 -215 12 149 -400 -66 32 -204 208 -209 -29 36 104 -165 -22 -224 79 33 -14 259 -31
6447 -31 89 -4 240 204 214 -52 78 16 181 204 -182 248 129 62 55 198 81 -152 147 -48 -83 72 26 38
6471 38 -153 61 -285 -49 11 76 -86 33 255 -81 -131 -139 -64 24 142 -65 354 -14 173 120 240 60 -66
6494 -66 -180 -100 -277 -88 29 66 179 -37 225 87 -200 -108 220 122 -113 -183 -155 -115 -127 -176 186 266 246 84
6518 84 84 -178 5 -119 -148 90 -187 -51 -37 -384 79 309 165 66 1 139 8 -87 -423 -125 31 -161 -78
6541 -78 -55 -112 -26 -121 134 118 -38 -302 -11 150 154 70 -110 207 -49 -218 -212 -301 -27 403 411 81 73 -1 335 221
6567 221 68 84 84 82 -232 117 -33 -50 110 -55 85 -134 5 72 13 -136 -238 -7 105 -58 158 -172 190
6590 190 85 -66 330 -273 26 55 -22 9 -250 161 262 145 -58 266 72 190 -123 297 38 66 -93
6611 -93 82 49 -23 -113 -65 125 -115 200 43 -223 58 106 44 81 -76 20 -203 23 27 259 50 -160 106 13
6635 13 -85 6 -332 -24 -111 58 -81 220 -58 -104 96 137 -87 -12 -186 -93 21 119 96 -94 124 142 119 -173
6659 -173 -356 -160 -98 -161 -40 -138 -365 -94 91 -193 59 76 -139 -6 -32 11 -99 27 52 17 -18 38 -182
6682 -182 94 -151 -5 -30 262 -336 -111 45 -93 -134 86 -47 171 24 -169 -1 111 -38 -65 -283 -41
6703 -41 -129 140 -183 -67 -247 -109 -159 324 -102 -171 272 14 126 -3 262 170 -23 -35 -58 -28 -70 -154 226
6726 226 -336 170 -189 -171 145 -11 362 -5 -230 41 128 -43 442 97 -36 103 36 -144 67 315 83
6747 83 -216 32 -68 -150 -303 111 144 24 50 -19 18 -169 -98 387 -112 -132 337 -9 227 -76 -170 -340 -176
6770 -176 196 27 96 -101 -27 -220 -226 -37 229 -38 117 -11 134 185 11 -100 -4 14 17 -19 -126 -121 502 242
6794 242 201 45 178 180 -101 191 7 67 232 -338 -152 161 39 -109 132 191 -41 40 -40 99 -161 -10
6816 -10 -48 114 -72 -361 -119 -181 44 92 251 -38 -168 -159 -129 174 46 47 -22 7 -50 -63 16 -112 181 118 -108
6841 -108 -97 172 254 108 -83 -379 7 125 45 -202 132 -118 70 -4 52 -6 181 153 78 -141 41 229 -42
6864 -42 95 160 -41 -152 356 -15 52 -14 -221 133 -84 -181 241 56 -16 -268 -176 -73 87 45 62 -46 189
6887 189 88 -154 189 -27 -131 -170 -48 101 -11 -271 11 162 -209 -179 236 -63 67 -96 -64 255 192
6908 192 189 60 65 -36 195 -40 -24 -107 -187 -71 -160 8 41 -460 202 210 112 58 187 -71 124 -22 48 97 -164
6933 -164 -100 177 -4 -277 67 -133 -135 -163 -44 -74 143 -20 15 6 34 183 26 -140 -203 91 -48 -216 -121 333
6957 333 -125 92 -38 -225 -63 60 262 -134 -26 -28 -134 102 267 90 -258 124 47 -56 176 245 -127
6978 -127 -227 -179 -104 148 142 -242 145 -359 -351 -77 -13 212 358 -86 146 -16 -25 -312 169 -96 262 371 -363
7001 -363 114 85 -167 162 166 -224 -104 -41 19 -111 -26 -22 61 86 -42 114 28 -282 -196 111 -85 100 -111 -30
7025 -30 157 196 -210 15 18 240 -48 -26 36 181 -147 83 -221 213 -84 109 205 -45 -346 -256 -96 -80 -301
7048 -301 -221 67 172 6 229 -57 -402 -203 -151 89 -69 34 -197 -51 97 26 186 -24 82 87 24 -375
7070 -375 -125 77 139 73 -177 -19 117 -339 140 -42 123 -34 149 146 -27 -2 26 -33 141 60 75 92 151 -44
7094 -44 51 141 -40 80 45 -65 -89 -87 263 -83 138 -113 69 165 87 11 -61 -294 184 45 55 80 -216 -40
7118 -40 -196 111 -331 -87 -41 105 -68 65 -93 182 -209 19 94 55 -76 -201 -137 -42 22 -163 27 -330
7140 -330 86 74 -182 -184 91 230 10 2 143 -161 -53 87 111 -10 -107 -36 -93 -50 -145 -129 135 -201 -226 -155 145
7165 145 -169 -6 36 -159 177 -81 52 102 -167 202 -209 -13 136 278 -107 212 68 76 134 245 -258 28
7187 28 1 42 -44 153 -130 255 -32 -355 -62 243 -253 -206 -114 -92 -147 28 83 291 -140 38 62 64 501 12
7211 12 -28 -76 -20 247 -88 -180 58 -107 -9 135 -215 11 -52 38 58 -37 -186 -153 175 41 -164 199 -332 112
7235 112 -232 168 -313 -97 173 130 245 82 -32 -282 122 -53 -9 142 33 -135 70 -24 -73 201 123 -87
7257 -87 135 113 15 72 166 -10 -158 -174 56 200 324 76 -156 -384 -171 -234 -42 -96 -129 34 204 -98 105
7280 105 64 266 -59 205 -109 53 -98 -330 -2 -37 265 -452 18 -30 59 -134 -151 -12 146 21 -327 3
7302 3 42 -122 -285 130 -381 -2 60 -222 56 60 -117 -91 -253 -104 -34 25 -169 58 87 -151 38 -332 -19
7325 -19 -84 151 -27 39 63 53 -120 74 -110 137 -438 306 2 171 -174 454 9 -150 305 252 -238 -103
7347 -103 1 68 146 -29 53 -211 47 -35 185 -30 249 -223 208 154 -110 16 40 -28 -92 -69 -35 -365 -120
7370 -120 -125 -71 -40 243 -45 -203 350 62 -71 -73 0 22 -70 -19 -66 -152 15 81 -29 -49 -38 328 -64 142 175
7395 175 -81 117 -79 123 -120 13 -84 -43 174 -305 -41 -48 -74 -64 -151 72 17 -74 -41 25 71 -56 20 -119
7419 -119 13 -14 -213 200 180 108 51 355 0 16 -24 -84 42 90 151 233 -38 -58 -7 -178 -177 -38 -3 64 -169
7444 -169 41 39 -20 -155 -6 240 183 -21 -89 -182 -133 10 216 -2 139 -202 179 126 148 195 81 47 -370 256
7468 256 8 123 77 -63 -245 -102 71 -147 -50 128 266 -113 35 -62 172 67 -189 -15 128 -91 88
7489 88 39 -312 140 -239 -16 0 54 147 -267 61 160 -31 -135 -246 119 -141 255 122 -34 -64 74 -157
7511 -157 51 67 122 -127 -94 -22 -113 293 -46 18 -156 92 -165 -74 35 -217 -301 189 -69 -95 111 -278 -114
7534 -114 -87 218 -239 -152 -82 -145 263 276 291 -138 86 107 -2 -168 46 92 -26 15 -143 -126 106 -181 -42
7557 -42 -128 -87 95 24 232 48 244 190 66 83 53 -114 7 97 -373 221 211 -318 111 -122 53 298 -105
7580 -105 452 130 -96 110 197 162 113 -63 -18 -83 -60 -8 -4 -150 -11 109 116 186 152 -212 82 -97 290 -104
7604 -104 -52 -94 -68 -212 -35 -51 -93 58 -6 289 -185 120 56 -9 -311 -153 277 -111 457 -72 93 268 -5
7627 -5 -140 -205 -63 -129 23 76 -61 -20 -164 118 19 31 76 -20 354 56 204 -81 -85 22 -23 -136 36 59 36
7652 36 -345 -16 -179 -173 14 81 26 -16 163 -83 100 -312 -192 82 -108 81 14 -69 -191 317 -171 177 -92
7675 -92 139 -385 -28 -142 48 37 265 133 -144 396 39 -65 -150 49 94 -38 208 2 -70 107 -204 -108
7697 -108 115 111 -205 -2 -14 9 66 -394 284 -115 251 195 92 131 -125 -16 114 207 20 12 -154 -354 196
7720 196 305 -80 -105 197 -14 -157 58 59 -121 -123 -18 222 192 165 -41 -178 161 -117 80 -343 -42 -182
7742 -182 -27 -138 -148 99 83 40 9 -18 -453 329 362 5 72 214 -181 201 299 5 165 -19 -220 63 27
7765 27 203 339 -9 118 -6 226 173 74 -131 -168 36 117 300 108 106 16 104 156 131 126 -59 110 192 45 -182
7790 -182 18 102 365 -24 126 199 171 -46 157 129 -19 178 -45 -66 98 -100 -86 -58 121 -137 -238 47
7812 47 -29 207 -35 -197 45 137 79 -54 20 -1 213 130 79 -80 -39 230 236 -216 -104 41 158 -93 311 184
7836 184 -388 96 -126 -315 -1 60 45 138 26 248 204 27 -240 116 267 -91 -120 134 -205 -298 34 57
7858 57 -62 -88 -115 113 -401 181 -112 -214 -23 -88 -23 -135 37 86 32 218 165 -104 40 -25 34 88 -352 254
7882 254 270 -115 0 -116 -152 -221 -189 -289 -53 -63 -143 62 17 157 82 -54 310 -83 331 -103 89 134 117
7905 117 7 98 148 6 -47 -64 89 43 -18 164 217 0 -51 -6 56 30 -271 249 304 157 163 111 -40 -35 7 220
7931 220 2 83 -352 90 -87 -70 -212 311 7 -109 -28 -363 83 -13 84 -153 52 -11 -1 3 -359 168 122
7954 122 133 162 -256 223 -165 104 -184 151 193 -50 -57 17 -66 226 -138 -128 -344 169 120 45 -77 152 -141
7977 -141 47 140 -64 -2 161 -50 74 -262 -191 -260 110 53 250 -52 -166 37 280 21 280 55 -41 8
7999 8 -32 8 10 9 113 -144 172 92 211 137 153 -11 1 78 173 10 107 83 148 -58 -219 -129 50 253 129 -128
8025 -128 54 -145 -14 399 -16 -98 -179 -23 -174 -188 -80 -65 12 213 -4 -149 160 98 -18 -159 -52 105
8047 105 -401 73 87 32 158 25 -21 -22 56 171 -276 170 -55 -120 24 286 119 -141 314 113 148 -5 283
8070 283 -128 -15 -212 -53 154 -1 -75 -233 -84 -157 152 -46 -208 -2 -280 173 -137 6 23 -101 184
8091 184 178 -384 -77 -105 -107 -168 60 -88 72 -249 -197 59 64 -63 -152 -178 -170 153 -69 243 72 246 403 37
8115 37 276 -205 20 23 99 166 335 -310 8 170 104 159 54 104 132 -64 -62 -67 69 94 153 -74 -214 -278 139
8140 139 354 28 -155 -240 -87 -323 14 19 17 -190 137 119 -64 135 39 16 -233 -76 -121 -55 92 92 107 -13
8164 -13 84 34 -85 300 29 -177 -82 -82 18 -128 -123 288 -29 252 -139 -231 -66 -33 -170 144 66 -154 212 -85
8188 -85 -96 -151 -34
8191c4
$$ Imaginary data points
##PAGE= N=2
##DATA TABLE= (X++(I..I)), XYDATA
0 0 0 0 0 0 0 0 0 -8 8 -8 9 -16 16 -24 24 -32 38 -41 49 -62 72 -81 97 -110 124 -145 162 -185 210 -237 265
31 265 -300 336 -375 418 -467 517 -575 638 -707 783 -866 961 -1064 1179 -1307 1454 -1621
48 -1621 1811 -2034 2299 -2615 3007 -3506 4159 -5061 6391 -8551 12655 -23209 104845 189242
62 189242 -79102 -104240 -44900 -3812 102042 157398 -62510 -187796 -13731 122289 51414
73 51414 10398 -40099 -132478 -43073 155369 88103 -107151 -102688 -14238 8768 85826 96923
85 96923 -85975 -160131 20184 119228 46573 10822 -30132 -110259 -15903 148826 81507 -74028
97 -74028 -62163 -11619 -344 76136 83791 -75087 -125612 19715 84705 24281 -2902 -48057
109 -48057 -105998 -3824 132501 52431 -88822 -74268 -18326 18195 95633 73683 -89165
120 -89165 -118708 31703 95609 45260 9858 -51544 -92592 22673 131322 36672 -82647
131 -82647 -59146 -6491 30187 80890 28159 -107145 -93302 49620 84311 17769 -26105 -71559
143 -71559 -73647 46911 119408 10545 -87184 -49950 3399 41406 80887 20261 -91774 -59327
155 -59327 58284 68859 14257 -15403 -53063 -46310 52869 88291 -13747 -78019 -35436 7319
167 7319 37701 58828 -8765 -97129 -48585 56013 58560 9820 -22936 -61419 -43102 58718
179 58718 84648 -10321 -61912 -26600 7086 42449 62381 -8168 -80623 -26003 58609 48367
191 48367 4148 -27647 -58353 -25383 65148 64832 -32789 -70296 -27989 11118 46216 51017 -28472
204 -28472 -86940 -19696 58659 44249 4073 -25636 -53480 -13829 68604 55349 -31773 -50626
216 -50626 -10013 18276 45218 38795 -36553 -71187 1358 59566 31711 -9119 -37085 -53139
228 -53139 -2902 68262 39235 -43670 -54096 -13102 16423 44857 33068 -40505 -63611 7822
240 7822 53981 26179 -4597 -27907 -39557 11136 66884 26723 -44399 -40015 -398 24007
252 24007 43229 18857 -51287 -57378 18119 52137 18666 -13990 -37937 -42788 13528 62745
264 62745 16643 -46033 -35322 -305 20583 39987 14953 -47156 -41027 28587 47089 10914
276 10914 -13135 -30676 -27866 27449 59527 3449 -49046 -28833 5742 24989 37490 4154
288 4154 -55040 -39631 28924 40852 6182 -15718 -32858 -27731 26823 51711 -3209 -43919
300 -43919 -18531 10580 24410 32577 -2190 -49716 -22834 39204 38787 970 -19319 -31500 -18097
313 -18097 35947 47883 -11997 -47033 -18844 9985 23924 28570 -9209 -50871 -20031 35179
325 35179 29749 -3847 -18161 -26664 -11164 35813 39004 -17807 -40270 -6944 17896 26018 23982
338 23982 -15090 -47161 -8601 41397 28040 -7031 -21127 -27873 -8474 36781 33358 -22537
350 -22537 -39256 -7036 13906 21163 18013 -17914 -42161 -2212 38647 19867 -11627 -19674 -20426
363 -20426 1863 39672 26221 -27186 -34647 873 20418 24091 14892 -22949 -40195 3096 38619
376 38619 16411 -12837 -20828 -21035 2866 35327 17606 -29382 -29251 3689 17727 18287 7459
389 7459 -25020 -32101 11778 37497 10637 -15633 -19659 -14856 10849 37415 13307 -30970 -25859
402 -25859 6045 18859 19317 5939 -26565 -29454 12763 31900 5671 -16131 -18389 -13400 11589
415 11589 31534 4331 -32030 -20118 10927 19401 16342 196 -28445 -22756 20611 32813 3541
428 3541 -16731 -17939 -9890 16671 32140 1304 -31296 -16767 10433 16768 13436 -3156 -28762
441 -28762 -17563 21257 25312 -3889 -18315 -15619 -5598 19057 26861 -6550 -31402 -10897 14946
454 14946 18611 12884 -6287 -27989 -11983 24949 24338 -3589 -15942 -14388 -3938 19286 23386
467 23386 -9903 -28243 -6702 13928 14412 7785 -10354 -26371 -6300 25666 18229 -9037 -18023
480 -18023 -13222 10 22713 20388 -13664 -26910 -3234 15737 15716 8266 -11471 -24616 -1922
493 -1922 25538 15089 -9905 -15058 -10469 2456 21235 14157 -18022 -24029 1018 15330 12413
506 12413 3575 -15617 -23446 3077 26482 11249 -12003 -15379 -9247 5368 23157 12021 -18053
519 -18053 -20269 3487 15025 11781 2935 -14655 -19061 6510 23857 6254 -13179 -13367 -7051
532 -7051 7431 20496 5548 -21486 -18247 5901 14921 10432 -476 -17637 -17037 9827 23438
545 23438 4704 -12484 -12033 -5194 9745 20318 3637 -20148 -12985 8326 13977 8172 -2940
558 -2940 -17587 -12892 13112 20189 -504 -14769 -11676 -3408 11357 18356 -1828 -22000 -10887
571 -10887 9734 13396 7708 -3545 -17214 -9972 14949 18360 -1899 -12583 -8729 -1194 12485
584 12485 16301 -4782 -20279 -6506 10980 11800 4636 -6424 -17480 -6876 16316 15118 -5086
597 -5086 -13451 -9430 -622 13550 14462 -6797 -19218 -3952 10838 10704 4665 -6467 -15346 -2764
611 -2764 17216 12544 -6492 -11980 -6275 2405 13957 11360 -10315 -17979 -1281 11526 9595 2636
625 2636 -9212 -16164 -1304 17473 9791 -7948 -11213 -6152 2671 14354 9525 -11285 -15312 1748
639 1748 11733 8298 1517 -9058 -13307 3124 17952 6670 -9501 -10377 -4411 4547 14377 6392
653 6392 -14213 -14767 3386 11030 7235 66 -11176 -13207 4851 16918 3681 -9776 -8294 -3101
667 -3101 5592 13504 3519 -14414 -10964 6544 11124 5146 -1619 -11070 -10326 8299 16008 909
681 909 -10940 -7790 -2137 6137 12571 1191 -15073 -9043 7163 9237 3527 -1890 -10343 -7909
695 -7909 9063 13845 -1282 -10083 -5582 -308 7273 11920 -708 -14713 -6483 8389 9446 3483
709 3483 -2884 -11101 -7011 9861 12628 -2560 -10451 -6068 -940 7086 10673 -2354 -14439 -4648
723 -4648 8718 7947 2194 -3824 -10662 -4516 11996 11470 -4303 -10081 -4254 1951 9039 9527 -4985
738 -4985 -14494 -2576 9403 7563 962 -5270 -10563 -2467 12009 8735 -5965 -9606 -3146 2458
752 2458 7995 6843 -6629 -12444 109 9903 5823 -399 -5565 -8545 83 12044 7385 -7105
766 -7105 -8564 -2272 3100 7820 5736 -7023 -11468 836 9151 4514 -1010 -6052 -8004 870 11182
781 11182 4852 -7294 -7557 -1266 4007 8330 4296 -8445 -9917 2661 9399 4409 -1204 -6228
795 -6228 -7528 2758 11703 3982 -7790 -6947 -947 4006 7675 2634 -9131 -8718 3947 8421 2930
810 2930 -2495 -6643 -6079 4353 10978 1290 -8002 -5952 439 4900 7324 1129 -9353 -7007 5245
825 5245 8541 2401 -2773 -6570 -4878 5163 9514 -87 -8130 -4875 924 5116 6453 -431 -9386
840 -9386 -5413 5718 7142 1074 -3766 -6636 -3331 6261 8918 -1184 -7892 -3955 1653 5445 6248
855 6248 -1777 -9369 -3858 6205 6738 283 -3905 -6327 -2683 6680 7568 -2650 -7737 -2979 2507
870 2507 5463 4990 -3120 -8947 -2337 6752 5955 -318 -3946 -5743 -995 7705 6705 -3607 -7284
885 -7284 -2309 2801 5407 3965 -3665 -8333 -856 6896 4828 -1053 -4270 -5129 -433 7916 5415
900 5415 -4809 -6906 -1352 3114 5585 3570 -4842 -7441 500 7741 4064 -1327 -4487 -4819 865
915 865 7974 3726 -5464 -6108 -707 3559 4731 2139 -5544 -6937 1429 6963 2801 -2373 -4835 -4237
931 -4237 1837 8088 2328 -5703 -5267 253 3849 4912 1432 -5983 -5778 2810 7024 1792 -2255 -4487
947 -4487 -3366 2592 7275 1045 -6151 -4256 922 3670 4432 385 -6537 -4871 3629 6450 1320
962 1320 -3070 -4611 -2976 3619 6981 520 -6399 -3982 1662 3684 3910 -114 -6399 -3826 4529
977 4529 6196 325 -3624 -3625 -1975 4181 6287 -1239 -6533 -2721 2264 4050 3270 -1089 -6786 -2657
993 -2657 4942 4917 -302 -3408 -3766 -1270 4757 5213 -2186 -6136 -1910 2473 3806 2579 -1924 -6666
1009 -6666 -1715 5508 4397 -1134 -3548 -3420 -941 4840 5047 -2467 -5874 -1161 2910 3919 2216
1024 2216 -2562 -6089 -1063 5582 3718 -1618 -3611 -3127 -145 5164 4074 -3336 -5621 -429 2909
1039 2909 3431 1534 -3335 -5732 62 6202 2976 -2155 -3589 -2489 814 5330 3138 -4208 -4763
1054 -4763 592 3461 3330 673 -3543 -4982 1424 5627 2041 -2367 -3023 -2121 1466 5087 2061 -4250
1070 -4250 -4374 954 3358 2617 412 -3655 -4342 1538 5188 1342 -2388 -2928 -1860 1549 4873 1326
1086 1326 -4679 -3889 1395 2954 2629 124 -3759 -3800 2424 5111 718 -2845 -2783 -1598 2333 4988
1102 4988 724 -4780 -3223 1541 3366 2407 -688 -4189 -3330 3179 4712 209 -2805 -2864 -1338 3010
1118 3010 4489 -461 -5044 -2325 2133 3309 1459 -1108 -4536 -2528 3365 4246 -768 -3414 -2411
1133 -2411 -342 2988 3724 -1333 -4790 -1417 2260 2999 1110 -1478 -3678 -1548 3975 3605 -1103 -3088
1149 -3088 -2222 -244 2881 3366 -1563 -4498 -1232 2720 2552 1184 -2016 -3914 -911 4044 3231 -1467
1165 -1467 -2902 -1916 33 3212 2929 -2188 -4378 -631 2758 2398 876 -2002 -3790 -411 4225 2645
1181 2645 -1856 -2963 -1746 766 3413 2461 -2806 -4232 -77 2590 2163 281 -2432 -3634 511
1196 511 4136 1936 -2383 -2835 -1148 1260 3531 1911 -3295 -3361 787 3097 1760 30 -2648 -3156
1212 -3156 1173 4324 1542 -2587 -2456 -967 1018 3400 1193 -3494 -3020 917 2835 1410 -343
1227 -343 -2690 -2481 1616 4044 691 -2492 -2094 -584 1676 3125 373 -3461 -2652 1522 2528 1134
1243 1134 -524 -2933 -2226 1951 3869 297 -2526 -2090 -440 1797 3135 2 -3902 -2100 1636
1258 1636 2733 1345 -710 -3069 -1840 2432 3374 -115 -2694 -1588 -33 2005 2784 -397 -3475
1273 -3475 -1451 2317 2011 842 -1369 -2679 -1243 2628 3023 -857 -2872 -1821 495 2243 2417 -1580
1289 -1580 -3621 -796 2343 2263 274 -1397 -2961 -690 3195 2348 -1285 -2575 -1147 542 2560 1956
1305 1956 -1809 -3378 -498 2303 2413 514 -1727 -2340 70 3028 2286 -1562 -2511 -692 758 2318
1321 2318 1642 -1986 -3176 -290 2731 1881 -25 -1781 -2173 515 3278 1753 -2242 -2131 -616 1009
1337 1009 2558 1176 -1995 -2807 435 2327 1381 -690 -1919 -2197 603 3140 1236 -2037 -2031 -273
1353 -273 1142 2454 1090 -2249 -2373 963 2316 1069 -522 -2156 -1707 1086 2932 795 -2248 -1851
1369 -1851 8 1775 2317 564 -2728 -1974 1391 2299 844 -634 -1987 -1345 1609 2611 138 -2102
1385 -2102 -1450 62 1335 2156 -166 -2717 -1702 1746 2029 448 -977 -2014 -1037 1986 2634 -451
1401 -451 -2294 -1162 535 1500 1777 -643 -2692 -971 1795 1956 289 -1338 -2089 -1088 2296 2138
1417 2138 -638 -1965 -975 441 1928 1702 -1048 -2855 -953 1891 1657 -140 -1134 -1979 -139 2283
1433 2283 1865 -1086 -2222 -725 522 1733 1421 -839 -2491 -61 2128 1453 -106 -953 -1836 77
1449 77 2221 1139 -1162 -2021 -327 721 1935 1138 -1633 -2364 403 2156 1536 -254 -1291 -1595 482
1466 482 2319 1323 -1689 -2041 -377 1047 1883 635 -1719 -2097 514 2041 1025 -291 -1400 -1398 880
1483 880 2371 977 -1562 -1777 221 983 1526 438 -1868 -1887 550 1568 617 -484 -1649 -1063 514
1500 514 2522 458 -1605 -1183 -32 720 1353 73 -1870 -1626 1014 1967 531 -750 -1497 -888 1113
1517 1113 2216 207 -1861 -933 304 1308 1343 -229 -1949 -1362 1202 1771 182 -856 -1471 -997 1329
1534 1329 1983 -270 -2085 -923 544 1110 1299 -340 -1918 -1165 1666 1643 10 -942 -1340 -389 1374
1551 1374 1614 -383 -1621 -512 532 1016 1208 -703 -1554 -744 1770 891 21 -1014 -1111 -186 1268
1568 1268 1698 -785 -1732 -206 810 898 1047 -926 -1657 -352 1343 1201 -386 -1223 -943 116 1772
1585 1772 959 -772 -1424 -398 573 1332 905 -806 -1796 -309 1656 1054 -373 -1028 -968 -86 1676 1005
1603 1005 -1193 -1251 -75 921 866 450 -929 -1264 71 1670 573 -701 -1140 -679 418 1188 607 -1357
1621 -1357 -1519 78 627 700 248 -1178 -1081 537 1294 575 -466 -1176 -371 287 1328 466 -1198 -1242 84
1640 84 812 908 234 -1287 -1200 646 1424 428 -722 -1066 -315 562 1381 263 -1525 -849 90 1086 813
1659 813 -162 -1201 -944 701 848 101 -937 -780 -698 945 1439 -28 -1609 -599 443 729 509 9
1677 9 -1143 -481 1095 1028 -38 -822 -715 -312 873 1196 33 -1429 -487 704 799 302 -594 -1210 -651
1696 -651 1006 1013 -219 -734 -810 -86 1204 1037 -425 -1081 -9 431 824 300 -389 -1226 -158 973 1127
1715 1127 -410 -728 -716 -61 1181 1031 -408 -1340 -174 816 591 280 -608 -1159 81 1307 725 -186
1733 -186 -632 -305 127 1148 760 -783 -1034 -26 1034 657 -116 -565 -1065 39 887 613 -465 -798
1751 -798 -165 63 1050 604 -655 -1178 389 593 779 346 -719 -1051 252 1212 98 -678 -929 -257
1769 -257 267 910 418 -726 -702 262 447 217 143 -763 -815 348 1214 55 -964 -801 -205 653 1348 18
1789 18 -1000 -716 468 843 741 -93 -686 -762 873 1047 127 -820 -349 -346 131 860 -128 -994 -460 705
1809 705 713 246 -280 -632 -510 794 1005 65 -653 -154 13 475 680 -99 -1106 80 534 458 85 -377
1829 -377 -542 -476 736 930 -71 -928 -472 -59 296 690 -228 -868 -314 697 687 60 -384 -888 -367 1181
1849 1181 751 -273 -522 -245 247 573 643 -534 -817 37 598 896 175 -614 -836 -95 960 451 -367
1868 -367 -847 107 327 525 674 -557 -772 -87 428 338 225 -634 -903 273 979 237 -519 -489 -368 246
1888 246 576 107 -856 -683 60 465 382 -2 -436 -400 327 1267 -1 -492 -471 -274 414 587 -357 -808 -611
1909 -611 212 642 226 -205 -594 -595 150 946 196 -688 -691 -194 465 596 207 -668 -339 279 749 336 -196
1930 -196 -526 -270 449 931 24 -304 -482 -67 340 596 125 -698 -508 320 718 166 19 -780 -351 460
1950 460 593 -194 -880 -523 -18 379 624 -115 -736 -82 292 542 183 -385 -618 -110 833 401 -84 -460
1970 -460 -511 347 428 -59 -52 -513 -70 619 368 170 -368 -722 -138 902 306 -232 -600 -438 364 318 365 -344
1992 -344 -597 -129 722 556 -115 -364 -1 48 774 220 -529 -346 -72 158 335 308 -176 -725 168 668 -199
2013 -199 -137 -349 -149 -160 291 271 -432 -250 -29 305 255 86 -153 -462 -11 599 17 -398 -527 -624 169 781
2035 781 181 -590 -623 500 393 468 170 -439 -568 112 379 128 -117 -475 108 591 718 166 -309 -188
2055 -188 125 365 481 -156 -543 -162 285 291 160 -183 -326 -202 280 306 -133 -497 -299 247 337 -101 -243
2076 -243 -642 -587 303 23 -247 -417 -179 43 654 598 -109 -376 -545 202 287 104 -235 -395 -404 109 239 -255
2098 -255 -357 -419 195 448 688 -517 -426 -117 -64 156 405 -578 -377 -120 371 336 -252 -567 -303 -274 493
2119 493 595 -319 -477 -181 340 567 300 -413 -367 -163 368 57 -35 -163 -384 258 317 99 -246 -553 51
2140 51 231 471 -86 -325 -450 -149 316 291 -102 -219 -419 366 604 0 -130 -109 292 170 148 163 -581 -135
2162 -135 25 386 155 -81 -67 15 341 331 -210 -342 -195 193 169 241 155 -427 -172 136 219 -42 -625 -358
2184 -358 278 80 494 23 -73 -313 71 317 191 -16 -702 -119 351 249 12 -321 -500 228 196 320 -91
2205 -91 -308 -250 312 631 -1 -127 -277 130 445 208 -99 -574 -307 26 223 291 -158 -491 -11 318 -130
2226 -130 11 -470 -618 148 152 128 -103 -152 -384 131 640 94 -280 -454 53 162 150 -15 -348 -260 186 79
2248 79 317 -280 -380 -188 37 320 -89 -339 -368 -18 469 -178 -69 -250 -84 104 46 299 -359 -165 -181
2269 -181 143 347 66 -595 -327 190 211 62 40 -209 -554 -286 329 -10 -335 -199 94 154 42 269 -424
2290 -424 -252 346 311 -35 -41 -428 -261 101 313 114 -304 47 162 10 294 -177 -559 -412 11 288 7
2311 7 -33 -215 -235 72 237 53 -591 -157 33 147 338 -95 -512 10 519 261 111 -7 -142 -36 265
2332 265 299 -300 -200 34 273 252 27 -340 -364 111 -98 289 -30 -22 -134 120 346 217 107 -33 -135 266
2354 266 -4 362 -262 -181 115 99 78 78 -402 -285 27 119 -64 -375 -305 -189 -52 201 110 -127 -127 189 325
2377 325 188 55 -174 -114 116 474 60 76 -221 154 174 212 -137 -364 126 228 442 244 -127 -5 36 -15
2399 -15 393 42 -296 -194 -98 513 282 -234 -490 8 379 424 -27 412 -263 -272 38 467 3 -367 -90 125
2421 125 -87 165 -264 -60 -87 -51 142 -185 171 -238 142 -37 292 -39 -312 -24 190 159 -57 -274 -200
2442 -200 -111 -262 287 87 -55 -123 208 197 64 -443 -153 -209 7 396 30 -42 -231 -8 99 162 70 -142
2464 -142 -182 193 481 112 -468 -309 -155 146 140 398 11 -20 -77 -190 315 53 -171 -36 55 245 126 -349
2486 -349 -223 -10 422 124 -42 153 -295 -225 663 -176 -54 -219 76 -122 482 207 -310 -444 169 53
2506 53 152 -264 -309 -266 -3 223 119 179 -108 -58 50 413 31 -576 -214 105 89 -191 -137 111 -196 244 196
2529 196 -213 -103 -87 -52 150 148 -355 -295 -17 -257 -13 188 -85 -402 -430 187 316 18 20 -271 -175 -8 124
2552 124 38 -261 -83 -190 109 156 -79 -210 -203 390 76 -75 -57 -353 -200 327 296 -114 -254 -251 211 200 65
2575 65 -184 -118 -254 344 270 -47 -61 -268 69 18 25 -497 -139 321 96 309 17 45 -415 -77 344 -102 -276
2598 -276 -162 -421 22 380 -151 -78 -271 1 86 113 78 -49 -104 107 351 -57 192 201 2 -1 257 -150 -272
2621 -272 48 3 105 14 -24 -186 -235 -63 131 159 -177 -82 79 126 220 -20 -362 58 147 8 5 41 -307 -219
2645 -219 6 21 -335 -40 -135 -162 108 383 401 -229 -343 16 86 -238 -387 -5 -460 241 298 -104 -239 -324
2667 -324 -157 -405 243 350 -417 -116 455 69 18 -43 -51 -461 76 384 -284 -93 49 89 236 226 -310 -245
2689 -245 -168 166 298 38 -46 -303 -231 291 232 119 -154 -51 -70 165 9 39 -297 -78 242 98 61 -263
2711 -263 -64 -165 -64 160 13 29 -320 61 398 -14 72 12 -28 -233 315 264 217 -225 -108 -187 21 -212
2733 -212 -297 -322 -217 204 89 -205 -278 -305 206 -214 0 -11 -75 -80 0 93 -48 -135 -117 557 42 40 27 12 104 169
2759 169 -57 -255 -140 -221 -44 263 244 -270 -353 -57 235 -191 87 -7 -110 218 256 118 -166 164 -67 195
2781 195 260 -4 -96 -191 -241 258 111 57 -210 -32 139 183 34 20 77 35 23 38 -40 82 3 -185 307 148
2805 148 69 17 -256 107 269 -237 -141 -114 264 42 -75 -130 -210 -82 49 296 57 -153 -315 132 87 343
2827 343 303 -88 -20 -80 386 365 -78 -76 169 86 364 -26 -133 -117 26 50 108 72 -110 -341 156 242 54 -200
2851 -200 -78 131 221 75 22 -72 -17 85 -123 -157 -292 208 156 -5 206 308 -33 -276 -100 -118 73 -99
2873 -99 -172 112 -145 169 10 139 -221 -179 -113 552 133 -73 -127 -321 163 319 -121 20 -175 97 486 109
2895 109 112 5 166 94 41 -219 24 -76 -22 36 235 -55 -177 -153 129 -116 132 197 -154 28 125 87 20 -202
2919 -202 -223 18 342 380 -81 -110 24 142 78 -49 207 -175 164 49 172 -416 -320 120 -41 223 36 -201
2941 -201 18 128 110 119 -101 -330 -96 -72 261 179 -95 -17 50 63 -57 173 14 -237 -203 -111 34 9 -92 -248
2965 -248 227 219 -177 210 92 -270 -119 -98 243 -416 -264 58 -37 -116 -97 -387 351 182 47 -96 -84 -153 -16
2988 -16 47 -200 -194 -306 -213 -33 344 -41 -74 -254 -87 22 79 -320 -87 -269 49 171 97 -119 -182 192 92
3011 92 -54 -5 146 -90 24 60 212 45 -201 -238 -29 -9 6 -196 -160 -3 125 -169 67 -205 -45 -41 222
3034 222 221 -217 172 111 -349 -123 170 -331 -314 -22 168 39 -82 80 -61 88 218 -79 72 23 -8 57
3056 57 61 -326 0 109 44 162 -57 276 -150 157 -132 -52 196 -131 -155 88 133 21 -80 -128 73 -78 57
3079 57 -339 335 -184 76 367 -169 -98 -113 -158 133 293 -59 36 130 -90 -41 133 -140 -298 -157 84 140 -381
3102 -381 63 -232 -188 146 323 116 6 3 -41 -39 54 -260 -74 -63 -246 184 166 -62 84 -132 100 97 102 40 -61
3127 -61 19 188 201 81 221 -180 156 -194 153 -236 -319 -91 438 -122 -110 -34 185 -1 188 10 -235 -100
3149 -100 -75 282 -361 -82 39 -183 -244 334 -181 -381 -5 -144 191 128 198 52 -457 -109 -52 164 92 -185
3171 -185 66 338 250 252 -212 44 35 -27 112 -6 -124 159 213 276 -102 -260 -277 -103 22 12 168 -43 64
3194 64 -308 231 179 -82 -250 -262 -11 137 -31 -360 -191 9 53 25 37 -159 164 133 482 -38 71 24 80
3217 80 190 -59 -132 -31 -38 49 -36 -173 -233 29 2 21 281 30 16 -13 -159 67 102 -331 105 -118 43 103
3241 103 336 -3 39 46 85 101 -40 -206 -9 324 97 -31 -59 -147 -390 45 230 85 -178 -95 15 184 142
3264 142 -89 2 -57 173 155 28 18 -80 183 246 70 -18 -100 33 -249 58 -79 -50 359 -285 223 20 -8
3287 -8 -41 -70 143 113 149 -104 -268 -363 126 70 174 -500 14 1 97 92 151 232 -279 309 97 -41 -272 -301 -150
3312 -150 -90 235 -4 -364 -44 -111 410 138 -17 51 60 11 218 265 33 -221 -240 68 -25 125 -93 -1 117
3335 117 -65 259 20 94 -121 -150 172 65 -215 -40 50 31 224 3 -350 -193 -173 115 192 107 -52 -281
3357 -281 -66 4 -3 -301 -86 125 202 169 24 194 -145 165 -99 82 121 -181 -59 1 307 -152 134 -223
3379 -223 -178 243 -145 15 38 -29 262 176 225 212 -17 84 -60 -56 -49 -347 4 -110 -68 261 35 7 92 246
3403 246 145 17 -174 -119 394 10 118 -51 61 270 172 115 7 -100 -425 -29 -131 33 33 -90 -248 98
3425 98 21 365 -235 57 -28 -159 129 370 -17 -178 -8 84 275 263 -312 -108 325 -24 71 -238 -64 -28
3447 -28 -116 252 -256 129 -255 -19 153 -71 263 -337 -2 66 234 195 176 -33 187 392 254 -14 -116 -244
3469 -244 142 106 -121 42 -252 -59 -199 159 59 -44 -89 187 112 63 -172 -99 25 46 -72 149 119 -115
3491 -115 -88 -39 24 -137 -138 61 -147 162 270 -184 -8 142 54 291 131 -42 -148 66 152 225 100 -584 11
3514 11 -109 209 -110 -328 -92 -158 19 -18 -46 -90 -90 -26 344 -145 -171 7 -121 443 276 71 -181 -257 209
3537 209 108 -189 -225 -247 -10 -55 280 -107 30 34 -31 -3 237 163 -12 -322 -68 159 -12 74 -137 -113 2
3560 2 225 -185 -30 250 196 397 440 25 37 -182 -96 187 169 204 -137 -179 -71 225 295 -174 174 96 70 185
3584 185 203 62 16 58 60 -45 -80 -15 -245 -271 118 -268 -27 44 84 123 393 -179 -575 -165 -5 271 -167 -213
3608 -213 -82 -174 137 70 -251 -135 218 39 -257 -15 -241 -266 -56 54 -124 30 -208 23 -28 379 147
3629 147 47 -249 -410 -82 375 76 31 46 -118 28 234 234 51 -43 263 9 -56 120 72 -55 64 -16 -17
3652 -17 -189 174 50 14 155 109 -36 125 -10 -72 231 -77 -92 174 140 139 -16 -148 -208 25 188 -108 264
3675 264 -210 -371 92 233 237 -194 -353 -266 -361 169 -77 -72 -28 168 29 23 -304 -260 -5 45 111 -23 -156 -336
3699 -336 304 289 21 -131 -395 -167 379 145 87 1 -188 19 362 250 39 -52 -172 -193 359 -11 -458 -421
3721 -421 -72 78 172 229 -22 139 -27 476 51 192 -96 -202 -93 12 123 87 -132 -134 30 40 -192 80
3743 80 158 -315 -73 -34 -58 -216 139 204 219 335 -321 -164 134 -80 230 139 -263 -338 -83 221 -107 -225 -89
3766 -89 -178 220 349 -85 -286 -11 80 87 67 -127 -266 58 32 103 77 -83 18 -246 -115 101 -137 -317 -323 252
3790 252 444 -74 107 202 -311 132 21 -25 -123 -133 -35 -152 46 143 -179 -56 105 419 10 -192 -238 -294 -24
3813 -24 340 2 -298 -120 64 162 -159 203 -86 -291 -61 356 176 -238 -158 21 -50 129 -95 -414 -267
3834 -267 -205 15 121 -8 17 -208 241 144 -276 80 -374 104 90 521 -159 -90 -284 70 246 266 -42 -251
3856 -251 -240 161 -82 -133 -111 -10 96 147 260 -74 -72 -55 -78 175 424 -272 -63 -126 229 8 7 130 -515 -142
3880 -142 251 -156 83 -177 -54 -72 276 431 -186 0 22 195 -10 -194 169 -119 -89 312 -17 -89 -67 -220
3902 -220 -96 112 -144 -19 -102 66 265 83 -145 -251 20 238 104 355 98 52 -238 -65 -8 -227 -66
3923 -66 15 106 -95 104 -65 -356 -125 11 164 -153 -129 71 44 17 -76 121 -55 -159 29 178 -38 -205
3945 -205 -10 -202 320 -114 -8 -349 -58 40 118 -45 -227 -75 -63 287 -155 127 69 -172 145 45 149
3966 149 -168 -161 121 -124 453 -82 -90 -48 -219 46 -27 70 -68 -255 -57 -198 -8 -326 -437 -419 198 314 30
3989 30 -6 -404 -228 118 -126 145 -137 -237 92 15 51 40 -291 -307 388 125 57 69 -154 230 225 -137 -234 -53
4013 -53 -257 -102 466 402 322 -29 -202 76 165 -17 73 -220 232 171 216 -196 -220 87 132 234 -104 173 -129
4036 -129 118 44 231 -10 38 -255 -157 195 202 -116 -101 146 -4 156 380 -223 -236 118 -56 94 127 -270 -178
4059 -178 -232 277 72 -24 -169 95 -59 251 -113 90 -131 -162 215 69 -100 92 -22 73 -22 82 -261 44
4081 44 209 421 104 -28 -288 -339 -167 185 325 -7 -197 -93 269 361 0 75 -148 -169 -89 291 74 -296
4103 -296 109 68 -52 94 -282 -20 -382 -116 -126 -193 -35 -360 -102 12 403 -144 36 -157 37 38 -59 -220
4125 -220 -136 39 240 90 299 -4 83 -123 166 133 80 -60 -57 -62 30 223 -91 -116 -476 321 85 150 -413 -129
4149 -129 373 112 114 28 -365 -70 245 307 -58 -2 213 -88 234 158 -73 55 -37 -109 -172 63 -67 -187 -40
4172 -40 43 -220 -137 -217 -149 -59 -5 240 -77 -114 -83 360 7 -188 -623 -274 112 210 183 -3 27 285 133 -8
4196 -8 100 -321 -50 -164 234 -120 10 103 159 192 76 205 196 3 76 127 63 61 -117 -184 -149 27 -26 133 -68
4221 -68 -8 49 148 90 -46 -330 -49 53 192 131 -127 -63 26 -3 234 136 122 2 155 242 26 51 -10 -93 -15
4246 -15 -55 21 -256 -215 2 132 136 -43 -298 180 -43 243 -196 116 3 -126 -34 84 63 -270 27 -128 217
4269 217 217 168 -194 -80 385 -66 286 -162 -170 357 293 38 -99 43 11 269 -54 23 -73 -17 -270 13 75 -94
4293 -94 301 -196 -111 69 -196 -95 -108 -164 -112 104 19 175 -135 -109 299 127 79 -139 -271 97 148 247 152 190
4317 190 -258 79 167 182 -482 -129 39 77 31 97 -191 43 312 17 22 -43 -151 -197 -64 230 227 -561 -129 120
4341 120 -140 -108 -74 -89 -174 -22 173 297 -353 -204 199 422 168 -3 46 14 11 -32 395 107 -359 -228 -408
4364 -408 235 127 257 312 70 -214 140 -130 -108 -189 238 121 -12 -90 -120 -115 -84 249 -32 57 107 213 43
4387 43 -103 84 -11 163 -219 4 155 114 -283 -286 -108 391 66 50 -202 41 -104 116 160 -232 1 224
4409 224 105 160 -158 -198 184 -129 7 -437 -70 -23 -43 245 56 -202 -312 -217 95 198 -55 -78 -468 87
4431 87 -61 308 -11 -290 -83 139 166 -192 109 -261 -202 210 6 -56 -154 -208 -115 -72 293 -63 -74 142 -172
4454 -172 552 -96 -257 -146 156 140 -3 128 -168 -49 46 80 -48 208 26 -2 14 -374 -241 -154 16 72
4476 72 43 111 -202 -126 -220 -36 331 355 -68 -122 18 173 222 -33 -10 -245 -120 12 20 103 -39 -47 -252 134 20
4501 20 -264 -113 -235 -62 157 -145 -33 -190 3 204 42 51 15 -337 67 -222 92 -261 -290 -69 64 -34
4523 -34 -131 -18 7 -98 -67 93 177 -73 37 74 57 220 -140 -158 50 198 118 241 113 -71 -93 238 49
4546 49 -119 -271 34 319 85 -8 -259 293 353 122 213 180 117 -55 -119 40 -350 2 -145 46 208 -147
4568 -147 -87 -257 -104 106 61 -70 150 -107 2 159 -67 310 49 -61 -102 100 253 336 -147 120 401
4589 401 225 140 171 9 -225 -98 109 -212 201 56 51 19 96 18 -262 395 208 36 17 -226 58 11 188
4612 188 383 -224 128 -264 213 39 56 -150 -230 -49 -52 218 -42 -41 174 -2 -328 70 -142 -181 98 223
4634 223 408 85 12 -178 -125 137 -180 7 -153 -402 1 -100 464 175 218 -131 -79 59 92 -149 -268 -277
4656 -277 -50 187 317 141 -167 -183 -220 106 -12 10 -239 64 118 181 -73 18 39 223 267 -260 -231 -259 194
4679 194 228 186 -291 -221 -108 359 223 276 56 -41 106 234 -111 -94 -198 51 85 184 155 -355 6 -26 296
4702 296 -19 206 -273 11 264 112 227 -22 -25 -155 251 136 65 74 -83 21 207 -47 26 -235 1 32
4724 32 98 -26 -111 -24 -35 190 14 7 -24 -104 108 70 199 -161 -372 -187 262 15 -55 -156 -96 -24 102 -95
4748 -95 -11 -47 138 374 51 314 43 -131 97 14 37 313 193 -20 -75 -198 -88 -35 -293 -103 25 33 -130
4771 -130 -156 -44 69 68 -26 -79 -177 -123 -58 -138 99 17 141 -237 38 96 -92 -53 -272 -31 190 -41 55 27 -305
4796 -305 120 34 106 -101 -126 -216 -145 30 31 216 -61 -22 -58 -258 278 -139 -247 78 277 -294 -241 -57 -101 -196
4820 -196 229 363 -10 -154 2 10 -91 136 -98 82 -177 64 -142 -93 -198 18 66 -86 0 131 110 -79
4842 -79 288 -52 205 213 -283 -52 240 -182 -19 112 190 184 351 83 10 273 202 113 -335 -1 -376 -31 90
4865 90 233 19 -65 -51 88 157 -79 -89 -409 104 141 -7 -28 -289 -377 -187 -5 -194 -74 -141 -30 -92 226
4888 226 -40 -113 15 59 267 -184 343 -120 11 -5 49 -12 -84 221 135 105 156 -196 358 -382 -245 196 -234
4911 -234 182 36 -166 38 -95 -27 50 -362 -160 60 -208 21 -327 -170 459 -14 116 57 -337 -2 121
4932 121 87 -276 100 -30 54 148 222 88 -205 163 -167 97 98 -275 -136 116 -39 162 -125 -244 -120 -392
4954 -392 205 209 18 151 -289 -4 -186 337 324 16 82 48 44 231 183 154 -36 -11 175 -138 -367 -237 179
4977 179 -83 -42 -93 64 -60 -83 -47 -45 -65 -222 -39 -69 -41 -79 86 51 104 -77 101 -505 36 97 27 208 -382
5002 -382 19 -103 38 -25 11 45 -129 -213 -86 -33 -82 -175 77 298 106 291 208 -6 -3 69 -365 309 -14 -129
5026 -129 -116 -75 319 252 193 -27 -258 227 85 -81 -116 113 388 290 55 38 -202 253 -56 87 161 260 61
5049 61 10 91 -23 48 -253 -180 56 -112 -47 -163 -245 -30 -118 -108 208 -19 14 198 -11 161 -110 -230 -23
5072 -23 236 -315 116 146 -505 2 52 74 -387 -205 -97 -396 50 -232 -87 49 37 -112 255 78 -144 176
5094 176 188 -143 323 39 -247 -57 238 63 -16 -198 93 29 26 -106 27 -310 -308 33 -212 118 -179 -206 -225
5117 -225 190 455 -75 63 -142 50 -99 28 -202 -114 91 2 130 1 -255 -353 -225 -168 306 -146 -86 183
5139 183 68 24 168 144 -145 160 -41 92 -157 -18 62 -97 -142 -128 112 170 -133 170 -111 -107 -108 -41 72 -111
5163 -111 -75 -23 106 -342 165 -68 106 28 -226 218 133 -126 13 240 62 7 226 147 -119 -89 -119 -152 257
5186 257 -102 21 -105 105 167 28 65 132 -88 128 -73 47 -143 -143 129 -170 232 7 -214 -226 -23 -134
5208 -134 -45 224 -79 -100 168 51 10 -24 -390 -61 208 193 47 31 -286 -155 30 154 -89 31 203 -195
5230 -195 -86 -15 -332 182 31 132 225 -18 -306 -167 -199 8 317 -107 -95 -91 -38 339 -68 14 -45 -143 160
5253 160 52 57 -91 146 26 -228 36 -130 -397 102 43 159 19 106 -242 -145 -117 108 -154 -107 61 360
5275 360 170 -296 -112 -24 -13 323 17 129 -64 -28 54 -123 312 7 -346 152 392 -189 -198 -222 -139 -158 126
5298 126 113 -168 11 -52 13 47 103 27 -67 92 212 113 -144 -184 -108 33 69 54 -74 -64 278 -378 -44 176
5322 176 -152 -360 105 -292 -18 -79 -240 -176 102 134 -29 -192 -136 -343 -102 95 43 18 -201 18 274 -396
5344 -396 -17 -10 -330 157 39 149 -275 52 -222 -66 75 -381 -361 31 -28 75 -23 -204 268 -256 106 -70
5366 -70 106 25 176 -199 120 191 -110 -11 92 94 290 98 -207 -302 151 106 -46 -87 92 -53 -76 -4 -193 -117
5390 -117 -83 -139 27 1 235 -93 -205 -138 -160 329 -31 -268 -308 -143 137 138 9 -172 -108 235 221 -78 -154 -357
5414 -357 -187 -152 161 196 -324 54 171 -269 -52 -123 -221 -72 188 120 26 523 32 -95 144 319 258 -78
5436 -78 -117 -55 376 23 -160 -154 -134 -122 67 245 -109 -16 -73 106 -106 118 -255 27 198 -10 129 -155 -131
5459 -131 134 -12 184 24 11 151 133 165 -82 -423 225 95 505 431 -11 -41 -289 -370 -209 -197 8 -144
5481 -144 -175 84 -12 -68 -68 234 92 207 119 -106 -159 75 -99 -67 83 33 295 -41 -169 56 -72 276 -155
5504 -155 -223 374 119 -256 106 25 292 65 -144 -114 -41 22 196 -165 -40 129 -104 87 -86 122 -105 222
5526 222 20 199 60 214 -235 -178 -126 131 -67 38 14 -242 -110 121 143 25 -256 -55 -40 307 17 -80
5548 -80 -166 -76 128 -25 56 -285 139 384 80 -40 74 -75 -284 33 332 5 -223 33 10 25 -72 -41 63
5571 63 -93 107 174 119 111 -245 -262 114 13 101 47 -215 99 153 77 193 -207 -422 -29 -88 -9 -119 -69 -104 19
5596 19 -68 209 -219 -234 135 480 83 133 204 -31 291 163 -1 -33 132 156 71 299 -147 -38 89 320 179
5619 179 89 73 53 -3 79 35 -136 63 -252 -50 181 227 -76 -24 -317 -73 334 96 309 -206 233 218 143
5642 143 -273 -118 -318 117 -19 185 -97 85 -112 -112 273 30 -167 84 -146 115 9 -173 -127 -40 105
5663 105 -31 82 335 37 -86 175 -59 -99 -107 73 22 199 58 23 -172 -142 288 129 -42 -159 54 -101
5685 -101 128 233 178 -157 157 -48 20 59 -20 125 -309 -362 48 -185 372 108 229 84 189 -321 -14 -67
5707 -67 1 277 8 -120 220 71 710 -109 -72 -189 18 -95 -27 -120 -88 -360 32 260 171 30 -137 119
5729 119 72 183 101 -203 26 -208 153 145 104 12 -76 -136 -252 149 -176 8 -89 64 -62 66 248 -299 -69
5752 -69 111 76 40 -43 -28 -40 -4 -11 198 -320 81 -375 -78 486 -332 152 -350 21 95 140 -21 -1 147 -48
5776 -48 -69 -344 8 -29 -147 325 -226 3 -141 -93 -210 62 130 13 -128 -59 45 122 -24 -111 74 42 157
5799 157 -244 22 31 -118 -13 9 -381 -224 49 141 -8 -2 -79 111 79 -7 49 -236 -218 -226 77 2 184 -92 -306
5824 -306 -82 266 -140 52 21 -81 -149 7 -235 81 -264 -307 107 -21 19 -271 -7 65 37 141 121 123 -313
5847 -313 164 373 -127 18 58 -267 -109 49 -56 -165 67 -187 -53 148 -34 -136 164 -43 99 -106
5867 -106 -26 -38 -370 -240 50 -78 97 -69 43 148 110 -102 -300 -138 212 205 31 -115 -135 -86 -89 -299 160
5890 160 67 297 -32 -15 -166 165 32 -272 -11 77 67 -442 -38 -20 -83 184 19 -63 -68 -138 -243 13 -17 -125
5914 -125 8 58 0 53 103 -163 -180 -124 -202 14 -49 151 140 170 37 -212 -33 -130 225 12 -40 97 48 252
5938 252 81 -215 173 -132 96 -31 315 -33 -242 -167 -97 -244 209 31 149 139 322 -32 -115 -211 -344 -215
5960 -215 -105 22 131 237 -4 154 169 216 -139 -196 47 274 181 47 153 56 32 184 -119 -25 -79 195 75
5983 75 -174 51 211 218 -84 16 -97 -86 23 -82 215 -119 -145 99 -77 94 141 27 95 68 -41 -319 137
6006 137 174 -89 -232 77 -12 44 -46 -93 299 95 -71 50 256 297 -47 164 41 -133 214 -316 -78 -129
6028 -129 14 -28 85 66 -39 164 62 -90 -349 193 66 -129 -174 107 173 -204 255 270 -99 -121 -19 -381
6050 -381 -12 86 -73 98 -527 -29 256 -95 -68 171 -78 171 30 30 -69 213 261 50 -12 -113 -195 -277 18
6073 18 279 139 -124 105 21 102 -166 39 -134 -40 351 101 169 36 36 259 -104 -154 40 -272 325 10 2
6096 2 -71 -348 29 71 96 74 -235 280 22 -334 137 315 -241 -54 -169 20 -10 -143 -128 54 163 356 4
6119 4 -87 -55 127 113 -52 -268 -56 -166 202 55 -286 -12 4 106 -79 -29 -176 -277 -99 184 -169 -232 15
6142 15 103 -52 171 202 67 24 57 -32 81 5 144 18 -114 132 -121 189 -52 -324 -20 -51 67 327 -20
6165 -20 -90 90 23 139 30 156 -59 156 231 11 78 -54 -157 -23 56 -181 414 -14 -30 -229 434 78
6187 78 70 -92 -200 28 -39 -10 170 288 -100 7 13 -39 -346 -160 -297 137 230 16 -103 17 151 -94 -127
6210 -127 110 105 -225 -21 85 121 313 -165 -272 310 166 131 178 77 61 70 490 83 111 -19 34 186 -88
6233 -88 -99 45 268 -153 -266 -258 -71 78 -319 138 137 -225 -76 63 314 78 30 -208 -193 114 114 -208 -59
6256 -59 -7 84 227 -172 90 -161 237 93 -97 144 124 -120 123 -26 88 -108 196 121 -11 -40 79 149
6278 149 -182 -149 130 -106 -146 -320 27 226 343 -165 62 -104 -147 155 349 434 -5 24 -67 -169 50 127
6300 127 374 -75 66 -71 -317 -87 77 109 -285 173 167 231 -89 -218 24 -105 -72 340 231 143 57 -255
6322 -255 39 -288 -21 -90 1 -228 -313 9 -176 143 209 63 -253 140 -168 -184 -75 145 -132 318 260 -134
6344 -134 -259 -17 -104 118 403 317 74 78 179 -130 -50 31 108 -85 210 85 -271 79 14 59 -36 -99 -219 100
6368 100 55 159 379 209 31 36 -28 148 -110 -36 -4 260 115 -168 19 -225 -397 -41 -242 -161 94 -74
6390 -74 226 -221 -23 -7 -3 -294 -78 219 10 -113 -86 162 -235 326 -57 247 46 317 -31 -105 -82 -12 -38
6413 -38 226 -55 34 -231 74 104 -141 89 241 -215 -55 -218 -49 -79 407 80 225 10 -137 -97 -105 5
6435 5 -126 5 28 84 -7 194 -45 -210 -259 275 -228 -102 -42 -178 48 -371 335 -235 -27 -22 186 -139 -116
6458 -116 -392 -4 355 251 72 -364 -77 80 2 180 -89 -263 2 -204 -40 -7 139 -240 -142 273 -42
6479 -42 310 57 249 43 154 110 387 16 -250 91 136 178 77 55 181 168 335 166 -387 -255 -86 42
6501 42 -18 -50 141 68 -25 -74 -122 126 -32 233 82 273 -87 -76 23 -34 115 -156 -1 -57 222 -150 133 -190
6525 -190 455 -52 170 -281 -162 16 135 201 20 -165 -70 -343 -109 80 33 -110 79 93 202 202 93 215
6547 215 -195 -278 53 137 278 -119 -40 60 159 -4 -47 35 -56 -79 162 50 36 61 -30 150 51 -19 -83 236 145
6572 145 -197 -117 44 145 190 -70 56 -154 -138 -161 63 -57 166 20 -335 112 -121 300 171 -3 154
6593 154 169 174 -122 233 99 -179 210 7 85 -262 272 -102 156 356 -485 129 224 -15 265 -17 64 329
6615 329 2 -206 -30 157 23 -248 289 99 -182 380 71 -42 -3 -54 -227 43 -287 -92 227 -95 176
6636 176 26 -246 303 -120 146 277 -128 134 -177 145 -177 222 -285 71 -106 -38 122 17 55 -18 -113
6657 -113 146 -244 230 264 168 71 -310 146 156 -53 51 -299 135 55 13 -258 -269 109 -15 105 126 -473 -8
6680 -8 39 84 86 256 -90 -57 232 -79 -73 -42 -66 -89 188 -101 -10 -152 240 187 -243 94 -270 -5 130 -111 254
6705 254 167 122 -27 -209 -247 62 87 15 70 -3 97 52 -87 -179 -157 243 -96 134 86 139 254 -113 -203 180
6729 180 287 -344 -124 -156 -106 180 130 338 -478 347 210 -150 -157 -325 -119 -24 165 -77 110 -24 -325 157
6751 157 -43 214 -42 -11 6 -45 213 3 196 303 124 118 -247 -7 44 -320 142 -58 129 -17 -173 -109
6773 -109 -245 -72 134 -54 -49 166 207 -31 -125 128 104 -91 303 -85 -135 -67 -25 242 -24 102 192 -46 -107
6796 -107 8 266 101 291 72 227 199 96 -380 124 -95 -135 -31 -56 -38 -102 -2 54 -186 57 17 -76 155
6819 155 -316 15 75 -37 -198 -23 -85 224 37 -213 143 132 -9 -82 262 38 -91 -143 140 -238 31 36
6841 36 -203 -203 -27 1 -141 -148 -187 -196 124 279 -63 -462 146 -57 100 81 -269 87 -89 -4 -122 -32 -292 97
6865 97 -45 113 -128 -239 -247 171 -50 -53 -121 -158 128 374 10 17 178 -188 28 46 255 -246 150 -94 337
6888 337 115 20 -140 -147 -169 -61 68 154 192 34 136 149 58 -56 141 -287 -70 -205 17 82 121 158 166 -109
6912 -109 -146 213 -46 116 80 123 -38 78 -65 3 -293 -291 154 114 -160 104 -106 -84 -164 -345 100 -130 -88
6935 -88 58 -61 -146 26 83 -152 72 -196 -67 -173 133 -170 46 58 -6 280 51 -33 200 -48 -170 51
6957 51 280 190 -387 224 197 -3 15 78 116 -210 56 -22 88 34 -30 137 187 -88 -83 63 24 101 211 -84 -124
6982 -124 -53 246 237 -63 45 167 -95 -24 -216 -160 -210 113 -24 5 67 16 -96 224 54 -207 -39 -1 168
7005 168 -304 302 113 -149 22 111 -15 -310 -42 1 405 230 242 137 -34 -192 44 -68 -64 68 204 96
7027 96 -49 -45 -82 239 67 21 63 -430 80 216 188 241 -439 -46 -92 -160 -83 16 122 -95 65 50 -173 106
7051 106 124 -31 137 -77 -31 88 -160 -485 129 78 -64 31 -7 -72 -103 -217 144 -207 285 119 -2 353
7073 353 36 -53 67 146 -72 77 31 1 95 247 -108 -120 225 57 98 269 -273 -186 148 54 52 42 -368 -32
7097 -32 93 304 -21 -99 -226 6 -160 -14 -51 213 -141 -130 131 155 -62 -86 93 82 -84 24 -51 15 -63
7120 -63 103 -106 -58 -123 -29 314 41 101 -222 45 118 -26 -229 176 98 211 -76 253 96 -37 -93 -124 57
7143 57 -95 -147 -90 -53 58 -89 -2 5 -186 -6 98 -152 -26 34 87 13 6 -218 -13 -591 -227 -99 -186 134
7167 134 -54 -110 -78 131 89 220 -66 204 -267 171 -129 3 -148 -165 181 4 525 -42 -46 21 7 -93 -55
7190 -55 58 326 -300 -353 -175 -151 -90 137 109 -80 -340 -113 -88 19 146 -70 -49 224 45 -116 22 169
7212 169 261 168 183 -147 -122 -213 -68 -49 -185 258 -50 -26 30 -7 73 -249 45 -53 130 -404 -15 73 -112 -219
7236 -219 250 10 258 -149 20 11 60 161 -220 -354 160 125 -76 -186 155 18 -112 -43 72 101 65 215
7258 215 159 -5 -35 -163 49 -94 125 -274 -322 140 -24 194 -21 -43 83 270 -89 219 -208 -108 -83 276
7280 276 142 -119 -6 -31 -85 -4 50 51 -25 161 -90 158 -104 -117 141 35 64 32 -32 -65 -174 -88 -282 -18
7304 -18 -206 -20 -195 103 324 81 168 327 -88 -178 -108 -266 49 46 20 -60 204 12 -89 308 47 92 124
7327 124 -14 15 -216 422 43 -5 82 77 246 -167 -133 292 -24 -165 38 -110 172 82 18 33 -37 249 183 -76
7351 -76 -47 226 90 -167 -210 -30 57 106 -55 -17 -233 160 -85 158 -45 -166 -97 -114 -136 291 69 59 -17 -69
7375 -69 -4 -234 12 -63 50 16 -60 0 -40 -216 190 39 -118 188 -92 42 -47 -209 -143 25 49 -291 330
7398 330 83 -55 -332 235 -2 -27 -49 46 6 89 -56 -70 4 177 30 -128 -126 64 62 105 -118 164 49 -4
7422 -4 45 282 49 394 -71 21 99 3 -20 83 -17 -11 -130 157 178 -63 -58 -18 -92 -330 -22 14 104 -129 -33 -238
7448 -238 158 117 -206 416 123 40 -231 376 -37 162 82 -69 99 224 -125 -92 37 66 -115 -136 -25 46
7470 46 -127 142 30 -24 -5 -126 413 12 -20 -174 180 112 -8 333 -199 15 -19 198 2 145 -50 -77
7492 -77 259 186 -108 254 -30 50 267 -36 -246 15 198 -12 232 -32 -25 -172 -143 -155 -6 -166 -276 -108
7514 -108 -133 150 226 53 -168 127 -101 -84 -239 -4 150 75 -13 -91 18 17 -85 -63 38 282 64 -36 103
7537 103 314 -212 199 -112 46 -91 11 146 -11 117 23 88 252 -27 104 -81 -86 -122 -325 -26 -125 37
7559 37 104 100 -237 -102 47 -45 -235 252 -175 -51 -123 48 243 -49 61 -136 50 110 84 194 60 311 89
7582 89 -33 -210 44 80 -175 -306 -155 -183 -194 -43 -91 45 -9 258 -194 -36 148 -118 -125 147 238 -57 -200
7605 -200 -8 -9 -168 105 -53 -186 -29 337 117 -74 -87 -121 -116 -77 290 32 -93 -205 18 -246 86 62 -5
7628 -5 -118 -127 -184 100 -19 199 -385 -237 -276 154 -284 -280 212 185 -12 -152 216 180 -86 47 257 -235 99
7651 99 95 -260 -127 -74 -41 75 -165 219 109 -219 96 117 1 147 -30 -139 178 -63 -16 -214 72 206
7673 206 -75 -224 -8 -202 64 193 233 -234 -193 -13 -41 -108 179 -99 -62 140 -64 -95 -231 -41 12 -194
7695 -194 -111 203 -18 86 479 -317 183 -46 -142 15 44 -216 -19 95 -174 36 2 229 153 89 175 169 -173
7718 -173 -79 240 -162 -50 44 -93 44 -46 115 9 130 -43 -151 141 140 -61 109 -62 108 -323 16 133
7740 133 16 142 78 34 -154 -9 -202 164 48 167 143 -93 53 -36 -73 115 14 361 -440 -358 -51 -203
7762 -203 -181 -379 160 -288 -95 22 37 59 -71 56 21 309 -102 157 -76 75 -94 -160 455 95 -327 44
7784 44 117 -184 -128 255 50 100 157 -212 346 109 -178 158 -50 -7 91 -265 -215 -218 12 -125 -164 171 62 257
7808 257 277 12 335 -453 -44 -157 -6 222 -5 -103 60 38 -32 -54 -70 -99 -69 -102 218 298 -27 18 183 -84
7832 -84 47 -160 16 -244 -59 32 -67 377 -34 -62 -142 98 66 164 317 90 179 -269 141 -190 -178 427 147
7855 147 -151 46 118 322 -19 37 -53 -223 48 -199 -35 269 -313 -357 -321 -13 55 -88 55 18 89 -156 15
7878 15 -114 -35 32 -37 123 149 -242 93 -23 182 -243 -60 -291 3 189 42 -133 -60 -104 -221 87 -171
7900 -171 -220 152 -56 -18 -19 98 -151 -13 -60 304 103 80 -274 51 15 130 -248 -105 232 100 -197 164
7922 164 -202 -72 106 -91 -36 145 233 42 184 -69 161 -15 -62 -108 -108 -142 -102 -21 -111 94 62 -271 -1 -107
7946 -107 -187 93 116 60 -195 -123 26 -85 -40 -166 -283 -76 307 190 151 124 -11 -347 88 -89 -100 -97 14
7969 14 -280 101 -27 -258 96 -103 313 53 -18 -18 -154 108 91 240 -31 -33 -135 -117 174 -1 -238 -64 -100
7992 -100 72 -29 -149 0 -173 51 242 -10 270 74 -187 140 44 -225 70 76 -289 -12 318 -200 158
8013 158 -58 137 55 -212 188 352 -78 -49 40 160 298 0 66 149 -203 -290 -198 -22 -301 106 -60 -255
8035 -255 -183 -274 10 -109 -140 69 -156 99 -88 -148 28 140 117 426 166 -224 138 214 37 310 -55 -165
8057 -165 135 -28 -189 -59 20 25 -100 178 250 63 -60 -258 80 86 144 -164 -44 -74 -351 29 50 17 -244
8080 -244 -1 -36 -143 -211 -76 215 -115 -221 200 -220 -140 152 232 234 119 -228 75 -207 -138 -193 211 69 -8
8103 -8 -67 -164 94 -70 -207 17 109 241 159 -92 -274 347 221 -282 -85 -69 112 -2 137 -459 -113 -156 -111
8126 -111 -123 211 64 -237 -7 -135 198 -207 248 -16 -81 105 -31 111 88 -215 222 -94 271 -75 -277
8147 -277 -390 -33 104 -65 127 -152 32 -203 -61 108 104 -281 390 88 123 -83 -33 -106 60 280 54 89
8169 89 71 -219 14 -182 -162 112 45 -422 43 15 -220 -273 -490 -147 -44 122 -183 -377 57 -252 12 -248
8191b48
##END NTUPLES=NMR FID
##END=
