##TITLE=1H_DE-27k
 D2O
 8 sc, 
 16.8.2024
##JCAMPDX= 6.0         $$ Bruker NMR JCAMP-DX V2.0
##DATA TYPE= NMR FID
##DATA CLASS= NTUPLES
##ORIGIN= UXNMR, Bruker Analytische Messtechnik GmbH
##OWNER= root
$$ XWIN-NMR		Version 3.5
$$ Fri Aug 16 16:01:50 2024 Russian Standard Time (UT+4h)  she@DPX200
##.OBSERVE FREQUENCY= 200.1318
##.OBSERVE NUCLEUS= ^1H
##.DELAY= (6, 6)
##.ACQUISITION MODE= SIMULTANEOUS
##.ACQUISITION SCHEME= undefined
##.AVERAGES= 8
##.DIGITISER RES= 18
##SPECTROMETER/DATA SYSTEM= spect
##.PULSE SEQUENCE= zg30
##.SOLVENT NAME= D2O
##.SHIFT REFERENCE= (INTERNAL, D2O, 0, 15.7039)
##AUDIT TRAIL= $$ (NUMBER, WHEN, WHO, WHERE, WHAT)
$$ ##TITLE= Audit trail, XWIN-NMR		Version 3.5
$$ ##JCAMPDX= 5.01
$$ ##ORIGIN= Bruker BioSpin GmbH
$$ ##OWNER= she
$$ F:/spectra/data/she/nmr/H-F/1/audita.txt
$$ ##AUDIT TRAIL=  $$ (NUMBER, WHEN, WHO, WHERE, WHAT)
(   1,<2024-08-16 16:00:58.59 +0400>,<she>,<DPX200>,
      <created by zg, POWCHK disabled, PULCHK disabled
       configuration hash MD5:
       00 E9 B6 7A A2 85 ED C7 34 08 36 98 17 FE 4E 26
       data hash MD5: 16K
       6C E6 87 F2 DC 24 DA 8E 8B 5C E8 B2 5F 89 51 97>)
$$ ##END=
$$ 
$$ hash MD5
$$ D8 48 34 5D 4F 3A E2 88 FE 73 41 1B FA 11 70 32
##$RELAX= 
##$RELAX= 
##$RELAX= 
##$RELAX= 
##$RELAX= 
##$RELAX= 
$$ Bruker specific parameters
$$ --------------------------
##$DU= <F:/spectra>
##$EXPNO= 1
##$NAME= <H-F>
##$PROCNO= 1
##$TYPE= <nmr>
##$USER= <she>
##$AMP= (0..31)
100 100 100 100 100 100 100 100 100 100 100 100 100 100 100 100 100 100 
100 100 100 100 100 100 100 100 100 100 100 100 100 100 
##$AQSEQ= 0
##$AQ_mod= 1
##$AUNM= <au_zg>
##$AUTOPOS= <>
##$BF1= 200.13
##$BF2= 200.13
##$BF3= 200.13
##$BF4= 200.13
##$BF5= 200.13
##$BF6= 200.13
##$BF7= 200.13
##$BF8= 200.13
##$BYTORDA= 1
##$CFDGTYP= 0
##$CFRGTYP= 5
##$CHEMSTR= <none>
##$CNST= (0..31)
1 1 145 1 1 1 1 1 1 1 1 1 1 1 1 1 1 1 1 1 1 1 1 1 1 1 1 1 1 1 1 1 
##$CPDPRG= <>
##$CPDPRG1= <>
##$CPDPRG2= <>
##$CPDPRG3= <>
##$CPDPRG4= <mlev>
##$CPDPRG5= <mlev>
##$CPDPRG6= <mlev>
##$CPDPRG7= <mlev>
##$CPDPRG8= <mlev>
##$CPDPRGB= <>
##$CPDPRGT= <>
##$D= (0..31)
0 1.2 0 0 0 0 0 0 0 0.06 0 0.03 0 0 0 0 0.0002 0 0 0 0 0 0 0 0 0 0 0 0 
0 0 0 
##$DATE= 1723809658
##$DBL= (0..7)
120 120 120 120 120 120 120 120 
##$DBP= (0..7)
150 150 150 150 150 150 150 150 
##$DBP07= 0
##$DBPNAM0= <>
##$DBPNAM1= <>
##$DBPNAM2= <>
##$DBPNAM3= <>
##$DBPNAM4= <>
##$DBPNAM5= <>
##$DBPNAM6= <>
##$DBPNAM7= <>
##$DBPOAL= (0..7)
0.5 0.5 0.5 0.5 0.5 0.5 0.5 0.5 
##$DBPOFFS= (0..7)
0 0 0 0 0 0 0 0 
##$DE= 6
##$DECBNUC= <off>
##$DECIM= 24
##$DECNUC= <off>
##$DECSTAT= 4
##$DIGMOD= 1
##$DIGTYP= 9
##$DL= (0..7)
0 120 120 120 120 120 120 120 
##$DP= (0..7)
150 150 150 150 150 150 150 150 
##$DP07= 0
##$DPNAME0= <>
##$DPNAME1= <>
##$DPNAME2= <>
##$DPNAME3= <>
##$DPNAME4= <>
##$DPNAME5= <>
##$DPNAME6= <>
##$DPNAME7= <>
##$DPOAL= (0..7)
0.5 0.5 0.5 0.5 0.5 0.5 0.5 0.5 
##$DPOFFS= (0..7)
0 0 0 0 0 0 0 0 
##$DQDMODE= 0
##$DR= 18
##$DS= 0
##$DSLIST= <SSSSSSSSSSSSSSS>
##$DSPFIRM= 0
$$ [...]
##$SUBNAM2= <"">
##$SUBNAM3= <"">
##$SUBNAM4= <"">
##$SUBNAM5= <"">
##$SUBNAM6= <"">
##$SUBNAM7= <"">
##$SUBNAM8= <"">
##$SUBNAM9= <"">
##$SW= 24.0689170037331
##$SWIBOX= (0..15)
0 0 2 0 0 0 0 0 0 0 0 0 0 0 0 0 
##$SW_h= 4816.95568400771
##$TD= 16384
##$TD0= 1
##$TE= 0
##$TE2= 300
##$TE3= 300
##$TEG= 300
##$TL= (0..7)
0 120 120 120 120 120 120 120 
##$TP= (0..7)
150 150 150 150 150 150 150 150 
##$TP07= 0
##$TPNAME0= <>
##$TPNAME1= <>
##$TPNAME2= <>
##$TPNAME3= <>
##$TPNAME4= <>
##$TPNAME5= <>
##$TPNAME6= <>
##$TPNAME7= <>
##$TPOAL= (0..7)
0.5 0.5 0.5 0.5 0.5 0.5 0.5 0.5 
##$TPOFFS= (0..7)
0 0 0 0 0 0 0 0 
##$TUNHIN= 0
##$TUNHOUT= 0
##$TUNXOUT= 0
##$USERA1= <user>
##$USERA2= <user>
##$USERA3= <user>
##$USERA4= <user>
##$USERA5= <user>
##$V9= 5
##$VALIST= <valist>
##$VCLIST= <CCCCCCCCCCCCCCC>
##$VD= 0
##$VDLIST= <DDDDDDDDDDDDDDD>
##$VPLIST= <PPPPPPPPPPPPPPP>
##$VTLIST= <TTTTTTTTTTTTTTT>
##$WBST= 1024
##$WBSW= 4
##$XGAIN= (0..3)
0 0 0 0 
##$XL= 0
##$YL= 0
##$YMAX_a= 245759
##$YMIN_a= -238318
##$ZGOPTNS= <>
##$ZL1= 120
##$ZL2= 120
##$ZL3= 120
##$ZL4= 120
##$ABSF1= 10
##$ABSF2= 0
##$ABSG= 5
##$ABSL= 3
##$ALPHA= 0
##$AQORDER= 0
##$ASSFAC= 0
##$ASSFACI= 0
##$ASSFACX= 0
##$ASSWID= 0
##$AUNMP= <proc_1d>
##$AZFE= 0.1
##$AZFW= 0.1
##$BCFW= 1
##$BC_mod= 2
##$BYTORDP= 1
##$COROFFS= 0
##$CY= 11.3945322036743
##$DATMOD= 1
##$DC= 2
##$DFILT= <>
##$DTYPP= 0
##$F1P= 15.6554695791079
##$F2P= 12.8336369535428
##$FCOR= 0.5
##$FTSIZE= 0
##$FT_mod= 4
##$GAMMA= 1
##$GB= 0.15
##$INTBC= 1
##$INTSCL= 1
##$ISEN= 128
##$LB= 0.24
##$LEV0= 0
##$LPBIN= 0
##$MAXI= 10000
##$MC2= 0
##$MEAN= 0
##$ME_mod= 0
##$MI= 1.114404
##$NCOEF= 0
##$NC_proc= 0
##$NLEV= 6
##$NOISF1= 3.799351
##$NOISF2= 2.8
##$NSP= 1
##$NTH_PI= 0
##$NZP= 0
##$OFFSET= 15.70392
##$PC= 1
##$PHC0= -25998.68
##$PHC1= 12.18748
##$PH_mod= 1
##$PKNL= yes
##$PPARMOD= 0
##$PSCAL= 0
##$PSIGN= 0
##$REVERSE= no
##$SF= 200.130013532006
##$SI= 16384
##$SIGF1= 3
##$SIGF2= 2
##$SINO= 400
##$SIOLD= 16384
##$SREGLST= <1H.CDCl3>
##$SSB= 0
##$STSI= 0
##$STSR= 0
##$SW_p= 3612.71676300578
##$SYMM= 0
##$S_DEV= 0
##$TDeff= 0
##$TDoff= 0
##$TI= <>
##$TILT= no
##$TM1= 0
##$TM2= 0
##$TOPLEV= 0
##$USERP1= <user>
##$USERP2= <user>
##$USERP3= <user>
##$USERP4= <user>
##$USERP5= <user>
##$WDW= 1
##$XDIM= 8192
##$YMAX_p= 0
##$YMIN_p= 0
$$ End of Bruker specific parameters
$$ ---------------------------------
##NTUPLES= NMR FID
##VAR_NAME=  TIME,          FID/REAL,        FID/IMAG
##SYMBOL=    X,             R,               I
##VAR_TYPE=  INDEPENDENT,   DEPENDENT,       DEPENDENT
##VAR_FORM=  AFFN,          ASDF,            ASDF
##VAR_DIM=   8192,          8192,            8192
##UNITS=     SECONDS,       ARBITRARY UNITS, ARBITRARY UNITS
##FACTOR=    0.0002076,     1,               1
##FIRST=     0,             0,               0
##LAST=      1.7004516,     0,               0
##MIN=       0,             -238318,         0
##MAX=       1.7004516,     245759,          0
$$ Real data points
##PAGE= N=1
##DATA TABLE= (X++(R..R)), XYDATA
$$ [...]
1930A0m6O0l22K32J85j8P3k79K15l5K67n60K06q1J83P7j01k02M50j83p3k89K20
$$ 10 -36 24 -298 -66 119 101 174 -105 110 75 342 -218 -12 -93 90 167 66 -136 314 131 58 -231 -11
1953a1kJ55l98K28j50N23l18r0K05J37p49L33L50k34k4L8l3J15m9k32K01k57K11
$$ -11 -13 142 -256 -28 -178 345 27 -63 142 279 -470 -137 213 -21 -45 -7 -40 75 26 -206 -5 -262 -51
1976e1K13L2k31j51L01p8J29k26J81k18j8r4J48k46J47J80M1R8l57l3K08j35L14
$$ -51 162 194 -37 -188 113 35 164 -62 119 -99 -117 -211 -63 -309 -162 18 59 157 -200 -233 -25 -160 154
1999A54k77J18j01K89k85K54k1l13J58k87K82P8k18P3P6k55k00N37p0p3m0P1L2
$$ 154 -123 -5 -106 183 -102 152 131 -182 -24 -311 -29 49 -169 -96 -20 -275 -475 62 -8 -81 -121 -50 -18
2022a8o4K78k67L0K40m72M04j35J32j83P1j99J62L84k57R5l5l54kL36L6j04N0
$$ -18 -82 196 -71 -41 199 -273 131 -4 128 -55 16 -183 -21 363 106 201 166 -188 -190 146 182 78 128
2045A28r5m6j74L54k92K37m4j98q3L73L14m06J6J2K4p1mL64l18K15l67J76j18
$$ 128 33 -13 -187 167 -125 112 68 -130 -213 160 474 68 84 96 120 49 45 409 91 306 -61 115 -3
2068cL75k14J3l38K01j28J61K0l46P4LO7r2K55Qk21L00r0l7j03K79Km24P6M30
$$ -3 372 158 171 -167 34 -94 67 87 -259 -185 -182 -115 -207 48 56 -165 135 45 8 -95 184 186 -238 -162 268
2093B68j54k13J82k44J00p9p1K07j8J61J30k12J68l05K10k90l0r9N61l32J12k67
$$ 268 114 -99 83 -161 -61 -140 -211 -4 -22 139 269 57 225 -80 130 -160 -190 -289 272 -60 52 -215
2115b15J6M47m77L42l30O3J6J95r9R3J53q1m9j22J25j39L40m25L46L5n52P13l58
$$ -215 -199 248 -229 113 -217 -154 -138 57 -42 51 204 123 74 -48 77 -62 278 -147 199 234 -318 395 37
2138C7j2k3J46m07J77k10M30l13K20J81k29K11j50k9o8O6Q9q6j64J79j77M30j64
$$ 37 25 2 148 -259 -82 -292 138 -175 45 226 -3 208 58 29 -39 27 116 30 -134 45 -132 298 134
2161A34j21o8n9L26j85Q5L5j24l89O20n33K45j23L29K1N6l01k17L40r5J30q4O2
$$ 134 13 -55 -114 212 27 112 147 23 -366 254 -279 -34 -157 172 193 249 -52 -269 71 -24 106 22 84
2184H4K2l50J24j09J96J93k34j8K48P3n33O39j47M2k78L0J24k73J21R1r6k3L30
$$ 84 106 -244 -120 -229 -33 160 -74 -92 156 229 -304 335 188 230 -48 -18 106 -167 -46 45 -51 -74 256
2207B56p9n2j29O8j92K43j25L0k8l0O4k67M78m02K69j47K68l64L21l57J18L04
$$ 256 177 125 -4 64 -128 115 -10 20 -8 -38 26 -241 237 -165 104 -43 225 -139 182 -175 -57 247
2229B47l61k94L30K9m1o4K34P4j40O4l56L22Rj67J60k08K88L0j92K22j20K45j59
$$ 247 -114 -408 -78 -49 -90 -154 80 154 14 78 -278 44 53 -114 46 -162 126 156 -36 186 66 311 152
2252A52l2k13J68j85P7J95l87l7M69m51K31J34k70j20j6L73K8l9n4n0K05l98J65
$$ 152 120 -93 75 -110 -33 162 -225 -262 207 -244 -13 121 -149 -269 -285 88 116 77 23 -27 178 -220 -55
2275e5L2J87j54K41l20o0k1J35N7P9J02j06N2n9k48m3J51l1j4K1K50l06m2N4N6
$$ -55 -23 164 10 251 -69 -129 -150 -15 42 121 223 117 169 110 -138 -181 -30 -61 -75 -54 196 -110 -152 -98 -42
2300d2N52k98m78K68l05M99j26l04M28l25j59K81l53M99l04M40j20q2o7R8k4K6
$$ -42 510 212 -266 2 -303 196 70 -234 194 -131 -290 -9 -362 137 -167 273 153 71 4 102 78 104
2322A04QQJ03l92P6l3M17o2k48o4K39P5l77m5p5J77J60k82K8Q4L48k87p5J19L64
$$ 104 112 120 223 -169 -93 -126 291 229 -19 -83 156 231 -146 -191 -266 -89 71 -211 -183 -99 249 -38 -113 6 370
2347C70k40j17k62L89k28p9J88j37l8Q5p3O6J39R5m1p9j69L58j77o9N25k64Rj65
$$ 370 130 13 -249 140 -88 -167 21 -116 -154 -69 -142 -76 63 158 117 38 -131 227 50 -19 506 242 251 86
2371H6j43k7j48M84j70k56K27j94O2j15J62K23l02K39P0l8r5q0r8j55J64J98p0
$$ 86 -57 -84 -232 252 82 -174 53 -141 -79 -194 -32 191 -111 128 198 160 65 -15 -113 -268 -104 94 24
2394B4n4k6J03J84j73j55R3m0k9qJ91n31N80l00K54n9J02q5r4R4j23j13j4L72
$$ 24 -30 -56 47 231 58 -97 -4 -44 -73 -81 110 -421 159 -141 113 54 156 71 -23 71 -52 -165 -179 193
2418A93l38J8J03k60M5M20k68K04j70j50P6K53R4j80o2j12R3K5k03J78n6M54j70
$$ 193 -145 -127 -24 -284 -239 181 -87 117 -53 -203 -127 126 220 40 -22 -134 -41 -16 -219 -41 -97 357 187
2441A87j35r4j27j13L31j68J40j97L70j84j93K4j97K28K34k36K23kL4q1L12k22
$$ 187 52 -42 -169 -282 49 -119 21 -176 194 10 -183 -159 -356 -128 106 -130 93 91 125 44 356 134
2463A34l6k41K03j32Lm0q4L73o22P19m06K48J1k41J76j32K62l39n3K42k38J2J36
$$ 134 98 -143 60 -72 -69 -109 -193 180 -442 277 -129 119 130 -111 65 -67 195 -144 -197 45 -193 -181 -45
2486d5j58q8K42K88l36J40j76J18Q1j40J24J9k94K13J80m60K2L19j24K61r9K61
$$ -45 -203 -291 -49 239 -97 43 -133 -15 66 -74 50 69 -225 -12 168 -292 -270 49 -75 186 87 348
2508C48m76K49j33K07j60j09J55j96M68k03k72M1K2J1J90k15J40J78Q3k10k89
$$ 348 -128 121 -12 195 35 -74 81 -115 353 150 -122 -81 -59 -48 142 -73 67 245 328 118 -171
2529a71L33k93K3K35o48K69O36o51L47L8p0K32k43J27j53j71J03J74k13L94j28
$$ -171 162 -131 -108 127 -521 -252 384 -267 80 118 48 280 37 164 11 -160 -57 117 -96 298 170
2550A70K8k36K13m78L63Q8k82K12k18p6J68L93k46j35K87m52K39l1N8M3l92L96
$$ 170 198 -38 175 -303 60 148 -134 78 -140 -216 -48 345 99 -36 251 -201 38 7 65 108 -284 112
2572A12M8p3k49J69L4j70J53k27J03K41K59l74J68j66mk93K24K97j29J37k68j59
$$ 112 160 87 -162 7 41 -129 24 -203 -100 141 400 26 194 28 24 -269 -45 252 123 260 -8 -167
2594a67J41J61J08k93L47l17J6j37K74m8o1R8r0l8J35k00k79L38j43K62l86O05
$$ -167 -26 135 243 -50 297 -20 -4 -141 133 85 24 122 32 -6 129 -71 -350 -12 -155 107 -279 326
2616C26n22P6L47q6k7J1r8j78L01N8j13j73j23J87P7r2j14J04J35J09l1k86O7
$$ 326 -196 -120 227 141 114 125 27 -151 150 208 95 -78 -201 -14 63 -29 -143 -39 96 205 174 -112 -45
2639d5J02j39o5K75k1j66p3K35r7j47k54M22j71M0K66m67K82P7P2k64J38j7p0
$$ -45 57 -82 -147 128 107 -59 -132 103 6 -141 -395 27 -144 -104 162 -305 -23 54 126 -138 0 -17 -87
2662h7o6M30k73k66K16k10J52Q0oj31L26l44J1J64MO2R4Nk34p1K95L8k00L0J89
$$ -87 -153 277 4 -262 -46 -256 -104 -24 -30 -161 165 -179 -168 -4 0 62 156 161 -73 -144 151 189 -11 19 208
2687B08l50l0L51j09K40l31J6rn3J04j21n4R7j13n5JL46j98J98M8j08K1p6j54
$$ 208 -142 -172 179 70 310 -21 -5 -14 -67 37 -84 -138 -41 -154 -209 -208 138 -60 138 186 78 99 23 -131
2711a31J12n7K10k49n3L15p7k61n3R7j34N81k94J27J19m56M30k10q8M8j05J08
$$ -131 -19 -76 134 -115 -168 147 70 -191 -244 -147 -281 300 6 133 252 -204 226 16 -72 -24 -129 -21
2733b1J04m50L93j73J14J0L80m50n0j62M55k4k86J57J62k67j37K87k46J67k77
$$ -21 83 -367 26 -147 -33 -23 357 -93 -143 -305 150 126 -160 -3 159 -108 -245 42 -204 -37 -314
2754c14M68l06N84j96j015J399p05l04O65K11q37J42L0l78N55n47M24J73l10R74
$$ -314 154 -152 432 236 -779 620 -85 -389 276 487 -350 -208 -178 -556 -1 -548 -124 49 -261 713
2774G13j490J393q99k16Q61p72L39j21K80K8rl22J09j00K81r1J71k40o0Q7K48
$$ 713 -777 616 -283 -499 362 -410 -71 -192 88 116 107 -215 -106 -206 75 -16 155 -85 -145 -58 190
2795A90j64O8M5Q2l39K70m7O5j01j3Nk17J00R9Km7N4n8O6r0P5q1J8k32Q6L20l82
$$ 190 26 94 139 221 -118 152 105 170 69 56 61 -156 -56 43 45 -2 52 -6 60 -30 45 -36 -18 -250 -164 156 -226
2822b26N57m46K01J80l67j19L23j68j39K03n3o9R4j71P9J64K57k76j29P5J89j67
$$ -226 331 -115 86 266 -101 -220 103 -65 -204 -1 -54 -123 -29 -200 -121 43 300 24 -105 -30 159 -8
2844hM4r9J29O9m56L29j37J17N1j17J1O5L48k30p0n3K95m64ML70n37M27O8j96
$$ -8 36 -63 66 135 -321 8 -129 -12 39 -78 -67 -2 346 116 46 -7 288 -176 -172 198 -339 88 156 -40
2868d0J19j28n1oK24J12n17K51K06j84R8l70M27j23m1NN3J00k91L24k18P2j35
$$ -40 79 -49 -100 -106 118 230 -287 -36 170 -14 84 -286 141 18 -23 -18 35 135 -156 168 -50 22 -113
2891a13K15m0j33j52M13j15k94K57p3J78m64K26o6K19j44N6j41M7N2J29J34j14
$$ -113 102 62 -71 -223 190 75 -219 38 -35 143 -321 -95 -161 58 -86 -30 -171 -124 -72 57 191 77
2913G7K4m45M61j68K21l27Q1J44l03M29p3k30L11k28J50kj3R0N6l73K95m46K73
$$ 77 101 -344 117 -51 170 -157 -76 68 -235 194 121 -109 202 -26 124 122 109 199 255 -118 177 -269 4
2936DK27l50J61j33R7J90k38r1J94l19N18k64L69l20J22J86o80N83k68J0J96p3
$$ 4 231 -119 42 -91 6 196 -42 -133 61 -258 260 -4 365 45 167 353 -327 256 -12 -2 194 121
2958A21q6j16Q4j37K8J46k4j74M59k39K53m35K95j05J15k91J52J71j23J20j40
$$ 121 35 -81 3 -134 -106 40 16 -158 301 62 315 -120 175 70 185 -106 46 217 94 214 74
2979G4j00J21k61J57K03j68k64J68J94j98L56m65J80j43L34l11k5K05m44J34p3
$$ 74 -26 95 -166 -9 194 26 -238 -70 124 -74 282 -183 -3 -146 188 -123 -148 57 -387 -253 -326
3000c26J45J08j15K35j04J5J16j07j03M09j32p8j09j13r4L29j33r6L1L59%l56
$$ -326 -181 -73 -188 47 -57 -42 74 -33 -136 273 141 63 -46 -159 -253 76 -57 -153 -122 237 237 -119
3022a19J90J97l15o1n2L37j15p4k04m5J21j58L74r0l3M6m6K87l34L63k10R3l66
$$ -119 71 268 -47 -108 -160 177 62 -12 -216 -261 -140 -298 76 -14 -47 -1 -47 240 -94 269 59 152 -214
3045b14L64r4N6K06m84M15k78M0j02L3p0Nm8L14l02j26K81R5k66M40k69o1k81
$$ -214 150 56 112 318 -166 249 -29 11 -91 -58 -128 -123 -171 143 -159 -285 -4 91 -175 265 -4 -65 -346
3068c46J99J03J21R5m10M06l97L85p7j69J80j68K8O0Q7n1k75K02m5P7m2RO7j06
$$ -346 -147 -44 77 172 -238 168 -229 156 79 -90 90 -78 -50 10 97 46 -229 -27 -72 5 -37 -28 39 -67
3092f7J62J41j43p3K94j24J40l84Q2m7J63j43K70k71l14K84P0Q8p1l84q1J33K74
$$ -67 95 236 93 20 314 190 330 -54 28 -19 144 1 271 0 -314 -30 40 128 57 -327 -408 -275 -1
3115aK04l12L1k28M98j78m4m1K92m74J09R2j55J55O8J65l5J6m06K26J90l73K15
$$ -1 203 -109 -78 -306 192 14 -30 -71 221 -253 -144 -52 -207 -52 16 181 146 162 -244 -18 172 -201 14
3138A4rj95K33q6O6J13o0K0k5J28k12n2K5j79K83J0j6o3K49l5l73K71r5p8K11
$$ 14 5 -190 43 -43 23 136 76 96 71 199 -13 -65 -40 -219 64 74 58 -5 244 209 -164 107 12 -66 145
3163A45K19l95K11l21j75L17j0j3j4J60Ok67RJ98m6k97K33J72j13l62J83J50J50
$$ 145 364 -31 180 -141 -316 1 -9 -22 -36 124 130 -137 -128 70 24 -273 -40 132 19 -343 -160 -10 140
3186A40k25m2O3Q2J57m8R9l84K28nJ62k27M5Rj67J78Q9k32J00P9j12J53l09Q0
$$ 140 -85 -127 -64 18 175 127 226 -158 70 65 227 0 45 54 -113 65 154 -78 22 101 -11 142 -167 -87
3210h7l9P4j16L34l09L3Q0M5K00l62j11L06j68J37j81J62Nk38J51j5Kn1K00k59
$$ -87 -126 -52 -168 166 -143 -110 -30 15 215 -147 -258 48 -120 17 -164 -2 3 -235 -84 -99 -97 -148 52 -207
3234b07j78L36J63j51j15l2j06K46L5M4j5K4L6k00l9L30k93p6k9J29K36j93j2
$$ -207 -385 -49 114 -37 -152 -184 -290 -44 -9 35 20 44 80 -120 -159 171 -122 -198 -227 -98 138 -55 -67
3257f7N0J92m18J27K45j43q9J07J70q7r4qK27n1q1j86j12P2K69j87k24J99k6j82
$$ -67 -17 175 -243 -116 129 -14 -103 4 174 87 -7 -15 212 161 80 -106 -218 -146 123 -64 -288 -89 -115 -297
3281b97K36k3L72j74R0m6k37l8m9K40O8Q6m7m78K75j05j1J86R6l30J87j64k78
$$ -297 -61 -84 288 114 204 158 -79 -117 -166 74 142 228 181 -297 -22 -127 -138 48 144 -186 1 -163 -441
3304d41M53R5j74L3k28N18j33j72J41M1j10J0M2j77L00j14P8L8J58m14J83k22
$$ -441 12 107 -67 -34 -262 256 123 -49 92 133 23 33 75 -102 198 84 162 200 358 -56 127 -95
3326i5M09k17K7k40L23j89Lk38J93N7Q8M6k50L1q0P5J1l34M27J3k92K00m7k43
$$ -95 314 97 124 -116 207 18 21 -217 -24 33 121 167 -83 -52 -132 -57 -46 -380 47 60 -232 -32 -79 -322
3350c22O08j33j27O5R4j21L9j0n8k61J26J90N0lk61oj15O38k37l17N78m36N5j1
$$ -322 286 153 26 91 185 64 103 93 35 -226 -100 90 140 137 -124 -130 -245 393 156 -161 417 -19 36 25
3374B5j16J16K24l45j8J42j62L04Q9j15j73J2L08m80J8J59J32k67j21L64l54K95
$$ 25 -91 25 249 -96 -114 28 -134 170 259 144 -29 -17 291 -189 -171 -12 120 -147 -268 96 -258 37
3396C7k8j6J81O2l15OP3rJ66n9%l31K82m9j28K41j66j69jJ79k29L69l02L06k2
$$ 37 9 -7 174 236 -79 -73 0 -9 157 98 98 -233 49 0 -128 113 -53 -222 -223 -44 -273 96 -206 100 78
3421G8k35K04n4j62J51q1K6m9K14Q1k61J10k25M2k6K09j90M85k43J38l02J12l06
$$ 78 -157 47 -7 -169 -18 -99 -73 -122 92 173 -88 22 -203 -161 -187 22 -168 317 74 212 -90 22 -284
3444b84K82j53n6J29J10Q3J60K0R6k98k87O9Q7l54L38L23l28J05m03M94k97R8
$$ -284 -2 -155 -211 -82 28 111 271 291 387 89 -198 -129 -42 -396 -58 265 -63 42 -361 133 -164 -66
3466f6P4K62r0j31j81j52L48k8l45L14P0j38J27q1J78k03J73q5R3l51O0k9K19
$$ -66 8 270 180 49 -132 -284 64 36 -309 5 75 -63 64 -17 161 -42 131 46 139 -212 -152 -181 38
3489C8J6P1k58q5K36j74L12k60J77n6n6k44J49K82j80l2%M6M8k28L0K94r5j38
$$ 38 54 125 -133 -218 18 -156 156 -104 73 17 -39 -283 -134 148 -32 -64 -64 -18 30 -198 -168 126 31 -107
3513a07J39j75L28n50L56N5K08m14L94j53k55K41P9l06K19p2k11K24J21j67r9
$$ -107 32 -143 185 -365 -9 46 254 -160 234 81 -174 67 146 -160 59 -13 -224 0 121 -46 -145
3534a45j58J87r4L40k20k60M64l03K44r1K36k69k4J29j09k41L05Q0j68L28j70
$$ -145 -303 -116 -210 130 -90 -350 114 -189 55 -36 200 -69 -93 36 -73 -314 -9 71 -97 231 61
3555F1k15K29K9k6j76M96m89j09L99k93L4N6K18q4k68r1J59K92r3J26k72O0j9
$$ 61 -154 75 104 78 -98 398 -91 -200 199 -94 -60 -4 214 130 -138 -229 -70 222 129 255 -17 43 24
3578B4j17j2L69k96o8l8J85J33l87Q5R8j2J30k43K95j79OK87Q4l71N3k71N8K48
$$ 24 -93 -105 264 -32 -100 -138 47 180 -207 -122 -24 -36 94 -149 146 -33 -27 260 344 -27 26 -245 -187 61
3602F1l14p5L73k27J15j14R9N3L5j29K1M05m62j92L59m2k23J34K0l6K21R4j12
$$ 61 -253 -328 45 -182 -67 -181 -82 -29 6 -123 -102 303 -159 -351 8 -34 -257 -123 -103 -139 82 176 64
3625F4j32J98j78J61o8m1L35n54L43j22j70K51k82N57j55J2k49j80K3q4J85N4
$$ 64 -68 130 -48 113 45 4 339 -215 128 6 -164 87 -195 362 207 219 -30 -210 -187 -271 -86 -32
3647c2K87j40QK9k05J6j30J29p4K44j37J1k9J6N3l28P1K00j15M2O9M1j10Q7m31
$$ -32 255 115 123 152 -53 -37 -167 -38 -112 132 -5 6 -23 -7 46 -282 -211 -11 -126 -84 -15 26 -84 3 -428
3672d28K95R9o8j2J27Kp1J38R6k93J79j85m0J24J1j04K26l4k25L35k15K49l51
$$ -428 -133 -34 -102 -114 13 15 -56 82 178 -115 64 -121 -161 -37 -26 -130 96 62 -163 172 -43 206 -145
3695a45J59Q6R5k13k23J24K02n4j04r7K10j6l34N54m87J36PK84j7l88N9k4M05
$$ -145 14 100 195 -18 -241 -117 85 31 -73 -170 40 24 -310 244 -243 -107 -100 184 167 -221 -162 -186 219
3718B19k80K28j04J12k46o2K15k08P6P8jp9j76K92P4k54J53l90K14O7R3N0k42
$$ 219 -61 167 63 175 -71 -133 82 -126 -50 28 27 -52 -228 64 138 -116 37 -353 -139 -72 21 71 -171
3741a71J41N9K9j29j09Q5L60k13j89K65j08r1R8k36J67m8k74K07J01J89k61J84
$$ -171 -30 29 58 -71 -180 -95 265 52 -137 128 20 -71 27 -209 -42 -90 -364 -157 -56 133 -128 56
3763E6o2L5R6n34L46m3L35k33K10k53K74j87j85J85n8K8k38L96j37k07J89n0q1
$$ 56 -6 29 125 -409 -63 -106 229 -4 206 -47 227 40 -145 40 -18 10 -228 168 31 -176 13 -37 -118
3786a18N8J48k01L14j26m7l4L16l41j55K88k19J35k8k99J72J06K56j99L8L7M2
$$ -118 -60 88 -113 201 75 28 -6 310 -31 -186 102 -117 18 -10 -309 -137 -31 225 26 64 101 143
3808A43m08L18R4J4k31N7r0q1K19o3j22k5j25N52j91l31P26j57m26Q6K6M4j66
$$ 143 -265 53 147 161 -70 -13 -103 -184 35 -28 -150 -175 -300 252 61 -270 456 299 -127 -41 -15 29 -137
3831a37K07l19J06K09p1j68J85j29L21J56l21J44k81j80O9J67p6L9J67r4q9J35
$$ -137 70 -249 -143 66 -5 -173 12 -117 204 360 39 183 -98 -278 -209 -42 -118 -79 88 -6 -95 40
3853D0J12j07j05r7K2lJ03K60J33n52K84j15j4o6J3L01l14J47nl56K32K77m29
$$ 40 152 45 -60 -157 -135 -138 -35 225 358 -194 90 -25 -39 -105 -92 209 -105 42 37 -319 -87 190 -239
3876b39L53j45j55L09k96L49k84j9m5j32K14N8k3p9J85l2qq2R7K52n22J15J53
$$ -239 114 -31 -186 123 -173 176 -108 -127 -172 -304 -90 -32 -55 -134 51 19 11 -71 26 278 -244 -129 24
3899B4p3M47k61k22j87L03r6j16Q8M02l85j82O04n18L32j91k3J87l17K59O2j96
$$ 24 -49 398 137 -85 -272 31 -65 -181 -93 309 -76 -258 346 -172 160 -31 -54 133 -184 75 137 -59
3921e9P4j69Q4J9j49K72j71n4J51j17J65m1K21o08K84J74N2k12J88P1n8j52l21
$$ -59 15 -154 -70 -51 -200 72 -99 -153 -2 -119 46 5 226 -382 -98 76 128 -84 104 175 117 -35 -356
3944c56J70K14l40J75J61m0R4j50J81j80j49K44J74K6j86L9j57K79l85K82k97
$$ -356 -186 28 -312 -137 24 -16 78 -72 109 -71 -220 24 198 224 38 77 -80 199 -186 96 -201
3965b01M41k27J90j62J89m46J26K64j33L3L29k44j37J4j91M01j18O5j05J0K8l9
$$ -201 240 13 203 41 230 -216 -90 174 41 74 403 159 22 36 -155 246 128 193 88 98 126 87
3987H7k98K01J17o1l1J93j66n0K19j97j54J25Mj46nK21j69m5J93L0p1j62K4L22
$$ 87 -211 -10 107 46 15 208 42 -8 211 14 -140 -15 -11 -157 -162 59 -110 -155 38 68 -3 -165 -141 181
4011A81k96J84J25l59J88q6kJ58J35l65J78K03m06k6J35rj57L23r1r2K38L0q5
$$ 181 -115 69 194 -165 23 -63 -65 93 228 -137 41 244 -162 -188 -53 -62 -219 104 13 -79 159 189 104
4034A04%j90J98Q2j4K26n73K19m6K15k30Q2j24Q2O5o3j83J48j56K96j48l5K7L61
$$ 104 104 -86 112 194 180 406 -167 52 6 221 -9 73 -51 31 96 33 -150 -2 -158 138 -10 -45 -18 343
4058C43n19L95l50J93k2%j58J22J88j01Q9j60J16k61K76r8n8j0nK8J38j41J10
$$ 343 -176 219 -131 62 40 40 -118 4 192 91 180 20 136 -125 151 53 -5 -15 -20 8 146 5 115
4081A15k33j8K26J54m68K23R4N9n7l7p6J16PJ01k95m3nK88%k43J74J16j13j17
$$ 115 -118 -136 90 244 -224 -1 93 152 95 58 -18 98 105 206 -89 -132 -137 151 151 -92 82 198 85 -32
4105c2J22oj23R0p8K11j95rj00j86N42m16J16K08j82k7M6P0O3j84K5N6J60j8q6
$$ -32 90 84 -39 51 -27 184 -11 -20 -120 -306 236 -180 -64 144 -38 -65 -19 51 114 -70 -45 11 171 153 67
4130F7J9P4N6ol04j80Q8M91l71o8R0K67l13j31K15J24k47J09K8n9J58J14k94j07
$$ 67 86 160 216 210 -94 -274 -186 305 -66 -134 -44 223 -90 -221 -6 118 -129 -20 8 -51 107 221 -73 -180
4154a80o5K98M7j93J75N9j56J48l5K4j63N3j58r9L11j62k1J92j53K37l22M3K99
$$ -180 -245 53 100 -93 82 141 -15 133 98 122 -41 12 -146 -245 66 -96 -117 75 -78 159 -163 -120 179
4177A79k86K13m21M37k76k92N58J91k30j09NJ59l01OL48m88L31j88J3N6J12k91
$$ 179 -107 106 -315 122 -154 -446 112 303 73 -36 -31 128 -173 -167 181 -307 24 -164 -151 -95 17 -274
4199b74L70l6K18m86L40J10p7k40j54R7J54n9n9l4J02L13j52J04m68L07o3r5J61
$$ -274 96 60 278 -208 132 242 165 -75 -229 -132 22 -37 -96 -130 -28 285 133 237 -231 76 13 -82 79
4222G9j17L74k02l23K27Q3m1J37l03L81j98k27j31L15M2k11J99j25J34K4O0K9
$$ 79 -38 336 134 -189 38 121 80 217 -86 295 97 -130 -261 54 96 -115 84 -41 93 117 177 206
4244B06j94k26K27M0j06K62jJ33p37K25J90j9k14J58j59M98m68R9K17k42j05K89
$$ 206 12 -214 13 53 -53 209 208 341 -396 -171 19 0 -214 -56 -215 283 -185 -86 131 -111 -216 73
4266G3m2PL47n70L87k65j80L12K35o06J43K3J16k11L02Q7j53q5p2J21K45k44L3
$$ 73 31 38 385 -185 202 -63 -243 69 304 -302 -159 -136 -20 -231 71 158 5 -80 -152 -31 214 -30 3
4289Ck38K23l10J67L2M6K69k41N0l27M17J32M9j33j57k27M41K0j51J74q1m19K88
$$ 3 -235 -12 -322 -155 -123 -77 192 -49 1 -326 91 223 272 139 -18 -245 196 216 65 239 158 -261 27
4312B7J88k25k07K37L3J65l99K47k11M09m09K30j49Q9L6k6K84m37K4N1L32k2j81
$$ 27 215 -10 -217 20 53 218 -181 66 -145 264 -145 85 -64 25 61 35 319 -118 -94 -43 289 267 86
4335H6l5j83K88k09L18j08k74k16L12J65QJ55n14J95J24k02J50j1J9J40l03pj8
$$ 86 51 -132 156 -53 265 157 -117 -333 -21 144 152 307 -207 -12 112 -90 60 49 68 208 -95 -102 -120
4358a20J42L7k44K81p3q0j17K61j08J24k35J45J68j02k41K00K39j27J59l82P6
$$ -120 22 59 -185 96 23 -57 -174 87 -21 103 -132 13 181 79 -162 38 277 150 309 -73 3
4379CM1L0l26K06K23l26K52J41l18L74l07k41L75k78p8p8M29j8pl10L19p2n5p9
$$ 3 44 74 -252 -46 177 -149 103 244 -74 300 -7 -248 127 -151 -229 -307 122 104 97 -213 106 34 -21 -100
4403a00J13L2l7M3OQ6q6j33j49J76J11m05K85M0J23o5n2P8j11J19l69K42p3J09
$$ -100 13 45 8 51 57 143 57 -76 -225 -49 62 -343 -58 -18 105 40 -12 66 -45 74 -295 -53 -126 -17
4427a7l7K73l53K20k59J65r7j6P7j75K59p8J53J24k93RK85j71k72nL00J2j22J22
$$ -17 -54 219 -134 86 -173 -8 -105 -121 -44 -219 40 -38 115 239 -54 -45 240 69 -203 -208 92 104 -18 104
4451A04J2j75j40j38j0L65j4P9Lr4P1Q7l12j41M15M4k20q9o4L27l06J56J59r9
$$ 104 116 -59 -199 -337 -347 18 4 83 86 -8 63 150 -162 -303 112 156 -64 -153 -217 110 -196 -40 119 20
4475B0k1j21R2j73l8J87J91n0M7k68N3P8j03L1n2M05l62J35k73k1J79K05k64l4
$$ 20 -1 -122 -30 -203 -241 -54 137 87 134 -134 -81 -3 -106 -75 -127 278 -84 51 -222 -243 -64 141 -123 -157
4499a57L40r0j40L8P8p4MM8k79L82r3k26J89j50J11k52K44J72j45k98N08l67L65
$$ -157 183 93 -47 -9 69 -5 -1 47 -232 150 57 -169 20 -130 -19 -271 -27 145 0 -298 210 -157 208
4522B08M7m51J63j7L00m50J97j60l4J38Q0j34p8L12n14K81K36L5n4j59L70l09
$$ 208 255 -196 -33 -50 250 -200 -3 -163 -197 -59 21 -113 -191 121 -393 -112 124 159 105 -54 316 7
4544GJ9J23k14N3J83k08J58k38M3P9PJ31n81L98j9J99k73J27q0JJ9K22k37N6k1
$$ 7 26 149 -65 -12 171 -37 121 -117 -74 5 12 143 -438 -40 -59 140 -133 -6 -86 -85 -66 156 -81 -25 -46
4569d6J07K37n6k95K32l0k75o9p4K33j13l1J51m1K13o1J10q6j13K44l71l1J48
$$ -46 61 298 242 -53 179 149 -126 -195 -269 -36 -149 -180 -29 -70 143 82 192 106 -7 237 -134 -165 -17
4592a7K2l6M03l68j71J97O0q9J26j13M8L96k91q4j46L1j45L50l1o3J48l51M18
$$ -17 5 -31 372 4 -167 30 90 1 127 14 62 458 167 83 -63 -32 -177 173 142 79 227 -124 294
4615B94m23r0K18L29l64J71m5j66j24K02o7j32K34J67j94l43M93m23O32o77L92
$$ 294 -129 -219 -1 328 -36 135 90 -76 -200 2 -65 -197 37 204 10 -333 160 -263 369 -308 84
4636H4p9O8N6k09L43k64L2n8O9J03l04K65j56M2n3J75j5N9k83PK09j62p1j14K42
$$ 84 5 73 129 -80 263 -1 31 -27 42 145 -159 106 -50 -8 -61 114 99 158 -125 -118 91 -71 -142 -256 -14
4661a4L39k74j13qL8p0L25m95M53n95K10J58J47l95L63J02j48J37j70J03j11K39
$$ -14 325 51 -62 -70 -32 -102 223 -272 181 -414 -204 -46 101 -294 69 171 23 160 -10 93 -18 221
4683B21jl41k87N31j03PO6q5l65K71J93m9k17L95l12J37K92l20l18L49o8R6n8
$$ 221 220 -121 -408 123 20 27 93 8 -357 -86 107 58 -159 236 -76 61 353 33 -285 64 -4 92 34
4706C4p1M9J87k69m25M70j20r5K14j90J60K11l35j3N77j64k9k19k0L3J89p5j78
$$ 34 -37 12 199 -70 -495 -25 -145 -240 -26 -216 -56 155 -180 -193 384 220 191 -28 -48 -15 174 99 -79
4729g9J60j78J55P2k75q1L31K5m06L08J55J2j72m8O7N4k11R5J78j61m05M07L9
$$ -79 81 -97 58 130 -145 -226 105 130 -276 32 187 199 27 -21 46 100 -111 -16 162 1 -404 3 42
4752D2k21J46m6L9L41k35L9K33m71K32k18J76m7J51m8j98R9L20m04o9L81j01j99
$$ 42 -179 -33 -79 -40 301 66 105 338 -133 99 -119 57 10 161 113 -85 14 334 -70 -139 242 141 -58
4775e8j35J42l9M4k28K70OL2P4k18J74m4n6J11k02K73r6M5l6K74n07N50n6j97
$$ -58 -193 -51 -90 -46 -274 -4 2 34 108 -110 64 20 -36 75 -127 146 50 95 59 333 -174 376 320 123
4799A23l59J19J79j70K41k59J20l6J9J62j90q9j12K75m3k5K07j55J3O0m5K49k72
$$ 123 -236 -117 62 -108 133 -126 -6 -42 -23 139 -51 -140 -252 23 -20 -45 162 7 20 80 35 284 12
4822A2J79k6mk27O7j13J83l44K36J16m2l2j06P9k30L23j26K62k64J45n1L77m85
$$ 12 191 165 161 -66 1 -112 71 -273 -37 79 37 5 -101 -22 -252 71 -55 207 -57 88 37 414 -71
4845g1OJ17j72K42M8k59K17j37n8j57N22j62k5k53J33K2j06l7J25j25mM61l98
$$ -71 -65 52 -120 122 170 -89 128 -9 -67 -224 298 136 111 -142 -9 13 -93 -130 -5 -130 -134 327 -71
4868g1k5J19J27l86N09m76M81n15L62k46J03J89j10k13Pj44J90J28j40J30Qm9
$$ -71 -96 23 150 -236 273 -203 278 -237 125 -121 -18 171 61 -152 -145 -289 -99 29 -111 19 27 -22
4890b2J37j94p3L4K93l84L01j45J47l63K69Q5k31L6J99k10j08L07k62P9O5Q5R2
$$ -22 115 -79 -152 -118 175 -209 92 -53 94 -269 0 85 -146 -110 89 -121 -229 78 -184 -105 -40 45 137
4913A37m4k45K37j05k85M16kl78Q2m5K61L03k86r6mJ30K3j4k63M22j17j27j61
$$ 137 93 -152 85 -20 -305 111 109 -269 -187 -232 29 332 46 -50 -54 76 99 85 -178 244 127 0 -161
4936a61L21j71J98k51K91k46o9j01K67J03j25J8K31J02l93L1m56K96J23p9k1J36
$$ -161 160 -11 187 -64 227 -19 -88 -189 78 181 56 74 305 407 14 45 -411 -115 8 -71 -92 44
4958D4K36q1l34R2J00k06J32k92K89M9RK36m9m14K18K06l32M67n07q8M03K3o5
$$ 44 280 199 -135 -43 57 -149 -17 -309 -20 29 38 274 225 -189 29 235 -97 370 -137 -225 178 201 136
4981A36j87q8L23o7J04j75l2J07m1j00j55J58J14k15k30M05j06R1P9j46K11k30
$$ 136 -51 -139 184 117 221 46 14 121 80 -20 -175 -17 97 -118 -348 57 -49 42 121 -25 186 -44
5003d4M20k04l98M4p4L97j49K05l19k27P40k46l44M09l82K04J34r8K5P6j71j33
$$ -44 376 172 -226 -182 -256 141 -8 197 -122 -349 391 145 -199 210 -172 32 166 68 93 169 -2 -135
5025a35k43M27j83r7J00J04j28M34j67j42m0K30k47k7J61l6J73m9l1o7M8Nk88
$$ -135 -378 49 -134 -231 -131 -27 -155 279 112 -30 -70 160 -87 -114 47 11 184 135 104 37 85 90 -198
5048a98L1k61K68J09J78qO3l31K1K19k01J8r7M35j39j23M8M4r3J10k8j8O8k40
$$ -198 -167 -428 -160 -51 127 119 182 -149 -128 91 -110 -92 -189 246 107 -16 32 76 -17 93 65 47 115 -125
5072a25Ro6J50O8R4k54J84j36L48l26J62r2J2J55m26L95k31J16k73J74m1ok75
$$ -125 -116 -182 -32 36 130 -124 60 -76 272 -54 108 16 28 183 -243 152 -79 37 -236 -62 -103 -109 -384
5095c84M70j12j37L99K6j69km0M2j42qJ5q2M13j28j48j13N30l76J55k46L39k95
$$ -384 86 -26 -163 236 262 93 91 51 93 -49 -57 -42 -124 289 161 13 -100 430 54 209 -37 302 7
5118Gp3J69m08N57j82k06K07l38J91J94q1k82j04M85m05j08M09k36j2M87m31L49
$$ 7 -66 103 -305 252 70 -136 71 -267 -76 118 37 -245 -349 136 -269 -377 32 -204 -216 271 -160 189
5140A89k27N4J52K9m05J33p5M95m08J6j69L44N1j72k5j52K4K48j76j79K69j94
$$ 189 -38 16 168 197 -208 -75 -150 345 -63 -47 -216 128 179 7 -18 -170 -146 102 -74 -253 16 -178
5162a78o9K05K60k93l68M88J17k47P4K93m64N20n69P2L91l10j82J27L21k46K11
$$ -178 -247 -42 218 -75 -443 45 162 -85 -11 282 -182 338 -231 -159 232 -78 -260 -133 188 -58 153
5183A53k21r1J58J10k19l7J66J77k85p5L20l00n4J44K58j68k84M5K31j10l3M78
$$ 153 -68 -159 -1 109 -110 -147 19 196 -89 -164 156 -144 -198 -54 204 36 -248 -203 28 -82 -115 363
5205C63j81l25j46L52j14q5J64L41l75J94m97K97J40k06K35r9k30K80o1Ll70M44
$$ 363 182 -143 -289 63 -51 -136 28 369 -6 188 -309 -12 128 -78 157 58 -172 108 47 50 -320 124
5227A24j21J53k0j27P0J21L3j75j53j12R5K22J1K7m91J82K62pP2m28K10k36J96
$$ 124 3 156 136 9 79 200 233 58 -95 -207 -112 110 121 148 -343 -161 101 94 166 -262 -52 -288 -92
5250i2m4Q9K80l76J34j38J02n4K17o8n5p5p7J57j0l27P0r1K9J24R3j6j83K85J56
$$ -92 -136 -47 233 -143 -9 -147 -45 -99 118 50 -5 -80 -157 0 -10 -337 -267 -358 -329 -205 -112 -128 -311 -26 130
5275A30j56m8N2QJ42j47j32L36j51P7O5j34j01J0j43K62j44J91l0k26J48n6J44
$$ 130 -26 -74 -22 -14 128 -19 -151 185 34 111 176 42 -59 -49 -192 70 -74 117 87 -139 9 -47 97
5298I7J32j82r4O1J5L1k39L32n55N43J46k75K00k65r0M38k69j43r0M9RJ68Q4K2
$$ 97 229 47 -47 14 29 60 -179 153 -402 141 287 12 212 -53 -143 295 26 -117 -207 -158 -149 19 103 125
5322A25k2k75K28j6m5J12j10J26Q2j22p2r6L04m77N45k88k48L98j12j93J25l6
$$ 125 103 -172 56 40 -5 107 -3 123 205 83 11 -85 219 -258 287 -1 -249 149 37 -156 -31 -67
5344f7J12K31n01L06J22k95J05k02J8K32J7k4l68K90O9k45N97k47k91J02O2O7
$$ -67 45 276 -225 81 203 -92 13 -189 -171 61 78 54 -314 -24 45 -200 397 150 -141 -39 23 90
5366I0R4o9m91O51K5k48QR8m35L7L49n6k18J6Nj3L31k32K6l22K47J79k58J73j52
$$ 90 184 115 -376 275 300 52 60 158 -277 -240 109 53 -165 -149 -144 -157 174 -58 -32 -354 -107 72 -186 -13 -165
5391a65K06j68J61j41J40J18r2k78O1M83m11K86k37K12j95j4j07L9J50j61O06
$$ -165 41 -127 34 -107 33 151 59 -219 -158 325 -86 200 -37 175 -20 -34 -141 -102 48 -113 493
5412D93p81L12m9J2j96J09K13k68L39k14J21j91O1RL72p1k28k59j78N65k79J10
$$ 493 -288 24 -25 -13 -209 -100 113 -155 184 -30 91 -100 -39 -30 342 271 43 -216 -394 171 -108 2
5434BJ71k55rk2N2P0J6J10j93K34j42k67K00l9q0K36J14q4J53l56M33n08j7j05
$$ 2 173 -82 -91 -113 -61 9 25 135 -58 176 34 -233 -33 -72 -152 84 198 114 267 -89 344 -164 -181 -286
5458b86M26m8m41M37k71Q9l2K71j35j12j04oN93m34K53k8Q0J2j14q7M4l17l8J16
$$ -286 140 92 -349 88 -183 -94 -126 145 10 -102 -206 -212 381 -53 200 172 252 264 150 63 107 -210 -248 -132
5482a32R7L19j47j79j60K46M9K83j74n27M50j37P5q9l4J58J17j36J01j24l39M23
$$ -132 -35 284 137 -42 -202 44 93 376 202 -325 125 -12 63 -26 -60 98 215 79 180 56 -283 140
5504A40o8j50R7j24J63M2l04K07n1rJ05Mj7J70K19j56k86J11m6j13j21K33k08
$$ 140 72 -78 19 -105 58 100 -204 3 -48 -57 48 52 35 205 424 268 -18 93 47 -66 -187 46 -162
5527a62L35l84J90k21L50J64j28j38K04L91m28l40J16Q8r9l0K06l55N78l54k08
$$ -162 173 -211 -21 -242 108 272 144 6 210 601 173 -167 -51 37 -62 -92 114 -241 337 -17 -225
5548b25M06j53k1mJ57j5j94J98k13q5L16k28k71K55J86j55q1J60L46n58K02K12
$$ -225 181 28 7 3 160 145 -49 149 -64 -149 167 -61 -332 -77 109 -46 -127 33 379 -179 23 235
5570B35O3k72J00o6o0j33K07J17l26nR1K1N1j79J98n2Q4R9J56m04K71J62j90l85
$$ 235 298 26 126 60 0 -133 74 191 -135 -140 -49 -28 23 -156 42 -10 74 173 329 -75 196 358 168 -217
5594b17oL14j31J22N8J67m95L77j19j89p3R6L3R9mq3L0j55J52k12J85m1p0L74
$$ -217 -223 91 -40 82 140 307 -188 189 70 -119 -192 -96 -63 36 32 -51 -21 -176 -24 -236 -51 -92 -162 212
5618B12l94P1K11l15K34M2J5j78L78j91O3k40Q2k56K01L7L5l02J88j51M57N5l49
$$ 212 -182 -111 100 -215 19 61 76 -102 276 85 148 -92 -10 -266 -65 -28 7 -295 -107 -258 199 254 -95
5641i5L15j46j56J06p1J41m6j58J60jJ2j34J16r2L51n34J50L15m04j6K59j52P9
$$ -95 220 74 -82 24 -47 94 48 -110 50 49 61 -73 43 -49 302 -232 -82 233 -171 -187 72 -80 -1
5664aK16j48q8J5K39m00L6r5J74l2pk1k4jj82L96Lj32k36Q5L68l5O0n9k99O0J8
$$ -1 215 67 -21 -6 233 -167 -131 -226 -52 -84 -91 -112 -136 -137 -319 77 80 -52 -288 -203 165 130 190 131 -168 -108 -90
5691i0Qk34M83Mj53j93J13J97l0N8p1M3k65pO1L8Q7n8K66p9k76k28N51l22qK97
$$ -90 -82 -316 167 171 18 -175 -62 135 105 163 92 135 -130 -137 -76 -38 49 -9 257 178 -98 -326 225 -97 -105 192
5717A92l89j47K35M3j4J42l67J76J65R3l0j78Kk0L28m72L62N9M5l23K19l84P6
$$ 192 -197 -344 -109 -66 -80 62 -305 -129 36 129 99 -79 -77 -97 231 -241 121 180 225 -98 121 -263 -187
5740a87J62j30J37k5l40J17J73L54j65J30l24j28L64j55R6j36M5l32J72O6K83
$$ -187 -25 -155 -18 -43 -383 -266 -93 261 96 226 -98 -226 138 -17 79 -57 -12 -344 -172 -106 177
5761A77m54K50j22K22q4k10K84k27L99n9j29l03M70j45l4P2n6J88k32l0m5K5J91
$$ 177 -277 -27 -149 73 -11 -221 63 -164 235 176 47 -256 214 69 35 107 51 239 7 -23 -68 -43 148
5784A48l02J80J39k21Q0k12L19k49L27l49k15N12j9l26L95j82m3p0K2j3j22K98
$$ 148 -154 26 165 -56 24 -188 131 -118 209 -140 -355 157 138 -188 207 25 -18 -88 -66 -79 -201 97
5806I7j16p6k51L92N6j29J12p8n9J33J57M7q3m39M29m3qm56K15j01K23K13n47
$$ 97 -19 -95 -346 46 102 -27 85 7 -52 81 238 285 202 -237 192 149 141 -315 -100 -201 22 235 -312
5829c12N4M18K0n7Lk50J19j4j93K84k71K6R7J73k09kn1L22l88J54M7k08J19r9
$$ -312 -258 160 180 123 126 -124 -5 -19 -212 72 -199 -173 -76 97 -112 -114 -165 157 -231 -77 -30 -238 -119 -218
5853b18N42k63K31k50j66M78j89l61N40l2l29m6O3L9J74n08K91j4K09Kk50Oj67
$$ -218 324 61 292 42 -124 354 165 -196 344 312 -17 -63 0 39 213 -295 -4 -18 191 193 -57 -51 -218
5876b18N34m06J03k09R1K33k85nJ00K5K30j59J4J72m31L19lQ1p7j6M1k3q4Q1J39
$$ -218 316 -90 13 -196 -105 128 -157 -162 -62 -37 193 34 48 220 -211 108 105 186 109 93 134 111 27 108 247
5901B47k79J29j24l6J80l60K41K4k19L16j99K02j36l7N0K1K4j43k7K92m61J65
$$ 247 -32 97 -27 -63 117 -243 -2 22 -197 119 -80 122 -14 -51 -1 20 44 -99 -126 166 -295 -130
5923a30L16j79J18O3l67J80pm60M32L63l14j39K6L89k70j52L41j14kj05plk73
$$ -130 186 7 125 188 -179 1 -6 -466 -34 329 15 -124 -98 291 21 -131 210 96 94 -11 -18 -21 -294
5946b94K73J17q8K76n28M96m47M5L05l53L04k21M39j66m69L67J27k35J45n32L64
$$ -294 -21 96 8 284 -244 252 -195 -150 155 -198 106 -115 324 158 -311 56 183 -52 93 -439 -75
5967g5M52o10J12J99j18O3k18k9K18k21K3rL01Q6P4m51K07l1K43l18J65j89rJ84
$$ -75 377 -233 -121 78 -40 23 -195 -224 -6 -227 -204 -213 88 174 248 -203 4 -27 216 -102 63 -126 -135 49
5991D9o8l7K89j4l73J37m3K51m37K15j9O6j20K53k71q5N57n86K12M5l12J41Q9
$$ 49 -19 -56 233 219 -154 -17 -60 191 -246 -31 -50 16 -104 149 -122 -207 350 -236 -24 21 -291 -150 -61
6014f1M0j56J3L00l73M34k49l9J83L6k40L63k22J31j16l21O48l4m29L9k17M13
$$ -61 -21 -177 -164 136 -237 197 -52 -91 92 128 -112 251 29 160 44 -277 371 337 -92 -53 -270 143
6036A43j09k38M01k36o8P2k84J41K16o0R5o4J6n0j20N3Q8K75k11j37K73k50J2
$$ 143 34 -204 197 -39 -107 -35 -319 -178 38 -22 73 9 25 -25 -145 -92 -4 271 60 -77 196 -54 -42
6059d2q1J33k22K92j73M0L02k21J77qm52M70l88L63k95L31Nl24K94l79M36M6j33
$$ -42 -123 10 -212 80 -93 -53 249 28 205 197 -255 215 -173 190 -105 226 231 -93 201 -178 258 304 171
6082A71k46qJ6J86l55L79j34k90L56J61m37L31J82m54J38m05K42L06j06J28k44
$$ 171 -75 -83 -67 119 -236 143 9 -281 75 236 -201 130 312 -142 -4 -409 -167 139 33 161 -83
6103h3N8K50j42j5j89J11Q2Q1k22q9oJ02j34M42j81o9J21j05J39K7n05N00j92
$$ -83 -25 225 83 68 -121 -10 72 153 -69 -158 -164 -62 -196 246 65 -4 117 12 151 178 -327 173 -19
6126a9J90m4o9k39k7L19j98j07L30J58j05m04J55L6k34L42j26m8r0J78k5O2mO4
$$ -19 171 127 58 -181 -208 111 -87 -194 136 294 189 -215 -60 -24 -258 84 -42 -90 -180 -2 -27 35 31 95
6150I5p4J12j4j33L61k54j91K08j59j88K48L5j82J77J79k45j5j61J80K2J5m6P5
$$ 95 21 133 119 -14 347 93 -98 110 -49 -237 11 46 -136 41 220 -25 -40 -201 -21 1 16 -30 45
6173D5k65K60j96K45j46j36J19J78K43l38J68k41k13M07k47J97k39lj9K80r2J20
$$ 45 -220 40 -156 89 -57 -193 -74 104 347 9 177 -64 -277 130 -117 80 -159 -162 -181 99 7 127
6195A27J11k51j08J61Mj19m0j0L52j17L49k19j33N4J8m71N03k57L66n23L56k58
$$ 127 238 -13 -121 40 44 -75 -115 -125 227 110 459 240 107 161 179 -292 211 -46 320 -203 153 -105
6217a05p4Q7K1J45J60m06K42Q7k53R2l17N33m64N03nk85L36l90p9j11M93l34O8
$$ -105 -179 -92 -71 74 234 -172 70 157 -96 -4 -321 212 -252 251 246 -39 297 -93 -172 -283 210 -124 -56
6240e6q9n5J49O5L99n07l37N10J61j46J18k14mJ6j48J99k4l28J33M2O3M1k76K29
$$ -56 -145 -200 -51 14 413 -94 -431 79 240 94 212 -2 -6 10 -138 61 37 -291 -158 -116 -53 -12 -288 -59
6264e9L4j2nP4j83J38lN3k00OL88m07l6K44p9Rq1J19L02m08n8J98j00J38k25M40
$$ -59 -25 -37 -42 32 -151 -13 -16 37 -163 -157 231 -176 -212 32 -47 -38 -119 0 302 -106 -164 34 -66 72 -153 287
6290B87k04k09J77j01K19R0j05R7k00q3K71r0j9ll16K96p8L11l39j55J61M0p5
$$ 287 83 -126 51 -50 169 259 154 251 51 -32 239 149 130 127 -189 107 29 340 1 -154 7 47 -28
6313b8j54J33k19L35l06n6J44R7%M09l10J38j35l07M51l18J70k33K80l50N02m14
$$ -28 -182 -49 -268 67 -239 -295 -151 -54 -54 355 45 183 48 -259 192 -126 44 -189 91 -259 243 -171
6335a71J35J60j65j9k3K23J4k70L16L2l79L0K88l81K05J79k95J07l5L18j51J31
$$ -171 -36 124 -41 -60 -83 140 154 -116 200 232 -147 -117 171 -210 -5 174 -121 -14 -49 269 118 249
6357B49l48M7k20O14m31r9K39j4J12l43J68M2N0Pj81J34k27Q9J97k22j34P27k37
$$ 249 -99 -52 -272 342 -89 -188 51 37 149 -194 -26 16 66 73 -108 26 -201 -112 85 -137 -271 456 219
6380B19m87L96J44m76K47j28j21R9J33Q3j07J1N5l2j03K5j59J08J35K1J57m74
$$ 219 -268 128 272 -204 43 -85 -206 -107 26 109 2 13 68 36 -67 -42 -201 -93 42 63 220 -254
6402b54J53K82l41K85j55N5p6J64r9L81l51r0J55q4K57m55M1k7J48j1k19O2L67
$$ -254 -101 181 -160 125 -30 25 -51 113 14 395 44 -46 109 25 282 -173 -132 -159 -11 -22 -241 -179 188
6425A88k87K2j2N1K12l33m3j4L13n9k16L84k01j20J66j82P4J13k14O2N9K78j86
$$ 188 -99 -77 -89 -38 174 -159 -202 -216 97 38 -178 206 5 -115 51 -131 -57 56 -158 -96 -37 241 55
6448E5k64L42R8m33K42l41J39R5J51n3K2O1k97JN38k56O5j13K04qm89L85m0r9
$$ 55 -209 133 231 -202 40 -301 -162 -67 84 31 53 114 -183 -182 356 100 165 52 256 248 -241 144 104 5
6472EJ75m89M20j66l2P5O1j7K3l44L69l15M75m09N33l91k1K31l71O9l1N7j81K31
$$ 5 180 -309 111 -55 -87 -12 49 32 55 -289 80 -235 240 -169 364 -27 -48 183 -188 -119 -150 -93 -274 -43
6496d3P6l01N03J7k70Q4jJ51l02K6j0J5J16J82K6l08J16o7J00K36l37k87J47K21
$$ -43 33 -268 235 252 -18 66 65 216 -86 -60 -70 -55 61 243 269 -39 77 10 110 346 9 -278 -131 90
6520I0j98J05L87l70J53j80j11K41l34L86k83J51L0J16k79p4K63l3j21J08K05
$$ 90 -108 -3 384 14 167 -13 -124 117 -217 169 -114 37 67 183 -96 -170 93 60 -61 47 252
6541B52J5n61J55K21j44R1l23J26J20k01L53J05P4n2j45o9k67jM08j98K11m36
$$ 252 267 -294 -139 82 -62 29 -294 -168 -48 -249 104 209 283 231 86 17 -250 -251 157 -41 170 -266
6563b66K86j2L1oj75L51l35J41L5l06K35j3n6J3M0k9K6J9k91K45j72J58K21j8
$$ -266 20 8 39 33 -142 209 -126 15 50 -256 -21 -34 -90 -77 -37 -66 -40 -21 -312 -67 -239 -81 140 122
6587A22q2J2J42r7j63M5J65r0k09N6Q8n4L84l57J41j86j40N11j60r8r5j11M34
$$ 122 40 52 194 97 -66 -21 144 54 -155 -99 -11 -65 319 -38 103 -83 -223 288 128 30 -65 -176 258
6610B58l66L00o5l28N11l87M40o50L42P6p2k44L96k63Pl9J61j44J06O6J23l46
$$ 258 -108 192 127 -201 310 -77 363 -287 55 131 59 -185 211 -52 -45 -84 77 -67 39 105 228 -118
6632a18J14k82L46l74R9K18j77K31J4Q0N8j42j14j60K92k2l9K4J47k84O3K73l85
$$ -118 -4 -286 60 -314 -215 3 -174 57 71 151 209 67 -47 -207 85 63 24 48 195 -89 -26 247 -138
6655a38M1j14M4L14m19L1l2K33r5J50J13p5M0nj56P3o7K2k24K74k33R1J94j21
$$ -138 -97 -211 -167 147 -272 -241 -273 -40 -135 15 128 53 93 88 -68 5 -62 -40 -264 10 -223 -132 62 -59
6679e9J88q4j37M0k18L16R1j12L7k5k1k97L22O7l72J13L01j72l7o8l4K60n6mj50
$$ -59 129 45 -92 -52 -270 46 137 25 62 37 16 -281 41 108 -264 -151 150 -22 -59 -127 -161 99 43 39 -111
6704a11O3oj29P5k32N36j87J22r1j98k4J10J09K43m22K42Nl95M87n5Q4j8k81L32
$$ -111 -48 -54 -183 -108 -340 196 9 131 40 -158 -182 -72 37 280 -142 100 105 -290 197 142 226 208 -73 259
6728B59m1J17m20k97m5M42J24k40j09L81j56J27l20K54j61j30K26m4J65k90J40
$$ 259 218 335 -85 -382 -427 15 139 -101 -210 171 15 142 -178 76 -85 -215 11 -33 132 -158 -18
6749a8j06M26r5o8o3J40l23L45l20j9M6N6K39K7l09k7j32J69L42l39j6K05l28
$$ -18 -124 302 207 139 76 216 -107 238 -82 -101 -55 1 240 267 -42 -69 -201 -32 310 -29 -45 160 -168
6772a68j44L21o2n4L11j83k10n6L28o3o3L05l39P6N1m7n0J48J10L3n32K92k7K02
$$ -168 -312 9 -53 -107 204 21 -189 -245 83 20 -43 262 -77 -1 50 3 -47 101 211 244 -288 4 -23 179
6796A79k56L53k78k44L71k67lP6K08j5j97L3O6j30J51k9K70j07k88K07l39K24
$$ 179 -77 276 -2 -246 125 -142 -145 -69 139 124 -73 -40 26 -104 47 18 288 181 -107 100 -239 -15
6818a5Q8J33J51k67l6K18m87J7K12k14J22l46P32k96L8n47M32J18Q6P7n7m00J94
$$ -15 73 206 357 90 54 272 -215 -198 14 -200 -78 -424 308 12 50 -497 -65 53 139 216 159 -241 -47
6841d7K15R2j49k19K02j91j3J59j24M8R4K8p6j03k7L41j53J62k64L9m5p9M32o17
$$ -47 168 260 111 -108 94 -97 -110 49 -75 -27 67 95 19 -84 -111 230 77 239 -25 14 -31 -110 322 -295
6865b95K51K42j39l43L96k85O2N1p2K37l28M81j47K3l57K6J79k52o7K59l3K26
$$ -295 -44 198 59 -284 112 -173 -111 -60 -132 105 -223 258 111 134 -223 -197 -18 -270 -337 -78 -111 115
6887A15K18l25K37m7j94j09K67j17j51Q6j98J83J8R9j55J40J07k3k06n1q1K63
$$ 115 333 8 245 198 4 -105 162 45 -106 -20 -218 -35 -17 82 -73 67 174 151 -55 -106 -187 76
6909G6j02L9J01mP8J21l12J43k70K98m00K79j75J60m9P8J17j90J12m02N8K20J89
$$ 76 -26 13 114 110 188 309 -3 140 -130 168 -232 47 -128 32 -17 61 178 -12 100 -302 -244 -24 165
6932A65l76J71m0j40J58j5l12K18K64j40m56N29J47j78P0j77N9K63j79m86N84
$$ 165 -211 -40 -80 -220 -62 -77 -389 -171 93 -47 -503 26 173 -5 65 -112 -53 210 31 -455 129
6953A29o7N5j11l27J62L22p2m2j14K24l38R3J2j5J13n6j53L55m3k03j11K03k05
$$ 129 62 117 6 -321 -159 163 91 49 -65 159 -179 -86 -74 -89 24 -32 -185 170 127 -76 -187 16 -189
6976a89L58l18L05r3m10J78j12M45k7k31J43k37l7K69P1j08M0M40m80k5k42N23
$$ -189 169 -149 156 63 -347 -169 -281 164 137 -94 49 -188 -225 44 115 7 47 487 7 -18 -260 263
6998B63l68m4J66j12K37pj00P6k50K24Pj62K01p1q5k9K9M0j92O62o42M49k54K10
$$ 263 -105 -149 17 -95 142 135 35 111 -139 85 92 -70 131 60 -25 -54 -25 15 -177 485 -157 292 38 248
7022B48k82oJ37j75l5L87l02O5J67m5K7j61o6K2k09K93j44n5Q4J72r0j94K41j47
$$ 248 -34 -40 97 -78 -113 274 -28 37 204 159 186 25 -41 -19 -228 65 -79 -134 -50 122 32 -162 79 -68
7046f8J61j0J14n59J94j9L42m7k62J23K00q0j8l01L18j21J07l01K39kl07J36n5
$$ -68 93 83 197 -362 -168 -187 155 108 -154 -31 169 89 71 -230 88 -33 74 -227 12 10 -297 -161 -216
7069b16M25l30M5M68m99k0q1K65K9j74J98J28j28l3jk83M77k38j33p7O0J81K8
$$ -216 209 -121 -76 392 -107 -127 -208 57 86 -88 110 238 110 77 76 -207 270 32 -101 -178 -118 63 91
7092I1k18m7K55j30J43J2j92J52M5M5J62j15m52Q7J03J07j07R0n9K06j72k37K26
$$ 91 -127 -174 81 -49 94 106 -86 66 111 156 318 203 -249 -162 -59 48 -59 31 -28 178 6 -231 -5
7115eM3o6j70K01j55K42%J55j30k74L52k1k27K20l28O5P1J52K58j90l18M0J17
$$ -5 38 -28 -198 3 -152 90 90 245 115 -159 193 172 -55 165 -163 -98 -27 125 383 193 -125 -85 32
7138C2K08m89L25n4R5j82K7L25j84j6k96J55O7oj11K25j71r4K10J00P5j0l52K68
$$ 32 240 -249 76 22 117 -65 -38 287 103 87 -209 -54 13 7 -104 121 -50 -144 66 166 241 231 -121 147
7162A47K11l91J83j46j80L80k68L7j18q2K37m4mJ60l54K18j00J54j75Q4L69l16
$$ 147 358 -33 150 4 -176 204 -64 -27 -145 -227 10 -34 -38 122 -232 -14 -114 40 -135 -51 318 2
7184Bj70L32j52l36N28j56K5p7J26k01l57M15K17j83l7Nj72L21l60K16j48K99
$$ 2 -168 164 12 -324 204 48 73 -4 122 -79 -436 -21 196 13 -24 -19 -191 130 -230 -14 -162 137
7206A37j67L34q9k31LK1L15j12m38O2K66j53L40l27j97N5O7p8L99l87J00K07P
$$ 137 -30 304 215 -16 -13 8 323 211 -227 -165 101 -52 288 -39 -236 -181 -114 -192 207 -180 -80 127 134
7229A34L07m49j6k06P5K5L41p8k76J70K4q9J03j20q7J77l10J64J56p8j83K73k3
$$ 134 441 -8 -24 -230 -155 -130 211 133 -143 27 51 -38 65 -55 -142 35 -275 -111 45 -33 -216 57 34
7252C4n7j16q6L07q4J17j44P6j38j62M04r8k07K62K66k54m21M20k24j10M2J2M29
$$ 34 -23 -139 -225 82 -2 115 -29 47 -91 -253 151 53 -154 108 374 120 -301 119 -105 -215 -173 -161 268
7275B68l43K14J8j50Q6l01L40j20l4J18p7L04n54j6K47k26J69K08p0k79K55J65
$$ 268 -75 139 157 7 93 -208 132 12 -22 96 19 323 -231 -247 0 -226 -57 151 81 -198 57 222
7297B22j88l12O5K22O8j6jj86J52J94l34q6N70k52k99M12k48j14J64j9j39J24
$$ 222 34 -278 -213 9 77 61 60 -126 26 220 -114 -200 370 118 -181 231 -17 -131 33 14 -125 -1
7319ak13K88L06m11J95l38L08o2J39j35j48O6K07l02J39j11N0J09j90O4J67k51
$$ -1 -214 74 380 -31 164 -174 134 72 211 76 -72 -6 201 -101 38 -73 -23 86 -104 -40 127 -124
7341a24K13J31l52J67k17J20J0J69j61n7Q8k23L16%k35M10k03l45Q4J73P8m2K04
$$ -124 89 220 -132 35 -182 -62 -52 117 -44 -101 -13 -236 80 80 -155 255 52 -293 -209 -36 42 0 204
7364B04j32K52q14k1P36l45L6j6LK81l9p4j67J21p0Pj83J60k12L87P1j01Kj30
$$ 204 72 324 -490 -511 225 -120 -84 -100 -97 184 145 71 -96 25 -45 -38 -221 -61 -273 114 185 84 86 -44
7388d4O5Q4j78N2L30k47k17N28n16j69L16j23L23m38J33K21m98L01j01N1l4J65
$$ -44 21 105 -73 -21 309 62 -155 373 -143 -312 4 -119 204 -234 -101 120 -378 -77 -178 -127 -161 4
7410DN9q9J30j93N9J7J28p5k11L89l66j83M12L1P1k1q8k77K84n6k60J95j67n6
$$ 4 63 -26 104 -89 -30 -13 115 40 -171 218 -148 -331 81 112 183 162 74 -203 81 25 -235 -40 -207 -263
7434b63K67k80J64k33K46J42J51k69J99k67N42o7m71J18o9P4k70J80L3M6L4K29
$$ -263 4 -276 -112 -345 -99 43 194 -75 124 -143 399 332 -139 -21 -90 -16 -286 -106 -73 -27 7 236
7456B36l36j3j51M55m66L42k54K12Q7n97M85j66J98n0l2M5o1j05J48n7Q2Q2l6
$$ 236 -100 -113 -264 191 -275 67 -187 25 112 -485 0 -166 32 -18 -50 -5 -66 -171 -23 -80 2 84 48
7479D8j00O9j37Q1l39M52j18j78J75p8L82n41K85J35k70j3R9K04q7J57k41J1j85
$$ 48 -52 17 -120 -39 -378 74 -44 -222 -47 -125 257 -284 1 136 -134 -147 -48 156 69 226 -15 -4 -189
7502a89J70n4J1J03J38k10J4n3L96j33j45J47m57L0P4N41l83j93L92m34K18k1
$$ -189 -19 -73 -62 41 179 -31 -17 -70 326 193 48 195 -262 -232 -158 383 0 -193 199 -235 -17 -38
7524c8L38k61j2j86L22K7l66K96n9m01M41j15j06K85m16J18J38L03l28l1K64k84
$$ -38 300 39 27 -159 163 190 -176 120 61 -340 101 -14 -120 165 -251 -133 5 308 -20 -51 213 -71
7546g1j7J33k02J66j02J67k25J81J0j09kL30l01l0K43j5j15j59K92k87j8m8K95
$$ -71 -88 45 -157 9 -93 74 -151 30 40 -69 -71 259 -42 -72 171 156 41 -118 174 -113 -131 -179 116
7569A16q7J25k76l0J76n3j40L06l5j51k6J86q7Q5o7R8l97J40L5k0R5m0k6Q4J23
$$ 116 29 154 -122 -152 24 -29 -169 137 102 -49 -75 111 24 109 42 140 -257 -117 -82 -102 -7 -47 -73 11 134
7594A34k79J06K80k07R0k59L30l71M25j57j88J25Q6k61q9K08L07n21O2M04r32
$$ 134 -145 -39 241 34 124 -135 195 -176 249 92 -96 29 115 -146 -235 -27 280 -241 -179 225 -707
7615g07R99j81q8n5K11j72K65k55p7j68L7q0J24K60m0p2P2l5j66L1K21j81n2J5
$$ -707 292 111 23 -32 179 7 272 17 -60 -228 -191 -271 -147 113 73 1 73 38 -128 -97 124 -57 -109 -94
7639i4R5m28N00j39j59L47j47R7j14k96K86k41J94L8j48J57J59j90O5j61PJ47
$$ -94 1 -427 73 -66 -225 122 -25 72 -42 -338 -52 -293 -99 -61 -209 -52 107 -83 -18 -179 -172 -25
7661b5K01k52j6K12m8J4p9q1l13K94J77j54P5q9K53k75K80l5m9L1k18J89P0J92
$$ -25 176 -76 -92 120 72 86 7 -74 -387 -93 84 -70 5 -84 169 -106 174 139 90 121 -97 92 162 354
7685C54k79jO7j07j71K14J65o65K40Oj47L70k78L37j35k1J5Mk06J53R6k40J46
$$ 354 75 74 141 34 -137 77 242 -423 -183 -177 -324 46 -232 105 -30 -51 -36 -32 -238 -85 11 -229 -83
7708h3J00N8o8K96n07M66Om06J84j47L20k61l75J58M52l67M88m50L37j74j66L1
$$ -83 17 75 7 303 -204 262 268 -138 46 -101 219 -42 -417 -259 193 -174 314 -136 201 27 -139 -108
7730a08j87K03M2n2N0J04j40pK17j61pJ68k27L41k18m8j68P2J72r6J92o4m3o6
$$ -108 -295 -92 -50 -102 -52 52 -88 -95 122 -39 -46 122 -105 236 18 -30 -198 -126 46 -50 142 78 35 -31
7754c1J99l82K47J88j64k07K23n8J04LO3q0m64K89r5K2M08k88m6K67j14J4pk58
$$ -31 168 -214 33 221 57 -150 73 15 119 122 185 105 -359 -70 -165 -143 265 -23 -69 198 84 98 91 -167
7778a67K41k39M8J84q9N4K18j08j54j24r0K64n1o3J50j13l29L42j20J17l9k11
$$ -167 74 -165 -117 67 -22 32 250 142 -12 -136 -226 38 -13 -76 74 -39 -368 -26 -146 -29 -68 -279
7800b79R8K24k9j49P8P6j18J53j96J69j31j24j4M79o6r2j14j44NM39j82k13J14
$$ -279 -181 43 14 -135 -57 19 -99 54 -142 27 -104 -228 -242 237 171 79 -35 -179 -174 265 83 -130 -16
7823a6J72J25k54j7k37J64J20K2j40j72L88m21M45K12m24K76j72O1J1k56k31K58
$$ -16 156 281 27 10 -227 -63 57 79 -61 -233 155 -266 179 391 -33 243 71 132 143 -113 -344 -86
7845h6N3l48J82K35K55n76K62O9J47k75J48n4K03k84J89j08k18J55N0J35k13n
$$ -86 -33 -381 -199 36 291 -285 -23 46 193 -82 66 12 215 -69 120 12 -206 -51 -1 134 -79 -84
7867h4l4J06K27l69P5J2J92k00K9j43k0J00J7J7J36j31R2O1j02n1K88j57j36J47
$$ -84 -118 -12 215 -154 -79 -67 125 -75 -46 -189 -209 -109 -92 -75 61 -70 22 83 -19 -70 218 61 -75 72
7891G2r8l0J12J13k48J26J42m52N94l49N0K31k83j5Q7P2M3l59J18j8R7N2j64K21
$$ 72 -26 -56 56 169 -79 47 189 -263 331 -18 32 263 -20 -35 52 124 167 -192 -74 -92 5 57 -107 114
7915A14J20l32kK02l10J76k52L31r2j15K73R2j46j30l20M69j55L29k16M4K21l08
$$ 114 234 -98 -100 102 -208 -32 -284 47 -45 -160 113 205 59 -71 -391 78 -77 252 36 80 301 -7
7937gn5m8j0P9J2K77n01N80k82k11J6J53L2J40j09k17L21J02k40L9Rm1k05L14
$$ -7 -62 -110 -120 -41 -29 248 -253 327 45 -166 -150 3 35 175 66 -151 170 272 32 71 80 39 -166 148
7961A48k55K86l38L6J30o0L48Kk81K9J10m82M98R6m39J61K9j81O1J7J8k73L04
$$ 148 -107 179 -159 -123 7 -53 295 297 16 45 155 -327 171 267 -172 -11 18 -163 -102 -85 -67 -340 -36
7984c6M5J0j58N1J78k49J09l1K19l09K68j50m5L08k32rm0L01l64L93q4j22P8o4
$$ -36 9 19 -139 -88 90 -159 -50 -81 138 -171 97 -53 -98 210 -22 -31 -71 230 -134 259 175 53 131 67
8008F7k38Q4K25k89N0k5L04j6l43K42q3J50J21l54K01j25P9K11j24j48j44k33
$$ 67 -171 -87 138 -151 -101 -126 178 162 -181 61 -22 128 249 -105 96 -29 50 261 137 -11 -155 -388
8030c88N72n1p2k90M00k50J54m5p7o3K58m46J24O1j38K51j34L8k54N54n2k51O2
$$ -388 184 133 61 -229 171 -79 75 30 -47 -110 148 -298 -174 -113 -251 0 -134 -96 -350 204 152 -99 -37
8053c7l78K53J03P7l81M23J85m16L26l08R0j0j87J98k24L41l42M82k25k62L47
$$ -37 -415 -162 -59 18 -363 60 245 -171 155 -153 -63 -73 -260 -62 -286 55 -287 195 -30 -292 55
8074E5qq4m3l6J18L61l41P9o1R4r4p6J70l2k32M7j56N2N01l79L04k42J18l4J1
$$ 55 47 -37 -80 -116 2 363 22 101 40 134 40 -36 134 102 -130 -83 -239 -187 314 -65 239 -3 115 81 92
8099I2j13j74L14j18K30j71P5k46Q7r0J87j98J84l8O7j53j65N26j76k65J41j39
$$ 92 -21 -195 119 1 231 60 135 -111 -24 -114 73 -125 59 21 88 -65 -230 296 120 -145 -4 -143
8121a43L54l94K6j37K71J45l63L29j03j69K31L19n48j9L60k66J21L9r8J49J06
$$ -143 211 -183 -157 -294 -23 122 -241 88 -15 -184 47 366 -182 -201 159 -107 14 53 -45 104 210
8142B10k40N6R4j42M9j68J08j13M8O3K86r3k59K38j86M3M2m5L97l62L9l5j64P7
$$ 210 -30 26 120 -22 27 -141 -33 -146 -98 -35 251 158 -101 137 -49 -6 36 -9 388 26 65 30 -134 -57
8166e7j8K08l35J90J49N2j31l1j78R1L7q6m0L01k33K58j69k1j2j29J25J17o4J94
$$ -57 -75 133 -202 -12 137 189 58 27 -151 -60 -23 -109 -149 152 -81 177 8 -13 -25 -154 -29 88 24 218
8190B18r0
$$ 218 128
8191A28
$$ Imaginary data points
##PAGE= N=2
##DATA TABLE= (X++(I..I)), XYDATA
0@%%%%QqQj6J6k4L2l8M6n6P2q8J04j24J48j76K08k40K79l25L73m27M88n56O33
$$ 0 0 0 0 0 8 0 8 -8 8 -16 16 -22 24 -32 40 -48 56 -68 80 -96 112 -128 151 -174 199 -228 260 -296 337
29C37p16Q04r05J017j137J270j418J578j754J947k157K390k648K933l247L598
$$ 337 -379 425 -480 537 -600 670 -748 830 -924 1023 -1134 1256 -1392 1541 -1706 1892
45A892l991M431m929N501o163O940p868Q995j0406J2227j4677J8175k3614L3295
$$ 1892 -2099 2332 -2597 2904 -3259 3681 -4187 4808 -5598 6629 -8048 10127 -13487 19808
59A9808n5701J98228Q3424l88814p630R2013Q6494J32938K2099l03187j17990
$$ 19808 -35893 162335 245759 -143055 -150685 -58672 27822 160760 182859 -120328 -238318
70b38318K44863J62927j06844p0407o9761p6433J35918K14284j13655k30103J8255
$$ -238318 6545 169472 62628 -7779 -77540 -153973 -18055 196229 82574 -147529 -129274
81a29274J25082M3659O4992k5056j96211n3042K10047J06157r3771o7386l7451
$$ -129274 -4192 39467 104459 79403 -116808 -169850 40197 146354 52583 -14803 -52254
92e2254m4940J06913J46513q5120j64443K0698Q2020K0809L8750j6461j35255
$$ -52254 -97194 9719 156232 71112 -93331 -72633 9387 30196 68946 52485 -82770
103h2770k7701J47412N9794q1450m9251k1059j7505Q7744R8335q0720j26813K2318
$$ -82770 -110471 36941 96735 15285 -33966 -55025 -72530 15214 113549 32829 -93984 -71666
115g1666P6137L2068K9694k9473j11496j2559J22678N2694o1322m4910k1162o256
$$ -71666 4471 36539 66233 36760 -74736 -87295 35383 88077 26755 -18155 -39317 -45573
127d5573P3092O5281p2175r3696K6709O4658K0412M818l9051p8149J3332J02869
$$ -45573 27519 92800 20625 -73071 -46362 18296 38708 43526 4475 -73674 -60342 42527
139D2527K6976o5287m2842q980J5431O5468L7613o8587o8609L1025N4749J5472
$$ 42527 69503 4216 -38626 -47606 -32175 33293 70906 2319 -66290 -35265 19484 34956
151C4956j532l4368n1564K1410P4206P255n2610k6369L617J8028M2391J1606n9086
$$ 34956 33424 -944 -52508 -31098 43108 50363 -2247 -28616 -24999 -6971 35420 47026 -12060
164a2060m2227L5494M2579N064j1182l1437l3578K5792N7104m11m2854j8685M045
$$ -12060 -54287 -18793 23786 28850 17668 -13769 -47347 -21555 35549 35138 -7716 -26401 -22356
177b2356J5370L3343O475m4509k5806K9557K8467K43r337k2097k0378K4736M0080
$$ -22356 -6986 26357 32832 -11677 -37483 -7926 20541 20784 11447 -10650 -31028 -6292 33788
190C3788q342l5799j1434P283J5896K4500k018l9399j8127K7058K3632o66r552
$$ 33788 25446 -10353 -21787 -14504 1392 25892 23874 -15525 -33652 -6594 17038 16372 6820
203F820j9500j4901K2548L0232q953k7470n524P515J2576J6789n351l0484p385
$$ 6820 -12680 -27581 -5033 25199 16246 -11224 -16748 -9233 3343 20132 14781 -15703 -23088
216b3088K5361J6470n636j0968j5043o372K2139K2065j3021k3857l397Q380J1765
$$ -23088 2273 18743 13107 2139 -12904 -19276 2863 24928 11907 -11950 -15347 -6967 4798
229D798J2174p374k4534m045K1114J1336o068q183j0248k683J7459J4426j2932
$$ 4798 16972 9598 -14936 -18981 2133 13469 7401 -782 -11030 -13713 3746 18172 5240
242E240j7108Q78R037Q657P204q784j8786L37J8977P577o785p901q378l04J5517
$$ 5240 -11868 -10990 -1953 6704 13908 5124 -13662 -13325 5652 13229 6444 -1457 -9835 -10139 5378
257E378J0251j1969j3623J788P032N960M652p629j3919K947J5122L272p150n967
$$ 5378 15629 3660 -9963 -8175 -1143 4817 9469 1840 -12079 -9132 5990 9262 2112 -3855
271c855m032J580J2774N714j1780j0252L693P514M712J834p378j0641L904J2304
$$ -3855 -7887 -6307 6467 12181 401 -9851 -6158 1356 6068 7902 524 -10117 -6213 6091
285F091K056o602m355k729J699R491L249j0030p053M765N445K275K82o340o916
$$ 6091 8147 1545 -2810 -5539 -3840 5651 8900 -1130 -8183 -3418 2027 4302 4584 -1756 -8672
300h672M730J0188J23o846l404r35K514P872J448q879n008M028M680K015J51n343
$$ -8672 -3942 6246 6369 -477 -3881 -4816 -2302 5570 7018 -1861 -6869 -2841 1839 3854 4005 -1338
316a338n089M549P133o63n530k635K97K531N173K6p181l050M650L865O89j511
$$ -1338 -6427 -1878 5255 4592 -938 -3573 -3276 -745 4428 4454 -2727 -5777 -1127 2738 3427 1916
332A916m278l001M224N903j058m825k031O20K490M212j117n149j943L486L281
$$ 1916 -2362 -5363 -1139 4764 3706 -1119 -3150 -2530 -40 4172 3055 -2094 -4037 -551 2730
347B730n37j177k915j838L965L885j966l938q50J366K186K388j141m639j196L814
$$ 2730 2193 1016 -1899 -3737 228 4113 2147 -1791 -2641 -1275 911 3299 2158 -2481 -3677 137
363A37K231l77j687k144j302L460L305k012l183l67R66J834J585j637k822j97
$$ 137 2368 1991 304 -1840 -3142 318 3623 1611 -1572 -1939 -973 861 2446 809 -2013 -2210
379b210K892J393n48j729j833J1K874K195k251k425j82J481J543Q01j608k545
$$ -2210 682 2075 1527 -202 -2035 -2024 850 3045 794 -1631 -1813 -332 1211 2012 404 -2141
395b141L28K393Q81p07j361j142N22K522J027k346j477M32J088J000O18j823j702
$$ -2141 -1813 580 1461 754 -607 -1749 -1227 1295 2322 -24 -1501 -1069 19 1019 1637 -186 -1888
412a888O84K335N73j200j237l58K87J865N96j807j477O89J168O03L90j505r96
$$ -1888 -1204 1131 1704 504 -733 -1091 -804 1061 1657 -150 -1627 -938 230 833 1223 -282 -1278
429a278Q17J511j13n48j005m43J129J071J72j909p54R58Q12O39p3j481r73J110
$$ -1278 -461 1050 937 389 -616 -1059 70 1141 1313 -596 -1350 -392 420 1059 986 -495 -1468 -358
447c58J238k25o87k85o30Q21J110l01j093o42P72M50P69n19j039n88J077R62j60
$$ -358 880 655 -32 -317 -947 -126 984 683 -410 -1052 -280 170 939 420 -619 -1207 -130 832 672
466F72r57n81L02Q00Q53m15j149j29M23P77j07q1o53p58J177O21l20m12n60J37
$$ 672 -285 -866 -564 236 1089 674 -475 -604 -181 596 489 408 -245 -1003 174 795 475 63 -497 -360
486c60P60J28l29o34j79Q51M49l75l24o19L40P01M21p04j78l47j9P54M10n94m57
$$ -360 400 528 199 -435 -614 237 686 311 -13 -632 -292 409 830 126 -52 -399 -418 336 746 152 -305
507c05p4M78J32l8k78l53j00J057m28k63k78q7O69Q0J63m97l36QP64P9j07k74
$$ -305 -379 99 231 193 -85 -438 -538 519 91 -172 -450 -537 132 212 375 -122 -458 -450 314 393 286 12
529A2n20J74P08j00k30m55M35rJ28J73l76j43J12L01k0r4k61j74J24P38l09j63
$$ 12 -508 -334 374 274 44 -411 24 15 143 316 -60 -203 -91 210 190 96 -165 -339 -215 523 214 51
551E1k75Q5K75J09l2L5n97M16K89l27m41O3J88R0K27j9rl67K34K33l34J39l65
$$ 51 -224 -139 136 245 213 248 -349 67 356 29 -412 -349 -161 -71 156 137 128 -239 -5 228 -106 33 -332
574c32R0J89N17l22n04K44n3M13k16J22j31o0K05m2O6m11l53Q21K11j21k12J70
$$ -332 -242 -53 464 142 -362 -118 -171 242 26 148 17 -43 162 120 186 -225 -578 243 454 333 121 291
596B91k80p3K41K74l48n17Q9M77J39o2k52J58k8j70O1l97J75J61l2M61p4m17J16
$$ 291 11 -62 179 453 105 -412 -323 154 293 231 -21 137 109 -61 0 -397 -222 -61 -93 368 294 -123 -7
619gL3K07O3j65q0r2J61K22m08J07j74O3J51j46L46o05n8M39l8k02M20o7n05P0
$$ -7 26 233 296 131 51 -41 120 342 -66 41 -133 -70 81 -65 281 -324 -382 57 19 -183 237 170 -335 -265
643b65j9K52r0Q4J80P8l01R2k8K51k76j27K30o8R3J13r8j99N8M5j86K23j31K45
$$ -265 -284 -32 -122 -38 142 220 -81 11 -17 234 -42 -169 61 -7 86 199 101 -98 -40 5 -181 42 -89 156
667A56k20j9o9J16L15n8m55N2J37o0O1j33L66M2j49J0n5j55k58K22J35L00j17
$$ 156 -64 -83 -152 -36 279 221 -234 -182 -45 -105 -44 -177 189 231 82 92 37 -118 -376 -154 -19 281 164
690A64j76j15M7J89k41J08J57l26L09r6J06m7j54k97N41j00j73l02M45o9j72K74
$$ 164 -12 -127 -80 109 -132 -24 133 -193 116 20 126 79 -75 -372 169 69 -104 -406 39 -30 -202 72
712G2J27j22JQj36J43J11p32N76L42j23n95L12PJ39N8j19l09K52K01n43J08M5
$$ 72 199 77 78 86 -50 93 204 -528 48 390 267 -328 -16 -9 130 188 69 -240 12 213 -330 -222 -177
735a77n8J96J67K35l65j72M4J72K0j78J86l13J94R8M1m5j71j3K55k36m5L83k71
$$ -177 -235 -39 128 363 -2 -174 -130 42 62 -116 70 -243 -49 49 90 45 -126 -139 116 -120 -165 218 -53
758e3m0j23j77M46j73K00q3J80k56L68k98p1o4R7J90k06K6K4J15p9O5k80K14j8
$$ -53 -93 -216 -393 53 -120 80 -3 177 -79 289 -9 -80 -144 -47 143 -63 -37 -13 102 23 88 -192 22 4
782Dk65L70J57l00P0j07J00K19n22J56j75R9L01J4k12m4J47K07j11oR0o7k55K31
$$ 4 -261 109 266 -34 36 -71 29 248 -274 -118 -293 -194 107 121 -91 -135 12 219 108 102 192 125 -130 101
806A01j69J80O6j28r2J05J02l3j86k07L18K11l68K12m34L50J90m96L55nl00K73
$$ 101 -68 112 178 50 -42 63 165 132 -54 -261 57 268 -100 112 -322 28 218 -278 77 72 -228 45
828D5j92M7M65l54J41j65k22K94o5J81j23l3J62k82J85Nk85R6J38k3N5m3j08j01
$$ 45 -147 -100 365 11 152 -13 -235 59 -6 175 52 19 181 -101 84 89 -196 -100 38 15 70 27 -81 -182
852a82K54J7j30k60K57q8Q6O2j10K60k79P4K18M6r2q8P0l80M55k41J42l30K00
$$ -182 72 89 -41 -301 -44 -132 -46 16 -94 166 -113 -39 179 225 133 45 115 -265 190 -51 91 -239 -39
875c9K90k00r7M9L0l31P0K48n7k24L77j45J06l8N3j71J13o3K18oJ79n1j15o1q7
$$ -39 251 51 -46 3 33 -298 -228 20 -37 -261 116 -29 77 39 92 -79 34 -29 189 183 362 311 196 135 48
900D8Q2j4l54N03k25J8J07k92L23k01L04l46j12p8J54j9N7K45K67m37M1J05k0
$$ 48 130 116 -238 265 40 58 165 -127 196 -5 299 -47 -159 -237 -83 -102 -45 200 467 30 71 176 156
923A56j72mK8J7k82K88m05K59P2Q2n06O42qj43J69ml07m8J60K48l81L19l8l72
$$ 156 -16 -20 8 25 -257 31 -374 -115 -43 39 -467 175 167 24 193 189 -118 -166 -6 242 -139 180 142 -230
947b30K42K2K79p46N07k33M71m74L17l62K52o9P1n1r2p7J83J98j0k14Po3J26j0
$$ -230 12 34 313 -433 74 -159 312 -162 155 -207 45 -24 47 -4 -96 -173 10 208 198 -16 -9 -72 54 44
971D4J15J8j97j35J36K90k42j95K7P9K96l35J05K37j0k14j1j96l7J01L11M5n09
$$ 44 159 177 -20 -155 -19 271 29 -166 -139 -60 236 -99 6 243 233 19 8 -188 -225 -124 187 232 -277
994b77L46J63k25q4J24k24n4n9L51p7M42j41l07Q4l4K66m33k4K53j56J89k19K80
$$ -277 69 232 7 -77 47 -177 -231 -290 61 -16 426 285 -22 62 28 294 -139 -163 90 -66 123 -96 184
1017A84k75K55k52J61k83J25K24m12J83j41J26N03k77j29j01j01M37l37j1R1k4
$$ 184 -91 164 -88 73 -210 -85 139 -273 -90 -231 -105 398 121 -8 -109 -210 227 -110 -121 -30 -54
1038e4%r0J05O2l89N19j12m8J04m7P9P3k61j25j08N8K3N67k88j00N3L8j83L31
$$ -54 -54 -144 -39 23 -366 153 41 -7 97 50 129 202 -59 -184 -292 -234 -211 356 68 -32 21 59 -124 207
1062B07n42O54m48K63j86j8J54n08M11Q5J28l69N3K9K62R0m54K22N6k7J99m13
$$ 207 -335 319 -129 134 -52 -70 84 -424 -13 72 200 -169 -116 -87 175 265 -189 33 89 62 261 -152
1084a52j03J26J46J51L0k47K3j69RM54k86M5j39K73p4oJ4J04o6m0J41k66N2j77
$$ -152 -255 -129 17 168 198 -49 -26 -195 -186 268 -18 27 -112 161 87 81 95 199 133 93 234 -32 20 -157
1108a57j4k4M2J1P8m9J43jK70l06L15m32K90l51j74O70k07K3j07P5j16j3Q3k57
$$ -157 -171 -195 -153 -142 -64 -113 30 29 299 -7 308 -124 166 -185 -359 311 104 127 20 95 -21 -34 49 -208
1132b08N8R7J99l05j15L18J99k33L02k67j8Lj63k8J46L43l41J32l49L45K14l98
$$ -208 -150 -53 146 -159 -274 44 243 10 312 45 27 30 -133 -161 -15 328 -13 119 -230 115 329 -69
1154f9k75M13k5O0M1k98J63J80j26O3j46L57k83j49J49j01J78j23j86K80l8oj10
$$ -69 -344 69 44 104 145 -153 10 190 64 127 -19 338 55 -94 55 -46 132 9 -177 103 65 59 -51
1177e1r0K17J96m01M29K33p15J12J04Q4lr3k50J95M17k53k77O3K74l69K94q2l46
$$ -51 -141 76 272 -129 300 533 -182 -70 34 118 115 22 -228 -33 384 131 -146 -83 191 -178 116 34 -312
1200c12N33m11J63p0L51l46k9K14k0J04k21p8K8N42l51l25J70O7K3j52K5N7J68
$$ -312 221 -190 -27 -97 254 -92 -121 93 73 177 -44 -122 -94 448 97 -228 -58 9 32 -120 -95 -38 130
1223A30m94L49M73j42j90K4k63P15p63k35L96j02J15P3k78M16m68O6J72J6p3l6
$$ 130 -364 -15 458 316 126 150 -113 602 -161 -396 0 -102 13 86 -192 224 -244 -178 -6 10 -63 -99
1245i9M5l4J98j15L1l97J46J11j44K85J75P5k88P7J37j76k75O2J61p5l3K38j43
$$ -99 -54 -88 110 -5 26 -371 -225 -114 -258 27 202 277 -11 66 203 27 -248 -186 -25 -100 -133 105 -38
1268c8j00J95NK3k3o3j38Q1j24O4k2J76O1k13M18l44J46j91K18J2j66Q7j13J04
$$ -38 -138 57 62 85 62 -1 -139 -58 -182 -118 -140 36 97 -116 302 -42 104 -87 131 143 -23 64 -49 55
1292E5j74K92k22pJ39j10J18j85J89J10k39k99O02l44M94k96j38j62J64L29l52
$$ 55 -119 173 -49 -56 83 -27 91 -94 95 205 -34 -333 269 -75 419 123 -15 -177 -13 316 -36
1313c6j36M19k51J98l46Q9J97j97N05n62P5J00m33L82r5K11j03m94J77J74J7Q8
$$ -36 -172 247 -4 194 -152 -63 134 -63 442 -120 -45 55 -378 4 -91 120 17 -477 -300 -126 -109 -21
1335b1k4L07Ol20L9M8K41l44k04N25j80j32j46K3R3l1Q9O8K93k82k45K3K6J60
$$ -21 -45 262 268 -52 -13 35 276 -68 -272 253 73 -59 -205 -182 -89 -120 -31 37 330 48 -197 -174 -148 12
1359A2J2j45N8J04o7R8J38j70j95K06Pq4j76K71L3j01K81m20l69N56P9l23R1J77
$$ 12 24 -121 -63 41 -26 72 210 40 -155 51 58 -26 -202 69 102 1 282 -138 -507 49 128 -195 -104 73
1383G3J41m08J19J69l27L17J88k50%J09O1k84q2J11N5j64M47l77J17j6K43k58
$$ 73 214 -194 -75 94 -233 84 272 22 22 131 192 -92 -174 -63 -8 -172 275 -102 15 -1 242 -16
1405a6rm0J16L2k64M26j91K35l03j39L40l12k2L0J04J29k49m3K32k70L73k12K30
$$ -16 -25 -65 51 83 -181 245 54 289 -14 -153 187 -125 -147 -117 -13 116 -133 -176 56 -214 159 -53 177
1428A77k90J74L8k69K72l29K44l0J57j60j17O1K13l21n1L57j74N1L41m5k60q7
$$ 177 -113 61 99 -170 102 -227 17 -13 144 -16 -133 -72 141 -180 -231 126 -48 3 344 299 39 -48
1450d8J10r2J43rJ03j56%P9l52P2Q8j8j08L70m61R5Q5k01L68j17P3k10J64N6k44
$$ -48 62 -30 113 104 207 51 51 130 -222 -150 -62 -80 -188 182 -279 -184 -99 -300 68 -49 24 -186 -22 34 -210
1475b10K35J13P5j68j01R0J21J9n3J08m24J09J93j02p0J56o4j78K45p3P7k74K5
$$ -210 25 138 213 45 -56 34 155 174 121 229 -195 -86 107 5 -65 91 27 -151 94 21 98 -176 -151
1498a51J18J73j27QK19k76p8j06K42j01K12o4r3J75q6k0p4j58K41l35K59M2O9
$$ -151 -33 140 13 21 240 -36 -114 -220 22 -79 133 69 -24 151 65 45 -29 -187 54 -281 -22 20 89
1521H9l0j95K2K32j62j54K05j6l69M1O51m55J40L24k91q2j33L84K66n41J68k41
$$ 89 59 -136 -114 118 -44 -198 7 -9 -378 -337 314 -141 -1 323 32 -50 -183 201 467 -74 94 -147
1543a47j80M97j18j19J73j40j26J19pJ12L10n01K71n9k04K81k47O8M4j67L26j24
$$ -147 -327 170 52 -67 106 -34 -160 -41 -48 64 374 -127 144 85 -119 162 -85 -17 27 -140 186 62
1565F2j27P3R4j82k3j09K39k52M09k36O8j6p2J56m8m46M32k16J87K21k65k36M26
$$ 62 -65 8 102 -80 -103 -212 27 -225 184 -52 16 0 -72 84 36 -410 22 -194 -7 214 -51 -287 139
1588A39k79L08j06l25K56K13l10J91j93q9L50K14l78M50n91J97j32J08Q4k62J26
$$ 139 -140 168 62 -263 -7 206 -104 87 -106 -195 155 369 -9 441 -150 47 -85 23 107 -155 -29
1609b9k8O3J41k52J08J9j15J44o6J2J98j77KN6L31n82L13k52J57k3m19O95k55
$$ -29 -57 6 147 -105 3 22 -93 51 -15 -3 195 18 20 76 407 -175 138 -114 43 20 -399 296 41
1632D1k11j33L80L1j11L8j60R2L09l46J75L35l70j41R2p4J32K50m10N2N7j06K43
$$ 41 -170 -303 77 108 -3 35 -125 -33 276 -70 105 440 70 -71 21 -53 79 329 -81 -29 28 -78 165
1655A65k72Q8k38K85j89L29m08K89j71m5J86k92Q3K83l16K10L27j79n4j07j56
$$ 165 -107 -19 -257 28 -161 168 -240 49 -122 -167 19 -273 -190 93 -223 -13 314 135 81 -26 -182
1676a82M16m79L68j53Q3j99K86J2k8J4j50J86k60nJ8j23J32P9q5jK62j53p9J27
$$ -182 234 -245 123 -30 53 -146 140 152 124 138 -12 174 -86 -91 -73 -196 -64 15 -70 -71 191 38 -41 86
1700H6k94O56o73Q0J87J23n35L73k28J50N4K72l02%JL62j87q9J95j20k41L16j06
$$ 86 -208 448 -225 -145 42 165 -370 3 -225 -75 -21 251 -51 -51 -50 312 125 36 231 111 -130 186 80
1723H0k14K96j41l20J67O8K02n3j1m4P8k6n9J00Q7o29L44L87l55P2J65J7l13J38
$$ 80 -134 162 21 -299 -132 -64 138 85 74 30 108 82 23 123 210 -419 -75 312 -43 29 194 211 -102 36
1747C6P7k82RK5K30m5l9K0k13m7K34l21J24M35Km47L87n7lk98K68L4J22m18J94
$$ 36 113 -169 -160 -135 95 50 11 31 -182 -229 5 -316 -192 243 245 -202 185 128 125 -173 95 129 251 -167 27
1772B7k08L16l1k44L04n09N24k52K31l52K55j58J67N1m80K95q4O4J8p0L68k47
$$ 27 -181 135 104 -140 164 -345 179 -73 158 -194 61 -97 70 121 -359 -64 -148 -84 -66 -136 232 -15
1794a5l7k4J47n2J17l22L78j95o5j60L15j0l7j51L42j75L0k01L10k54L70k3l81
$$ -15 -52 -76 71 19 136 -186 192 -3 -68 -228 87 77 40 -111 231 56 86 -115 195 -59 311 288 -93
1817i3J11r7K85OJ58j75N8n93N68m8j74R1N7J05l56j33oJ71L68k95k8J19j1k02
$$ -93 18 -79 206 212 370 195 253 -340 228 180 6 97 154 259 -97 -230 -236 -65 303 8 -20 99 88 -114
1841a14j56O89m56M60k48l80J87K08o35K91M68k88o6j00L32q7j65j65L96k3k87
$$ -114 -270 419 -37 423 175 -205 -18 190 -445 -154 314 26 -40 -140 192 105 -60 -225 171 148 -139
1862a39J30J79j58N4j76L32N2k97L3j2p2L7J20m22L32K0L7K6j78l22O76O3m73
$$ -139 -9 170 12 66 -110 222 274 -23 10 -2 -74 -37 83 -339 -7 13 50 76 -102 -424 252 315 -158
1885a58p7J51L62k22k13j52L38O6m4N7q8J36k15K21P9k39m8K08j95l62R7K0K33
$$ -158 -235 -84 278 56 -157 -309 29 95 51 108 20 156 -59 162 241 2 -46 162 -33 -395 -298 -278 -45
1908d5K87k70l4J85k47P5j48J82k31K31J84j28j4Q1l49K68j02J16j23R9j07L29
$$ -45 242 -28 -62 123 -124 -49 -197 -15 -246 -15 169 41 27 108 -241 27 -75 41 -82 17 -90 239
1930B39q7l15K24j92J99M60o31j02L07J47m70K53l0K75r8j85j24J71p0J11j29
$$ 239 152 -163 61 -131 68 528 -103 -205 102 249 -221 32 2 277 179 -6 -130 41 -29 82 -47
1951d7o1N18m03O0K70n20K28j84K40j48J10J0o2m0j94j33K58P9Q6J20J1l66J87
$$ -47 -108 410 7 67 337 -183 45 -139 101 -47 63 73 11 -29 -223 -356 -98 -19 67 187 198 -168 19
1974A9j21K62J22m02P4j30R0K17n59K54N03o49L13J62J26l99N1j95O3L20k71L50
$$ 19 -102 160 282 -120 -46 -176 -86 131 -428 -174 329 -320 -7 155 281 -118 -67 -262 -199 121 -150 200
1996B00l16K42l8J4l35L44k94K5P5J75L6l47lLJ02K98M4m70J76k7J59Q7j13j29
$$ 200 -116 126 88 102 -233 111 -183 -158 -83 92 128 -219 -222 -219 -117 181 225 -245 -69 -96 63 150 37 -92
2020i2L85q2j37k24n3K26j49N1K48k57j4j08j98L49K76k70L70k89P4K6k93K29
$$ -92 293 211 74 -150 -203 23 -126 -75 173 -84 -98 -206 -404 -55 221 -49 321 32 106 132 -161 68
2042F8l47K99l33K84L03k06P6m0o6q3J64l57L88N1k19l5J26j58J3P3k24j8J30
$$ 68 -279 20 -313 -29 274 68 144 104 38 -45 119 -238 150 201 -18 -53 73 -85 -72 1 -223 -241 -111
2065a11J40R4l19J23l04J18J95K05p1p3k75K61P9j24O3P2m28L89J70k33j2m6K84
$$ -111 29 123 -196 -73 -377 -259 -64 141 70 -3 -278 -17 62 -62 1 73 -355 34 204 -29 -41 -87 197
2088A97k09m5K5L8j48L6J02L08n47J59K90q2j23J56k36J93J26m34J69K09j74q4
$$ 197 -12 -57 -32 6 -142 -106 -4 304 -243 -84 206 124 1 157 -79 114 240 -194 -25 184 10 -74
2110g4R6K03l88J50j27j72K27K46l43J62K03k84J20r4K00j38N9p3j91L3K68j69
$$ -74 22 225 -163 -13 -140 -312 -85 161 -182 -20 183 -101 19 -75 125 -13 46 -27 -218 -185 83 -86
2132h6R7j59J44k9K48n3lk31k17L31r8j5J65p6N28n41L64l04O0j95j70L92j78
$$ -86 11 -148 -4 -33 215 162 159 -72 -289 42 -56 -71 94 18 546 5 369 65 125 -70 -240 152 -26
2155b6j5k5j14J05j8J35k76M38q2J0m5k47P9M3K05l8k3J31k12L48p29N0L10K78
$$ -26 -41 -66 -180 -75 -93 42 -234 204 122 132 87 -160 -81 -38 167 129 106 237 25 373 -356 -306 4 282
2179B82l16l0O6l8J16m5l1J53Q6k75J60p8o6J85M0m05K18Q2l3J10j56L00k90J43
$$ 282 -34 -64 2 -36 80 35 4 157 243 -32 128 50 -16 169 209 -196 22 104 71 181 25 325 35 178
2203A78j29k33J88J02o3N6q7J3l63M33j41k1M2o1K01Mk24j03J42J13o7n0l3J02
$$ 178 49 -184 4 106 43 99 12 25 -338 95 -46 -67 -25 -86 115 119 -105 -208 -66 47 -20 -70 -103 -1
2227aJ58k59q9L18k08M5O9Olq1o0k4K0K39j86j99L39K1P2p0j42l0K26j01j49J41
$$ -1 157 -102 -191 127 -81 -36 33 39 36 -45 -105 -129 -109 130 -56 -255 84 105 177 107 -35 -65 161 60 -89 52
2253E2R4k23O01m24j15j7k55M85l70L16k53K53m67M75o02K65J44R1p1Q5J10k70
$$ 52 146 -77 524 100 -15 -32 -287 198 -172 144 -109 144 -323 152 -450 -185 -41 50 -21 64 174 -96
2275i6J79r4j6J26j36j97L35j06K5j58L10j2k17o4%K29j02k57K93j10j44L42p0
$$ -96 83 -11 -27 99 -37 -234 101 -5 20 -138 172 160 -57 -121 -121 108 6 -251 42 -68 -212 130 60
2298F0J04l84K23k21k5L22J73l57j2r6J59p6R9j76L38l5J4j03q2j0J29J75l70
$$ 60 164 -220 3 -218 -243 79 252 -105 -117 -213 -54 -130 -31 -207 131 96 110 7 -75 -85 44 219 -151
2321a51O7j7K23p1j03p3J70j21P0p9p2Q8K32j77J96j06J24o3NJ32j70l8M8J36
$$ -151 -84 -101 122 51 -52 -125 45 -76 -6 -85 -157 -69 163 -14 182 76 200 137 142 274 104 66 114 250
2345B50l33k53K26o3Q0M53p1j41j63K0K34m16M58k23j04j35L01O4l50J88j52Q7
$$ 250 -83 -336 -110 -173 -93 360 289 148 -15 5 239 -177 281 58 -46 -181 120 184 -166 22 -130 -43
2367d3j10K11L0j23R0j22r5J30n2J6K89l09J40k66J48K15j4j81Q8r1J62k58M25
$$ -43 -153 58 88 -35 55 -67 -162 -32 -84 -68 221 -88 52 -214 -66 149 135 -46 42 -49 113 -145 280
2390B80l90o6p8J98K29m30M85j06j31j13J87k81K93j44N13n27L76j16m10K08j75
$$ 280 -110 -176 -254 -56 173 -257 228 122 -9 -122 65 -216 77 -67 446 -81 295 179 -231 -23 -198
2411a98M9O9k5J7J60n0m4j67J64n2jj21J49j27J09N46o15L2K73j27l31M26q9j53
$$ -198 -149 -80 -105 -88 72 22 -22 -189 -25 -77 -78 -199 -50 -177 -68 478 -137 -105 168 41 -290 136 47 -106
2435a06J12k69K90j16j34O1K98j34Kj13k51Q38m28N3m44L92j0l3j22k4J12R0l76
$$ -106 6 -263 27 -89 -223 -162 136 2 4 -109 -360 478 50 103 -341 51 41 8 -114 -138 -26 64 -312
2458c12L86L5J15k55j45L20j68o3K55q4P7k38K80m04j29N79l50l50N87r7j59L76
$$ -312 74 109 224 -31 -176 144 -24 -87 168 84 161 -77 203 -201 -330 249 -101 -451 136 39 -120 256
2480B56m57j50K39J12j94K54j26J7m5J97N9l49j16K97k4l19N07l81N81l72J40
$$ 256 -201 -351 -112 0 -194 60 -66 -49 -94 103 162 -187 -303 -6 -30 -349 158 -223 358 -14 126
2501A26k47J16j86K87j8j27p8J70j55k6J25K2j53K27Q7k50M9l8L12k38j1N5j67
$$ 126 -121 -5 -191 96 78 -49 -127 43 -112 -138 -13 9 -144 83 170 -80 -31 -69 243 5 -6 49 -118
2524a18K92J71k94p7j08J26J5k6J55j27j98L24k18K69j24J15j33P6k02J98q2l9
$$ -118 174 345 51 -26 -134 -8 7 -19 136 9 -189 135 -83 186 62 177 44 120 -82 116 34 -5
2546eK62j70l82K53K27j27j41L77l02j52n0J07j50N9M62k70j32L93j99j6k12o0
$$ -5 257 87 -295 -42 185 58 -83 294 -8 -160 -210 -103 -253 -194 268 -2 -134 259 60 44 -168 -228
2568b28J03j62K06P2l7K33L6l09L7j46L6K08K95m69M8M9m2J27k4j66M39p6n20
$$ -228 -125 -287 -81 -9 -46 187 223 -86 -49 -195 -159 49 344 -125 -77 -28 -70 57 33 -133 306 230 -290
2591b90J99l25L98L47o05M35j31N9m3j7l8k17L16K83m37J06l22L11j53L65m87
$$ -290 -91 -416 -18 329 -276 159 28 87 44 27 -11 -228 88 371 -66 40 -282 29 -124 241 -246
2612b46o3J58N5J47p1P7k74O10m75K43J44m66K00k53J55N10l84k4j06k0P9R7n0
$$ -246 -309 -151 -96 51 -20 57 -217 393 -82 161 305 -161 39 -214 -59 451 67 43 -63 -83 -4 93 43
2635D3n4O5J19j68N7LJ5k5l38N54k68M6k41J82q8L8Q7j33K13l86M51j84J44m33
$$ 43 -11 54 173 5 62 65 80 55 -283 271 3 49 -192 -10 -98 -60 27 -106 107 -279 172 -12 132 -301
2659c01O52l00j34L8j20m3J11Q0k1m9J82J62m90Q1J70Q0J06j87j61O1O1K63m88
$$ -301 351 51 -83 -45 -165 -208 -97 -17 -38 -87 95 257 -233 -152 18 98 204 17 -144 -83 -22 241 -247
2682b47J81J4J02k05J67N9Pr6k03K47n00M76J21k38L99m49L25n99O72l47j28n1
$$ -247 -66 -52 50 -155 12 71 78 -18 -221 26 -474 2 123 -115 284 -165 160 -439 233 -114 -242 -293
2704b93J00M48r5r2J06K3P3m25j5J95j64j5P4O5k01K34Qmj63J23J04j02J09j31
$$ -293 -193 255 160 68 174 197 270 -155 -170 25 -139 -154 -80 -15 -216 18 26 22 -141 -18 86 -16 93 -38
2728c8r3L38j01j48RK99n00kL55k37j74q4M04J84k35j6N11l93k31J12N6rJ64m5
$$ -38 -131 207 106 -42 -33 266 -234 -236 119 -118 -292 -376 28 212 -23 -39 472 79 -152 -40 16 7 171 126
2752A26m29K01J0k31L87m48L16m60R25p5p76P35j004J033j53L12n31O88J36j563
$$ 126 -303 -102 -92 -323 64 -384 -68 -528 397 322 -454 281 -723 310 157 469 -62 626 762 -801
2772h01P98n35O89j87k30L22L97r25L68k82K91j80L72l02J09Q0%K4j5L2j62J09
$$ -801 -3 -538 151 -36 -266 56 453 -472 -104 -386 -95 -275 97 -205 -96 -16 -16 8 -7 25 -137 -28
2794b8r4L32l74n3J93j4K81j25k92J92k37l0O8L07m35M11k81J63j26J54J73l29
$$ -28 -122 210 -164 -217 -24 -38 243 118 -174 18 -219 -249 -181 126 -309 102 -179 -16 -142 12 185 -144
2816a44j11K34m7O9k09K53l2m0k1j38j01j65K33L50j95K59j52r2N0j89K56k66
$$ -144 -255 -21 -68 1 -208 45 13 -27 -48 -186 -287 -452 -219 131 -64 195 43 -49 1 -188 68 -198
2838a98K46L2j04r5J72P6r2qj75M2J66j14q8K07o4L80q3m7k13p8Q4J9l4kP1r3
$$ -198 48 80 -24 -119 53 129 37 29 -146 -104 62 -52 -140 67 3 383 300 253 40 -38 46 65 31 29 100 7
2864Gj89K60lj61K41k9m76N41l13q6o8M77J14l99NJ18Q1j8j16J14J43k99jj66
$$ 7 -182 78 75 -86 155 126 -350 191 -122 -208 -276 201 315 -84 -79 39 120 102 -14 100 243 -56 -57 -223
2888b23K9J18m4j51L54l5j85P4N1K52l34J69Q4k36O8q0J10j22K65k07J01K33j55
$$ -223 -194 -76 -120 -271 83 48 -137 -63 -12 240 -94 75 159 -77 -9 -89 21 -101 164 -43 58 291 136
2911A36r5k6l9N3j85J81O5m9K9K85o00L2J33J00k38O0K37k48L70m61L21n8J12
$$ 136 41 15 -24 29 -156 25 90 41 70 355 -245 -213 -80 20 -218 -158 79 -169 201 -260 61 3 115
2934A15r2O4Qk69L39l27KL1j53R5J77k0k11M62q1j07l4J9J41j24L53m37J85l13
$$ 115 23 87 95 -174 165 -162 -160 -129 -282 -187 -10 -30 -241 221 140 33 -1 18 159 35 388 -49 136 -177
2958a77K9PK60M5m52N65k24n6j71L99j99N3Q3l50M83k51M1j84MN0l1k43J74K08
$$ -177 -148 -141 119 164 -288 277 53 -3 -174 225 26 79 162 -188 295 44 85 -99 -95 -45 -76 -319 -145 63
2982F3j97j11K90j20J29n4K6l11K31K07L8l19L0L5L3J53k80J94k9LM5J78m32K22
$$ 63 -134 -245 45 -75 54 0 26 -285 -54 153 191 -128 -98 -63 -30 123 -157 37 8 11 56 234 -198 24
3006B4k2j95p0m5J87k02K58k3j46J49L47l37J57m5K07J18l50M55o43k39M89J82
$$ 24 2 -193 -263 -308 -121 -323 -65 -88 -234 -85 262 -75 82 37 244 362 12 467 -176 -415 74 256
3028B56o6j70j07n9J22R2j01j44L3J25Q0n06N76m23J49J95j99L49kj26l05K44
$$ 256 190 20 -87 -146 -24 68 -33 -177 -144 -19 61 -445 131 -292 -143 52 -147 202 200 74 -231 13
3050A3k53L85n5j40Nn9K04r8M0k69j65L61J16M7k0j72j48n7J89jJ07l5k93K87
$$ 13 -240 145 90 -50 -45 -104 100 2 42 -227 -392 -31 85 132 112 -60 -208 -265 -76 -77 30 -5 -298 -11
3074a1J78n69N47q8K26m20k5K0p7J96j79J48N0J16k85J99j7RJ93p9j43J25J72
$$ -11 167 -402 145 57 283 -137 -162 -142 -219 -23 -202 -54 -4 112 -173 26 9 18 211 132 -11 114 286
3097B86m49K63j34L77l64o1J20J10j85Q7j7Np1J79j91R1j4j58K15J13n04K97J00
$$ 286 -163 100 -34 343 -21 -82 38 148 -37 50 33 38 -33 146 -45 46 32 -126 89 202 -302 -5 95
3120I5k64M50m88L82k16j58K06K1o7j89M61n00J8K11P4L7j83J24kL38o08K91R4
$$ 95 -169 281 -207 175 -41 -199 7 28 -39 -228 233 -267 -249 -38 36 73 -110 14 12 350 -258 33 127
3143A27k96j49K59r5K43J51j49k17J27O9l9J07j9k21J71j01l6qL90m80K30k06
$$ 127 -169 -318 -59 -154 89 240 91 -126 1 70 31 138 119 -102 69 -32 -68 -76 314 -166 64 -142
3165a42K87p5R4j28k11L31Q0l33K19j87l2K22m8j4J53j74j92K57k21j39K06j54
$$ -142 145 70 164 36 -175 156 236 -97 122 -65 -97 125 77 63 216 42 -150 107 -114 -253 -47 -201
3187b01J92j24P02q65K90k24j8L61j66m0K98j70j99L87j6j12k30K50k63N9J00
$$ -201 -9 -133 569 -296 -6 -230 -248 113 -53 -93 205 35 -164 223 207 95 -135 115 -148 -89 11
3208A1Qk05R4r9L20k29L08k63k82N43k96J63J1j06m1q1j4N2M19k93j02r5K21p6
$$ 11 19 -186 -92 -191 129 -100 208 -55 -337 206 -90 73 84 -22 -63 -144 -158 -106 313 20 -82 -177 44 -32
3232c2j05L28j97k77J82K81q5k61j15N87n53L01j38r7J38mJ97o52M64J66m4k36
$$ -32 -137 191 -6 -283 -101 180 95 -166 -281 306 -247 54 -84 -181 -43 -47 150 -502 -38 128 84 -152
3254a52N0l0P9J00j49J17J04j15Q9m20K27KL0n8k96N54%R9k49k54m2J75j9N9L56
$$ -152 -102 -132 -53 47 -102 15 119 4 93 -327 -100 -98 -68 -126 -422 132 132 231 -18 -272 -314 -139 -158 -99 257
3279B57j52p1NJ12k60L39j11m22L74l02K09J17j95J80J61k93K92k63K06q8J55
$$ 257 105 34 39 151 -109 230 119 -303 71 -231 -22 95 -100 80 241 -52 240 -23 183 95 250
3300B50k22j97L77j52j4j49L8j99M71j81J08K05j40j05l11N3M58j88j64J49j48
$$ 250 28 -169 208 56 42 -107 -69 -268 203 22 130 335 195 90 -221 -168 290 102 -62 87 -61
3321f1m3O3K08j34l5N8R0k49J23K18j60O9L0l71J87M0k04M80j88m7Q1j48O8N0
$$ -61 -104 -41 167 33 -2 56 146 -103 20 238 78 147 177 -194 -7 33 -171 309 121 74 155 7 75 125
3345A25k2k3L3j25J88l73L06j32j21Q1j16L4J49k9q2OJ42k62N4L50M5O9k12P0
$$ 125 103 80 113 -12 176 -197 109 -23 -144 -63 -179 -145 4 -25 -107 -101 41 -221 -167 183 228 297 85 155
3369A55P5k10n7j55O1K76l4j49R1N3pj73R1l6q1J08J00M9J2Jj06j44j2j14N56
$$ 155 230 20 -37 -192 -131 145 111 -38 53 106 99 -74 17 -19 -100 8 108 157 169 170 64 -80 -92 -206 350
3394C50N9k17P3l94QJ19Ml0p0N2J66J55l84k84M21k29J29J63J01p10L72K14k58
$$ 350 409 192 265 -129 -121 -2 2 -28 -98 -46 120 275 -109 -393 28 -201 -72 91 192 -518 -146 68 -190
3417a90J87l20L57j94J50K20m19R4L05Oj26j37k2j28j59J88J73p0N7Q5O9n3m45
$$ -190 -3 -323 34 -160 -10 210 -209 -115 190 196 70 -67 -89 -217 -376 -188 -15 -85 -28 57 126 73 -372
3440c72M20N6j91j88J16O0J54j53K03m53J61O5J9Q4J1k24oL08j43n3Q2k17M18
$$ -372 48 104 -87 -275 -159 -99 55 -98 105 -348 -187 -122 -103 -19 -8 -232 -238 70 -73 -126 -44 -261 157
3463A57k01J52J00j18o8j12M4J49p4J20k09K6J77L7k20N8P1k29J99l05K07k13
$$ 157 -44 108 208 90 22 -90 -46 103 29 149 -60 -34 143 180 -40 18 89 -140 59 -246 -39 -252
3485b52M94k65k22N32l95J63K92l67K25l61K06l4j37M5l54L87Q0m7J09k54J16
$$ -252 242 -23 -245 287 -108 55 347 -20 205 -156 50 16 -121 -76 -430 -43 37 -10 99 -155 -39
3506c9K6M57m05N6j09J51J21n09L31l5k36L42M5n03M25k8p0Nk12L36j45J59l52
$$ -39 -13 444 39 95 -14 137 258 -251 80 45 -191 151 196 -307 118 90 20 25 -187 149 4 163 -189
3529a89R2J89L91m64q6K59j92K67l28M1M6p6J03k17J40j89L14k31J33k1J27j61
$$ -189 -97 92 483 19 -67 192 0 267 -61 -20 26 -50 53 -164 -24 -213 101 -130 3 -18 109 -52
3551e2P3j64K22j03M00j02k92K56l25K99l20J07J9k47p1q0O0K28j16K53p8M03
$$ -52 21 -143 79 -24 376 274 -18 238 -87 212 -108 -1 18 -229 -300 -380 -320 -92 -208 45 -33 370
3573C70k51l04k2j96P51l90o6j31m7L03Q6p4L04l51q2J49K51k90j29J76M7K3l03
$$ 370 119 -185 -207 -403 348 -42 -108 -239 -286 17 103 29 333 -18 -100 49 300 10 -119 57 104 127 -176
3596a76M98k61K21k81M6o1j67N6R9K05j59M0J87q1m19K81m2P5O3m11L27j11L4
$$ -176 322 61 282 1 47 -14 -181 -125 -26 179 20 60 247 166 -253 28 -14 61 124 -287 40 -71 -37
3619c7j31N3J24K13k25j60J54q5n5K88j1M5j32O0k42J46K40Jm72N37l02j51r2
$$ -37 -168 -115 9 222 -3 -163 -9 -94 -149 139 128 173 41 101 -141 5 245 246 -226 311 9 -142 -234
3642b34K40J1j69J70qL2l50L12R1J17l08j42K04K4l55M35k8k75J24L0L30l2p3
$$ -234 6 17 -152 18 10 42 -308 4 95 212 -96 -238 -34 -10 -365 70 42 -233 -109 -79 251 219 146
3665A46k3j88R3j97oK86j73p4K08l91K12r1k05L52N7J69j22%Pq6J52j64Q5p8J12
$$ 146 123 -65 28 -169 -175 111 -62 -136 72 -319 -107 -198 -403 -51 6 175 53 53 60 -26 126 -38 47 -31 81
3690H1l7P9k66P8L28k11l06K83K73j68m3j48K35k73K08mm66P80n93K3j06N2o0
$$ 81 44 123 -143 -65 263 52 -254 29 302 134 91 -57 178 -95 113 109 -357 423 -170 -147 -253 -201 -261
3713b61J33M0L46j62p6J38l44L31j10k03L87k67P6N1j55r9L97l7p0n3o4K09j58
$$ -261 -128 -88 258 96 20 158 -186 145 35 -168 219 -48 28 79 -76 -175 222 185 115 62 -2 207 49
3736D9J1pj76j5n5K84k42K30M34m91q0P7L9k93K16j60K20r5rj02K88q5R4J7j8
$$ 49 60 53 -123 -138 -193 91 -151 79 513 22 -58 19 58 -235 -19 -179 41 -54 -63 -165 123 38 132 149 131
3761A31n24L56N4k1O1k82K91j70n6P3K68l70J93o2J35j13n9L2J80Q4n4n4K11j58
$$ 131 -393 -37 17 -4 57 -225 66 -104 -160 -87 181 -189 4 -58 77 -36 -95 -63 117 201 147 93 304 146
3785A46N8j70k39L78k05K43k63J37k43M09j57j21r7N1l66M99k88J81j46J04J70
$$ 146 204 34 -205 173 -32 211 -52 85 -158 251 94 -27 -124 -73 -439 60 -228 -47 -193 -89 81
3806H1n1o8n8J51j12R4k62L57o3k6M5j64j86L88J22l61R8l9K32k13P6N1n8j14
$$ 81 30 -38 -96 55 -57 37 -225 132 69 43 88 -76 -262 126 248 -113 -15 -54 178 -35 41 92 34 -80
3830h0L51q9j30m3q4K5q0R2P1l79K30N16n07J55k99O34l58o3J76m5o0Lj58J65
$$ -80 271 182 52 9 -75 -50 -130 -38 33 -346 -116 400 -107 48 -251 383 25 -38 138 93 33 36 -122 43
3854D3L5j87L30P3k39K26k15n1K2J57j46j65J65k6l02K79M5m77P32l10j7j39j14
$$ 43 78 -109 221 294 55 281 66 15 37 194 48 -117 48 22 -280 -1 44 -433 299 -11 -28 -167 -281
3877b81J47J24K8K96k47j71J8M86p03L58J0l46K18n0M91m45K4L8l99N66L0k67
$$ -281 -134 -10 18 314 67 -104 -86 400 -303 55 65 -281 -63 -113 378 -67 -43 -5 -404 162 192 -75
3899g5r1k30J66K28j74J88j27L36m38M73l64K62k03o6N6J99K57k35k16j33P1J43
$$ -75 -166 -396 -230 -2 -176 12 -115 221 -217 256 -108 154 -49 -115 -59 140 397 162 -54 -187 -116 27
3921B7k33K6L87k4k61KP8L3Q2m15J95J14L13k40l68K50J42k19J72k9j85J53J6
$$ 27 -206 -180 207 183 -78 -76 2 35 117 -298 -103 11 324 84 -284 -34 108 -111 61 32 -153 0 16
3944A6K9j64M9K93k96j05K83L17k27m48R8M09m80J83K63m28L2K94j15m0K18K9
$$ 16 45 -119 -70 223 -73 -178 105 422 195 -253 -155 254 -226 -43 220 -208 -176 118 3 -37 181 210
3966B10j30k71J7K50J69k42j93K32j06N1j37L53l88n1K22K32k68o1J36K61l61
$$ 210 80 -191 -174 76 245 3 -190 42 -64 -13 -150 203 -185 -236 -14 218 -50 -111 25 286 -75
3987g5N9k83K24M6r0L1j39L12k03J60j12R0Q6j43Q6M6rJ37q5P8m79M01j02J17
$$ -75 -16 -299 -75 -29 -119 -88 -227 85 -118 42 -70 20 106 -37 49 95 86 223 138 216 -263 138 36 153
4011A53m36K59J34Q8k59P4L3ql0K12l07K02k50J40L10l51k13K75L6l07K58k0k4
$$ 153 -283 -24 110 198 -61 13 46 38 8 220 -87 115 -135 5 315 -36 -249 26 62 -245 13 -7 -31
4034c1k73L74k13J66k84K56J16k86J51J32j84J0J34J31k96L6mJ48m9j01L16m51
$$ -31 -304 70 -143 23 -261 -5 111 -175 -24 108 -76 -66 68 199 -97 -61 -65 83 34 -67 249 -202
4056b02J43o0l7r1K87L69n91J86p6l0K38j41Q0j48L0P4k15L63o8rr1M1L03k03
$$ -202 -59 -119 -156 -247 40 409 -182 4 -72 -102 136 -5 75 -73 -43 31 -184 179 111 102 11 52 355 152
4080A52r4m45M63n8k17M1J35J37l11J53J05K3j6K46o64O7kK21J03K11m17N23m69
$$ 152 58 -387 76 18 -199 -158 -23 114 -197 -44 61 84 68 314 -350 -283 -285 -64 39 250 -167 356 -113
4103a13L87l05j4n3j14L3M21k1j57jJ5j77p6J60K32P4l79J74l77N36j61j90J79
$$ -113 274 -31 -45 -98 -212 -179 242 221 64 63 78 -99 -175 -15 217 291 -88 86 -291 245 84 -106 73
4126G3J39j05k50J66K44l26k89N55m38k7K44M37l64j41K62m01J63L10m15K07J08
$$ 73 212 107 -143 23 267 -59 -348 207 -231 -258 -14 423 59 -82 180 -221 -58 252 -163 44 152
4147A52l17J18L15n47M31Jl03K28J63k03q0p3j23L55l31K17K69k36l93N27n30
$$ 152 -165 -47 268 -279 152 153 -150 78 241 38 -42 -115 -238 117 -214 3 272 36 -357 170 -360
4168c60K65K5M2J8L84m79J30J30m66L74j28K4J38m6m9N1j25o2L02j36n68N84J7
$$ -360 -95 -70 -28 -10 374 -105 25 155 -311 63 -65 -41 97 51 2 53 -72 -134 168 32 -536 48 65
4191F5J80k15j41P4K18r7%k9J38k75J09j58K64M0k74N4K85l73K54k60q9J92J7
$$ 65 245 30 -111 -37 181 84 84 55 193 -82 27 -131 133 173 -101 -47 238 -135 119 -141 -230 -38 -21
4214b1n2K83k25J62m57P0J60J94j71J37r9P4o1P8J92l28J12J09k80K64j43J75
$$ -21 -73 210 -15 147 -310 -240 -80 114 -57 80 -19 55 -6 72 264 -64 48 157 -123 141 -2 173
4236A73j12j65MJ42lj37K22l06M41k80l24O61q7j93m6K57n84M43Rk73o5L62k10
$$ 173 61 -104 -100 42 39 -98 124 -182 259 -21 -345 316 229 36 -10 247 -337 106 115 -158 -223 139 -71
4259g1k07M43k73J68lK2R1l43p1K55k82M84m18J81Q8J7O7Lk7j58K02k24O1J69
$$ -71 -278 165 -108 60 57 79 170 -173 -244 11 -271 213 -205 -24 64 81 148 151 124 -34 168 -56 5 174
4283A74n87O00k74J81j61J38j03j44O1K19j94J94J32k17L5j57L38l13J05M5j62
$$ 174 -413 187 -87 94 -67 71 -32 -176 -115 104 -90 104 236 19 54 -103 235 -78 27 72 -90
4304i0P7qJ17m00K52J24j75L23m06K49j41J35K34k58k76J33K36p9k12pM32k33
$$ -90 -13 -21 96 -304 -52 72 -103 220 -186 63 -78 57 291 33 -243 -110 126 47 -165 -172 260 27
4326B7m9j36K49J66n05L9L96lr3J44m47K62n2j75L10o5J64l11J45L5n23M27J26
$$ 27 -22 -158 91 257 -248 -209 187 184 91 235 -212 50 -2 -177 133 68 232 -79 66 101 -422 5 131
4349A31r1m01k7L83L4L4j08j18K3j9KP8jo3J41j31J40Ll8J70m8J0K7o2k66K10
$$ 131 40 -361 -388 -5 29 63 -45 -163 -140 -159 -157 -79 -80 -143 -2 -133 7 10 -28 142 94 104 131 69 -197 13
4375A3k85K43L27k19J01m85L53l64K59m2J13Q0j55J78Q0q9L6J10k42R2k42J53
$$ 13 -272 -29 298 79 180 -305 48 -316 -57 -99 14 94 -61 117 197 108 144 254 12 104 -138 15
4397A5n1k31K28K29l07K54qk98J92j34J83l5M0Oj76nJ95k26R6r1K06RL9L9k96
$$ 15 -36 -267 -39 190 -117 137 129 -169 23 -111 72 37 77 83 -93 -98 97 -129 -33 -124 82 91 130 169 -127
4422a27J03L09l20O4%k54J05m3j05K59K03l22L07m28L20m29K10K03l6K97m80O00
$$ -127 -24 285 -35 29 29 -225 -120 -163 -268 -9 194 -128 179 -249 71 -358 -148 55 19 316 -164 436
4444D36n20j38K92R9n70N13l60l6K96L05m57k40K75L78k36k06J60J9K17j94Q3
$$ 436 -84 -222 70 169 -401 112 -248 -284 12 317 -140 -380 -105 273 37 -169 -9 10 227 33 116
4465A16k4l33M24j87Q0l39N51k81j10q6K93j0N3l23N63j06m40J33J65k8j85P7
$$ 116 92 -241 183 -4 76 -263 288 7 -103 -189 104 94 147 -176 387 281 -159 -26 139 111 -74 3
4487Ck31O1J75J15r3J63j39J9K7k20K21R2j99Q9P1m57L52j19P1j38N3l34L12K62
$$ 3 -228 -167 8 123 30 193 54 73 100 -120 101 193 -6 83 154 -303 49 -70 1 -137 -84 -418 -106 156
4511A56j0l5j27K68l56M4L96k89r9K23l35M56l32J5l6j79K08p1j52K53n3J26J25
$$ 156 146 111 -16 252 -104 -60 336 47 -52 171 -164 292 -40 -25 -61 -240 -32 -103 -255 -2 -55 71 196
4534A96m5m10M60K3N5k00k35J60j56l3K17m9K55q3L3l74P2J40l30K69P1n4q3J74
$$ 196 151 -259 201 224 279 79 -156 4 -152 -185 32 -17 238 155 188 -186 -114 26 -304 -35 36 -18 -101 73
4558G3J41j53k56J96l62K64K38p2K08k85m7J29M99m17k55R9K26j19l8j52K95j30
$$ 73 214 61 -195 1 -361 -97 141 69 277 -8 -55 74 573 156 -99 0 226 107 69 -83 212 82
4580H2l6j59K43l91K43mN8M1k9J12k31j06J85p2L53q1k56J07R7M5k09L48k16j22
$$ 82 46 -113 130 -261 -18 -22 36 77 48 160 -71 -177 8 -64 289 208 -48 59 156 201 -8 340 124 2
4604BK57j57n1J09j43M0p9N8J96p2k71K01R6l86L69m08J83L96m29L64k62R4k01
$$ 2 259 102 51 160 17 57 -22 36 232 160 -111 90 186 -200 169 -239 -56 340 -89 275 13 107 -94
4627i4J1l58O34j70k89L38j93J46n7J03k67L40l3j43K97j80j43M1j43K36J8L8
$$ -94 -83 -441 193 23 -266 72 -121 25 -32 71 -196 144 111 -32 265 85 -58 -17 -160 76 94 132
4649A32J67l39J22j34J64n3j99l0j81J53J62M4N0l2L46q5j25j14J32J63m65J68
$$ 132 299 -40 82 -52 112 59 -140 -170 -351 -198 -36 8 58 26 372 287 162 48 180 343 -122 46
4671D6J05j38N8l10L37l92O05l01J79k59j8o5J27J27jO8k47L46l38O8K27N1j90
$$ 46 151 13 71 -239 98 -294 311 10 189 -70 -88 -153 -26 101 100 168 -79 267 -71 -3 224 275 85
4694H5m22J54J04R5n7K75n18lK89K04k3j71N9j32k1J3j20M39k73K35K27l68J39
$$ 85 -337 -183 -79 16 -41 234 -284 -287 2 206 183 12 71 -61 -82 -69 -189 250 -23 212 439 71 210
4717B10o2O9m41N23o34K63L56l42Q0J0M23j91j92JL2J06n06K80n3L44l54m5k6
$$ 210 148 217 -224 299 -335 -72 284 -58 22 32 455 264 72 73 105 211 -295 -15 -68 276 -78 -123 -149
4740a49J28K6p2k68K56j66L51j48J75k91L68Rj84j9J83l90l2L24J1j9n64M66k10
$$ -149 -21 5 -67 -335 -79 -245 106 -42 133 -158 210 219 35 16 199 -191 -223 101 112 93 -471 -5 -215
4763b15L72M6k65K15j81n1m4J37K47k64j10K68q0n66P61P6l58M5J08J9r3j63J84
$$ -215 157 203 -62 153 -28 -79 -123 14 261 -3 -113 155 75 -491 270 346 -12 33 141 160 67 -96 88
4786H8q6k38K93K1n2m9J39K5k85K30k23K27j93k90M93p8j86R0K43j45n2l7Q7J07
$$ 88 2 -236 57 78 26 -23 116 141 -144 86 -137 90 -103 -393 100 22 -164 -74 169 24 -28 -65 22 129
4810A29j21k69M6M40k09J57j82j64K57K61n30K60j07J73k27N0R1j16L24m91L2
$$ 129 8 -261 -215 225 16 173 -9 -173 84 345 -185 75 -32 141 -86 -36 55 -61 263 -228 -196
4831a96O31m91Q4k1K6K18m33K72n7Q9k00J61k27J03Q2l1L6m55L19M24n45M49j24
$$ -196 435 -56 28 7 33 251 -182 90 33 122 -78 83 -144 -41 41 10 46 -409 -90 334 -211 238 114
4854A14j00k31O96m29k71K78oJ33l0l40J16K31N3o5j89q5J24K71k91Mj55K25j56
$$ 114 14 -217 479 50 -221 57 51 184 154 -186 -70 161 214 149 -40 -125 -1 270 -21 -17 -172 53 -103
4877a03MK02K37k91k87J35O7K27j7j22l03j45K05K67j37l1j88K18O8O9O9q7k31
$$ -103 -99 103 340 49 -238 -103 -36 191 174 52 -251 -396 -191 76 -61 -92 -280 -62 6 75 144 57 -174
4900a74L11m9j47q6M79l12l6QO0j84K2M26n06K84k54o9L01j98K21p9l9K92l31
$$ -174 137 88 -59 -145 334 22 -14 -6 54 -130 -108 318 -188 96 -158 -227 74 -124 97 18 -21 271 -60
4923f0k48P3nK38j19K47k51N4Q3J66l3mk03q7M33j08J1r2r4O3n2k16J37m1J30
$$ -60 -308 -235 -240 -2 -121 126 -125 -71 12 178 145 141 -62 -149 284 176 187 95 1 64 12 -204 -67 -108 22
4948B2k80J10J27Q1J2j75K46m45K92k18P1J43rq5K74k23J41j54K16O0o2j14K88
$$ 22 -258 -148 -21 60 72 -103 143 -302 -10 -228 -157 -14 -23 -108 166 -57 84 -70 146 206 144 30 318
4971C18j78n8K6j84k13J57K87j27j44L23k83j06L42j42J5L03k25j30m9J2j38J69
$$ 318 140 82 108 -76 -289 -132 155 28 -116 207 -76 -182 160 18 33 336 111 -19 -68 -56 -194 -25
4993b5j22P1K38l6k75K23l23J55l9J07m3J0J93k57L59l46K37J81k79l0J16l45
$$ -25 -147 -76 162 126 -149 74 -249 -94 -133 -26 -69 -59 134 -123 236 -110 127 308 29 -1 115 -230
5015b30L26J53j04P2j06j3j83j97J9J43L52m15J61J11j42j82K47J65k28M01n14
$$ -230 96 249 145 217 111 98 -85 -282 -263 -120 232 -183 -22 89 -53 -235 12 177 -51 350 -164
5036a64j1K58q6OK51l10N5k91K63j0o1O9k49K90J96m25L96j69O2J27p6l09L77
$$ -164 -175 83 -3 3 254 -56 -1 -292 -29 -39 -100 -31 -280 10 206 -219 177 8 70 197 121 -188 189
5059A89j26K33k30J61k35l16J59L05j32k9P1j08R5j76P7J02K16k80J78l39L93
$$ 189 63 296 66 227 -8 -324 -165 140 8 -21 50 -58 37 -139 -62 40 256 -24 154 -185 208
5080B08l42K04m14K28J12j75L6J77k64K09Pl6J30j8k61l5K9M7K58pk55L00k06
$$ 208 -134 70 -344 -116 -4 -179 -143 34 -230 -21 -14 -50 80 62 -199 -234 -205 -158 100 93 -162 138 -68
5103f8J3J59pk74Q5Q5j76j88L65j87K70k05N0K69k41J8Q8j53j4L38m64N6M2P6
$$ -68 -55 104 97 -177 -92 -7 -183 -371 -6 -193 77 -128 -78 191 -50 -32 56 -97 -111 227 -237 -181 -139 -63
5127f3J90j94o5K63j05K2q7p3J85j79k93M34k94J10L88k68J81l7j47k16J12K9
$$ -63 127 -67 -132 131 26 48 -39 -112 73 -106 -399 35 -259 -149 239 -29 152 115 -32 -248 -136 -107
5149a07j26J85M6m0M4O7p2j34P7P2K7j09l6J53J07l66J18r7K94N9k85j3j02J77
$$ -107 -233 -48 -2 -42 2 69 -3 -137 -60 12 39 -70 -106 47 154 -212 -94 -191 103 162 -123 -136 -238 -61
5173f1j4nk9J46J2M8K0K04k45l84L95k13J78k11J41J8j41N07m36k68O96m48L61
$$ -61 -75 -80 -109 37 49 97 117 321 76 -308 87 -126 52 -159 -18 0 -141 366 -70 -338 358 -90 271
5196B71m51K14R6l4j40L42k17l52K79qN2k09L99l78j6J00pk8J36j02k48K20m8
$$ 271 -180 34 130 96 -44 298 81 -271 8 0 52 -157 242 -136 -152 -52 -59 -87 49 -53 -301 -81 -129
5219a29K31kk73J52p8R5O3Q0J43l52l6K20n87L87M3PP9M5k98J83K09l92n0J70
$$ -129 102 100 -173 -21 -99 -4 59 139 282 -70 -106 114 -473 -86 -43 -36 43 88 -210 -27 182 -210 -260 -90
5243i0q3L53o58J73K67r2J85J83k65l6J91j92m1N6J37j21L40l21K75m91L68l63
$$ -90 -173 180 -478 -305 -38 -130 55 238 -27 -63 128 -64 -105 -49 88 -33 307 -14 261 -230 138 -225
5265b25L39j78k38L13P2j75j77L44L7j42R0o5r6J30Ok55J68K80j42j8O7j78rJ5
$$ -225 114 -64 -302 11 83 -92 -269 75 112 -30 60 -5 -101 29 35 -220 -52 228 86 68 135 -43 -52 -37
5289c7J62n9k09O9J14n6k16L92m96K09K0L71k39k9J31k74K69j61K9Om3J42j43
$$ -37 125 66 -143 -74 40 -16 -232 160 -336 -127 -107 264 25 -4 127 -147 122 -39 -10 -4 -47 95 -48
5312d8n3J0K78j76k12K01J0l2n1L90k09j58M16j21k1q5O3k94L80l02J91k82O4
$$ -48 -101 -91 187 11 -201 0 10 -22 -73 317 108 -50 366 245 224 139 202 -92 288 -14 177 -105 -41
5335d1k97K10L26k06o6q0J08L10m5l00Q0o4J04L71q78M87J86m07J26J23J99K0
$$ -41 -338 -128 198 -8 -74 -154 -46 264 219 -81 -1 -65 39 410 -468 19 205 -202 -76 47 246 266
5357B66l14p2J39J67K8m13K6K15J57j73J90k09P8P3m6k41k2K25j17J08r5P7o7
$$ 266 -48 -120 19 186 214 -199 -173 42 199 26 216 7 85 158 112 -129 -151 74 -43 65 -30 47 -20
5380b0O5k13M67k65k85K24PM2Q7Pn55M59j31j9K53m83M88m54M41l5N8j35K35J6
$$ -20 45 -168 299 34 -251 -27 -20 22 109 116 -439 20 -111 -130 123 -360 128 -326 115 80 138 3 238 254
5404B54k65Q6k36K98p6L12n91J02k14J34K46k60N08k58J6J47J03m18P1J63j65
$$ 254 -11 75 -161 137 61 373 -218 -116 -330 -196 50 -210 298 40 56 203 306 -112 -41 122 -43
5425d3O0j03K98j28K6m73P7R9N18j48j89m7K27R7o06J36n8N36J9l99J52J02o4
$$ -43 17 -86 212 84 110 -363 -286 -187 331 183 -6 -53 174 271 -335 -199 -257 279 298 -101 51 153 89
5448H9J98l36j82J97l2p9K63k85J62l5r6J05K86l46O5j38J32K26l61K95l47LM39
$$ 89 287 -49 -231 -34 -66 -145 118 -167 -5 -40 -136 -31 255 -91 -26 -164 -32 194 -167 128 -219 -216 223
5471B23l31K24R3j12j8l75K88L1k28K02j20J12L0j44m13N49j28J80J38j58l08
$$ 223 -108 116 209 97 79 -296 -8 23 -205 -3 -123 -11 19 -125 -538 11 -117 63 201 43 -265
5492b65N15l7k35K49k07R9n6K1K05m27P0J98P7l32j36Q6P0MJ71k1j81K09m73N30
$$ -265 250 213 -22 227 20 119 63 84 289 -138 -68 130 207 -125 -261 -175 -105 -101 70 49 -132 77 -396 134
5516A34j12N5n0j43j02L89j80L0J32j57J5j28R5j30K41k54L21P9r8l03L18r8l13
$$ 134 22 77 27 -116 -218 171 -9 21 153 -4 11 -117 -22 -152 89 -165 156 235 137 -166 152 54 -259
5539b59O04l50k7o3k4P0K19J06n1l31J52j28J67J29k86Q0l27K28M3M01l14km13
$$ -259 345 -5 -32 -95 -119 -49 170 276 225 -106 46 -82 85 214 -72 8 -319 -91 -48 353 39 37 -376
5562c76L32J74k38J50k81J19L01K7l30K39k36J79P2j13o2J0j80p2N40n07K90%
$$ -376 -44 130 -108 42 -239 -120 181 208 -122 117 -119 60 132 19 -43 -33 -213 -285 255 -252 38 38
5584C8J6j12Q2l21M85r1l25M24k27K2J39k05R0j82P2q0K11R7k36J08jM0o2r3L66
$$ 38 54 -58 24 -297 188 97 -228 196 -31 -9 130 -75 15 -167 -95 -175 36 133 -103 5 4 44 -18 -111 255
5609B55Jl00J55K28m90J99q1PN4j62L35J05k35k08j15J93k55J92K29J14p0k27
$$ 255 256 -44 111 339 -151 48 -33 -26 28 -134 201 306 71 -137 -252 -59 -314 -122 107 221 151 -76
5631g6J15j16O0K49j44J41l37p2n9R9n5K68J80j27K09j32j85k76L75j80L29j58
$$ -76 39 -77 -17 232 88 229 -108 -180 -239 -140 -195 73 253 126 335 203 18 -258 117 -63 266 108
5653A08k26K11j88N4k56J38r0O4J21J38J7j45J70o3l53N44j77jj48N5l9q7L83
$$ 108 -118 93 -95 -41 -297 -159 -249 -185 -64 74 91 -54 116 53 -300 244 67 66 -82 -27 -66 -153 230
5676B30k46J60j2j59J67m02M85k25j66J64K36l82J88j36R6K01k93O8r0J76m2k83
$$ 230 -16 144 132 -27 140 -262 223 -2 -168 -4 232 -150 38 -98 -2 199 -94 -26 -116 60 18 -265
5698b65K63N1k01J45K8l3L9j75n5M4K07J32j80P0j20j97K89l84M43R1j49J66p3
$$ -265 -2 49 -152 -7 21 -12 27 -148 -203 -159 48 180 0 70 -50 -247 42 -342 101 192 43 209 136
5721A36j43O8j34M51m51m9KM5q0k18J45K02L21m04K93o7l19L14l66K88J43k63
$$ 136 -7 61 -73 378 -73 -122 -120 -75 -155 -373 -228 -26 295 -109 184 117 -202 112 -254 34 177 -86
5743h6j98K43M38j4l47K27K2p3k32M2k44K92j06j86M37M5k64K7j64P2k14K99m6
$$ -86 -284 -41 397 383 36 263 285 212 -20 22 -222 70 -36 -222 215 260 -4 23 -141 -69 -283 16 -30
5766c0mM0J26j15K19k10m24K09p9K69r2j51N49j53k95q7K45M4l48L40l84K06L28
$$ -30 -34 6 132 17 236 26 -398 -189 -268 1 -91 -242 307 154 -141 -228 17 61 -287 53 -331 -125 203
5789B03m77K16J11m7Q7l21K31j12L59l57O2j5j23J99J18l4O3j54M3k24J61N0R8
$$ 203 -274 -58 53 6 93 -228 3 -109 250 -107 -45 -60 -183 16 134 100 163 9 52 -172 -11 39 137
5812A37L31k99j02o3K50M5k10J88k54j21N3L13j95Ln5J79Nk09L8K80k28j61J97
$$ 137 468 169 67 4 254 299 89 277 23 -98 -45 268 73 76 21 200 205 -4 34 314 86 -75 122
5835A22k44L26m56K70L01q48L66o6N9K88j62j17K22r6L5J57l46O0R2N7j9M9j11
$$ 122 -122 204 -252 18 319 -529 -163 -229 -170 118 -44 -161 61 -35 0 157 -189 -129 -37 20 1 50 -61
5858f1l2r3K48nk18K21J5M7l73p7L88j93J51n7N09n20k36M75P6k03l3K3L5ml63
$$ -61 -93 -186 62 57 -161 60 75 122 -251 -328 60 -133 18 -39 470 -50 -286 189 265 62 29 52 87 83 -280
5883b80L07m3k95J87K76k01P0J36RN2k00L08m04R4k75J74j91K60K1R7l3q7p7J96
$$ -280 27 -16 -311 -124 152 -49 21 157 166 218 18 326 -78 16 -259 -85 -276 -16 5 102 69 -18 -95 101
5907A01k50R6J74J98m53K16j76Jl6J37j65M2K47k05j41L49j30j9j27Q4j18L40
$$ 101 -149 -53 121 319 -134 82 -94 -93 -129 8 -157 -115 132 -73 -214 135 5 -14 -141 -57 -175 165
5929A65Q8o24L96k08L45l05L32j27J62j67oJ41m3k44j24M62k11k0k26J20q2j07
$$ 165 253 -371 25 -183 162 -143 189 62 224 57 51 192 149 -95 -219 243 32 12 -214 -94 -176 -283
5951b83M12q2j86L90m16K9J74M9k33p5J64J7q3Q6O0J76l98R3K39J97k08l69O18
$$ -283 129 47 -139 251 -165 -136 38 87 -146 -221 -57 -40 -123 -37 23 199 -199 -106 133 330 122 -247 371
5974C71m53M9k30L74l24K27n6K39j69K2j52J51J82k28J25j95J41J71l79J51k93
$$ 371 -82 -33 -263 111 -213 14 -42 197 28 50 -102 49 231 3 128 -67 74 245 -134 17 -276
5995b76K53J4J06rL4K26j80j65j88l4qK73L2j23J61M8l26k69M16q7O0j86K22P8
$$ -276 -23 -9 97 88 122 348 168 3 -185 -219 -227 46 78 -45 116 164 -162 -431 -15 -102 -42 -228 -6 72
6019G2J9k36r6L28j36k9j20q9R4K42J21L0j00k38M3J99j57Q3j72P8J57q2Q1M4
$$ 72 91 -145 -241 87 -49 -78 -198 -287 -193 49 170 200 100 -138 -95 104 -53 30 -142 -64 93 11 92 136
6043A36l61K38P2Mk36p8q6J24K96j82R0o6J25J46j24j74l2J6J65L1q9j99L35k57
$$ 136 -225 13 85 89 -147 -225 -311 -187 109 -73 17 -49 76 222 98 -76 -108 -92 73 104 15 -184 151 -106
6067a06J23K13l06P0J1p7n8J55p5o9P0q1P9K00j70j33k2L10j9j42J97K4m13J03
$$ -106 17 230 -76 -6 5 -72 -130 25 -50 -119 -49 -130 -51 149 -21 -154 -176 134 115 -27 170 194 -219 -116
6091a16j04L95l02J58k42J79Q5L5P9j62L2k85K36K69l37M39m12K96m41K98p5Q9
$$ -116 -220 175 -127 31 -211 -32 53 88 167 5 37 -248 -12 257 -80 359 -53 243 -198 100 25 114
6113A14q6k54L03J7L7K2k84l3J92L3mo7l1j67K92M6j38Qk8P4p8k5M19l56K09l41
$$ 114 28 -226 77 94 131 153 -131 -164 28 61 57 -10 -41 -208 84 130 -8 0 -28 46 -32 -57 362 6 215 -126
6139a26K14l76K28J36l71L85J00K8l65K75k05J67J45k50L3p3L3K70k54m1J81l64
$$ -126 88 -288 -60 76 -295 90 190 218 -147 128 -77 90 235 -15 18 -55 -22 248 -6 -47 134 -230
6161b30L78l59M65j27j79K12k79J57n5J01L46k84j38N7k19J95q7r0J82J29j75
$$ -230 148 -211 254 127 -52 160 -119 38 -17 84 430 146 8 65 -154 41 -46 -136 46 175 0
6182@J07j51j40J40L27j32j50k9Q9L0q6k31K91J37k87K80k14j09n6N05l98k20
$$ 0 107 -44 -184 -44 283 151 1 -28 61 91 5 -226 65 202 -85 195 -19 -128 -184 321 -77 -297
6204b97K00J58J3k2Q2j55N1O7j01j70L26P0m12P0K75J61j14j2k61j07R9K70m14
$$ -297 -97 61 74 52 134 -21 30 97 -4 -174 152 222 -190 -120 155 316 202 190 -71 -178 -79 191 -223
6227b23M16l6l13K39j51J61r7l3l1J71k29m8J38L41j10k21k9N56k94k71J82l93
$$ -223 193 157 -156 83 -68 93 -4 -37 -68 103 -126 -174 -36 305 195 -26 -55 501 207 -64 118 -275
6249b75M40J30m30P9P3j38L02k65K35k3J44l86M58j97j09r3L13k08j34n3L97k04
$$ -275 165 295 -135 -56 17 -121 181 -84 151 128 272 -114 344 147 38 -55 258 50 -84 -137 260 56
6271E6m1RJ7K67k72J35k89J25j3j89K60j03M50k57P1l98j5J99l3q4K01M5j03p1
$$ 56 15 24 41 308 36 171 -118 7 -6 -195 65 -38 412 155 226 -172 -187 12 -21 -105 96 141 38 -33
$$ [...]
8191a39
##END NTUPLES=NMR FID
##END=
