##TITLE=1H_DE-27_oil2
 D2O
 8 sc, 
 9.10.2024
##JCAMPDX= 6.0         $$ Bruker NMR JCAMP-DX V2.0
##DATA TYPE= NMR FID
##DATA CLASS= NTUPLES
##ORIGIN= UXNMR, Bruker Analytische Messtechnik GmbH
##OWNER= root
$$ XWIN-NMR		Version 3.5
$$ Wed Oct  9 14:29:25 2024 Russian Standard Time (UT+4h)  she@DPX200
##.OBSERVE FREQUENCY= 200.1318
##.OBSERVE NUCLEUS= ^1H
##.DELAY= (6, 6)
##.ACQUISITION MODE= SIMULTANEOUS
##.ACQUISITION SCHEME= undefined
##.AVERAGES= 8
##.DIGITISER RES= 18
##SPECTROMETER/DATA SYSTEM= spect
##.PULSE SEQUENCE= zg30
##.SOLVENT NAME= D2O
##.SHIFT REFERENCE= (INTERNAL, D2O, 0, 15.7039)
##AUDIT TRAIL= $$ (NUMBER, WHEN, WHO, WHERE, WHAT)
$$ ##TITLE= Audit trail, XWIN-NMR		Version 3.5
$$ ##JCAMPDX= 5.01
$$ ##ORIGIN= Bruker BioSpin GmbH
$$ ##OWNER= she
$$ F:/spectra/data/she/nmr/H-F/1/audita.txt
$$ ##AUDIT TRAIL=  $$ (NUMBER, WHEN, WHO, WHERE, WHAT)
(   1,<2024-10-09 14:28:26.10 +0400>,<she>,<DPX200>,
      <created by zg, POWCHK disabled, PULCHK disabled
       configuration hash MD5:
       00 E9 B6 7A A2 85 ED C7 34 08 36 98 17 FE 4E 26
       data hash MD5: 16K
       49 0F 0F 46 44 E3 8A 60 81 EF 64 9D D8 EE CD F2>)
$$ ##END=
$$ 
$$ hash MD5
$$ B4 D5 CB F4 50 82 6D 05 F5 FC BF DE 49 3E 80 6B
##$RELAX= 
##$RELAX= 
##$RELAX= 
##$RELAX= 
##$RELAX= 
##$RELAX= 
$$ Bruker specific parameters
$$ --------------------------
##$DU= <F:/spectra>
##$EXPNO= 1
##$NAME= <H-F>
##$PROCNO= 1
##$TYPE= <nmr>
##$USER= <she>
##$AMP= (0..31)
100 100 100 100 100 100 100 100 100 100 100 100 100 100 100 100 100 100 
100 100 100 100 100 100 100 100 100 100 100 100 100 100 
##$AQSEQ= 0
##$AQ_mod= 1
##$AUNM= <au_zg>
##$AUTOPOS= <>
##$BF1= 200.13
##$BF2= 200.13
##$BF3= 200.13
##$BF4= 200.13
##$BF5= 200.13
##$BF6= 200.13
##$BF7= 200.13
##$BF8= 200.13
##$BYTORDA= 1
##$CFDGTYP= 0
##$CFRGTYP= 5
##$CHEMSTR= <none>
##$CNST= (0..31)
1 1 145 1 1 1 1 1 1 1 1 1 1 1 1 1 1 1 1 1 1 1 1 1 1 1 1 1 1 1 1 1 
##$CPDPRG= <>
##$CPDPRG1= <>
##$CPDPRG2= <>
##$CPDPRG3= <>
##$CPDPRG4= <mlev>
##$CPDPRG5= <mlev>
##$CPDPRG6= <mlev>
##$CPDPRG7= <mlev>
##$CPDPRG8= <mlev>
##$CPDPRGB= <>
##$CPDPRGT= <>
##$D= (0..31)
0 1.2 0 0 0 0 0 0 0 0.06 0 0.03 0 0 0 0 0.0002 0 0 0 0 0 0 0 0 0 0 0 0 
0 0 0 
##$DATE= 1728469705
##$DBL= (0..7)
120 120 120 120 120 120 120 120 
##$DBP= (0..7)
150 150 150 150 150 150 150 150 
##$DBP07= 0
##$DBPNAM0= <>
##$DBPNAM1= <>
##$DBPNAM2= <>
##$DBPNAM3= <>
##$DBPNAM4= <>
##$DBPNAM5= <>
##$DBPNAM6= <>
##$DBPNAM7= <>
##$DBPOAL= (0..7)
0.5 0.5 0.5 0.5 0.5 0.5 0.5 0.5 
##$DBPOFFS= (0..7)
0 0 0 0 0 0 0 0 
##$DE= 6
##$DECBNUC= <off>
##$DECIM= 24
##$DECNUC= <off>
##$DECSTAT= 4
##$DIGMOD= 1
##$DIGTYP= 9
##$DL= (0..7)
0 120 120 120 120 120 120 120 
##$DP= (0..7)
150 150 150 150 150 150 150 150 
##$DP07= 0
##$DPNAME0= <>
##$DPNAME1= <>
##$DPNAME2= <>
##$DPNAME3= <>
##$DPNAME4= <>
##$DPNAME5= <>
##$DPNAME6= <>
##$DPNAME7= <>
##$DPOAL= (0..7)
0.5 0.5 0.5 0.5 0.5 0.5 0.5 0.5 
##$DPOFFS= (0..7)
0 0 0 0 0 0 0 0 
##$DQDMODE= 0
##$DR= 18
##$DS= 0
##$DSLIST= <SSSSSSSSSSSSSSS>
##$DSPFIRM= 0
$$ [...]
##$SUBNAM2= <"">
##$SUBNAM3= <"">
##$SUBNAM4= <"">
##$SUBNAM5= <"">
##$SUBNAM6= <"">
##$SUBNAM7= <"">
##$SUBNAM8= <"">
##$SUBNAM9= <"">
##$SW= 24.0689170037331
##$SWIBOX= (0..15)
0 0 2 0 0 0 0 0 0 0 0 0 0 0 0 0 
##$SW_h= 4816.95568400771
##$TD= 16384
##$TD0= 1
##$TE= 0
##$TE2= 300
##$TE3= 300
##$TEG= 300
##$TL= (0..7)
0 120 120 120 120 120 120 120 
##$TP= (0..7)
150 150 150 150 150 150 150 150 
##$TP07= 0
##$TPNAME0= <>
##$TPNAME1= <>
##$TPNAME2= <>
##$TPNAME3= <>
##$TPNAME4= <>
##$TPNAME5= <>
##$TPNAME6= <>
##$TPNAME7= <>
##$TPOAL= (0..7)
0.5 0.5 0.5 0.5 0.5 0.5 0.5 0.5 
##$TPOFFS= (0..7)
0 0 0 0 0 0 0 0 
##$TUNHIN= 0
##$TUNHOUT= 0
##$TUNXOUT= 0
##$USERA1= <user>
##$USERA2= <user>
##$USERA3= <user>
##$USERA4= <user>
##$USERA5= <user>
##$V9= 5
##$VALIST= <valist>
##$VCLIST= <CCCCCCCCCCCCCCC>
##$VD= 0
##$VDLIST= <DDDDDDDDDDDDDDD>
##$VPLIST= <PPPPPPPPPPPPPPP>
##$VTLIST= <TTTTTTTTTTTTTTT>
##$WBST= 1024
##$WBSW= 4
##$XGAIN= (0..3)
0 0 0 0 
##$XL= 0
##$YL= 0
##$YMAX_a= 537301
##$YMIN_a= -338096
##$ZGOPTNS= <>
##$ZL1= 120
##$ZL2= 120
##$ZL3= 120
##$ZL4= 120
##$ABSF1= 10
##$ABSF2= 0
##$ABSG= 5
##$ABSL= 3
##$ALPHA= 0
##$AQORDER= 0
##$ASSFAC= 0
##$ASSFACI= 0
##$ASSFACX= 0
##$ASSWID= 0
##$AUNMP= <proc_1d>
##$AZFE= 0.1
##$AZFW= 0.1
##$BCFW= 1
##$BC_mod= 2
##$BYTORDP= 1
##$COROFFS= 0
##$CY= 11.3945322036743
##$DATMOD= 1
##$DC= 2
##$DFILT= <>
##$DTYPP= 0
##$F1P= 15.6554695791079
##$F2P= 12.8336369535428
##$FCOR= 0.5
##$FTSIZE= 0
##$FT_mod= 4
##$GAMMA= 1
##$GB= 0.15
##$INTBC= 1
##$INTSCL= 1
##$ISEN= 128
##$LB= 0.24
##$LEV0= 0
##$LPBIN= 0
##$MAXI= 10000
##$MC2= 0
##$MEAN= 0
##$ME_mod= 0
##$MI= 1.114404
##$NCOEF= 0
##$NC_proc= 0
##$NLEV= 6
##$NOISF1= 3.799351
##$NOISF2= 2.8
##$NSP= 1
##$NTH_PI= 0
##$NZP= 0
##$OFFSET= 15.70392
##$PC= 1
##$PHC0= -26369.5
##$PHC1= 42.98743
##$PH_mod= 1
##$PKNL= yes
##$PPARMOD= 0
##$PSCAL= 0
##$PSIGN= 0
##$REVERSE= no
##$SF= 200.130013532006
##$SI= 16384
##$SIGF1= 3
##$SIGF2= 2
##$SINO= 400
##$SIOLD= 16384
##$SREGLST= <1H.CDCl3>
##$SSB= 0
##$STSI= 0
##$STSR= 0
##$SW_p= 3612.71676300578
##$SYMM= 0
##$S_DEV= 0
##$TDeff= 0
##$TDoff= 0
##$TI= <>
##$TILT= no
##$TM1= 0
##$TM2= 0
##$TOPLEV= 0
##$USERP1= <user>
##$USERP2= <user>
##$USERP3= <user>
##$USERP4= <user>
##$USERP5= <user>
##$WDW= 1
##$XDIM= 8192
##$YMAX_p= 0
##$YMIN_p= 0
$$ End of Bruker specific parameters
$$ ---------------------------------
##NTUPLES= NMR FID
##VAR_NAME=  TIME,          FID/REAL,        FID/IMAG
##SYMBOL=    X,             R,               I
##VAR_TYPE=  INDEPENDENT,   DEPENDENT,       DEPENDENT
##VAR_FORM=  AFFN,          ASDF,            ASDF
##VAR_DIM=   8192,          8192,            8192
##UNITS=     SECONDS,       ARBITRARY UNITS, ARBITRARY UNITS
##FACTOR=    0.0002076,     1,               1
##FIRST=     0,             0,               0
##LAST=      1.7004516,     0,               0
##MIN=       0,             -338096,         0
##MAX=       1.7004516,     537301,          0
$$ Real data points
##PAGE= N=1
##DATA TABLE= (X++(R..R)), XYDATA
$$ [...]
1958b3oj04M45l50nJ5j8r1l9m00M14M64J07j12l14j35K86K7j17L9m04L52q7n0
1982a06JM0r6m0K82j4q6Mm1M9j24J02K23N9o55N59m7l32J3K7L76k20k1K26l53
2007a74J2J81O9J81l91J18m42Q51k49k12m23J89L81J03j84p8r6J22L4R3r0m3J12
2030F4L3J82n53Q8M54k19or0K5K47k46j11L55k51P1p7j06O0P1j86j3J83K69l06
2054f2Q9O1j01j07K54k1K78m72k07N83n75L13J70k36k16L19m2l18L49J61k02n1
2076c3n3L42Q1k44j98P4J33l51K12j32M67l76j11P4R0Q7N2l21J77K04j11n9L9
2099D3j37J90k0p5O4k62n0L38l6J45k56K18j89J37R0l20L7M9J1p3K23J74k91J91
2123B01Jm89pL56l2j15L85l50j44j02N5K65n4N8kR9k2q3o9O7j14M13k39m8K17
$$ plain form
1958 -23 -29 -133 312 -38 -43 -28 -46 -137 -176 -576 -162 302 409 297 -17 -152 134 161 44 83 -321 31 -56 -106
1982 -106 -105 -65 -161 -201 81 67 -19 -15 -56 -7 -131 -29 194 253 -402 157 110 -222 -209 -182 194 -26 -47 179 -174
2007 -174 -162 19 88 269 -122 -4 -446 405 156 -56 -479 -290 91 194 10 -68 -164 -42 -8 85 -5 -48 64
2030 64 97 279 -274 -186 268 49 43 -47 -22 225 -21 -132 223 -28 43 -34 -140 -80 -9 -195 -208 -25 244 -62
2054 -62 27 88 -13 -120 134 113 391 -81 -288 295 -280 33 203 -33 -249 70 28 -290 59 220 18 -33
2076 -33 -86 256 337 93 -105 -31 102 -249 -37 -169 298 -78 -189 -115 -25 62 114 -207 -30 174 63 4 43
2099 43 -94 96 76 1 65 -197 -247 91 55 200 -56 162 -27 110 200 -120 -83 -34 -23 -96 127 301 10 201
2123 201 202 -287 -294 62 30 -85 300 -50 -194 -296 -241 24 -30 28 26 125 103 20 -49 18 -96 317 78 30 247
2148B47l00q8K9J70Q1k79J70j05J25K93m0m9m13J93Q5j99K34O0k69K89j84l84
2170c34M22m4J82j77K1K5J32k96J02p4p5K34k2j94J04R3n2l4k8J16j26Q9%J54
2194B18j60l7j8J08p7K14l00P6M44m94R5K65m34L3r0K22l1J27o5J11k81J7K13
2217A56m32O13m30K41Q6ll66L19r1O7m6l63K75l86N42m55M34L9j47m44L49K21
2239A79j56MR6m5m34K93M5qJ35j09L1j28K96j68O7j40n45K95L55j32m9J24K4J10
2263A40j56K83l13J14k26J00N5m2j19J58q4P7o5N9K18j35j30k07J41Q5j27K33
2285E9k62M84l27j41J01j54M85j49J06j66r8J24k69L63l46L9J15j74K83k8K46
2306B91j74j72L32m28k26P26l11l5l37L23J81N3j25k77J46l6K30j87j79L65k12
$$ plain form
2148 247 -53 -141 -112 58 139 -140 30 -75 50 343 303 254 -159 34 119 -80 154 214 -55 234 50 -334
2170 -334 88 44 226 49 70 95 227 -69 33 -41 -116 118 96 -98 6 99 47 13 -15 101 -25 64 64 218
2194 218 58 21 3 111 34 248 -52 24 468 -26 69 334 -100 -67 -157 65 34 161 96 207 -74 -57 156
2217 156 -276 337 -93 148 234 231 -135 184 93 160 114 -249 26 -360 182 -273 161 200 53 -391 -42 179
2239 179 23 27 123 78 -356 -63 -18 -26 109 0 31 -97 199 31 98 -42 -587 -292 63 -69 -118 6 30 140
2263 140 -16 267 -46 68 -158 -58 -3 -45 -164 -6 -90 -13 -78 -19 199 64 -66 -273 -132 -47 -174 59
2285 59 -203 281 -46 -187 -86 -240 245 96 202 36 -62 62 -207 156 -190 -151 -36 -210 73 45 291
2306 291 117 -55 277 -151 -377 349 38 3 -334 -11 170 223 98 -179 -33 -69 161 -26 -205 160 -52
2327e2K99k75J30j60n8k5J32j26J76o7r9N0O6J26p8J65j63j50j99J89j02J60K84
2350B23j70K50P6k44k43L65o5k36J93r1k35J20p0J96K3K0M6l83L22J04m26K75
2372E0J10k36K28k17J54J5j97K92l84J45L91m43J62rj54K93o31O16j68J9j23k48
2394c35K92k89O75j25j27K46k31J60j82N0K26m06L96k37j94J39J09k6j85k17J84
2415g7J21q6j33O5n7J72j14K58k59K15L8j62o5l6R7P3j93K89K7m97L29K89q1k88
2439g5m4K18q0M7o3J51k47K74k17j2L98l04m55O7L02j23L13l17L41m0j88K61o5
2462A42j67j65M74l50J08R4l16J92j71K14Q5j20J28j38J70Q9l53j68L26l1l38
2483b95K85j73l8K07n7o4P5mk73N44m26j13K01O7K00m37K48R6k09K82j25M4m68
$$ plain form
2327 -52 247 -28 102 -58 -116 -141 -9 -135 41 -26 -125 -75 -9 117 39 204 41 -109 -308 -119 -221 -61 223
2350 223 53 303 379 135 -108 257 192 -44 149 58 -177 -57 -127 69 92 112 158 -225 97 201 -225 50
2372 50 160 -76 152 -65 89 104 -93 199 -185 -40 351 -92 70 61 -93 200 -431 185 17 36 -87 -335
2394 -335 -43 -332 343 218 91 337 106 266 84 134 360 -46 350 113 -81 58 167 141 -44 -261 -77
2415 -77 44 -42 -175 -110 -167 5 -109 149 -110 105 143 -19 -84 -120 -23 50 -143 146 173 -324 5 294 213 -75
2439 -75 -119 99 19 66 3 154 -93 181 -36 -48 350 46 -409 -342 -40 -163 150 -167 174 134 -54 207 142
2462 142 -25 -190 284 -66 42 136 -180 12 -159 55 140 20 148 10 180 269 -84 -252 74 43 -295
2483 -295 -10 -183 -221 -14 -71 -135 -60 -64 -337 207 -219 -332 -131 -64 136 -301 -53 43 -166 116 -9 35 -433
2506d33M10lK45n3r8Pq0k16M01j47j78rJ63N1j3j51P9J24q8N5J86j75M5rk62k6
2532a75J21O5j47K92J07r4j6j95P0j7L76m54R4j1k32L8K54P9o2l00K94M7j41J07
2556A00n6P2k97M49R8m35M4r8M6K58k97p3L43k0l88N07j98mR6o9Pk50N49o36K74
2581B2J11j3k07K90l00p7L02N0k11j79r3L61N7k80j1L43k51L32m51j49L71L32
2603C49j66j05O0k01J75k39n4L77k80K54j52l2L3j47P0j06J51K2J13j08L18l05
2625B7L65k75k12M04l82R3P0l8M6P8l23J83j94J09J38k45L97l21r0N2J14K0J24
2648A40l70L38k71J84J2l6j9K56l26j53N07j54k0l9J98j68P6m24N9K32N1j26O9
2671A6O1j35R1j2L42k46J26l86L19r0j33R0Q2k44M20m28Q6M9q1j59K67j28j34
$$ plain form
2506 -433 -23 -26 219 166 68 75 -5 -221 180 33 -145 -154 9 60 47 -104 -25 99 11 66 252 77 122 113 -149 -175
2532 -175 -54 11 -136 156 263 169 153 -42 28 11 387 -67 27 16 -216 -178 76 155 93 -207 87 134 -7 100
2556 100 44 116 -181 268 366 -69 -25 -123 -77 181 -116 -189 154 134 -254 253 55 51 147 78 85 -165 384 -252 22
2581 22 133 120 -87 203 -97 -174 128 178 -33 -212 -305 56 113 -167 -178 165 -86 246 -205 -354 17 349
2603 349 183 78 138 -63 112 -127 -181 196 -84 170 18 -14 19 -128 -58 -164 -13 9 122 14 332 27
2625 27 392 117 -95 309 -73 20 90 52 98 176 -147 36 -158 -49 89 -156 241 -80 -170 -118 -4 16 140
2648 140 -230 108 -163 21 33 -3 -22 234 -92 -245 262 108 88 49 247 79 155 -269 -210 22 73 -53 16
2671 16 77 -58 33 21 363 117 243 -143 176 86 -47 43 125 -119 301 -127 -41 8 -73 -232 35 -93 -227
2694b27M99k67j88L70k51j2o6Q5P3o6J06o7j10j06J91p9O8J27k11J87p4q4J26
2717B4k52J80M7q1J73m8k10M36k15J04J2l2j45J58rK5j35J01k07k3J52j0J45m15
2741b25J4M92n16L77l13P8L12o2k33J17J73J13m53K39O1j33J94j93j33R5p8j19
2763a93M28j64k98K33m0M9J7j82J08J79Nk74K85M8j71J22l4J2k34k41N26l00j09
2786b28J45M6J54J44l57j03R3J47r4L57l78j66J12L38j81J63j17K2p4l65N35k49
2808e6M9J98q7K43k73J53k73N0L84k04m09J62J85k91L4J66qp5J62l04Q8K08k86
2831a84MLL31k68J67L3L8k83Q3J47L4q8K90l32RJ2Lr3L80l44K94J6j19J4l67M25
2857B05l77J50J44k35n6K14j24K48K2O1m09O2J73nR7n2k57Q5J98k91K21O6j04
$$ plain form
2694 -227 272 5 -183 187 -64 -76 -142 -57 16 -50 56 -11 -121 -227 -36 -115 -47 80 -131 56 -18 -102 24
2717 24 -228 -48 -1 -82 91 43 -167 269 54 158 170 138 -7 151 142 167 32 133 -74 -97 55 45 190 -225
2741 -225 -211 281 -235 142 -171 -93 219 157 -76 41 214 327 -126 113 174 41 235 42 -91 4 -74 -193
2763 -193 235 71 -227 6 -34 15 32 -150 -42 137 142 -132 153 201 30 152 118 130 -104 -345 181 -119 -228
2786 -228 -83 -37 117 261 -96 -199 -106 41 -53 304 -74 -240 -128 210 29 192 75 97 23 -342 193 -56
2808 -56 -7 191 104 347 74 227 -46 4 388 184 -225 -63 122 -169 -135 31 23 -52 110 -194 -106 102 -184
2831 -184 -180 -177 154 -114 53 86 124 -159 -76 71 105 17 307 -25 -16 -4 -1 -94 286 -58 236 252 133 147 -220 205
2857 205 -172 -22 122 -113 -169 45 -79 169 191 252 -157 -95 78 73 170 118 -139 -54 144 -147 74 140 36
2880C6k29L65l9J65k42j57K62l6j65J11m10L46k0Oj07J01J59J58m2k82R0j39O0
2903il4k6lR4J58k37j94J36j65K93R2k22L79k93OJ63j74L6J95k83l00N17r4K07
2927B42k89j18L42k67o8J71j00Q5P0m8K32j89k0m16P03m26K01j8m2PM0k98J06
2950a00K03k42R8J17l18L96l41oK47j4K3J8J35l58K66j29O4j99R4o6p6L87j27
2973G2j63L3K14N4k30k5L12L4k98PN3l7J94j75j45M02k79j6m5J46m10K62Q9r2
2997d3R5N9n4j63L48j43J9L2k1J49j85k03L78m06J24k86P6J09L02j47j24R2k5
3020a7M9O4j70J10J73j65j86L07k86K1K65j13P4Kl8l63K51k28O5J37L50l18r1
3043a07Lr2M07j24m2L17m18k7L90N3r7k29J08k29J25Ol65L90j09K84k16j4J1J57
$$ plain form
2880 36 -193 172 133 298 56 -101 161 125 -40 71 -339 7 -13 -7 -114 -13 146 304 262 -20 70 -69 -9
2903 -9 -43 -69 -72 22 180 -57 -251 -115 -280 13 105 -117 262 -31 -25 138 -36 0 195 -88 -388 129 35 242
2927 242 -47 -165 177 -90 -158 13 -87 -2 68 20 252 63 43 -373 330 -96 105 87 45 52 92 -206 -100
2950 -100 103 -139 -41 76 -242 154 -187 -193 54 40 63 81 216 -142 124 -5 59 -140 -46 -112 -188 199 72
2973 72 -91 -58 156 210 -20 -45 267 301 3 10 63 26 220 45 -100 302 23 7 -38 108 -302 -40 49 -43
2997 -43 52 111 57 -106 242 99 118 150 129 278 93 -110 268 -138 -14 -300 -224 -115 187 40 -84 8 -17
3020 -17 32 96 -74 36 209 44 -142 165 -121 -100 165 52 126 128 90 -273 -22 -250 -185 -48 302 -16 -107
3043 -107 -104 -196 211 87 45 362 -56 -83 307 360 263 34 142 -87 38 44 -321 69 -40 244 28 14 25 182
3067A82jk65m1K7N2J14j18l38J48K88j63J09Q6m25L33l23L24j8l21L11l46K96
3089h9P6K1r6N31m95J78L0l19J75K17k37j2K56l42j5P6K33m26L77k69rj20M12
3112A53j11J84r5j8P4R0l77L56l68o0j51M99J1l06J03K6N8K63n35K04J10J86l65
3135f9o4N60o83K05K41k99K20o7j30K66p05N88J7l4j22J36k8k03M49m70K27P7
3157A12k20p5M31q3KJ87l32Q7L3j15J01k57M20On08J04K14j42j85L46l69K06K24
3180A87K8j69o4J15K88j80J06m11O0K73p8M4j89r2n2N1K82k90J18j19L83m29J1
3203a27J43Q0r3J8%j44L12n7j16K55k17J23j1k6r1K2m51J78J37P5j33J7R7k79
3227b88M05j11N9k06M02m73L9J08J36J42j63K0K36n1k29qq6J16k43L28k38J84
$$ plain form
3067 182 181 -84 -125 -98 -46 68 -50 -388 -240 48 -115 -6 80 -345 -12 -335 -11 -29 -350 -39 -385 -89
3089 -89 -13 8 -88 443 -52 126 156 -163 12 229 -8 -20 236 -106 -121 -45 188 -238 139 -130 -139 -259 153
3112 153 42 226 131 113 187 277 -100 256 -112 -172 -323 176 187 -119 -16 10 68 331 -204 0 110 296 -69
3135 -69 -133 427 -256 -51 190 -109 111 44 -86 180 -525 63 80 46 -76 60 32 -171 278 -192 35 112
3157 112 -108 -183 248 165 167 354 22 109 142 27 128 -129 291 297 -211 -107 107 -35 -220 126 -243 -37 187
3180 187 215 46 -18 97 385 205 311 -100 -40 233 155 199 10 -82 -134 -83 199 -91 27 -92 291 -138 -127
3203 -127 16 96 3 21 21 -123 189 132 16 271 54 177 166 140 49 71 -380 -202 -65 10 -123 -106 -9 -288
3227 -288 117 6 65 -141 261 -212 -173 -65 71 213 50 70 306 255 26 18 -68 48 -195 133 -105 79
3249G9k69N10m14L7l2J78r1K32j67j9K35m06J16J10k2J41k03j61J94R6j17J0j40
3272a03pJ50J1J40j53k21o6K77j06n7J68O8R3j07P5j68K6j40j14J29J71q3J1j76
3296a82K46m49M89j41J79j80J70j44N3k1Q2q5m18M39L83k21k99q1N32o9n01N5
3318a63P2J04m6J00r2J54k07L5k9K3J22Qj51L66P3k74l24J03L74j28k58L49j37
3341G4M5K3n51M21lO4r2j54L0J97m79K77j6JK72k9r6K2o1k23M14M5l72M11J41
3366C61k04j96M9m8L9N2MJ92k45n8p1J63J8q2J7m8j55L94q3m1P2j07m4j4r4J46
3392A7J50j63J01l3l8L6n4j29L48k77r3J40%j19J58l55L07J53l34Q4P9J63j97
3415e6k54N39m69N7l91O12J05r8l28L29N1l09M74o18LL65J42k69J28j2k64L04
$$ plain form
3249 79 -190 320 -94 -57 -89 89 -2 230 63 44 279 -127 -11 99 77 218 15 -146 48 144 27 37 -103
3272 -103 -110 40 51 191 38 -183 -249 28 -78 -135 33 101 194 87 162 -6 20 -120 -234 -105 66 -17 -6 -182
3296 -182 64 -385 104 -37 142 -38 132 -12 41 20 102 17 -401 38 421 200 -99 -180 352 283 -218 -163
3318 -163 -91 13 -33 67 -25 129 -78 -43 -72 -49 73 81 -70 296 369 95 -229 -126 248 120 -138 211 74
3341 74 119 142 -409 12 9 73 -19 -173 -143 54 -425 -148 -164 -163 109 80 -16 6 -55 -278 136 181 -191 220 361
3366 361 157 -39 10 -38 1 53 57 249 4 -54 -125 38 56 -26 -9 -57 -212 182 99 58 130 23 -21 -35 -129 17
3392 17 167 4 105 72 34 70 16 -113 235 -42 -135 5 5 -114 44 -311 -4 149 -185 -101 -22 141 -56
3415 -56 -310 229 -240 -183 -574 38 143 45 -283 46 97 -212 262 -356 -353 12 154 -115 13 1 -263 41
3437D1k33K16r8J99k64J19N2J93l4j15j51J06j58l3Q1J01p6k2J03j99j77K44J52
3460D7l66M52L1K8Lm03L91l10J00O2Lk2K61l55J21J65r0k41J36o2L8L03l76R4
3484A0l3k60L38K3J08k94R5p8jJ96k09R0K31j30j10P9j87R3o0M6L10j97P6J24
3508B60k97j5K23j35r6j35P8J82j5j30J33K30k29K4o4j38L55j85po8r1J81q9N3
3532B5K96k46n1j05J29N5j0l40pK70K76l74R0O2K08p9l27K31k09N1J77k33L07
3555A96j52O9n0k65J14O5M9l01L78j06J32j93K57l32J44q5M3K0j52J45M30l62
3577D4k54J72K61k71k11J47k9L8J22L91k51j61p9L96l11M1k09L74j49k7L12j19
3599B27L5j20n3j84j13N49k68l30K42J9J50j03J91l90J9J86l64K15l7K33j50J03
$$ plain form
3437 41 -192 24 -74 125 -139 -20 32 225 191 76 -75 31 -127 -160 -79 22 -54 -76 27 -172 -349 -105 47
3460 47 -319 133 164 192 195 -208 183 -127 -27 35 38 16 277 -78 43 208 118 -123 13 -49 -11 292 -84 10
3484 10 -23 -283 55 78 186 -108 -13 -91 -92 104 -105 -15 216 86 -24 55 -132 -39 -99 -53 257 60 136 260
3508 260 -37 -52 171 36 -60 -195 -117 65 50 -80 53 283 54 78 14 -124 231 46 39 -29 -120 61 -28 25
3532 25 321 75 24 -81 48 103 93 -247 -254 16 292 -82 8 70 278 199 -128 103 -106 -55 122 -111 196
3555 196 44 113 63 -202 -88 -23 26 -275 103 -3 129 -64 193 -139 5 -80 -37 -17 -169 -24 406 44
3577 44 -210 -38 223 -48 -259 -112 -141 -103 19 410 159 -2 -81 315 4 45 -164 210 61 34 346 227
3599 227 262 142 89 -95 -208 341 73 -257 -15 4 154 51 242 -148 -129 57 -307 -92 -129 104 -46 57
3621E7k44J03K07k36j17J29lo0K1q1J95o8J65n8K10j66j79L20l82O03n43J37p8
3644f8N4L6J74n7l25K95p4K42j57m3j7J04m71L51l98O6R6L52j63k56J35K15k78
3667a87K48k24N18k94j23j04K9K95k10j0j21K37k9j13K03q3j40j06K83r7p0K3
3689g5M7j01J34q9K50j54k64M54j57p4k19M6J10l0K11J63j01k66J81j10K32j33
3711E5K09j53r1L06m00K53j51K57o16L23J75L0n3k5l2k44j31j17M60l3J34o7n2
3734C7J18l4j11K24m06j4L96j47P0m74J29nJ72K69P2l31L4L9L09l98K6J72p4j10
3758c7j24O2l11L58lrk73K78J33k27L20l6l08K74l0J03k31j58L41k21L68j21j14
3781C4r1M1m4N6K57j16j43J85j56o5L07l16J33j82k8L89l61J0K11L5k33J07K2
$$ plain form
3621 57 -187 -84 123 -113 -230 -101 -104 -164 -143 -224 -29 -97 68 10 220 54 -125 195 -187 416 -127 10 -68
3644 -68 -14 22 196 139 -186 109 35 277 120 77 60 164 -307 44 -354 -288 -192 160 -3 -259 -124 91 -187
3667 -187 61 -163 355 61 -62 -166 -137 158 -52 -62 -183 54 25 -88 115 32 -108 -214 69 -28 -98 -75
3689 -75 -28 -129 5 -84 166 12 -252 202 45 -29 -248 -202 -92 -122 89 252 151 -115 66 -44 188 55
3711 55 264 111 20 326 -74 179 28 285 -331 -8 167 197 144 119 87 -157 -288 -405 55 22 156 89 37
3734 37 155 121 10 234 -172 -186 210 63 133 -341 -212 -217 -45 224 296 -35 -1 38 347 -51 -25 147 73 -37
3758 -37 -161 -99 -410 -52 -55 -64 -337 -59 74 -153 167 131 -177 97 67 170 -61 -219 122 -99 269 148 34
3781 34 -57 -16 -60 -4 253 137 -6 179 23 -42 265 -51 82 -100 -128 261 -100 -90 121 156 -77 30 52
3804E2J11k14j17M02k2j38j91O8J8N6P3Pk0J38j78j78l1K11N1j98J96j05k58K18
3828d9j41L04k93q0J48K10o8q4J32l8k4o6J48k70J14J87j88K92j57J1J82k95P2
3851D7n2r4J01L4P7m19J25O7p2K47j05J23O6l50J97r0J23O4J07m3l66L03k71J19
3875f2K23j33l12J91n0o1M58o2o4m5M0j21j64M36k21j26J68o27M85R5o8J01K56
3898C37l06Rk35Q2J24q5K59k64k7K39n83N11j49J29L18k61j28O1Q5k46L67j86
3920E1J50l44J82k00L10k1j86K93l32J46P5j78l81L15j16J41l49P30k98n0R3L9
3942G0K3o8Q3m22L38l5j96l0M21l43J24O5j4j38m5K10%M0j81j30K95j30rJ60J77
3967B65q0l75K68j19L33m03J22j05L0r0K12J04j53l34L79j14J04k45R3J09n6K77
$$ plain form
3804 52 163 -51 -168 234 212 74 -117 -49 -31 25 98 105 85 223 45 -133 -164 47 98 -100 96 -9 -267 -49
3828 -49 -190 114 -179 -259 -111 99 31 -53 79 41 17 -49 99 -171 -57 130 -58 234 77 88 270 -25 47
3851 47 -5 -99 2 36 113 -306 -181 -114 -186 61 -44 79 145 -205 -8 -98 25 89 196 153 -213 90 -181 -62
3875 -62 161 28 -284 -93 -143 -204 254 192 128 83 123 2 -162 274 53 -73 95 -532 -47 48 -20 81 337
3898 337 31 40 -195 -113 11 -74 185 -79 -106 133 -450 61 -88 41 359 98 -30 31 116 -130 237 51
3920 51 201 -143 39 -161 149 128 -58 235 -97 49 124 -54 -435 -120 -236 -95 -444 286 -12 -62 31 70
3942 70 93 25 108 -314 24 -11 -207 -237 184 -159 -35 30 16 -122 -167 43 43 83 -98 -228 67 -63 -72 88 265
3967 265 185 -190 78 -41 292 -111 11 -94 -64 -154 58 162 9 -325 54 -60 44 -201 -108 1 -55 222
3989B22k41nj69K89n0l64J88m3N4L14j19n5k29Q4k1J44J32k90K23J38p4l54J17
4012a09R9K0ML52n20J14r5M9K87k23Q7k55M65j75k24N9N4r1n6L89k65r9J88k79
4036b24J79r8M17l61K14l74N33k21n6p7J1j30K76j10K66l58J69J75O2j52k91J08
4058d2l3J22J36mj48J65j36Oj76L50m5j25l9K03k57l0J63k52L02m47K37P9j05
4081g6J38r2K35K57n15k24M04j46l30M65j43K2N1o6j54K78k54jL29P6l28k7J10
4104Ik48L16j51L37k61j06j12k2K01q5j25K28J37k04K29k33J29oK79n21N08m60
4126a61P3K93o8l77M16k9l94K02j49L67O2k60K3K88l51J12j16J18l22R1r9K06
4148g5PK27l26J97R6J16l45J55K0l02L46j68j00J1K16L6J38k58J71l25L59o40
$$ plain form
3989 222 -19 -24 -193 96 46 -318 -130 -173 -119 195 76 21 -208 -124 -145 -1 131 -159 64 202 128 -226 -109
4012 -109 -10 10 14 366 -154 -40 -135 -86 201 -22 65 -190 275 100 -124 -65 -11 -102 -158 231 -34 -133 55 -224
4036 -224 -45 -143 274 -87 127 -247 286 65 9 -68 -57 -187 89 -21 245 -113 56 231 293 141 -150 -42
4058 -42 -75 47 183 179 31 196 60 66 -110 240 195 70 31 234 -23 -53 110 -142 160 -287 -50 29 -76
4081 -76 62 -30 205 462 -53 -277 127 -19 -349 116 -27 -5 46 -20 -174 104 -150 -151 178 254 -74 -101 9
4104 9 -239 77 -74 263 2 -104 -216 -238 -37 -122 -247 -19 118 -86 143 -90 39 33 312 -209 299 -161
4126 -161 -88 205 137 -240 176 147 -247 -45 -194 173 235 -25 -2 286 -65 47 -69 49 -273 -182 -281 -75
4148 -75 -68 159 -167 30 126 242 -103 52 72 -230 116 -52 -152 -141 75 111 249 -9 162 -163 196 -444
4170d44O78l97K35j67L54J51j08p9r7J10l54J01r9K26L4j1j50k27j44L87Pp3k5
4193i2K44k15k07L52j56K50q1k36O11n12j1m6L18j96J51k94K77j82K3K06M3p2
4215A75j01o3K53m86M39m4j95k81O27k98k09J58q5Q0k02M49o35L56J79j30Q8o9
4237FR1J1k68J33K41n24M81O6l52K12l31K45n0K12l92k2L65q0o0J67k63J85P9
4260A52RKm86L60K6j87J81Q2J4j33J1K48k56J79l96K14J7k89P35m64j12p7J11
4283e9L40r1l22q3J33K40J52j27l75M7K80l77L56q2l69P0P4Q6J63J37k89J79L8
4306A21l92K17j03J06K33j43P9j73j02J10R0j40L36j32k47J54k06K93L9l04L35
4327A71j98q6K20o0m9k5P1j64k89O1M70p9j21j56L65J27o8j86o1j19j3K92j08
$$ plain form
4170 -444 234 -163 72 -95 259 410 302 223 126 236 -118 -17 -116 110 144 133 -17 -244 -388 -1 6 -67 -92
4193 -92 152 -63 -270 82 -74 176 95 -141 470 -42 -53 -99 219 23 174 -120 157 -25 -2 204 247 175
4215 175 74 11 264 -222 217 173 -22 -303 324 26 -183 -25 -110 -30 -232 217 -418 -62 117 -13 75 6
4237 6 97 108 -160 -27 214 -310 171 237 -115 97 -234 11 -39 173 -219 -241 124 44 -16 151 -112 73 152
4260 152 161 163 -323 37 63 -124 57 139 153 20 31 279 23 202 -194 20 37 -252 483 19 -93 -170 -59
4283 -59 281 190 -132 -215 -82 158 310 183 -192 -145 135 -242 114 32 -337 -267 -193 -107 56 193 -96 83 121
4306 121 -271 -54 -157 -51 182 39 118 -55 -157 -47 43 -97 239 107 -140 14 -192 101 140 -164 171
4327 171 -27 -113 107 47 -2 -27 44 -120 -409 -348 122 43 -78 -234 131 258 190 4 -57 -176 -189 103 -5
4350eP4l03K62j20L99l60q0o7M76l00J2J41k04J61j60J0J44j94n7M37k96J64n44
4373d10N46k28J50M4j21j14qJ27r0q3PK08J91k9l07K18k58L19m74K18j88K8P2
4396a82J23m1K6L09j02j01j03M4o0j27N08n6j88L8K22j25j18j62m4J19l1J47j56
4419f0O5K50m01L41l45L8L66n74P1K97j84k35N11j77J01r4L66m10J23L1j83rJ65
4442E3Kj25O3K40k58K33j87j36J00l36K78j17L21M0q9q9K4j01J70N2l66K62J78
4465B12J15p10L64O7k13N68n57L57l23j11R8Q3J02k05L86l76j04J60J86j79m3
4486a23O5K18L5J17m29Q6j49K76J21m16j03M00j90K73j14M0m95K28L19k69K86
4507A76N6j86j37J39j38Q0j35M07l71j70J71K94j09q5n4l6K80k84K89n59K67J66
$$ plain form
4350 -5 69 -234 28 -92 307 -53 -133 -200 276 -24 -12 129 -75 86 -74 -64 80 -114 -171 266 -30 134 -410
4373 -410 136 -92 58 102 -19 -133 -141 -14 -104 -187 -180 28 219 190 -117 101 -157 162 -312 -94 -282 -254 -182
4396 -182 -59 -100 -74 235 133 32 -71 -27 -87 -214 294 238 50 88 310 185 67 -95 -139 -20 -51 96 -60
4419 -60 5 255 -146 195 -150 -112 254 -320 -249 48 -136 -371 140 -37 64 -30 336 -74 49 80 -103 -112 53
4442 53 55 -70 -7 233 -25 208 21 -115 -15 -351 -73 -190 131 171 82 -7 17 -84 86 138 -228 34 212
4465 212 327 -383 -19 48 -165 403 -154 203 -120 -231 -133 -50 52 -153 233 -143 -247 -87 99 -80 -123
4486 -123 -58 160 195 312 -117 -31 -180 96 217 -199 -302 98 -92 181 67 107 -388 -160 159 -110 176
4507 176 232 46 -91 48 -90 -10 -145 262 -109 -279 -108 186 77 -8 -62 -98 182 -102 187 -372 -105 61
4529F1J87j36j49J44n23K38J92M3j03m2J78j65K66r6k32L08j88j45K49o4j10J92
4551A05J61j12L4k30N7J54l33Q2j01J68J10J49j83j04j3j5K53k18J26k54K54j91
4573a01K50k03L89l6k93K8j24l31K83J95J35l15J68K32m87J00K35j74Q9q1J72
4594A31j49j31K50p7J35l3n3j58l95N82l6k25L32m87J11K30Mj26j7J89J83l04
4616d4J38q2m75J54M39k81J40K81p9j82j20r2K94J35l78L55l71J74j64Q5J00J8
4638D5n3Rk00J28K9o8QL6J35k47J56j8L6m2j39O5L81k00R7j43j20J94l49L72j3
4663I9j55J90K1j81Q2k59J20J67J43m19J50J3J69r2nj90M3K7R5J72m76N00n73
4686c59K86L87k43r8J11j02J68L2j14oo8K02k87L00p9k72L24j89K73k74J43k00
$$ plain form
4529 61 248 112 -37 107 -416 -178 14 57 -46 -88 90 -75 191 95 -137 171 -17 -162 87 23 -87 105
4551 105 266 154 188 -42 15 169 -164 -82 -183 -15 95 244 61 -43 -56 -71 182 -36 90 -164 90 -101
4573 -101 149 -54 335 299 6 34 -90 -421 -138 57 192 -123 45 277 -210 -110 125 -49 40 -41 131
4594 131 -18 -149 101 24 159 126 73 -85 -480 102 66 -159 173 -314 -203 27 31 -95 -112 77 260 -44
4616 -44 94 12 -463 -309 130 -151 -11 270 191 9 -111 -203 91 226 -152 203 -168 6 -158 -73 27 45
4638 45 -8 1 -199 -71 -42 -110 -102 -66 69 -178 -22 -40 -4 -46 -185 -120 261 61 158 15 -105 89 -260 112 99
4663 99 -56 134 155 -26 56 -203 -83 84 227 -192 -42 -29 140 48 43 -147 -104 -77 18 190 -286 214 -359
4686 -359 -73 314 71 -27 84 -18 150 182 68 62 -6 196 -91 209 130 -142 182 -7 266 -8 135 -65
4708f5J39m9R0o0K87k72M0k13L6O0k44K77k76R3K14k80M0J72n1L12m43M41m95
4731b47M88K04l60n0J07k89J35j36J73J42r6l3j8j18j00J59J6j40QK39j07J33
4753A10Q8j30k3k99L33j59K83q9j44K33k83r2L56k67P6q1mJ10l41J86L54k00j12
4776i5P5R7k01Q4R8j28k02M36l01M6K47k00Q4JO1k0j09L7K1j13J31N7k16O7L04
4801B61j90J21j04J00j92k29J99K11l21o2K87J24k17J97J77o47K22J64J9j68L34
4822B86l52L7l8N7n6k1K75m61rM71j92k77J93N1k2k21K29Q6P2o1k31N30k90q7
4846c1J0K8M18j07k10j24O0l72M61j82l9J26Q2J99l82J90k44O1J46j17N3n2r3
4869a19M52l97K08k23P7l25M22o3J97p9n5j30j47J49K7n7m5Q3j33M3Q2j98J85
$$ plain form
4708 -65 74 25 115 55 342 70 110 -103 -67 -7 -251 26 -250 -157 57 -223 -183 -11 -62 250 -193 248 -247
4731 -247 241 445 85 35 142 -147 -12 -148 25 167 71 38 20 -98 -198 -39 -23 -163 -155 84 -23 110
4753 110 198 68 45 -254 79 -80 203 114 -30 203 -80 -172 184 -83 -7 -88 -92 18 -323 -137 217 17 -95
4776 -95 -20 77 -124 -40 58 -70 -272 164 -137 -91 156 -44 40 41 102 82 -27 10 31 -82 49 106 -110 -43 261
4801 261 71 192 88 188 -4 -233 -34 177 -144 -206 81 205 -12 185 362 -285 -63 101 120 -48 286
4822 286 -66 -29 -67 -10 -66 -87 188 -273 -282 189 -3 -280 -87 -36 -58 -279 -50 36 108 47 -184 346 56 -31
4846 -31 -21 7 425 318 108 -16 44 -328 133 -49 -88 38 120 319 -63 127 -117 -56 90 -27 26 -26 -119
4869 -119 333 -64 144 -79 -2 -327 95 32 229 150 95 -35 -182 -33 -6 -63 -108 -25 -158 -115 -33 -231 -46
4892d6l9K35m31K15J87m7k83K47l68N41r1K25o36K70J65K37n93L7J14M12l05j38
4914i2J24M8k13J7L95j13k01J72j66MJ17K34l82Q7K32Kk54K73j97l51K76j17J72
4937F7K40j85k74J67q6M8j3P6L8Jp7J99j41O5L2k43J9n3L77j39o8k03L9K92k87
4962a09J24K14mm28N34m27j61k6J82J85j01l73L84K7k25J27L47k10j42j59J89
4983e2J57M2m74K68kN6L45k62Mp8j56K38k28N19l80l9oJ51l41K98j0K02m38J53
5007c3p2R7j07k18J95k48O21Ok71J75m11Q4Q4n8N0J53K61m03j3j2r6K32k95j2
5031b91K35N1j85J9N90m97Q6J27O8j43J93m34M31J50m70J93l43K54J75p1l60j6
5053b38L25P5m19J37N16m97J15n3j6P7l4rk81L13O3P4l69N76n81J67j8P8k15J14
$$ plain form
4892 -46 -85 150 -281 -66 121 74 -209 38 -330 211 120 345 -291 -21 144 381 -212 -175 -61 351 46 -92
4914 -92 32 80 -133 -116 279 166 -35 137 -29 -25 92 326 -56 31 263 265 11 284 87 -264 12 -105 67
4937 67 307 122 -152 15 -71 -23 -36 40 78 79 2 201 60 125 157 -86 -67 -120 257 118 50 -153 -114 178 -109
4962 -109 15 229 225 -203 331 -96 -257 -283 -101 84 -17 -390 -6 21 -204 -77 270 60 -82 -241 -52
4983 -52 105 147 -327 -59 -61 -5 340 78 82 4 -152 86 -142 377 -3 -42 -48 103 -238 60 50 252 -186 -33
5007 -33 -105 -8 -115 -333 -138 -386 235 241 -30 145 -266 -182 -98 -156 -106 47 308 -95 -108 -120 -216 16 -279 -291
5031 -291 -56 -5 -190 -171 419 -78 8 135 203 60 253 -181 250 400 -70 123 -220 34 209 138 -222 -238
5053 -238 87 162 -257 -120 396 -101 14 -39 -55 22 -12 -21 -302 11 74 148 -221 355 -226 -59 -77 1 -214 -100
5077a00Q0K24jl41J53J3Qk17J05J61j78K64l20J98K0O4j36J22k66L2K16j46J12
5100F7k94M0j69K70J22m8q2J50K37k44j98n3j60M42j27j84M32n2k61l6L6P1o5
5123a06K88L1N8N4m83K75k89K85R2K23j44m72L90l05L10k35m9J83P5k87j41L22
5145G5Q2j65pj51M02j86O1j53J3j48jJ70LJ68l7k7J83j53k97J81l15M32P1j73
5169B8J32j60M6m2k14L68j79R5J85k49k81L87j17l28J84J53J19k82Q5k6L31m30
5191a95L38l2q2J34m08N9K00J17l08N8j3n1K65M1M7m11N1L9Pn2K34l6j20K67j37
5216A2q9K21j69p9K1P1kN5K09l45K51j01jJ25j86j26L27P1m4m03J64K57l31o0
5240a52j57N60l18J10k6L8k67K00j14K22L4l27O8K18j92J14K56rp04L44j46J09
$$ plain form
5077 -100 -20 204 203 -138 15 28 36 -181 -76 85 -93 171 -149 49 69 133 -3 119 -147 -115 101 -45 67
5100 67 -227 -187 -356 -86 36 -12 -94 56 293 49 -149 -202 -362 80 -47 -231 201 149 -112 -148 -112 -41 -106
5123 -106 182 213 271 325 -158 117 -172 113 205 428 284 -188 202 -103 207 -28 -77 106 181 -106 -247 75
5145 75 157 -8 -15 -166 236 50 111 -42 -29 -177 -178 -8 -5 163 126 99 282 129 -168 13 -302 130 201 28
5169 28 160 0 46 4 -210 158 -21 74 259 10 -271 116 -1 -329 -145 8 127 -155 -70 -96 235 -195
5191 -195 143 111 29 163 -245 -186 14 131 -177 -119 -132 -183 82 123 170 -241 -190 -151 -144 -196 38 2 -118 149 12
5216 12 -77 144 -25 -104 -83 -12 -14 41 250 -95 156 55 54 179 -7 -133 194 265 221 -182 -18 239 -92 -152
5240 -152 -309 251 -67 43 17 55 -212 -12 -126 96 130 -197 -129 89 -103 11 267 258 -446 -102 -248 -139
5262a39K67n58N08l30Q5J8K42k06j87L1J33K82q6k97J95m9k06M69j58p8O7Ro6
5285e4K13L7k38j6j10qL02r5k41L98n2r4J39Q4n51L43k99M22n42N20m27L49k40
5308a60J77n3l08L23j33J82J30J2nk26r2M5J66q2J57R1m7l63j06L05J86j63j84
5331a48M12k39k47J97p3j15J06Q9n01M03K41k27L04l1j87j29j33L29K8k73j20
5352c14K59Jo2J10J49r3j4oj94J91j6l48M31K30l65J88j30K19l4l79OK59q4q1
5376g7J42j70P7l03L48j69m4J65m3k17R6K51m55J17L79j06k8L63m80L49l81L34
5398A48l65L91l00P2l8J42j95lJ16O2O6m6j84J7J53j48R8N0R8Rk45J94k86K9J31
5423c4k86J32J31J37k70J43K2pj14M7J05q0L92j79j0l1m8J95j4j82j56J47o4n3
$$ plain form
5262 -139 128 -430 78 -252 -167 -149 93 -113 -300 -269 -136 146 60 -237 -42 -91 -297 172 14 -64 3 12 -54
5285 -54 159 196 -42 -58 -168 -176 126 31 -210 188 136 42 181 265 -286 57 -242 180 -362 158 -269 80 -160
5308 -160 17 -36 -344 -21 -154 28 158 170 165 -61 -153 -108 58 -24 133 224 177 -186 -292 13 199 36 -148
5331 -148 264 25 -222 -25 -98 -213 -107 -18 -519 -116 125 -102 202 171 -16 -145 -278 51 79 -194 -314
5352 -314 -55 -54 -116 -6 143 50 36 30 -164 27 11 -337 94 324 -41 147 17 236 202 -177 -171 88 4 -77
5376 -77 65 -105 -28 -331 17 -152 -196 -31 -74 -291 -195 56 -399 -282 97 -9 -37 326 -154 195 -186 148
5398 148 -217 174 -126 -54 -92 50 -145 -148 -32 30 96 50 -134 -117 36 -112 -14 36 134 143 -102 92 -194 -165 -34
5423 -34 -320 -188 -57 80 -190 -47 -25 -32 -146 -99 6 -74 318 139 129 98 50 245 231 49 -107 40 -24 -77
5447g7j47K47q6J63l33L26l49K70j84J8K03j24J73j2k4l50L82j59R1l4n1O1j4
5470a0L63l55K28m90P12m00k73K32%m62J74K64k05P1R2M9j51J70J09j91m0M03
5492B90n76M40o1k8K15m56K55j30K80m5l56J76J2J04l25jK33K07m38R0J72K9N0
5515A37l63J35K04J8j66N1J35l3j9J14k92M2J29o9j48K01k10J38N5j99J23L24
5537C07l0k38k62R9K25l15L91l34kQ1J23Q2j22Q2M0J03k44j62K64K22j74L20m20
5560C6KR8r9l58K00K72j8k85j23K10k61K28k10J76K1K08Mj41o1J95j14M7J91k84
5584f6j11K42K5R1k40k0K99k46j3PK07k52J22l31K45K02l47M86j92j39j41J40
5606c2O5K90m10l7K05j07K03N0q0j25j51J55j64K56j43r0K47J3m26M14J60l55
$$ plain form
5447 -77 -224 23 -63 100 -233 93 -256 14 -170 -152 51 -73 100 88 64 -286 96 -63 28 -6 -57 4 -10
5470 -10 353 -2 226 -264 448 48 -225 7 7 -455 -281 -17 -222 -151 -59 -10 -161 9 118 -73 -113 290
5492 290 -286 154 93 65 280 -176 79 -51 229 184 -172 4 16 120 -205 -206 27 234 -204 -114 58 87 137
5515 137 -226 -91 113 131 -35 16 151 118 99 213 -79 -37 92 23 -125 76 -134 4 59 -140 -17 307
5537 307 277 39 -223 -124 101 -214 177 -157 -159 -78 45 127 5 87 127 230 -14 -176 88 310 136 456 36
5560 36 38 136 37 -321 -121 151 133 -152 -275 -65 -326 -98 -308 -132 -111 97 101 -40 -101 94 -20 27 218 -66
5584 -66 -177 65 90 181 -59 -79 220 -26 -39 -32 175 -77 45 -286 -41 161 -186 300 108 -31 -172 -32
5606 -32 33 323 -87 -124 81 -26 177 227 147 22 -129 26 -138 118 -25 -115 132 145 -281 133 293 -62
5628f2J03J37j33M5j83R3M8N3Qj95J57R3L6k54Q6K30m16M92m91K60n5n1j2J21
5652A10m7m2m0j97Q0M54j87q6j00j18N30m92L76k00m2K28j7%l60RJ12k47L15L2
5676G1m2K8P1qj87Q1J13j29N8j17N8J23R9m3n44M68K2k88K82j98N9L59m76K44
5700A04j55L01l01M1L08J80m59J89j3p4m1O8n02L93P9k68j31L17J94j8m78L43
5722G7O3j55j91q8J33k4K68k26J90j5j98J81L0k13J32p8J5K04n1j34K26j01L18
5745C63l96p5J83k93K43k78K10N4J08k30j3r8K40r8P6j86J05K31k78M60k69J09
5767A68j30o2R7k13K95O5j06M8P8m22L56L2L3l98J92o8p4J96k04R7O4j78j68L42
5791D0j02Q6j90L04j14J55j01l75K47N05n64R3r1j5L08m75Q7P8pj49L80L2J97
$$ plain form
5628 -62 41 178 45 90 -93 0 48 101 109 -86 71 164 200 -54 32 262 -154 338 -153 107 52 1 -11 110
5652 110 63 21 -19 -216 -136 318 131 45 -55 -173 357 -135 241 41 -1 227 210 210 -150 -141 -29 -276 39 71
5676 71 29 57 128 120 -67 14 127 -2 56 -61 -3 120 219 176 -368 100 122 -166 116 -82 -23 336 -140 104
5700 104 -51 250 -51 -10 298 478 19 208 195 121 80 148 -354 39 118 -150 -281 36 230 212 -266 77
5722 77 140 -15 -206 -294 -161 -185 83 -143 47 32 -166 15 45 -168 -36 -114 -99 105 54 -80 146 45 363
5745 363 -33 -108 75 -218 25 -253 -43 11 119 -111 -124 -222 18 -80 -4 -190 -85 146 -132 328 59 168
5767 168 38 -24 73 -140 155 220 114 162 240 -182 174 206 239 -159 33 -35 -109 87 -117 -20 44 -134 -302 40
5791 40 -62 24 -166 138 24 179 78 -297 -50 455 -109 -16 -107 -122 186 -289 -202 -124 -131 -280 100 132 329
5814C29j19j01j20J55j07P5k9r2j33J09lK52l01K00o0J1j85J48l48L48Q3k3q7
5837Bk3J26n5j83j07Q2N1J67m0M2j07O8J7k10K77J15j01j36J80M0l25M3pK9mJ13
5863E4J42j55J81O7j02m47J96N9J34p7n5m7J29j50n2M27l00pJ57r0j53Q0k4M8
5887A5j01l1J73j26O5MK66k94kk09Q8J77q8q6O7K13p5J1m30J85N6J25n8k9L3j59
5913b10M61m76J10J99k57K4Q8L37J02m86j15K65P3j72J06q5K42l24L9k86M77j63
5935e1j77N43l39J10j91K34k69J72k86L89M1l06J13J19q1l29L48j76M9j36Q7J82
5957D6l75L34J04j70j30J40K44p9j89N4k08K42k68J14J87m5k38L15j83J32J7k55
5979b11J34L8O2r8P4J56p6m44M27j96K92j49k08J90o0J60j22M6N6j00oR8j51J17
$$ plain form
5814 329 210 109 -11 144 37 112 83 -9 -142 -33 -36 216 -85 115 55 66 -119 29 -319 29 112 89 2
5837 2 -21 105 50 -133 -240 -158 -107 60 20 62 -45 23 40 -170 107 222 121 -15 165 205 -120 -77 -84 -55 -59 54
5863 54 196 41 222 289 187 -260 -64 -5 129 52 -3 -50 79 -71 -123 304 4 -3 154 64 -89 -9 -33 15
5887 15 -86 -117 56 -70 -5 -1 265 -29 -31 -240 -152 25 -63 -149 -82 131 56 67 -363 -178 -122 3 -55 -84 -51 -210
5913 -210 251 -225 -115 84 -173 -149 -61 276 378 -108 -223 42 115 -57 49 -36 206 -118 -79 -365 112 -51
5935 -51 -228 315 -24 86 -105 129 -140 32 -254 135 176 -130 -17 102 21 -308 40 -136 -87 -223 -136 46
5957 46 -329 5 109 -61 -191 -51 193 114 -75 -21 -229 13 -255 -141 46 1 -237 78 -105 27 44 -211
5979 -211 -77 -39 23 -75 -1 155 79 -365 62 -134 158 9 -199 -9 -69 91 -31 15 71 -29 -35 63 -88 29
6003B9K28m52N23l14J25j18J0Q6l11r3L30J5j33M2p8j25K91p0j88O0j8L05k38
6026i4J09j00n3L82l05J21r7l39M05K50q0n55L34J7p3j60K31P5J65l59J96K45
6048C15l22P7j25k30L62j1k17J6n4P3K66k61L32j64j85M45l84q7J64N1M0j39J99
6071A61k19J95k68J79j16J66N1l74K30J3Q4J00j22j45O0j12k68M11jJ78rl19K45
6094A20o7k18K45j16j47K47m32L08J6j63M24k03J94r4jk33L7J15K7j18J70J9k59
6117a29K88Q4j81k01J55j15K61j67L51n19L10LN0k77L96m53J49qkj89L68k0j2
6140A42k14r8L9K48q2J31n3p6J79o1k70m0j71L15j80J48l43L56K51j10n24K03
6162b10M53j93J66k80M92l98J34k98L38j91j53k8L92n84M01k31K03k8p6j39o2
$$ plain form
6003 29 257 -195 328 14 139 21 31 117 -194 -287 43 58 -75 -33 -111 -236 55 -15 -203 -143 -161 144 -94
6026 -94 15 -85 -138 244 -61 60 -37 -376 29 279 199 -356 -22 -5 -78 -238 -7 68 233 -126 70 315
6048 315 -7 70 -55 -285 77 66 -151 -135 -189 -116 150 -111 221 57 -128 317 -67 -154 10 61 101 -38 161
6071 161 -58 137 -131 48 -68 98 149 -225 5 18 102 202 80 -65 -5 -117 -385 26 25 203 194 -125 120
6094 120 53 -165 80 -36 -183 64 -368 -60 -44 -207 217 14 208 114 113 -120 -83 32 59 -59 111 130 -129
6117 -129 159 243 62 -139 16 -99 162 -5 346 -173 137 140 190 -87 309 -144 5 -3 -5 -194 174 154 142
6140 142 -72 -170 -131 117 35 166 113 37 216 155 -115 -155 -326 -11 -191 -43 -386 -30 221 111 -413 -210
6162 -210 243 50 216 -64 428 30 164 -134 204 13 -140 -168 224 -360 41 -190 13 -15 -91 -230 -292
6183b92M60j77j29M3L12k87K69k67K82n83L97l0L14j83k78R2J34J7L1j32J33k34
6205a08J05J4J97m65O60j01m69L22k34J40j14m4K64ql55L34L4l07J4k68N16j78
6227e1p6M36l26O0K9N5k38K28k19L8K8J20L73k09l15K86k83l82N67j75R2lO2O1
6251A58j14r6j0M1j26M88m17j07K36k9K17m45M2K93l86J34J66o7J95n3k16k67
6273c63M10j03j5M2N5J30k94K96m97M51N8P0k29j45J5R0j99r8N3K39J45k8k57
6296a74M3M05l55J93k14K93k56j15L4J49j67n8L75k04k7L63j96l02J51J75n5O8
6318A26j29J28m03K8K62M4J6K6j13q5K16j40o2J84k54r6L97m25M56L2j01j51k60
6341c04K23M80l65K40l75J98k62K83j30N5J38J94k99r8O8j28k71L2J40J32J58
$$ plain form
6183 -292 168 -9 -138 -95 217 -70 199 -68 214 -369 28 -2 312 129 -149 -57 77 94 125 -7 126 -108
6205 -108 -3 11 208 -257 403 302 -167 155 -79 61 -53 -97 167 159 -196 138 172 -135 -121 -389 127 -51
6227 -51 -127 309 -17 43 72 127 -111 117 -102 -64 -36 84 457 248 -67 219 -64 -446 121 -54 38 35 97 158
6251 158 44 -52 -62 -21 -147 341 -76 -183 53 24 241 -204 -162 131 -255 -121 45 -22 173 120 -96 -363
6273 -363 47 -56 -71 -29 26 156 -138 158 -339 112 170 240 11 -134 -119 -29 -228 -326 -273 -34 111 83 -174
6296 -174 -131 274 -81 112 -102 191 -65 -180 -146 3 -164 -222 153 -51 -78 285 89 -213 -62 113 58 126
6318 126 -3 125 -278 -250 12 56 72 98 -15 -100 116 -24 -86 98 -156 -252 145 -280 176 208 107 -44 -304
6341 -304 -81 399 34 274 -101 97 -165 118 -12 43 181 375 76 -22 46 -82 -353 -321 -181 -49 109
6362A09k92J27n9R3k41J27n0J22j76M6J84J96l29L82m57n5N38l67P4j05J54k47
6384b26J38J92n4j23k63L03Ml1j56K92q0K6q5J79nm5k02K9k32O54n67K21L65l38
6408dj04q4NK11J96k09k16M04j85Q3m2J64n0L1j19k48J44L6L3j07R2K95j80j87
6432d1M4J54L7l84K00K16l56m3K14j1J04j75k04K61M0k24kJ45n5K30l97K27k5
6455d5Q3J24kj87j68K56j43J1j10N2Q7No3J05Q1l87J40K51P9l77J95j84N35k76
6479F2N5l47J21L12j39k33J73K79l53r9J29J48l36K01j0Q8J59q1r8k72k1L88O0
6502A86m31M47l62N0N4j18L20k18k79K17l1K40J13J11m33K33J51k29k3r5j00M27
6524B30l79K39j78J10J46j76j43M42l95o2L80ol9k05Q0k5J04k12j49K35n6j35
$$ plain form
6362 109 -183 -56 -115 -22 -263 -136 -186 -64 -240 -194 -10 186 -143 239 -218 -273 265 -102 -28 -133 21 -226
6384 -226 -88 104 50 -73 -336 -33 -29 -60 -216 76 -4 22 -63 116 111 66 -136 -107 -339 315 -252 -31 334 -4
6408 -4 -108 -192 -187 24 220 11 -205 199 14 97 55 219 169 200 81 -167 -23 13 46 -61 31 326 146 -41
6432 -41 3 157 194 -190 10 226 -130 -173 41 30 134 -41 -245 16 56 -168 -170 -25 -80 150 -247 -20 -45
6455 -45 38 162 160 -27 -195 61 -82 -71 -181 -129 -42 -37 -100 5 86 -301 -161 90 169 -208 -13 -197 338 62
6479 62 117 -230 -109 203 64 -169 4 283 -70 -169 -40 108 -228 -27 -37 51 210 129 31 -241 -262 126 186
6502 186 -245 202 -160 -110 -56 -174 146 -72 -351 -134 -165 75 188 299 -134 99 250 21 -2 -97 -197 230
6524 230 -149 90 -88 22 168 -8 -151 291 -104 -166 214 208 169 -36 44 19 123 -89 -238 -3 -59 -194
6546a94L22l42J64R3P4k49J86Qn6K99l83k5j08N3j04N53k64o6k00K22K13l64J54
6569a4N2m1n6K47m22N41j58r1P3P5j51l9j28Q1q4J17R6l45K72j18J42j78L1O4
6593c4j6l42M72j65M2R0mL27l38J72m06K20l48J95J92J56l22m9o0L24o26L64k1
6616a77R6J59l36K35Q1j46J13J99j14j96K8j21J77J12j96j98J22l8J78j76J51
6637d7J07p8J32k06J90j45J23k35K31k14L5K63k50r7L15l27L04k59L91l47L23
6658B09o1p2L1l8J58m23L39j04L22Mm65J9J23l5P0J6k34J15M5J13k56J18n0N1
6682eP6j46j0K13J46l40Q7l7M09m66J89k28J99Q8L4j80P4r6k73M25q4j73M7n1
6706a02j07L81r9J56l45L7O5j15M37o22M17j30J97K70m80J17j82j5j19n5L16n5
$$ plain form
6546 -194 128 -214 -50 43 117 -132 54 62 6 305 -78 -103 -211 -158 -262 291 27 -39 -239 -17 196 -168 -14
6569 -14 38 -3 -59 188 -234 307 149 58 131 206 55 16 -112 -31 -115 2 98 -247 25 -93 49 -129 -98 -34
6593 -34 -50 -392 80 -85 -43 47 43 370 32 204 -202 18 -330 -135 57 213 -109 -158 -218 106 -520 -156 -177
6616 -177 -81 78 -258 -23 58 -88 25 224 110 -86 -58 -179 -2 110 -86 -284 -162 -200 -22 -198 -47
6637 -47 60 -18 114 -92 98 -47 76 -159 72 -142 -107 156 -94 -191 124 -203 101 -158 233 -114 209
6658 209 148 76 107 69 227 -196 143 39 361 365 -100 -81 42 7 77 93 -141 -26 19 132 -124 -6 -56 -5
6682 -5 71 -75 -85 128 274 -66 21 -16 393 -73 116 -112 87 175 209 29 103 7 -266 159 75 -98 -51 -102
6706 -102 -209 172 73 229 -116 -79 -14 -129 308 -314 103 -27 170 440 -40 77 -105 -120 -239 -294 22 -33
6728c3P3K13m38L17j34j47M17l46j39o8O27l46J9kO3O0j96J47j68j9L0m28L66
6751a32J41j04K04K25m82j42L63Lk02M14j02l53N53j25Pm19K48j96r0J86K13j86
6773B4L00o34Q0L86k40K21k34jJ10L8J59j95l10j66K02J69jL14l56n2K32l7k74
6796b65K88P1j4k4k29J91k27r1L82Q1l22K53J3J5l8k19J34P0k43K04r5o3J77o0
6820a1r9K7K82j69N9K5j49O9j40L8K00m27M09J73j04j80O8j38J53j23l8J1k44
6843c08K97j68M41m65j6K93J2p4O9k40L46j67j5o7J34j29L98o93K12L31m19N17
6865B89k51p6J06J61j21j85J07p4p2q5n0N09l17K03j55J3j86L28n7m65K98j25
6887b05K59p0L55j71j52J03k86J07K16j31L2k00K85l71J00L49l32k44N22r5m8
$$ plain form
6728 -33 40 253 -185 132 -2 -149 268 -78 -217 -285 342 -4 15 13 76 136 -60 87 -81 -100 -70 -498 -132
6751 -132 9 -95 109 334 -148 -290 73 76 -126 288 186 -167 386 261 268 -151 97 -99 -189 -3 210 24
6773 24 324 -310 -230 156 -84 137 -97 -98 12 50 209 14 -296 -462 -260 -91 -92 222 -134 -186 46 9 -265
6796 -265 23 94 80 56 -173 18 -209 -300 82 163 -159 94 107 122 84 -135 -1 69 -174 30 -65 -128 49 -11
6820 -11 -110 -83 199 30 89 114 -35 34 -106 -68 132 -295 114 287 183 3 71 -67 86 -37 -75 -64 -308
6843 -308 -11 -179 262 -203 -219 74 86 12 81 -159 187 20 5 -62 72 -57 341 -352 -140 191 -228 289
6865 289 38 -38 68 229 108 -77 30 -44 -116 -201 -251 258 -59 144 -11 2 -184 144 87 -378 -80 -205
6887 -205 54 -16 339 168 16 119 -167 -60 156 25 57 -143 142 -229 -129 220 -112 -356 166 71 23
6908B3j21J59k14M02k77P0LN8k10J35k35R0K15J11k65o2K8J95P5j68L15j59q0
6931H8R5k53J9l2j2J56m3j96JK7K14J04j0k24j87N03k66m6k5m7L49k96J07K23
6955B49j13j3j21j13M75l06l2K69k54j5p9R5J7l02M08J28k01K14k40j2j79l00
6977d25K53o0K08j76lJ80J78L1l76L61k51K4n6RK49j05j08K02j5j74j53L76k62
7000i3k17L73q6P4K56j07l44L18p7j81J98j30LK11J96n03QJ28k00J25K30k2k54
7023i4n5J22k02J29K13j52J21J99l84m8O6K6P5k6K14l5l02P4J48k08l32L76M9
7046b6j11M5j36K47J19j15K4L38m45J77l18J7J83j12J01p4k11M15q4k94L74j81
7068f7Q3K26l23L54j88j02J58k23j35K22M3k1j0K0j9J23kk32j6n7K51k7m1j5L3
$$ plain form
6908 23 -98 61 -153 249 -28 42 45 103 -107 28 -207 -117 98 209 -56 -118 -90 105 180 12 327 168 88
6931 88 183 -70 -51 -83 -95 61 18 -178 -177 -150 64 168 158 -66 -253 250 -16 -62 -87 -134 215 -81 26 249
6955 249 136 123 2 -111 364 58 26 295 41 26 -53 42 59 -243 165 293 92 306 66 54 -125 -425
6977 -425 -172 -232 -24 -200 -203 -23 155 186 -190 171 -80 -56 -112 -103 146 41 -67 135 120 -54 -207 169 -93
7000 -93 -310 63 -23 51 307 200 -144 174 97 -84 114 -16 -13 198 394 -109 -101 27 -173 -48 182 160 -94
7023 -94 -149 -27 -229 -100 113 -39 82 281 -103 -151 -85 -59 16 -10 204 169 -133 -59 89 -119 -451 -75 -26
7046 -26 -137 -92 -228 19 138 23 47 385 -60 117 -201 -184 -1 -113 -12 -86 -297 118 34 -260 114 -67
7068 -67 16 242 -81 273 85 -17 141 -82 -217 5 48 27 17 37 18 141 139 -93 -109 -166 85 58 17 2 35
7093C5j45J81P3k25K18j47j82L85nl79L38n6J69j76j76K14k29K59Rj20l12L29
7115E8o0J02j78kJ25k41M2k74L20J12L18m34K59j14q4l9q2L6K90l9j11J35k69
7138a30Q2O0j08r5K01k7K22m67L29k62N57o37j08N44n8k4j36l0M0O8q5p7L06j18
7162D7j19J02J42k37l8r4nL96k38k05J35o1L6K75L4k53m4O8M9M3K6O9m2j12M3
7187A7l0P0k12J27Q9r4J32r6j15K63j10k91J87PJ3L4j2J02k07O8P4J53l36N01
7211C34n37J88j25M7q9QK22K88l92R5J58lq3k42K47n1Kk94J93r2j54K19k45N60
7235B54l26L38n36L25m1Q4l88N59k89m77L40o6M43q9j24J76J28m14L31l49N12
7256C91q8p0j65l49K66K69l68pJ70j9j25K11j07j0K71l78K24l74L52N2k43K19
$$ plain form
7093 35 -110 71 144 -81 137 -10 -192 193 188 -191 147 91 260 84 -92 122 -107 152 161 41 -271 58
7115 58 -2 100 -78 -80 45 -196 -154 -428 -108 4 322 -112 147 33 -51 -90 -172 -136 154 115 4 139 -130
7138 -130 -48 12 -96 -191 10 -17 205 -262 67 -195 362 -275 -383 161 103 79 -57 -87 -47 21 -64 -141 165 47
7162 47 -72 30 172 -65 -103 -197 -202 194 -44 -249 -114 -175 -139 136 170 -83 -127 -59 -10 33 59 128 86 -26 17
7187 17 -13 57 -155 -28 61 -33 99 3 -112 151 41 -250 -63 -56 -43 -9 -21 81 -126 -58 16 169 -167 334
7211 334 -203 -15 -140 -93 -182 -174 48 336 -56 39 197 194 111 -131 116 65 67 -227 -34 -126 -280 -61 -306 254
7235 254 -72 266 -270 55 14 98 -290 269 -20 -497 -157 -223 220 131 7 183 311 -103 228 -121 391
7256 391 303 233 68 -281 -15 254 -114 -121 49 30 -95 116 9 -1 270 -108 116 -258 94 146 -97 122
7278A22k96Q8j48L55j39J22P7m51n5N71j87j92M43k92J5J09p2j51K81o2k60o2
7300a84J78k5j84M77l60J96p5P3P2p7Q9k87J10j65N8L7L3j76O0M73l06j85K49
7323H1j47j1j12J64J9j66K79j68J28l8J5k04o0l6K91J56j57K7k00L37J7m07K34
7346D2n7m2j12L26k60J62K10k63LM2K90m74Q8K04l36r5K74L7O2m90M06K7K90j80
7370A54N6J45l72K72j18Q1j70j61M04l40k41K72K06n21M79k31j66K90L45p87L16
7391h7K97m74KJ98O9J69M64q27JQ5k2L24l2m08J54nK96k21O5J15k97m2J66p5k25
7416c10j69L95J6K03M0j21K11j61k23L3J94j26K2m5J84k10NK12O1j70J29j41j73
7439a44k0K72j89J0R3p6L60n64J68K51k2l96M35n1O2k61K82p5j04K76l36K09k3
$$ plain form
7278 122 -174 -86 -234 121 -18 104 181 -270 -325 246 59 -133 310 18 33 142 70 -81 200 138 -122 -184
7300 -184 -6 -31 -215 262 -98 98 23 96 168 91 180 -107 3 -162 -104 -67 -34 -210 -150 323 17 -168 81
7323 81 -66 -77 -189 -25 -6 -172 107 -61 67 29 44 -160 -220 -256 35 191 34 61 -139 198 215 -192 42
7346 42 -15 -57 -169 157 -103 59 269 6 9 51 341 -133 -45 159 -177 -272 2 39 101 -389 17 44 334 154
7370 154 210 355 -17 255 137 218 48 -113 291 -49 -290 -18 188 -333 146 -85 -251 39 384 -403 -87
7391 -87 210 -264 -262 -64 5 174 638 -189 -188 -103 -125 199 167 -241 -87 -92 204 -17 48 163 -134 -176 -10 -85 -310
7416 -310 -479 -84 -68 135 175 54 265 104 -119 -86 108 -18 4 -41 143 -67 -62 150 211 41 170 29 -144
7439 -144 -164 108 -81 -71 22 -54 306 -258 -90 161 139 -257 178 127 189 -72 210 135 31 307 -29 180 157
7462A57rl76M33m9k73J67O0J30j48l31J25j26K11N3m9p%j73K2K24j95J19l05K32
7486a08M4o8O2j4j1j90N2O24l36l56L77l23O51n32K30m5r8j42J43M8l12L25k6
7509ej67J09j45q1J89l1J80l2r8J8%Q6l7L3N3P9J65m72M2J14pr9r5J21K39j22
7535C7k68L64k88R0K88j47k25J12J87l39N18l53L5J86l3j95J96RpK4k61K61P4
7558B65k35Q5m3R6k95Nm6J28K0L35l84Qj7m8J64j08K6Q7j45pn2R8M4P6p0q9L14
7585B12j00R2n75L72K45n5R1r9m8j47J0k1K67k28j50J3LK1k36K71k21M12j89m31
7609d91M14mj05J84l9L52k38j98K85J6K03n27L93l57m3K17Nk34J2k17PM36r2L99
7633C78l73K19k47J19J92m67L79l41q7M70k00k33oK04K2L4k72L60l33L34m61M03
$$ plain form
7462 157 148 -228 205 156 -117 50 110 240 92 -239 -114 -240 -29 24 -25 -32 -32 -205 -183 41 -154 -35 -340 -108
7486 -108 -64 -132 -70 -84 -95 -285 -233 391 55 -301 76 -247 404 -128 102 57 -41 -183 -40 8 -304 21 -5
7509 -5 -172 -63 -208 -289 -100 -131 49 17 -81 -63 -63 23 -14 19 72 151 316 -156 -114 0 -7 -106 -201 -80 159 37
7535 37 -231 133 -155 -65 223 76 -149 -37 150 -189 329 -24 11 197 164 -31 165 174 167 191 -70 191 265
7558 265 30 115 72 168 -127 -122 -168 -40 -20 315 -69 -61 -78 -126 38 -70 -44 43 -102 -109 -161 -63 -19 57 -13 -102 212
7585 212 112 204 -371 1 246 191 282 183 135 -12 -2 -23 244 16 -134 -121 -118 -97 -333 -62 -283 129 -60 -491
7609 -491 -77 -81 -186 -2 -41 311 73 -125 160 176 379 -148 245 -112 -155 62 67 -167 -155 -372 -365 71 -21 378
7633 378 5 224 -23 96 288 -179 200 -141 -228 242 42 -191 -197 7 29 63 -209 151 -182 152 -309 94
7655I4j24l4K93l06L1j92N29k14l52L33k01Q5j9M42p4k77j68N6R8N1m4lk60J17
7679a39J19j9k08K19K81j47m2R3j09KK31l16J3N4J05L5om45N8K71J44o0Q4o9k74
7704a25k67M49k18o0J7o1O16m20J84%j06L0N1l36O25o86M50j12O2J25j36N3l04
7727a69M21j66K1j09L75l31j68N4K30j74K2k5p3N3Rl2N0P3Q4k04j6J93l7J59l6
7752B04k21R0Rl2kP0K79k17k52J48k51K16r1J5M9j67j1J79o6P9j82K61J60k40
7776B7J35m51K63o3O5j55K34J72k07j10J02J28j28O2j96J86P0k13J83m0l0k19
7798a85J65q8L0j95R6O2L09l92O0q2K80QJ17r0M1j42k2R6j77K08j20j3l80O17
7822B03l76J64jJ61m18M51m19j21N14J20j83J29l47L14k7j63j27j3J70j23K36
$$ plain form
7655 94 -30 -64 229 -77 -46 -238 291 77 -275 58 -143 -58 -77 365 291 14 -154 -98 0 51 7 4 -256 -139
7679 -139 -20 -39 -247 -28 253 106 64 157 48 50 281 -35 -22 32 137 172 166 -279 -221 50 194 134 218 149 -125
7704 -125 -392 57 -161 -221 -204 -265 351 -69 115 115 9 39 90 -246 379 -307 143 31 93 218 82 135 -169
7727 -169 252 86 107 -2 373 42 -126 -72 158 -16 6 -19 -92 -39 -30 -62 -12 61 145 -59 -75 118 81 240 204
7752 204 -17 73 82 50 48 118 397 180 -72 76 -175 41 -50 -35 14 -153 -164 15 -51 28 -154 107 267 27
7776 27 162 -289 -26 -89 -24 -179 55 227 20 -90 12 140 12 74 -122 64 134 -79 104 64 34 -185
7798 -185 -20 -108 -78 -273 -177 -115 194 -198 -138 -220 60 68 185 95 136 -6 -28 68 -109 99 -21 -34 -414 203
7822 203 -173 -9 -10 151 -267 184 -235 -356 158 278 95 224 -123 191 164 1 -126 -139 31 -92 144
7843A44J86m76N3K18k26J77l8k03M2K19j32J49R3j31J36k71J50j1j18r2k3j48
7865c02K89k0R0q4P0n1j09J94O4l44J98j41K69l6l92K78K9K8j95J97j73j5M88
7888C32p46M05R8J29k74O4L9J10o3j76l4j50K16l2L90j51k00j3j49M76k93Q0j96
7911a38K45k98M02j61m21N0M19J02k33J20m62L00J38j26J28j78J02O6OJ55j55
7932F1k92L02PJ02l24k31L34M1k13P1N8L22m05k8K1K38j01NL09k74mn6J46K27
7956C16l63J82k38k79M52O6l09M61km9k73k01L29q3K9j47L4on6L6Q2k19q2L13
7980gl3j26N15m01n2J47L02Q1o30M75k87K7l7j16K10r4K71m21M13n32O49m18j28
8003a92J35lL13j35o5o9O8Q3k06L6k01L74j94J04k2k23J05K35J02j98j05Or8L30
$$ plain form
7843 144 330 -146 -93 125 -101 76 38 -165 -123 96 -36 113 206 75 211 -60 90 79 -39 -131 -154 -302
7865 -302 -13 -33 57 -27 43 -8 -117 77 141 -203 -5 -146 123 87 -305 -27 2 30 -165 32 -141 -156 332
7888 332 -414 -9 89 218 -56 8 47 157 94 -82 -116 -266 -50 -82 308 157 -43 -56 -205 271 -22 58 -138
7911 -138 107 -191 211 50 -371 -321 98 200 -33 87 -375 -75 63 -63 65 -113 -11 55 61 216 61
7932 61 -231 71 78 180 -144 -375 -41 0 -213 -142 -84 238 -167 -195 -174 64 -37 -32 277 3 -1 -57 89 316
7956 316 -47 135 -103 -382 70 136 -173 288 286 237 -36 -237 92 9 38 -109 -75 -81 -137 -101 -19 -238 -320 -7
7980 -7 -40 -166 349 -52 -104 43 345 426 -204 271 -16 11 -26 -142 68 -26 245 -176 237 -295 354 -64 -192
8003 -192 -57 -60 253 118 53 -16 52 135 -71 -35 -236 138 -56 48 26 -197 -92 143 245 47 -58 -52 -150 180
8027A80l18K92k47P5L29n73P7M4J29k47K23l82M53J85r5j54l18K92M0J08k11j87
8049c05M59k02R7l16J16J65L7l52N64o9j28p0Q5l7N6k17K1O9Q5k71J88L01Q0l67
8073a1l50L62k5J46L0l60J38Q1J47j30J43j57J83nl61K67O4j6m5k26nL89n72N75
8097B62j76l53J04K73M1K7l15J16R6j84j38n1J03J05qj25N12k26k04J76l5J21
8119A21J62l76L03k03Q1j38K50j04k84K68n3O6O7j36P3m9J45l17L6LQ5k64L61
8142I7n9K7k65M00j73j27J84j06P4l66M04j76p6J46K05k99K04k9j43L28q5l02
8164a37p9J09K5Q1R4R7k90j5p8J49K95k4k85L6P4M7k30L4qo3Q0L78n47K41n0K16
8190A50L7
$$ plain form
8027 180 -138 154 -93 -18 311 -262 -185 -141 -12 -259 -36 -418 35 220 125 -29 -347 -55 -15 93 -118 -305
8049 -305 154 -48 49 -267 -151 14 51 -301 263 194 66 -4 81 44 100 -117 -96 -27 58 -213 -25 276 356 -11
8073 -11 -361 1 -24 122 152 -208 -70 11 158 28 171 14 197 192 -169 98 162 146 101 -125 -130 259 -313 262
8097 262 86 -267 -163 110 151 178 -137 -21 75 -109 -247 -298 -195 -90 -98 -223 289 63 -141 35 0 121
8119 121 283 -93 210 7 88 -50 200 96 -188 80 27 93 160 24 97 48 193 -124 -88 -85 0 -264 97
8142 97 38 65 -200 200 27 -100 84 -22 52 -314 90 -86 -162 -16 189 -110 94 65 -78 250 165 -137
8164 -137 -216 -107 -82 -1 93 190 -100 -115 -193 -44 251 227 -58 -22 52 99 -131 -97 -105 -168 -88 290 -257 -16 -66 150
8190 150 187
8191A87
$$ Imaginary data points
##PAGE= N=2
##DATA TABLE= (X++(I..I)), XYDATA
0@%%%qJ6j5J5k4L2m0M8n6P2q8J06j30J60j92K24k64L12l63M22m90N62o46P42q38
28d43R50j078J209j356J524j708J908k127K366k630K921l236L584l971M397m867
44b557N390n977O639p390Q249r245J0416j1815J3520j5653J8415k2146K7498l5875
58b0531N0947q6469L16984K76370n91433k34842O4682L00288K71160l3468m44577
69a30889k07207K31328K88390R537j55401k24346o0190K16054K39905r1511k57218
80a41548r2448J35178J89633J04532j13603k37374n5943K19232J92643k6162j57938
91A6202j44279r867J81140J60650p7814j90614o4445P0875J15908O4485q0127
102D2114j51589j3842J25553Q1318l3383r0062p1052L2666J25679O0578q3064
$$ plain form
0 0 0 0 0 -8 8 -7 8 -16 16 -24 24 -32 40 -48 58 -72 88 -104 120 -144 168 -195 227 -263 299 -347 395 -443
28 -443 507 -571 638 -718 806 -902 1006 -1121 1245 -1385 1536 -1700 1884 -2087 2310 -2557
44 -2557 2833 -3144 3495 -3895 4354 -4891 5525 -6290 7230 -8423 9992 -12154 15344 -20531
58 -20531 30416 -56053 260931 537301 -54132 -288974 -224292 75996 347156 313688 -130889
69 -130889 -338096 -106768 181622 191159 35758 -188588 -248778 -32724 207181 115670 -141548
80 -141548 -233996 -98818 90815 195347 81744 -155630 -211573 7659 200302 174140 16202
91 16202 -128077 -137944 43196 203846 126032 -64582 -129027 -58152 57756 122241 42114
102 42114 -109475 -123317 2236 83554 50171 -39891 -110943 -78277 47402 107980 24916
113B4916j06543r255P8944R4860K1289q9659j00945J5221J02001O3226k7017q0430
125a3392o1045K5781Q8403L7553n7617p0096q952M5068N4410O150n9868n2371
137f5976K5494O3637K3738k9283m9419k2882L8106O2730P961n0532m2961M650
149c4737M0322M0201m055m8734l4800K0075M0523J5762j7262l4029j6849K1886
161a1697L3755K58k8749j9952N959K3309J9457p973k9310j2329K0276K4625M967
174B2596j6672k2241n144K2307K3263m184k2291j4540L889J7636J4641o793k1274
187h807q457J1309J4626L263r913j3391k410J3444J2006m458j2414p065N638J2047
201E418P477o920j3988l434J0426J0896J155q661j0635j212J1032Q806l419r619
$$ plain form
113 24916 -81627 -90882 -11938 82922 104211 14552 -86393 -71172 30829 94055 67038 -13392
125 -13392 -74437 -48656 39747 77300 19683 -50413 -59365 -14297 40113 46263 -13605 -65976
137 -65976 -40482 23155 46893 17610 -31809 -54691 -16585 46145 54106 3574 -39387 -34737
149 -34737 5585 45786 41731 -7003 -41803 -21728 18795 34557 17295 -16734 -33583 -11697
161 -11697 22058 22316 -6433 -26385 -20426 2883 22340 14367 -14943 -27272 -6996 17629 22596
174 22596 5924 -16317 -21461 846 24109 19925 -2366 -16906 -13017 4619 19260 12467 -8807
187 -8807 -17264 -5955 8671 11934 2021 -11370 -13780 -336 11670 7212 -5202 -12267 -6629 5418
201 5418 12895 5975 -8013 -11447 -1021 9875 11030 2369 -8266 -9478 1554 10360 6941 -2678
215b678n086J891Q357N054m206q861j670N798N782R1n071n422N98P144M894l448
231C167o050k526K879O211K663m122o474p67M986M312L61m088m702M0N569K434
247C893j794l820k015J436M085J297k502l569K50K642K507k96k430k704J263L590
263A833J522j879k858j236J348K797J473k170k562m24J715K402q9j849j896L43
279a530J824J086o14j374r15M90J913N58j294j615J27J640Q40M93j772j023K5
296a141J457J117o43j090p89L46J466M86m54j064l57L80O90L52p44p37o5P83P37
315G30l88o27j98k1Q18M92k07r69k93K75O53K61k58n17j92O10K13M54o77l00k05
336c46K35N91Q2n37o73j7P92K71J5p75k25K66N78K61n15n09j39L85P09J18l68
$$ plain form
215 -2678 -7764 -5873 2484 7538 3332 -5529 -7199 -1401 4381 4472 -599 -6021 -5423 1721 6615 3167
231 3167 -2883 -5409 -2530 3681 6344 2222 -4252 -5019 -33 4279 4640 552 -4150 -4110 1459 3893
247 3893 2099 -1721 -3736 -2300 1785 3082 580 -2989 -2739 -97 2410 2114 -316 -3020 -1757 1833
263 1833 3355 1476 -1382 -2618 -1270 1527 3000 830 -1732 -2156 -441 1961 1872 23 -1873 -1530
279 -1530 294 1380 766 -608 -1523 -1033 880 1438 144 -1471 -1344 296 1136 1629 -143 -1166 -1141
296 -1141 316 1433 790 -300 -1089 -743 723 1209 755 -309 -666 -286 404 756 12 -725 -790 -7 730
315 730 342 -285 -483 -504 314 806 599 -370 -663 -388 265 526 268 -249 -441 169 382 836 159 -141 -346
336 -346 -111 480 562 25 -648 -665 127 398 413 -362 -587 -321 257 518 3 -506 -645 -260 449 567 199
357A99l55k20M43P05n87k17l61K41L47K2K30q14J9J03Q31j51l03n05J49K84K76
378C36J73m73l20p8L02O77m99k40m16M80N38J62q03l59J56L20N50P2p54j37L44
399C1N6K85j08k76k26J46L97N1p14K12l23L52O31j78o18k54J7O05O43o65k77k83
421d96N08K71M17l25p64j62N64N11k31k95j95k18Q27k13J24m26o77Q07M81k02
441C06m36m98K68L77J18L83p85q1R9M16m6Q0n06J46N32j49J51l80l60J89L53K03
463C80j71n89j67M32O55p8l37l37j86O79K35n03j12j22p7L32M67m66l70j16N54
484A03J08k72L03l16p2J47P9k27K31m94P4O43J4k83Rm07L28K82l64j50m5J42N05
507C38L51k72m19k10m5M70L06l63l27j62K18M41j71k54QJ71nJ76q7o84R5N50O3
$$ plain form
357 199 -156 -376 67 772 185 -32 -393 -152 195 217 447 -367 -348 -245 586 435 132 -373 -224 60 336
378 336 509 36 -284 -362 -60 617 118 -122 -538 -58 480 642 -161 -520 -364 -44 506 578 -176 -313 31
399 31 87 372 264 -12 -238 -92 305 356 -358 -146 -469 -117 514 336 -282 -536 -519 86 729 64 -213 -496
421 -496 12 283 700 375 -389 -551 13 524 293 -2 -197 -415 412 199 323 -103 -780 27 508 306
441 306 -130 -628 -360 17 135 518 -267 -348 -249 167 121 201 -305 -159 373 224 375 -5 -365 -176 177 380
463 380 209 -380 -547 -115 540 462 125 -212 -398 281 516 13 -99 -221 -298 34 501 35 -335 -451 103
484 103 211 -61 242 -74 -146 1 80 -147 84 -410 -336 307 321 38 47 -360 -32 250 -114 -264 -309 -167 338
507 338 689 417 -2 -212 -257 213 519 156 -171 -333 -115 326 155 -99 -91 80 75 251 164 -520 -425 125 188
530A88K0j65m6%K94j97J81l81j91K43K5M77m39l1l45Q9M21k2j87j0j84J1L13J32
554A96l14j02K22J62J50r2n0m11M13j35K09k3k96k88K55K06k7Q3j76m8N8J41j2
577A21p89P8O90L85l92j59J7o7K61k14K68k51o6J15O9P4k40j1k27L53J32J06m24
600a71K1nK76J66k17m25M52Qj07K39j63j96j0J82J92r5j57n1J1R8J61J27j80k94
624a38k1K68Q7L8j54k11j8P2J96k79M02l79M42j23j74r4M6m5J1M90j89k50m6p4
648a43L25m8o8j30L6L36j94K58k08j61j42K33K0L1k65R8O9j84L33m69J60Q9L7
671A3K58o6n67L9J7J50L77j38R9m76K80k7K10o9k53j30Q7K25l32K79l67M12J6
694C7J82j60J25o15L01N55k45n6j33k37M68k60O9k39j45M91p0R9r2j69K9J72j28
$$ plain form
530 188 208 43 -3 -3 291 94 275 -106 -297 -54 -29 448 9 -22 -367 -278 143 121 -66 -76 -260 -249 64 196
554 196 -118 -220 2 164 314 222 172 -239 174 39 248 225 -71 -359 -104 102 75 158 -18 -66 -8 133 121
577 121 -668 -590 100 485 93 -66 -49 -116 145 -69 199 -52 -118 -3 66 140 -100 -111 -338 15 147 253 -171
600 -171 -150 -155 121 287 70 -355 97 105 -2 237 74 -122 -132 50 242 147 -10 -61 -50 48 209 336 156 -138
624 -138 -159 109 196 234 80 -131 -149 -77 119 -160 242 -137 305 182 8 -86 -40 -85 -74 416 227 -23 -69 -143
648 -143 182 134 66 -64 -28 308 114 372 164 3 -139 94 114 145 -120 -22 47 -137 196 -273 -113 -24 13
671 13 271 205 -362 -323 -306 -156 221 83 182 -294 -14 -41 169 100 -153 -283 -196 29 -303 -24 -391 21 37
694 37 219 59 184 -431 -130 425 180 124 -9 -246 222 -38 31 -208 -353 138 68 167 75 -94 -65 107 -21
717b1J25j20o2j53M34k43K07m47L98k01n4J80J50k54O1m2J10O5k68j47K82j3J14
740A01j28J22o5J47n5k43l1m2n4M81m5m29J52n3j33K17Lj06K72l14J74K21p2j54
764c4r0J53n5qK3k24o3L49j5j31J92R7k30M7K06R5n27O3K00j16J21K7k05J46P6
789I7l20M54n57N45j64j23P9K98k49n1O1p6o0Mq9n3J65Q5k64J84k50k3L65n0J40
814A48l61L48j75M9J23J6j48p6K65K4l08J9p1J23J37j85J81r7p8l02K45j34K58
837An9K82j52o7k12L35j18J25j85J62k03j11L7q2L94k64J85j56O2p5K00k54K5
860a30J8l5K20P9K2rk98K52l64K65m5P8j35J59J53k55k9k48RL70K5r8K0k4K52
885B52m50J52j20L86m49J69K07l02J35L0PM1n47L59L27k14L0r7L53n44J89K41
$$ plain form
717 -21 104 -16 -78 -231 203 -40 167 -280 118 -83 -137 43 193 -61 0 -42 68 133 -135 -282 0 -13 101
740 101 -27 95 30 177 122 -121 -152 -194 -248 233 188 -241 -89 -142 -275 -58 -55 -161 111 -203 -29 192 120 -34
764 -34 -124 29 -26 -34 -11 -235 -298 51 36 -95 97 194 -36 11 217 312 -215 -152 48 -68 53 80 -125 21 97
789 97 -223 231 -326 219 55 -68 11 309 60 9 70 -6 -66 -62 -151 -204 -39 46 -218 -34 -284 -307 58 8 148
814 148 -213 135 -40 9 132 148 0 -76 189 213 -95 -76 -147 -24 113 -72 109 12 -66 -368 -123 -257 1
837 1 -58 224 72 5 -207 128 10 135 -50 112 -91 -202 -165 -247 147 -117 68 -88 -26 -101 99 -155 -130
860 -130 -112 -147 73 152 174 165 -133 119 -245 20 -25 53 -82 77 230 -25 -54 -302 -293 77 102 4 24 0 252
885 252 -198 -46 -166 220 -229 -60 147 -155 -20 10 17 58 -489 -130 197 -17 13 -84 269 -275 -86 155
907A55J08l41r8J58k07M22n6p3L4j79j8K79j63p7jj62K97j96M40m25K32n2J0j9
931F8L4l78K45k8J96j66l26L50k34L93k1j54J0m3j45j50M83l56r5K49K45p8q4
954A5K48m67M33n1l49m3J18P9q0L26l80N5j24J40j02r6K96Q2k41J60K02j36l96
977c11L98l56K12Q2qpq9M7nNJ01j61N2O5j60K31j37j73L56Q9l21J93k72J91Jp5
1003e2J78j03q0j6r1n5K81J41k61J50k40K21M5q7l37K43j1rj65Q8j03O1K46K45
1027B89m50K49r6Kq8r4J96J03o3j29K44o11M67L2j38M0O3o8j39N92p24M34j69
1050e8P0j2q2NK44l15L17k60Q2K0nj18L80L7m17l8K79j93K88k32M3j47N0L17o16
1075c61P60m21o4J28J72j44o3K25n44M11P8k33K92k6l88K63m5j39JJ08j16L25
$$ plain form
907 155 263 -78 -176 -18 -225 197 141 68 102 -77 -95 184 21 -56 -57 -219 78 -118 322 -103 129 77 87 68
931 68 102 -276 -31 -59 137 -29 -355 -5 -239 154 133 -21 -11 -54 -199 -349 134 -222 -317 -68 177 99 15
954 15 263 -204 229 178 -171 -214 -96 -17 -97 229 -151 -96 -220 -80 -182 -278 18 100 -141 19 221 85 -311
977 -311 87 -269 -57 25 17 10 -79 -32 -37 -32 69 -92 -40 25 -135 96 -41 -214 142 231 -90 103 -169 22 23 -52
1003 -52 126 23 -57 -73 -164 -219 62 203 -58 92 -148 73 118 31 -306 -63 -74 -83 -248 -160 -263 -202 44 289
1027 289 -161 88 -8 -6 -94 -188 8 111 48 -81 163 -448 19 51 -87 -47 16 -52 -191 401 -323 111 -58
1050 -58 12 0 -82 -77 167 -148 169 -91 -9 11 6 -112 268 305 -112 -150 129 -64 224 -8 35 -112 -62 255 -361
1075 -361 399 -22 -86 42 214 70 7 232 -312 99 177 -56 236 210 -178 85 40 -99 -98 10 -106 219
1097B19j69J1j92l3R9Q1O5J4j1j56K16l19M72m41R7K5q9J7N1J98P7l63L49j79
1121C9j93Q7M4J30j51J58k47j10J59m2j27L29k55O4oK50P4q1l78J90j02o3M55
1144B24k02N4j99j8M7K13l9J47r0j48q8J15J86m12N69k40J7j38j14N2k32L00K74
1167B78k47lK7R4N5j86k9J51nk13J8J90R6R1m15R6k76L31j34M60j88k29K53k57
1191d2R1jk29K67k48R1k86L88j6J14j40j50J31MN3j47j0j65J02J09j31N15l25
1214b5j57J89J04j45k22J90j0Q5n8L01k11J48j21l98K16J15Q4j02l2j43O9M1R4
1237A2j17MJ16O7mJ07kn54J28K58j25n9L86l06L5j61J29N6j07J07j54l0M89l85
1261a10P4j95L26l22J97J08J77j99Q4j47r5K00k8j7Q3m6j92P6j45K51k7k11K22
$$ plain form
1097 219 50 61 -131 -164 -65 16 81 95 84 -72 144 -175 297 -144 -47 -22 -111 -94 -43 155 232 -131 218 39
1121 39 -154 -67 -23 107 -44 114 -133 -243 -84 -126 -253 76 -179 -115 -121 129 203 122 -256 -66 -168 -231 224
1144 224 22 76 -123 -141 -94 119 80 227 137 -11 -99 16 202 -210 359 119 136 -2 -116 -64 -296 4 278
1167 278 31 28 55 149 204 18 -11 140 135 -78 -60 130 226 317 -98 -2 -278 53 -81 379 191 -38 215 -42
1191 -42 49 48 -181 86 -162 -71 -357 31 15 129 -11 -161 -30 -26 27 -120 -130 -295 -193 -84 -215 300 -25
1214 -25 -182 7 111 -34 -256 -66 -76 9 -49 252 41 189 68 -330 -114 1 85 -17 -49 -192 -123 -82 12
1237 12 -105 -101 15 82 78 185 183 -371 -243 15 -110 -169 217 -89 -54 -215 -86 -30 -137 -30 -184 -214 275 -110
1261 -110 -36 -231 95 -227 -30 78 255 56 140 -7 -102 98 70 53 136 90 -102 -26 -171 80 53 -158 64
1284F4n3J52M9l02r4N16n76R6L00k91J71J21j82j41K72k03L14o45K33K61J23r6
1306H9L0j34L41m09K35j26q8K63m16L17K5jK3j80Q3r6L74j87k30O3J76p9k82n1
1330b60R0M09k33p9J12n6N1J7N8r6k33J33M26j40j99J8j49J33j81J07N5J58j30
1353A1j15OJ29K5k90K64j36K45OLNj06o2j90r1J79k1K0L9J33q3j85L33j51p0K36
1379A34m70M02j27j62L68o9K20k20k64L99j82J2p3J5R5l1n6m3M47k46L54o25M01
1402B79k94J16J1l19o0J88j99K93M49l00l18J83J0j67K70rJ6l05M50n28K74J7
1424E7n4J7K77l67K26l27Q3J17m0j93k2J90L9m82O73j54j13m5L2N21l99k22J35
1447e1n9P4j85K86L4o5j52K52j22k1K05k00Q5m1J20K5k1J55m90N3L5K16k78L11
$$ plain form
1284 64 11 163 212 -90 -184 332 -244 -148 152 -139 32 153 -29 -170 102 -101 213 -432 -199 62 185 89
1306 89 119 -15 326 -83 152 26 -62 201 -215 102 127 126 149 -31 52 -44 330 143 -87 -24 152 73 -209 -260
1330 -260 -170 239 6 -73 39 -17 34 51 109 13 -220 -87 339 199 0 18 -131 2 -179 -72 -17 141 11
1353 11 -104 -98 31 56 -234 30 -106 139 145 148 153 47 -15 -205 -296 -117 -138 -118 -79 54 -29 -214 119 -32 -102 134
1379 134 -336 66 -61 -223 145 76 296 76 -188 211 29 41 -32 -17 78 47 -9 -52 395 149 503 -122 279
1402 279 -15 101 112 -207 -267 -79 -278 15 464 164 -154 29 39 -128 142 133 149 -156 294 -234 40 57
1424 57 3 20 297 -70 156 -171 -88 29 -11 -204 -226 -36 3 -479 194 40 -73 -118 -86 435 36 -186 -51
1447 -51 -110 -36 -221 65 99 34 -118 134 12 -9 196 -4 81 40 160 185 164 319 -171 -118 -83 133 -145 166
1471A66j54J55l4k10k07K35J16k61J26J71p2j96L81n23J50O7K59j66k52M41n8
1492A34m7l56L64q7O1j67M35l68k79Q8MK64pq9pj3mK81k52J94k35K77l9j60k8
1517c6J66k37m6p3N54k86j71P3P2qj59K09j32M13n20N6L27M4j83q2J8j28K71J11
1541B53k53k58L05L24m87N9j67N33k47Rn2O1n9L0J83q3j73O7M5j05k48L90q7N7
1565I7j97P7N7OJ27ql92L20j47J62N9l57R1j1J42j11P8k58L11Q0m08J20K5j88
1589c25J17J74j42L6K57k07j51j79K78R6J11j35R9n56N40J52n6k34J12J0o9K2
1611e0K54o0m65MK85Q3K9l6r1K37j81j26L43k32J35l73J29K8K43k41J9j2L9q3
1635a22K11J32j69J16m0Q6l66J91K49j47p6k96N1N6K34k30O4j30N33k23j0l50
$$ plain form
1471 166 12 167 133 -77 -284 -49 67 -194 -68 103 31 -165 216 -307 -157 -90 169 3 -249 192 134
1492 134 87 -269 95 8 69 -98 337 -31 -310 -222 -218 46 39 -50 -57 -70 -74 207 -45 149 -86 191 152 -8 -36
1517 -36 130 -107 -153 -226 328 42 -129 -56 16 8 -151 58 -74 339 -181 -125 202 246 63 -19 -1 -129 142 253
1541 253 0 -258 47 371 -116 -57 -224 309 62 71 19 80 21 51 234 151 -22 45 90 -15 -263 127 40 97
1565 97 -100 -23 34 40 167 159 -233 87 -60 102 161 -196 -105 -116 26 -85 -7 -265 46 126 -282 -162 -137 -325
1589 -325 -208 -34 -176 -140 117 -90 -241 -420 -142 -46 65 -70 29 -527 13 165 109 -125 -13 -3 -72 -50
1611 -50 204 144 -321 -317 -32 51 80 44 -47 190 9 -117 226 -6 129 -244 -115 -87 156 -85 -66 -78 -39 -122
1635 -122 89 221 52 168 128 214 -152 39 288 141 65 -231 -180 -124 110 -120 -56 -186 347 124 114 -236
1657b36K56L54m47M8k92L78j74P1J9J70n5l8l74l7K80k88J84N1K44N1l74J69K2
1680a8N8l70M51j82m1J2J81j12j68K12K10o8j33l38K82o0mO4j16K76k25M25l64
1703b8K29r6J76n19j26J64J09K86n38L83N4K7k7J82l96K49N1p7O4k53k6N3L17
1726B58l09q2l8J49O9j40K60k72K08r1j79K20k13Q4J83p9K50k60n4mJ98k24L3
1749c3j50J83k6R0m81J28N92j50k53L0O1j23K3J90j11P5k08J65J42l15J80Q0p1
1772A8p9k07L60k13N4J59J73m50K32Q2j01k18K57ok2L31l48m4L32k90K43K3k32
1795E4j3l46L30P0k54O9K82l24J46j20R8jj49J93k53M06k91K07l15q9L46r9m4
1818i7L60p9o5J72n20J51J69qj38j17M11j46l55K06r3K68l52L25nk34K86M1k96
$$ plain form
1657 -236 20 374 -73 -25 -317 61 -113 -42 -23 147 92 54 -320 -357 -77 -365 -181 -130 114 165 -209 -40 -18
1680 -18 40 -330 121 -61 -102 -90 91 -21 -189 23 233 165 32 -306 -24 -84 -88 -24 -140 136 -89 336 -28
1703 -28 201 105 281 -238 -364 -200 -91 195 -343 40 94 121 94 276 -120 129 180 103 167 -86 -112 -59 258
1726 258 -51 -133 -171 -22 47 -93 167 -105 103 12 -167 53 -160 -76 107 28 278 18 -36 -40 158 -66 -33
1749 -33 -183 0 -26 64 -417 -289 303 153 -100 -70 -9 -132 -109 81 -30 45 -163 2 144 -171 9 89 18
1772 18 -61 -268 92 -121 -67 92 265 -185 47 129 28 -190 67 61 39 370 22 -22 310 20 263 286 54
1795 54 41 -305 25 95 -159 -90 192 -132 14 -106 -8 -9 -158 35 -218 188 -103 104 -211 -300 46 -53 -97
1818 -97 263 184 119 291 -229 -78 91 83 -55 -172 239 93 -262 -56 -149 119 -233 92 87 -147 139 180 -116
1841a16L07p4k65J56J04o2k58K79k11J84J8j10K02k91K75P5k5k07M5j71L08j79
1863a6o8M8L52l39Q2k48N13m7m42K69k12j75M79k95L4J65K35k00k19K6r4K74j90
1886f8j60J80n1L0L07k03j22K95m73J83M60m21j53N0J46j12K5M29k82n9Q5O2j80
1909c2J13l7j61o5K30O8l98J02J41R5K77k82o3j55P7r9J15J53k91J00K35j34K9
1932A8k5j59K35K12m97J84J54j22J97l68J72J1Q5k88N1K33n05L44K41l19K38k43
1954a51K7k58M07j77O9K11k4k0k16K7N4j28l9L99j23l16K71J86l33p4K39p4q1
1977a24KL21l37j77L93k11J51k6j45O1K75k04r2K87l18P2N2k83m4N22j85K03l3
2000A60j63J33k43L02k19m8l48M96J2j93J35J13k35K17k18p0J35j2K26j10K7k8
$$ plain form
1841 -116 191 117 -148 8 112 50 -208 71 -140 44 62 -48 154 -137 138 213 188 -19 26 -145 163 -16
1863 -16 -84 -36 316 -23 59 -189 324 277 -165 104 -108 -283 196 -99 -65 100 335 135 -84 -58 -152 122 -68
1886 -68 -228 -48 -99 -69 238 35 -87 208 -265 -82 378 -43 -196 -146 0 -112 -87 342 60 1 86 148 -32
1909 -32 81 44 -117 -182 48 116 -282 -180 -39 56 333 51 -12 -167 -90 -189 -74 79 -212 -112 123 -11 18
1932 18 -7 -166 69 281 -216 -32 122 0 197 -171 1 12 97 -191 -140 93 -412 -68 173 -146 92 -151
1954 -151 -124 -382 25 -152 -83 128 104 84 -132 -105 -51 -179 -218 181 58 -258 13 199 -134 -208 31 -43 -124
1977 -124 -122 199 -138 -315 78 -133 18 -8 -153 -92 183 -21 -113 174 -144 -72 -20 -303 -347 175 -10 193 160
2000 160 -3 130 -113 189 -30 -78 -426 70 82 -111 24 137 -98 119 -99 -169 -34 -46 180 70 97 69
2022F9k51J76m3j83J94l6J24l19K05J32j69n9J68J03l17J90N0k3j40n2oJ70J2
2045eJ95m54J51J21J15k25P5J23k67J36R0J5j33j59K66k99M7J88Q9J07k74J58
2067F0k07K58j44o1J49j34j9K19l05J76K20N5l46K19j89j71M68j98K4j13j42L19
2089A38l52j5K5L91j29J79k77Q6m0k0n6L36l28K53N7j68p9k5k0M5Nj0l7J36J19
2114B14k35k3L41k79m68N18R7lo0j5j96K3J57k17J34l5j42J69J4M7j19L16l38
2137a00L33k96J30J43j21Q9N4k58j56L61l93J77R3j19l5P4K83R4j92M3l8l96J55
2160g5j26p4j51K61J05L90l17J90l17K20k91Q4O6K25n27L13K31J82k29J49j8k97
2182fJ78l73O38n89K80l33J55oJ88k90K80k81k7l6L84j57j79J83m45N06K05k50
$$ plain form
2022 69 -182 -6 -49 -232 -38 -74 50 -269 -64 68 -101 -160 8 111 -206 -16 34 11 -129 -181 -187 -17 -5
2045 -5 190 -264 -113 8 123 -102 -27 96 -171 -35 55 70 -63 -222 44 -255 -208 -20 69 176 -98 60
2067 60 -147 111 -33 -94 55 -79 -98 121 -184 -8 212 267 -79 140 -49 -220 248 50 74 -39 -181 138
2089 138 -214 -229 -204 187 58 237 -40 46 6 -14 -70 266 -62 191 248 80 1 -24 -44 1 6 -4 -41 95 214
2114 214 -21 -44 297 18 -450 68 165 162 102 87 -109 -86 71 -146 -12 -47 -189 -20 -6 41 -78 238 -100
2137 -100 233 -63 67 210 89 178 232 -26 -182 179 -214 -37 56 -63 -98 -24 259 353 161 204 166 -230 -75
2160 -75 -201 -275 -426 -165 -60 330 13 203 -114 106 -185 -101 -35 190 -337 -24 207 389 160 309 291 -6
2182 -6 172 -201 437 -152 128 -205 -50 -56 132 -158 122 -159 -186 -222 162 5 -174 9 -436 70 275 25
2204B5K85l19J9J29o6QL52l79k58L07o3j17K02l1m03L79p0J90o3n1k00J88J75
2227B39J16n00J50n3O2j44K72o0l75L19k17J20J82l31J02K72m20L82J13Qk04N4
2249H7m0qJ27k84P2k71L83k7j07K57j41lj47j72K07K7J78j1k72J56P4k05q7K02
2273eK19j45K43l10M1j5j28J17j91J54j03M8P2m9J27k65J3K72Qr8J2j11O3J33
2297A02K4j71l0K05k52N90o64K06k12L38m01K31p5J12o6KK76nk97j51J92Qk18
2320b56K35L54l31j3J78l76K40K3j5K92p28K66R1N6Q2r8O6l46L01J28r2J27Po2
2344A29k20K00J02k95R6J34j49J80l51J39K17m51K03J0j3j05N02n26R2N97m85
2365Fm8J89O3l04J67m72M89l25Q7J72p4L33l10j79J92J78k23j11K10J5j93J76
$$ plain form
2204 25 310 -9 10 139 73 81 433 54 -204 103 40 -77 125 94 -309 70 0 190 127 76 -124 64 239
2227 239 355 -145 5 -48 14 -130 142 82 -293 26 -191 -71 111 -220 -118 154 -266 116 229 237 33 87
2249 87 47 39 166 -118 -46 -317 66 39 -68 189 48 45 -102 -274 -67 -40 138 127 -145 11 85 -120 -207 -5
2273 -5 214 69 312 2 43 28 -100 17 -174 -20 -123 -75 -3 -52 75 -190 -177 95 103 5 17 -94 -31 102
2297 102 126 -45 -75 130 -122 468 -196 10 -202 136 -265 -34 -109 3 -63 -61 215 210 -87 -238 -46 -38 -256
2320 -256 -21 333 2 -11 167 -209 31 54 39 331 -397 -131 -40 16 98 0 66 -280 21 149 57 184 191 129
2344 129 -91 109 211 -84 12 146 -3 177 -174 -35 182 -269 -66 -56 -69 -174 328 -198 -106 491 6
2365 6 -42 147 210 -94 73 -399 90 -235 -148 24 -50 283 -27 -206 -14 164 -59 -170 40 55 -138 38
2387C8M1J86m07K18p6R6qm4nO5J22j83R5r3j2K74k98k25K51K1N8k51K26P9q9R
2413H8k38K45j20n9K13l58L62Kl30K62K2o4k04L78k01K8p6k97L53J17l07R1P8
2436a5j3m0J78j37N8j65O9L2l3P3K17l21K86n68K40K21m1J55l16J08j09J77r4
2459c8n3L19r0j73J37j96k04n9L78J67j57M18l96j31J57k14L57l20M82l35k49
2480b00O84n31J63j40M3Q1k33J54M05m59J97k01J71JJ49k70j0j08M0P5k7o0L05
2503B29k00l25J80P0J1K89o3j34K42m38K09k03K06Q0k35K10J5J00j84p5M1j98
2525a73L66j09q2o5J81l37K22L04k55k8K83j60l75L09K2JK6j83l9N8N1J8j64L39
2549B10j58L4J44l8m64L62j99M5L63r8j21J92j20k04J11l7k45K66k4L9l42M64
$$ plain form
2387 38 79 265 -142 76 0 96 88 44 39 104 226 43 138 45 33 307 9 -216 35 56 114 -137 89 168 79 88
2413 88 -150 95 -25 -84 129 -229 133 135 -195 67 89 25 -179 199 -2 26 -50 -347 6 123 -184 -93 -15
2436 -15 -28 -68 110 -27 31 -134 -65 -33 -66 7 224 -97 189 -379 -139 82 41 196 -120 -12 -121 56 -38
2459 -38 -91 228 138 -35 102 -94 -298 -357 21 188 31 449 53 -78 79 -135 222 -98 384 49 -200
2480 -200 484 -47 116 -24 19 100 -133 21 426 -33 164 -37 134 135 284 14 4 -104 -64 11 -16 -76 229
2503 229 29 -296 -116 -46 -35 254 191 57 299 -139 70 -133 73 153 -82 128 143 243 59 -16 25 -173
2525 -173 193 84 2 -63 118 -219 3 307 52 24 307 147 -228 81 103 104 130 -53 -92 -34 17 35 -129 210
2549 210 52 86 230 192 -272 90 -109 -64 299 201 80 272 152 -52 59 22 -223 43 19 58 -284 180
2571A80l7k26pj96M62l31K48j91k1K66j61j24K34k9q9J4N6K49m27K34L15n49m6
2594a76K96j63J18L01m73l39M40K6l6k12K3N8K12m24J68N89m23o8p0K33L76m61
2616eN3K23l80o0j2J16j55L17j46n3K46k06K17R1l1k61L25n25L38j91r1o6M78
2639B22j81j03O2kM59l53Q2k19K8N1j5l61K31P9oj0j23M8l66N46q5J57j23pM85
2664D96n47J02K16q2m39J07K34K20k72j67P9L04l95Q8k7L26l4j89J79l26K4J42
2686C9J98N8l97J90k04L51j37l7M5J85l12O7LJ17l94J16J30O6K07l52J61j53r
2709f2M6P6k86J84k48K46j01O8L1L72l10J66n28M37J36m32p3K82O1l14L76J57
2731B84l61Q7j69J72oj68J54j89L33k8m0J34j28P1j71j67L57j52k3j44l7L14j60
$$ plain form
2571 180 143 -83 -90 -286 176 -155 93 -98 -119 147 -14 -138 96 67 -22 -8 48 297 -130 104 419 -130 -176
2594 -176 120 -43 75 376 -97 -436 4 30 -6 -218 -195 -137 75 -349 -181 408 -15 -83 -153 80 456 -5
2616 -5 48 271 -109 -169 -181 -65 -220 97 -49 -102 144 -62 155 246 215 -46 279 -246 92 -99 -190 -256 222
2639 222 41 -62 0 -2 457 104 186 -33 -5 46 31 -330 -99 -20 -26 -36 -159 -111 -477 69 -16 141 18 11 496
2664 496 -51 51 267 185 -254 -147 87 307 35 -132 -53 251 -144 -56 -83 243 209 20 199 -127 -103 39
2686 39 237 295 -102 88 -116 235 98 61 106 291 -21 46 49 166 -228 -112 18 84 291 -61 100 -53 -62
2709 -62 -16 60 -226 -42 -290 -44 -145 -77 -46 326 16 182 -346 91 227 -205 -278 4 65 -249 127 284
2731 284 -77 10 -159 13 7 -161 -7 -196 137 109 69 203 75 146 -25 -192 165 13 -10 -154 -191 123 -37
2754c7j29M29l03o7M46o1j20l87J59M0m06M69J26k09k44J10P8R8j69L14j15n6
2776c4J39r4nl81O47l10k06L79q8k51O2J31K17q0j1m5j72M97p55m3M91M1m62L09
2800b4K02j31j7j29K04m36L92j26m1J38p3q6K44J7j19J5K54KM5k32J40l79j57
2823b97M90j27O3j61J34j18M42j93q3l11J91M0K4J62l85m5k2J54k58M31k91o2
2845b22M96r7k95n3L10j21Q3L8J27n22M11J87o75K86N3J7j72J06Q8r1m0M7M0m01
2869d00O51l03l9K23M0j97j39M19j59k90J18K62k97M1o7J33j52J15Qj25pL15k46
2892i6j1L11k75J20n2J86k20r2o4J63J01m73L55J73J25j92m39N57n1k74J64J77
2914A93k46K38L17p55J19K64j52n1J66J01l69L64j57J13q9l24L00J38j12j91K30
$$ plain form
2754 -37 -166 263 -40 -107 339 278 158 -229 -70 -30 -436 33 159 -50 -294 -184 -106 -8 -177 137 22 -34
2776 -34 105 11 6 -375 272 -38 -244 135 47 -204 -142 -11 206 126 115 70 -102 395 -360 -403 88 129 -333 -24
2800 -24 178 47 30 -99 105 -331 61 -65 -106 32 -41 -127 117 134 15 30 284 286 331 99 239 -140 -297
2823 -297 193 66 129 -32 102 -16 426 233 150 -161 30 70 94 256 -129 -174 -196 -42 -300 131 -160 -222
2845 -222 274 177 -118 -171 139 18 101 139 266 -256 155 342 -333 -47 6 23 -149 -43 45 -46 -86 -39 1 -400
2869 -400 251 -52 -91 132 172 -25 -164 255 96 -194 -76 186 -111 -70 -137 -4 -156 -41 -33 -158 -165 150 -96
2892 -96 -107 204 -71 49 -3 183 -37 -129 -193 -30 71 -402 -47 126 251 59 -380 177 126 -148 16 193
2914 193 -53 185 502 -253 -134 130 -22 -73 93 194 -175 189 32 145 56 -268 32 170 58 -133 97
2935I7P6k0k66l2N24l17K61l94J35J09k99j05J12L87m13J10J4j17J75n0p8K00
2957A09k30K15l66K89J69j79l8r8p5M62L2Kl74J65k99r1K31j28L4l9L21m4l9J08
2981A37k86P8K55K27o01L04Jj85l2o4R2M30k27n7j3lQj83P0K87k22R1o0Rm56L49
3007e1m8L03j27N7j57M8K29m56J99M8K39k09k62L13n66L29j6L55nj98j88K1r1
3030b33L30j33j19Q7M3M85m04K65l34l20J39J02M31n6k85l16J92P5j97K29j13
3051a32J62K71k75J90m50J33M12j87l43K26q5L59m8o84L34J43Q8m44N29L6k90
3072e5R9L40m85K49l65J60j10J63j6J37r7O5l8j69%j62N9J05K18r1ml22J29K83
3096I3J9k52K73O6j80K3o7N4j33J8k72L23J67m34L98j12m5J59j23k21K69L2n0
$$ plain form
2935 97 173 153 -113 -145 379 62 323 -71 64 173 -126 -231 -119 268 -145 -35 -21 -138 37 -13 -91 109
2957 109 -121 94 -272 17 186 7 -31 -129 -204 258 290 292 -82 83 -216 -307 -76 -204 -170 -209 112 68 29 137
2981 137 -149 -71 184 411 -190 114 115 -70 -102 -166 -74 356 129 72 59 56 64 -119 -49 238 16 107 47 56 -400 -51
3007 -51 -99 204 77 134 -23 25 254 -202 -3 45 284 75 -187 126 -440 -111 -127 228 223 25 -163 -142 -233
3030 -233 97 -36 -155 -68 -25 460 56 321 -13 -333 -194 -92 339 283 -2 -318 -126 -51 -248 -19 -132
3051 -132 30 301 26 216 -234 -101 311 124 -219 7 -78 281 233 -451 -117 26 114 -330 199 235 -55
3072 -55 44 384 -101 148 -217 -57 -167 -4 -20 117 20 85 47 -122 -122 -284 -225 -120 98 7 3 -319 -190 93
3096 93 112 -140 133 199 19 42 -25 29 -104 -86 -358 -35 132 -302 96 -16 -61 98 -25 -246 23 55 5
3119EJ29j52k13J08n0k6K20J22k21o3J69j57K37j36j75K68o8k02J56J86O3k37
3141c7j71K08l23J03M00Q7m32J52j18L79j19J12k46J73j60p5K1J8n0O2K53j75
3163F2J63j06nj53j13J88l85L28J42o8K7J05j64R3m59L67j73L11l48P4J08R9p1
3186B2j3q6M3O4l93N81l2l07J90j71r2Q1r4J95j87K09K7J39j17l24M02M3n13L53
3210B0K47o38K41K88p9J26k03m6j27K56lM20m53L34l68Q2R4j91l7oO1k04J07K13
3234A34j08r4j01j32K76J15O2m07J75K59m64M68Jk45L6o7k38M08lj68J82k07O3
3257e5j83M00q8j2k68L29k43J59j38J73o3Q6L1j63N8J64j0m08K13m4J05j70J32
3280Ej71R3M09n66K99k62K11Qk7j42L36j83k9k0k29K70j4J69j64M4n3J30J32j76
$$ plain form
3119 5 134 -18 -231 -123 -173 -199 21 143 -78 -141 28 -129 108 -28 -203 65 -3 -205 -49 137 200 -37
3141 -37 -208 0 -323 -220 180 267 -165 -13 -131 248 129 241 -5 168 8 -67 -46 -28 -78 -16 237 62
3163 62 225 119 114 -39 -152 36 -349 -21 121 53 80 185 21 114 -345 22 -151 160 -188 -114 -6 93 22
3186 22 9 -77 -34 30 -363 218 186 -121 69 -102 -194 -113 -207 -12 -199 10 37 176 59 -265 137 180 -333 20
3210 20 267 -371 -130 158 79 205 2 -44 -171 85 82 502 49 383 15 97 191 0 -37 -43 18 -186 -79 134
3234 134 26 -68 -169 -301 -25 90 152 -255 -80 179 -285 183 184 -61 -25 -92 -330 78 75 -93 89 -118 -55
3257 -55 -238 162 74 62 -206 123 -120 39 -99 74 11 97 128 -35 23 187 177 -231 -18 -62 43 -127 5
3280 5 -166 -73 336 -230 69 -193 18 26 -1 -143 193 10 -19 -39 -268 2 -12 157 -7 37 -16 114 246 70
3304G0k38J55p2L0R9j73L18j07j27K8pl80L91O1q7Pj02L35j07l3Q1j38L1k6k8
3329a9kK37j86Q6o6k91J94K30k29j00j32N39J39l34K9P8j90j17k08n2N28j14R9
3352A19l7l01M51l84K53j40j9N2L48j26J07m40j9J50L3K88n79L81J74n82M49o06
3374d28N71k10j56M30n09N68j72Pj20pK00l27R9K28l52K1L23m10L43j28k82J37
3396a74m7K95j84J01R7q3M11m01N8j07L5k6q6J5M8J82j38m7J62q0P5m4J11l08
3420a35j1J05J23J3P6k5p9J48j07j12K35k51Q1j75L89m55J04m6K69k25j51J52
3442g7k1J20j28O0n9K67l34L5O7m1J11J2m1J14J32k76K29k02Q1k97K69j21J55
3465E5J57l55J64o0L08k03K08m07k0q9K48j2k4k72J09J39J29J6k56j99M27Q2k27
$$ plain form
3304 70 -168 -13 -85 -55 44 -129 189 82 -45 -17 -24 -404 -13 48 -39 -32 -134 201 94 61 142 4 35 9 -19
3329 -19 -21 216 30 116 50 -241 -47 183 -46 -146 -278 261 400 66 95 173 -17 -134 -342 -394 134 20 119
3352 119 82 -219 232 -152 101 -39 -58 -6 342 216 323 -117 -136 14 47 335 -244 137 311 -271 178 -428
3374 -428 143 -67 -223 207 -302 266 94 101 -19 -26 174 -153 -54 174 -178 -157 166 -244 99 -29 -311 -174
3396 -174 -221 74 -110 -9 88 5 416 15 73 -34 1 -25 -111 -96 -48 134 -4 -51 111 31 106 62 173 -135
3420 -135 -146 -41 82 95 171 146 67 215 108 -4 231 -20 61 -114 275 -180 -76 -122 147 -78 -229 -77
3442 -77 -98 22 -106 -46 -105 162 -172 -137 -70 -111 0 12 -29 85 217 -59 170 -32 49 -248 21 -100 55
3465 55 212 -143 21 -39 269 66 274 -133 -153 -242 6 -6 -30 -302 -193 -54 75 91 -165 -364 63 145 -82
3488h2j0L1o8M36l26J59l52M6M51j09k94J52L3J71q1j80j62K13n2J25J6J01k89
3511g1Q4J39m03M71l10J32L7k78l4L34l00N15o13K48L06k20m5L31n01K23K2L0
3533I7j58L15k77M1J95j36r0J48k30K75j1n9N1n9j73q9K35l41L78l12M29j45k04
3556a20J25j0J7k93M54l97M90l54J63Q9m53J71L52l78N9L54J8j32l22P1K7j16
3578a85K07r2l4j8M49l40m2J28j33J85j48Q6k37P3J42K49l14k3j04M56n59J26
3600a28J35j15k69M34l46N04p3r4m1k85L23K6j39m0l4R8k2N7J20j58K66k35k7
3623d3P7r7KL05m12J41P7km5m5l8L30k03m06N72j26p2M9J6k10L2N9m65P43l05
3648f6J63r7L27l24q9J06P8JR6m73M15J97k95N3j90K78m01L72j88k05K84J89j44
$$ plain form
3488 -82 -92 -61 -129 307 -19 140 -212 -166 285 176 -118 34 67 238 157 -23 -185 28 -24 101 117 218 -71
3511 -71 13 152 -251 220 -90 42 79 -199 -233 101 -199 316 -297 -49 257 37 -8 323 -178 45 67 97
3533 97 -61 254 -23 18 213 77 -13 135 -95 180 169 110 161 102 -71 -160 75 -266 112 -200 229 84 -120
3556 -120 5 -5 12 -281 173 -224 266 -88 75 164 -289 -118 234 -144 -85 269 287 155 -167 -96 -69 -185
3578 -185 22 -70 -104 -122 327 -13 -55 73 -60 125 -23 63 -174 -101 41 290 -24 -47 -151 305 -254 -128
3600 -128 7 -108 -377 57 -289 215 142 48 7 -278 45 71 -68 -108 -142 -44 -66 -9 111 -47 219 -16 -43
3623 -43 34 -63 -61 244 -168 -27 50 48 3 -42 -80 250 47 -359 213 87 15 64 80 -130 -98 -39 -504 239 -66
3648 -66 97 0 327 3 -86 20 98 99 195 -278 137 334 39 92 -98 180 -221 151 -37 -242 42 231 87
3671H7J27j28k72J06K59k53L32m51J13J99l12J16K26O5n02K35J26p6Jj37K83k32
3693h8K19l01rR2j37J43o5K25k6J90m83L35k83L03j44j6M3j83K24j60K65l28j34
3716c18K74m1P4j65L73j61k61M24k85j3M14m60L9J02J02o8r4M9l96L81J76j29
3738A7j21O1P9j17M8j4P3j57K03m1j1J79l83M97l98N9j00N7o6J76p7l2K35l40
3762a73L87m39J50j00J29l1J28n6J16j20L11o66K19J47p1J73j33j21J28M1l18
3783b99M34j12m2N1J95j58r4j93K76k52J49r2J73L7j43J83jo1%j37K11k15J75
3806H5j04j60L47k29L69l83j16M89N1n6m99L60J45l36J3j06K87l4k8J34l40L89
3828B78k40k55J16Q1r5j16K15P3j9Jj9j03J25n2J43l15M19k74K2K60k72j06J52
$$ plain form
3671 87 214 86 -186 -80 179 -74 258 -193 -80 119 -193 -77 149 214 -288 -53 73 -3 -2 -139 144 -88
3693 -88 131 -170 -179 -87 -224 -81 -146 79 53 243 -240 95 -188 115 -29 -45 -2 -185 39 -121 144 -184 -318
3716 -318 -44 -85 -11 -176 197 36 -225 199 -86 -99 315 -145 -106 -4 98 30 -64 -15 -411 -30 146 17
3738 17 -104 -43 36 -81 -33 -47 26 -131 72 31 20 199 -184 313 -85 -26 -126 -69 -135 41 -36 -68 167 -173
3762 -173 214 -225 -75 -175 -46 -77 51 -5 111 -9 302 -364 -145 2 -69 104 -29 -150 -22 19 -299
3783 -299 135 23 -19 32 227 69 -25 -218 58 -194 -45 -137 36 73 -70 113 112 51 51 -86 125 -90 85
3806 85 -19 -179 168 -61 308 -75 -191 298 349 293 -206 154 299 -37 -24 -130 157 123 95 229 -111 278
3828 278 38 -217 -101 -20 -115 -231 -16 57 38 39 20 -83 42 -10 133 -182 237 -37 -15 245 -27 -133 19
3851A9k29l8J72M7J16j55J21j78P4j31J02j8M12m53J46k09L63j59j53j47J24K99
3873A25l88P21o84M00j62m0L61k07j5k0k2n38M75j55P2k4J01K91j04k70m2M83
3895C58l39J02L9j45j60R6R8k61L33k75j75K20o8O00o1l31L0J55m36N42k12k81
3917a71J95k0l51J83M1J12N0m9J13k54rK28R3Ok36K89l70K02r0j79K38j20q1K71
3941I1J16j39J38r1k78k35K14J70l8QM6L00k54P5o4l01K80J05k85K76j05K83l93
3964h1q4K02m3j88K76k02M65m11J69L4j20Q6k50J96L81m62K35j26k37K45m47N95
3986B33k77K36q5j55J70o7j20K70n47K92j10J08J27j04n2rJ56rO8k47j73J36K8
4009a31N3J75k33J77j22l0N49o87K77j41J25P3p3p1P0L12l67j19J16Q6p8K60l54
$$ plain form
3851 19 -210 -248 -76 -29 87 -68 53 -125 -51 -182 -80 -98 314 -139 7 -202 161 2 -151 -298 -174 125
3873 125 -263 458 -226 174 12 -28 333 126 111 91 69 -469 6 -149 -77 -101 0 291 187 -83 -125 358
3895 358 19 121 160 15 -145 -49 49 -212 121 -154 -329 -109 -177 423 362 31 61 216 -220 322 110 -171
3917 -171 24 4 -347 -164 -123 -11 39 -10 103 -151 -160 68 161 167 -69 220 -150 52 -38 -217 21 -99 -180 91
3941 91 207 68 206 115 -163 -398 -184 -14 -52 -44 2 302 48 123 59 -242 38 143 -142 134 29 312 -81
3964 -81 -165 37 -6 -194 82 -120 345 -66 103 137 17 103 -147 49 430 -32 203 77 -160 85 -362 233
3986 233 -44 192 107 -48 122 55 -65 205 -342 -50 -160 -52 75 -29 -81 -90 66 57 125 -122 -295 -159 -131
4009 -131 -78 97 -136 41 -81 -111 438 -249 28 -113 12 85 12 -59 11 323 -44 -163 -47 39 -39 221 -133
4032a33J02K49j17Q8j73Kk81M61n01K52K50j25k92J11j54J77Q9J55k91P3M2k7
4054d3K15k29M52m52j93M12k1j80L47k22l27M94l86N7K82l11K45R3o1o5k09J42
4076D0l12K63J37m5j93J76n0M8J19m02J24l6O5N5j38J87L3n1Q0k57M31m3k59j3
4100d1jo9L03J49k61n0Qn2J82o8J55m65L31O1n80M49m5J92p5j16MJj37K06j68
4125h7J85K84j65l36L00j92L21k52j52L4J71r8r9O4J11k06r1J14K86k24K5O2N6
4148A11k66K35L05n81K63K32j93r7qo6M0M84o61K12p2J24j8L91l13j71Q5K58j27
4171A67k71J21J2r2O1j55J40J91p7l59O6N7K03j53m9N00l36k75L88j70Q7o3j19
4194a26j73L26m1j16M4P2L7j65j08K15Kp9J73k1j15M11k75P9j36j23J79j33o0
$$ plain form
4032 -133 -31 218 101 189 16 18 -263 198 -303 -51 199 74 -218 -107 -261 -84 5 160 -131 -58 -16 -43
4054 -43 172 -57 395 -57 -250 162 141 -39 308 86 -241 253 -133 -76 206 -105 140 233 172 107 -102 40
4076 40 -272 -9 128 83 -110 66 16 64 183 -219 -95 -131 -66 -11 -149 38 71 20 100 -157 274 231 -28 -41
4100 -41 -42 -111 192 341 80 30 38 -14 168 100 255 -210 121 182 -398 51 6 198 123 7 11 12 -125 81 -87
4125 -87 98 382 217 -119 181 -11 310 58 -94 -60 111 13 -86 -22 89 -117 -208 -94 192 -32 -7 55 111
4148 111 -155 80 385 -196 67 299 106 9 1 -65 -25 459 -202 10 -62 62 44 435 122 -49 36 294 167
4171 167 -104 17 29 -63 -2 -157 -17 174 97 -262 -196 -139 64 -89 -138 362 26 -249 139 -31 56 -7 -126
4194 -126 -299 27 -14 -130 -86 -14 23 -142 -250 -35 -33 -112 61 40 -75 336 61 140 4 -119 60 -73 -133
4217a33Q4N14n92J51l70K59N4R1j43K32p7j52L92r6k19L6kr3j81O1M68r8l2J8
4241A72k74P2n4j06J96Q7J48k64R2p6L1k67Q4J91l02N2L03k05L11j39j7M8k61
4264a78R7J91k96J20j30K75j70K40k85J59j71K6J08M4k06M7K68j14J08m27L89
4285I5k91J82k4K39k30Q8j17r1J76j97J30r2J77j61O4J13n7K5j01k19L65KR5k56
4309h5J5L1k8k8r5J64K21l15J25K15m5j93J14o4K03M8j16l67J75P8J36j00lj88
4333a02K22M0k47J44j01J08J91o6k23K03J5j4n31L16J77k47J41j11k25J20J94
4354DJ22k35Q6l0j24K05J19j71J82rJ20n7l61M34n74M56M3k03m5P6O3m5J81k50
4378a3J17M18m09k14RJ98P1l76J06Q2M9J57k97K50k00l0k66N38k50n0QJ53J69
$$ plain form
4217 -133 -49 465 -127 24 -346 -87 -33 58 -85 147 70 -82 310 214 -5 31 29 -64 -245 -184 284 186 154 172
4241 172 -102 -30 -84 -190 6 93 241 -23 69 -7 24 -243 -159 32 -270 -218 85 -120 191 52 35 83 -178
4264 -178 -81 110 -186 -66 -196 79 -91 149 -136 23 -148 -122 -14 30 -176 -129 139 25 133 -294 95
4285 95 -196 -14 -38 201 -29 59 -58 -149 27 -170 -40 -132 45 -116 -52 61 4 29 -72 -291 74 76 171 -85
4309 -85 -70 -39 -67 -95 -190 -26 195 -120 5 220 175 -18 96 32 235 283 167 -200 -25 53 189 89 86 -102
4333 -102 120 160 -87 57 -44 64 255 189 -34 169 184 170 -361 -45 132 -115 26 -85 -310 -190 4
4354 4 126 -109 -23 -53 -177 28 147 -24 158 149 269 212 -149 285 -289 167 210 7 -38 38 101 56 237 -13
4378 -13 104 522 113 -101 -92 106 177 -199 -93 -11 38 195 -102 148 -52 -82 -348 190 -60 -110 -102 51 220
4401B20k51N0r4K71l04J31m06O87k91J80l29L34m5k82r5J38k78R8L46k0rQ4j96
4424f1J48j03j89K36j43L98p7n6j2j57oP7k9K09Qm32K90R9k34r2J29O5N1K29l55
4449gK12k15l0j25K25K7j08j53K17l06M19M8k77K96l71O3J7M37l79p3J28J9j28
4472f4Q4N2j08J93j77k23J79R3k73R0N42k70k43K49j04j64K10kk23J04K72j19
4494I8k37j99L10p9L6M89n18n0q2j6L01N7p9P1k72L87L1j16k00J18K09k67K51
4517B43j55J02j57L0J8j27L35l36J74Qk14j79L39P3q1o6J08j5k44k1J07J71j91
4540g8j27k4M4R1L36m07lj70M41j42j57K91J4l1k59K5L64k71M7l2K2J76l67M31
4564B14k93l21L11O6k84L18l05L85n0m57N51k06J05K78l58L44m23L6r7M0K88n4
$$ plain form
4401 220 -31 19 -75 196 -108 23 -383 304 13 193 -136 198 153 -129 -224 -86 -364 -266 80 60 51 135 -61
4424 -61 87 -16 -205 31 -112 286 209 153 141 -16 -22 55 26 235 243 -189 101 200 -34 -126 3 68 119 348 -7
4449 -7 205 -10 -40 -165 60 87 -21 -174 43 -263 156 204 -73 223 -148 -85 -68 369 -10 -83 45 64 -64
4472 -64 20 72 -36 157 -20 -243 -64 29 -244 -154 388 118 -125 124 20 -144 66 64 -159 -55 217 98
4494 98 -139 -338 -28 -107 -71 418 -100 -150 -232 -248 53 110 31 102 -170 217 248 132 -68 50 259 -8 243
4517 243 88 190 33 63 81 -46 289 -47 127 135 -79 -258 81 154 73 7 115 100 -144 -165 -58 113 -78
4540 -78 -205 -229 -185 -94 242 -165 -168 -338 103 -39 -196 95 109 78 -181 -156 208 -63 -16 -48 -26 150 -217 214
4564 214 -79 -400 -89 -23 -307 11 -294 91 41 -416 135 -71 34 312 -46 298 -125 -89 -186 -146 142 88
4586H8k11M85k62J2j96n8L51m1r5j72k54N33j06j11l22M73Jk51l2K8k24K69J43
4609D8J7k4M0L06q5n5K5k81ol23M80o1p2k42j09K5K99j34J02K45q1l2lk62L86
4634B03Q2l52J58J06m16R1J79K03m82K59J13q9k95L74k70J52J3l01K70k15J43
4655g4k03K55o8J94J14l77J71O0j02K95k55L10j50J39n77J70J10j41p0j63P6K56
4677c0J01pJ29k4p8l60L15k47J34L00j15J6Jj17R3l00m8K01K44l09l4K51k19J75
4701G2l09K47j0q7r6J6k6lJ24m4j44J12J07K04k38n8J01K20m75K10Q5j14K05Q2
4725A81l13n3L69N1p1j56j94j16P8L84k81N30m94k34P81m88K54j16rL28k86P7
4747B22k18k8J41l2J81k69J09m4j73n7OJ00N3n6K35l68J76J18j21J45J9k03O6
$$ plain form
4586 88 -123 362 100 112 -84 -142 209 168 73 -99 -353 180 74 -37 -359 114 115 -136 -168 -140 -364 -95 48
4609 48 65 41 81 387 302 247 272 -9 -15 -338 142 81 9 -233 -342 -317 -18 -152 -50 195 114 82 79 -183 203
4634 203 285 -67 91 197 -219 -128 51 254 -228 31 144 55 -240 134 -136 16 29 -272 -2 -217 -74
4655 -74 -277 -22 -90 104 218 -159 12 72 -30 265 10 320 170 309 -268 -98 12 -129 -199 -362 -286 -30
4677 -30 71 64 193 169 91 -269 46 -201 -67 233 118 134 135 18 111 -189 -237 -36 208 -101 -135 116 -103 72
4701 72 -237 10 0 -87 -183 -167 -193 -196 -72 -116 -260 -148 -41 163 -75 -133 -32 188 -287 -77 8 -106 99 181
4725 181 -132 -185 184 235 164 8 -186 -302 -224 160 -121 409 -85 -319 462 -26 228 112 103 431 145 222
4747 222 4 -24 117 85 266 -3 106 62 -111 -168 -162 -62 -9 -65 170 -198 -22 96 -25 120 139 -64 2
4770BL5k74K96kL4j12l11K89N9K0R5k47R7M8K9Mn3l30K17L48o2J5k80l0N20k72
4796A35P6m39K14K11m5j81P1p4J63j46J72J70m46J53l19J96L4q6J94q4L1J91n8
4819A33j29O9k92J12J66j36Q9j00L24k82J02K15k25R5m35J09l5K7M88k77J13J68
4841B99j68K1J2J03P8m18j52J30M55j68j68J43k11Q2M0Qom16L03M4K22l13J55
4864G5J09k87J39j10J48k69K4N2O5J02M9j77M6J00J12k9P6j01p8l23L72J82k98
4887b1qK06k61K22l89p1K66R4n4J74k72Q3k44J95or9K69k26L48k25j16n9J92M5
4911D3k34K49J24J02k44k89N8j47K33NJ59J48K0q2M5k31K39k76K17n5n0J77p6
4934A35k50o1K86Q4k04J2k89K52J09j00J9k42Q6q6K67jN1k58M1J52k2r5J08j21
$$ plain form
4770 2 37 -237 59 57 91 -21 -332 -43 16 36 131 -116 -19 29 58 62 9 -321 -104 244 182 197 -83 -113 407 135
4796 135 211 -228 -14 197 152 -29 42 -32 131 -15 157 327 -119 34 -285 -89 -55 -141 53 -31 0 191 133
4819 133 4 73 -219 -107 59 -77 12 -88 236 -46 56 271 46 141 -294 -185 -220 -193 295 18 131 299
4841 299 131 152 164 267 345 -73 -225 -95 360 192 24 167 -44 38 78 86 80 -336 -33 11 233 -80 75
4864 75 184 -103 36 -74 74 -195 -171 -119 -54 48 97 -80 -34 66 178 149 225 124 46 -277 95 277 -21
4887 -21 -29 177 -84 138 -251 -322 -56 38 -16 158 -114 -31 -275 -80 -86 -185 84 -142 206 -19 -135 -194 -2 43
4911 43 -191 58 182 284 40 -249 -191 -338 -105 -100 59 207 227 145 190 -41 198 -78 139 84 34 211 135
4934 135 -115 -176 110 194 -10 2 -287 -35 74 -26 -7 -249 -163 -249 18 17 68 -190 -149 3 -19 -114 -6 -127
4958a27M65J92o16J52j99l4J84l7n5r8k3j07M48k01j29K26Q6p4j49j49M9J46m3
4981i3O3o4M8p3L95l68p0j98L30j13J85J58k02l5l1L20Q4j89Q8nR2n3m36J47J71
5006A51J88l88r9J38jj54J72J16k79PJ74j49J03K5l0j77P8j09K90m09l2O30o6
5029A79k72N47n34O1k08M28j21j47K45l03K76m1k73p1M55k50j13O0j44K53m0P8
5051F5l0J69k9k66r8L16r9p6Q1L3j52J98j50j47Q8M9M0l4j27J77N0k04L18Mrl09
5077a42L6L00j24K16l17K00m18l4L92l69L63m11L91k7L8j86J25M5j61L6p7L61
5099B37j97k06M06k39j10Q3nk8j14J93m2k79M23p3Q1j8j5o4M9l07K14J55N4j75
5123B3p5K6J23j70l10M53M0Q0j34m8K63k87P2j66oj05J82L30m31O0N6j3J54j65
$$ plain form
4958 -127 338 530 -86 66 -133 -167 17 -20 -75 -173 -196 -303 145 -56 -185 41 127 53 -96 -245 -196 -50 -93
4981 -93 -30 -94 -46 -119 276 -92 -162 -360 -30 -143 42 200 -2 -37 -68 252 336 147 235 230 322 269 -167 -20 151
5006 151 339 -49 -148 -10 -11 -165 7 123 -156 -149 25 -124 -21 4 -26 -203 -125 -234 56 -353 -385 245 179
5029 179 -93 454 -80 -19 -227 201 80 -67 178 -125 151 110 -163 -234 221 -29 -142 -82 -226 27 -13 65
5051 65 35 204 175 -91 -189 127 28 -48 33 66 -86 112 -38 -185 -97 -48 -8 -42 -169 8 58 -146 172 176 167 -142
5077 -142 -106 194 70 286 -31 169 -249 -283 109 -260 103 -308 83 56 94 -92 33 78 -83 -47 -124 237
5099 237 40 -166 240 1 -109 -26 -31 -59 -173 20 -22 -301 122 49 130 112 97 33 82 -225 -11 144 198 23
5123 23 -52 -26 97 -73 -383 70 110 190 56 8 271 -16 56 -110 -116 -221 -39 291 -140 -80 -24 -37 117 -48
5147d8J74k1k2j46J10L46l25J5Q7j18o1r7J54n3k6K12j05PJ6J05j24j58L62k86
5171bK29j50p4p5K13j92K84m20k8j86M08k07K27k82J98%k65J88K45l50J74J63
5193I8r7L64n75K83J52k30K6r5n1M14l55k72K36R6k41L65j41m2O2K72k86J23j54
5216d8j2K19k32k33L01P2j73M5K60r0j21l87L95k4p1j3Q9J49j9l68J91J60j36
5239d6k30L0k01L27M7O5J85j83K40n31J43J54J48l23J69K78l06R5L4P4j52j12
5261i5oJ79n05O85j5On49L86k6l97M83k58J53l00K78k47L13J0k39K14l4J10k15
5284f9N8l2m6M05k90j06qJ16k63M25j56J42j47j6J13j16J51k20L55k87K14l19
5306i6O9R4O8j28N6p0Q6m0o1r3K81j31p4J79j31R8j29j93J90k99L49o9j00K72
$$ plain form
5147 -48 126 105 83 -63 47 393 68 83 170 52 -9 -106 48 -5 -31 181 76 83 99 204 80 -78 284 -2
5171 -2 227 77 3 -72 141 -51 233 -187 -215 -401 7 -200 27 -255 -57 -57 -322 -134 111 -239 -65 98
5193 98 1 365 -210 73 225 -5 21 -74 -125 289 -66 -338 -102 -6 -247 118 -23 -65 -3 269 -17 106 -48
5216 -48 -60 159 -73 -306 -5 67 -106 -61 199 109 -12 -399 -4 -28 -99 -112 -23 126 107 -261 -70 90 -46
5239 -46 -276 -246 -447 -120 -73 -8 177 -6 234 -297 -154 0 148 -175 -6 272 -34 61 95 169 17 -95
5261 -95 -101 78 -427 258 243 249 -300 86 60 -337 146 -112 41 -259 19 -228 85 95 -144 70 36 146 -69
5284 -69 -11 -43 -89 316 26 -80 -88 28 -235 190 34 176 29 13 126 10 161 -59 296 9 223 -96
5306 -96 -27 67 135 7 63 -7 79 39 -22 -115 166 35 -39 140 9 107 -22 -215 -25 -324 25 -44 -144 128
5330A28o0N0j67J30K8k48j02k22K43L02k78L2o2P9K31l47M7M04l81J76M8j03j75
5353b47J65M17o66P37k24j42j78n9N81m58J85j38l3L6K60k55j51Q2l3n5M02n20
5375b94K40Q2j94L2K59k32J16K01m29J53P2K82k90j8j06j75J05m0M7K24o1n0J89
5398A13o9M4j37P8j28j81L14L6K05j0k10l95M03%j12oK5J90k51J58M7j40J80l19
5422a65M25J1o9m95K08n6Q5K59j9l96L72k01r3K66l72j25J61J28K75j46j53M92
5444C92n04J17j20j16J55P3K8n14M09J21M6j14J03k04K2J96j59j26K01J35k65
5465a24j35K81Nk36L43J60k11K78k79n8j21R3j10N2N5O4j6K42k71mj13N2L81k29
5489I9q5P4o4K20j14j56o1Lj0L59k16j12J30J28l84M10m94L30k02K93j09p2L05
$$ plain form
5330 128 68 118 -49 81 109 -139 -241 -463 -220 82 -196 -164 -226 -147 84 -263 -216 188 -193 -17 31 -72 -247
5353 -247 -82 335 -331 406 182 40 -138 -197 384 -74 111 -27 -60 -24 236 -19 -170 -88 -121 -176 226 -294
5375 -294 -54 28 -166 -134 125 -107 9 210 -219 -66 6 288 -2 -20 -126 -301 -196 -236 -189 35 -26 -76 113
5398 113 44 88 -49 29 -99 -280 34 70 275 265 55 -340 63 63 -49 -55 -30 160 -91 67 114 -26 154 -165
5422 -165 260 271 202 -293 -85 -141 -56 203 184 -212 160 -41 -134 132 -240 -365 -204 -76 199 53 -100 392
5444 392 -112 5 -115 -231 -76 -3 25 -489 -80 41 87 -27 76 -128 -106 90 -69 -195 6 141 -124
5465 -124 -259 22 27 -209 134 294 83 361 82 24 -97 -4 -114 -62 -7 57 41 283 12 8 -105 -53 328 99
5489 99 14 88 24 244 130 -26 -87 -84 -94 265 49 -63 67 195 -189 221 -273 57 -145 148 39 -33 272
5512B72m31K03j28q2O8L50k27m3J57l36K15J08J95o78L42q5MK75j18jk29J9r1
5535b41K10j79L71o7j3j95J91k8l0o5KK35k60qJ54%P3J61n69K25J46j53o0L39
5559B39J07l02jJ22j24mk67K71J37k38k3n5K31K09m66K67n2j46R5N6n31M12L27
5582B64l91l3L39l89o3M10l98K07K2J20k60M20J1l08j79N91m84M3j2L3M8k02L43
5605A32l20K27l3j03j90L78L9l20L71k08l7M5k1K29j22j11K73j02r9P4r5K93p53
5628d53M73m22N11j82J80m9k09l6q5k5L13Q5j43J68j94n8j21P9O8j13L61J17k39
5651B6M4K26j17m93L64j86P1L33l76L95k63kK25n14J54K2j45M96l39L1J28j81
5673a01K33P2J20m03K45j08nO8l38K32K6L49m67k54M88j08k59K60L5o6j54J85
$$ plain form
5512 272 -159 44 -84 -166 -98 252 25 -18 139 -197 18 126 321 -357 -15 -100 -96 179 61 60 -169 -150 -241
5535 -241 -31 -210 161 94 81 -114 77 49 19 -46 -44 191 -69 -77 77 77 150 311 -258 -33 113 -40 -100 239
5559 239 346 44 43 165 41 37 -230 41 178 -60 -83 -138 93 302 -164 103 51 -95 0 56 -475 -63 264
5582 264 -127 -160 179 -210 -273 137 -261 -54 -32 88 -172 248 259 -49 -228 363 -121 -78 -90 -57 -9 -211 132
5605 132 -188 39 6 -97 -287 91 130 -190 181 -27 -64 -19 -40 189 67 -44 229 127 28 102 7 300 -453
5628 -453 20 -402 109 -73 107 58 -151 -187 -272 -297 16 101 -42 126 -68 -126 -247 -168 -100 -213 148 265 26
5651 26 70 296 179 -314 50 -136 -65 268 -108 287 24 22 247 -267 -113 -91 -236 260 -79 -48 80 -101
5673 -101 132 204 324 -79 166 58 53 121 -217 15 41 390 -77 -331 157 49 -210 50 85 19 -135 50
5695E0j34j22L0J05NKj17J85P9J53k65l0j6J91j47J75l46j35L80k20K83oj94K58
5719A64p1j42o5K1J30pj99L9J54J82n58O00k14j45J82K8l36K29P5Np7OL23j87
5743A37o8J0mj66J77l07K11l53M39n4k09q1L45j50j44L99m92J84N2o2L05o5k0
5766H4Q8j30k15L14j9k29j2J66j4k44K00j87J97OJ43p7j10J11l74K32K28j72m8
5789f2j00K95j83J58q3j91L77l82K47J6j82J14o0K91l15j53L99k55J14j74K68
5810A39k8m42M88k5k94j65K83OJ62j79O2K30q0Oj52J08m08L91K6j42O3j28j21
5833b00M21k21K08k22j81L59k35L12o6l68oJ69P5J29j34K93l90J95j57l82L87
5854a4J83k93L37k46J08J55k57J01j21J62OL3k11o6J78p6OJ04l11K57O3k55J68
$$ plain form
5695 50 -84 -206 -176 -71 -66 -64 -181 4 83 236 -29 -59 -75 116 -31 144 -202 -337 43 -177 106 100 -94 164
5719 164 93 -49 -114 -93 37 30 -169 -130 24 206 -352 248 34 -111 71 99 -237 -8 67 72 -5 1 324 137
5743 137 69 79 75 -91 86 -221 -10 -363 76 22 -187 -268 77 -73 -217 182 -310 -126 -74 -136 169 104 84
5766 84 172 42 -173 141 122 -107 -119 47 33 -211 -11 -198 -1 5 148 71 -39 72 -302 -70 158 -14 -62
5789 -62 -162 133 -50 108 25 -166 211 -171 76 92 -90 24 -36 255 -60 -213 186 -69 45 -129 139
5810 139 111 -331 157 132 -162 -327 -44 -38 124 -55 7 237 157 163 11 119 -289 102 128 -14 49 -79 -200
5833 -200 221 0 208 -14 -195 164 -71 241 175 -193 -199 -30 45 174 40 333 -57 138 -19 -401 -14
5854 -14 169 -124 213 -33 75 230 -27 74 -47 115 121 154 -57 -123 55 -21 -15 89 -222 35 98 -157 11
5877A1J45j48M9k9J75J05k29j9k05K46k70L16k18K1J95j60L8P0k05m7n9K64J16
5900A62l62N84l87J9%k5mj56K49j6K94m83L65k51L17k24l41J86K33l52M51l76
5922a17K28J37J11l94j24K74j35K28j00R7m67K56J33o7n4j42L00Pm00L70L6j53
5944B4J36k69q7O06n31L12l06K05N4l02R1j07J70J63J8m15J3K49K8J89j89j37
5966h5m5M0L44m44L59k33j5P2K8M24n82j24K09j32K04K22l44K5j79M22k24J56
5988I8j2l21o4L48P4l32K92J78N3o10m6O60k44K35k16L29k77k26K85k43j0P0L1
6011E2M7r3l70M47j45L5j84K4J33L1j84K38K08p1k79K37k0j89j11L2R8M6r4q2
6035a94J04K43j04p2K1l1j57K98M9j79J4q0J17P0k4m2k86J39J54m5M1k8J25P4
$$ plain form
5877 11 156 8 57 28 203 308 79 60 -145 101 -169 147 -71 -50 145 -15 23 93 -112 -159 -218 46 162
5900 162 -200 384 -3 16 16 -9 -13 -169 80 64 358 -125 240 -11 306 82 -259 -73 160 -192 259 -117
5922 -117 111 248 359 -35 -159 115 -20 208 108 205 -262 -6 127 60 6 -136 164 171 -229 141 177 24
5944 24 160 -109 -196 410 -121 191 -115 90 144 -158 -67 -174 -4 159 177 -238 -225 24 52 241 52 -85
5966 -85 -130 -90 254 -190 169 -64 -79 -7 21 445 -137 -261 -52 -184 20 242 -102 -77 -256 166 -58 98
5988 98 86 -235 -299 49 123 -209 83 261 314 -296 -342 318 74 309 93 422 145 -81 204 -39 -49 21 52
6011 52 99 6 -364 83 -62 -27 -211 -187 -54 -23 -207 31 239 168 -111 126 106 -83 -194 -162 -64 -18 -112 -194
6035 -194 -90 153 49 -23 -2 -33 -190 108 157 -22 -8 -88 29 99 75 33 -253 -114 40 -5 36 8 133 207
6059B07j75j60j96r0N32k94L22k72n0j94N38K63m95q1K37l48L52o1k18N3P3J91
6081A34Q9m30J16J68m01K67p7O1Q9j39M10m06P8L36l11J96k14N6k45M16k60L00
6103B33r0j77j53Q0K53j52O7j75K55k49J26j99M73j2j99j70K35J90q9q9k60K24
6125A22k80J82l24Q2N5N4L56j89n20M64k5rK28j69j62j19L24j69K37m76M99n30
6147c69M20r2J29j09L37k99O6n7Q4o5j76J43k47L62k14J01J22J74k73j01O6l9
6169c7oj06L60n68M26k60K10L24m79R3J7j7L63k20J6k46N7J03l09M59J85j4l32
6192A9j5K06j60l13N74l66j02J33J66l5l7J9k34K57j72L7Q4kj68l5L13j12M8l31
6216b26L22J65l37n7L15qk89k86L20O8k4L6k6r9L88k18k24L91n5j13P8k73J85
$$ plain form
6059 207 32 -128 -324 -414 118 -176 146 -126 -176 -370 168 431 -64 -145 92 -256 96 35 -183 -130 -57 134
6081 134 223 -207 -91 77 -324 -57 -134 -73 16 -123 287 -119 -41 295 -16 180 -34 22 -223 193 -67 233
6103 233 143 -34 -187 -107 146 -6 61 -114 141 -108 18 -181 292 280 81 -89 146 336 247 158 -102 122
6125 122 -158 24 -300 -218 -163 -109 247 58 -462 2 -23 -32 196 27 -135 -254 70 -99 138 -338 161 -369
6147 -369 51 -41 88 -21 316 17 83 26 110 45 -131 12 -235 127 -87 14 136 310 37 -64 2 -37
6169 -37 -43 -149 211 -357 69 -191 19 343 -136 -43 -26 -43 320 100 116 -130 -73 30 -279 180 365 351 19
6192 19 4 210 50 -263 311 -55 -157 -24 142 107 70 89 -145 112 -60 -23 61 59 -109 -144 169 57 105 -226
6216 -226 96 261 -76 -133 182 174 -115 -401 -81 -13 -37 -1 -27 -126 262 44 -180 211 156 43 121 -152 33
6239C3p0l8P7K88m08K01Q3m1j53K20n6l70J08J14J12J6j36J9K08j42J02j41Kr9
6263g1J65j09j56L01J2K34k87J34l24R8J47k37N4J50k03o6K03k77J50L78q1J21
6285C36k85k04m4J72K8k36M54K3j79k17L53m6o2l85J03J32J21J28l71J68n1L33
6307B71j76m27J53K80Ol39lo6J76K15k63K73k36n7J10k9j19L30J74l26P7J50n13
6330c39L29k0J77n2R7j27R8j05j96q7J70J66k34J77L49m69K09l48K35j63k14O12
6352B65m11j5L70m84j54M24k77K70K47j86j90J71j24K7K86k48L07l66P8j36PQ5
6374e4L6l82M43j43L70m79K35K23j96J40k24m3K7K13r5l14M57l09M09l49Q7J31
6396A83l51Q1K61k9k45M6J45l07J76J04k01J60l10L6K08P9O6p1k33M55j60N8p2
$$ plain form
6239 33 -37 -75 2 290 -118 83 166 125 -28 192 136 -234 -126 -12 100 116 -20 -1 207 65 167 26 28 -71
6263 -71 94 -15 -171 130 142 376 89 223 -101 -3 144 -93 -39 111 -92 -158 45 -232 -82 296 215 336
6285 336 51 -153 -197 -25 3 -233 221 244 65 -152 201 155 93 -292 -189 -57 64 192 -179 -11 -62 271
6307 271 95 -332 -179 101 107 -232 -235 -301 -125 90 -173 100 -136 -193 -83 -112 -231 99 273 -53 24 174 -339
6330 -339 -10 -30 147 95 192 65 163 58 -138 -225 -55 111 -123 54 403 -66 143 -205 30 -133 -347 265
6352 265 -146 -161 209 -275 -429 -5 -282 -12 235 49 -141 30 -94 -67 219 -29 278 -88 -10 -146 -139 -54
6374 -54 -18 -400 43 -100 270 -209 26 249 53 193 -31 -74 -47 166 71 -243 214 -95 314 -35 52 183
6396 183 -168 -87 174 145 -100 -54 91 -216 -40 64 -137 23 -287 -251 -43 36 102 31 -202 253 93 151 79
$$ [...]
8191A9
##END NTUPLES=NMR FID
##END=
