##TITLE=1H_DE-27_oil
 D2O
 8 sc, 
 16.8.2024
##JCAMPDX= 6.0         $$ Bruker NMR JCAMP-DX V2.0
##DATA TYPE= NMR FID
##DATA CLASS= NTUPLES
##ORIGIN= UXNMR, Bruker Analytische Messtechnik GmbH
##OWNER= root
$$ XWIN-NMR		Version 3.5
$$ Fri Aug 16 16:15:05 2024 Russian Standard Time (UT+4h)  she@DPX200
##.OBSERVE FREQUENCY= 200.1318
##.OBSERVE NUCLEUS= ^1H
##.DELAY= (6, 6)
##.ACQUISITION MODE= SIMULTANEOUS
##.ACQUISITION SCHEME= undefined
##.AVERAGES= 8
##.DIGITISER RES= 18
##SPECTROMETER/DATA SYSTEM= spect
##.PULSE SEQUENCE= zg30
##.SOLVENT NAME= D2O
##.SHIFT REFERENCE= (INTERNAL, D2O, 0, 15.7039)
##AUDIT TRAIL= $$ (NUMBER, WHEN, WHO, WHERE, WHAT)
$$ ##TITLE= Audit trail, XWIN-NMR		Version 3.5
$$ ##JCAMPDX= 5.01
$$ ##ORIGIN= Bruker BioSpin GmbH
$$ ##OWNER= she
$$ F:/spectra/data/she/nmr/H-F/1/audita.txt
$$ ##AUDIT TRAIL=  $$ (NUMBER, WHEN, WHO, WHERE, WHAT)
(   1,<2024-08-16 16:14:02.00 +0400>,<she>,<DPX200>,
      <created by zg, POWCHK disabled, PULCHK disabled
       configuration hash MD5:
       00 E9 B6 7A A2 85 ED C7 34 08 36 98 17 FE 4E 26
       data hash MD5: 16K
       A6 68 E5 4C 5E C4 D9 48 1F 39 A5 03 5D 91 6E DA>)
$$ ##END=
$$ 
$$ hash MD5
$$ 7B 1A 71 D3 CA A9 8B 10 4B FF 5A 4F A7 97 F0 52
##$RELAX= 
##$RELAX= 
##$RELAX= 
##$RELAX= 
##$RELAX= 
##$RELAX= 
$$ Bruker specific parameters
$$ --------------------------
##$DU= <F:/spectra>
##$EXPNO= 1
##$NAME= <H-F>
##$PROCNO= 1
##$TYPE= <nmr>
##$USER= <she>
##$AMP= (0..31)
100 100 100 100 100 100 100 100 100 100 100 100 100 100 100 100 100 100 
100 100 100 100 100 100 100 100 100 100 100 100 100 100 
##$AQSEQ= 0
##$AQ_mod= 1
##$AUNM= <au_zg>
##$AUTOPOS= <>
##$BF1= 200.13
##$BF2= 200.13
##$BF3= 200.13
##$BF4= 200.13
##$BF5= 200.13
##$BF6= 200.13
##$BF7= 200.13
##$BF8= 200.13
##$BYTORDA= 1
##$CFDGTYP= 0
##$CFRGTYP= 5
##$CHEMSTR= <none>
##$CNST= (0..31)
1 1 145 1 1 1 1 1 1 1 1 1 1 1 1 1 1 1 1 1 1 1 1 1 1 1 1 1 1 1 1 1 
##$CPDPRG= <>
##$CPDPRG1= <>
##$CPDPRG2= <>
##$CPDPRG3= <>
##$CPDPRG4= <mlev>
##$CPDPRG5= <mlev>
##$CPDPRG6= <mlev>
##$CPDPRG7= <mlev>
##$CPDPRG8= <mlev>
##$CPDPRGB= <>
##$CPDPRGT= <>
##$D= (0..31)
0 1.2 0 0 0 0 0 0 0 0.06 0 0.03 0 0 0 0 0.0002 0 0 0 0 0 0 0 0 0 0 0 0 
0 0 0 
##$DATE= 1723810441
##$DBL= (0..7)
120 120 120 120 120 120 120 120 
##$DBP= (0..7)
150 150 150 150 150 150 150 150 
##$DBP07= 0
##$DBPNAM0= <>
##$DBPNAM1= <>
##$DBPNAM2= <>
##$DBPNAM3= <>
##$DBPNAM4= <>
##$DBPNAM5= <>
##$DBPNAM6= <>
##$DBPNAM7= <>
##$DBPOAL= (0..7)
0.5 0.5 0.5 0.5 0.5 0.5 0.5 0.5 
##$DBPOFFS= (0..7)
0 0 0 0 0 0 0 0 
##$DE= 6
##$DECBNUC= <off>
##$DECIM= 24
##$DECNUC= <off>
##$DECSTAT= 4
##$DIGMOD= 1
##$DIGTYP= 9
##$DL= (0..7)
0 120 120 120 120 120 120 120 
##$DP= (0..7)
150 150 150 150 150 150 150 150 
##$DP07= 0
##$DPNAME0= <>
##$DPNAME1= <>
##$DPNAME2= <>
##$DPNAME3= <>
##$DPNAME4= <>
##$DPNAME5= <>
##$DPNAME6= <>
##$DPNAME7= <>
##$DPOAL= (0..7)
0.5 0.5 0.5 0.5 0.5 0.5 0.5 0.5 
##$DPOFFS= (0..7)
0 0 0 0 0 0 0 0 
##$DQDMODE= 0
##$DR= 18
##$DS= 0
##$DSLIST= <SSSSSSSSSSSSSSS>
##$DSPFIRM= 0
$$ [...]
##$SUBNAM2= <"">
##$SUBNAM3= <"">
##$SUBNAM4= <"">
##$SUBNAM5= <"">
##$SUBNAM6= <"">
##$SUBNAM7= <"">
##$SUBNAM8= <"">
##$SUBNAM9= <"">
##$SW= 24.0689170037331
##$SWIBOX= (0..15)
0 0 2 0 0 0 0 0 0 0 0 0 0 0 0 0 
##$SW_h= 4816.95568400771
##$TD= 16384
##$TD0= 1
##$TE= 0
##$TE2= 300
##$TE3= 300
##$TEG= 300
##$TL= (0..7)
0 120 120 120 120 120 120 120 
##$TP= (0..7)
150 150 150 150 150 150 150 150 
##$TP07= 0
##$TPNAME0= <>
##$TPNAME1= <>
##$TPNAME2= <>
##$TPNAME3= <>
##$TPNAME4= <>
##$TPNAME5= <>
##$TPNAME6= <>
##$TPNAME7= <>
##$TPOAL= (0..7)
0.5 0.5 0.5 0.5 0.5 0.5 0.5 0.5 
##$TPOFFS= (0..7)
0 0 0 0 0 0 0 0 
##$TUNHIN= 0
##$TUNHOUT= 0
##$TUNXOUT= 0
##$USERA1= <user>
##$USERA2= <user>
##$USERA3= <user>
##$USERA4= <user>
##$USERA5= <user>
##$V9= 5
##$VALIST= <valist>
##$VCLIST= <CCCCCCCCCCCCCCC>
##$VD= 0
##$VDLIST= <DDDDDDDDDDDDDDD>
##$VPLIST= <PPPPPPPPPPPPPPP>
##$VTLIST= <TTTTTTTTTTTTTTT>
##$WBST= 1024
##$WBSW= 4
##$XGAIN= (0..3)
0 0 0 0 
##$XL= 0
##$YL= 0
##$YMAX_a= 365577
##$YMIN_a= -319946
##$ZGOPTNS= <>
##$ZL1= 120
##$ZL2= 120
##$ZL3= 120
##$ZL4= 120
##$ABSF1= 10
##$ABSF2= 0
##$ABSG= 5
##$ABSL= 3
##$ALPHA= 0
##$AQORDER= 0
##$ASSFAC= 0
##$ASSFACI= 0
##$ASSFACX= 0
##$ASSWID= 0
##$AUNMP= <proc_1d>
##$AZFE= 0.1
##$AZFW= 0.1
##$BCFW= 1
##$BC_mod= 2
##$BYTORDP= 1
##$COROFFS= 0
##$CY= 11.3945322036743
##$DATMOD= 1
##$DC= 2
##$DFILT= <>
##$DTYPP= 0
##$F1P= 15.6554695791079
##$F2P= 12.8336369535428
##$FCOR= 0.5
##$FTSIZE= 0
##$FT_mod= 4
##$GAMMA= 1
##$GB= 0.15
##$INTBC= 1
##$INTSCL= 1
##$ISEN= 128
##$LB= 0.24
##$LEV0= 0
##$LPBIN= 0
##$MAXI= 10000
##$MC2= 0
##$MEAN= 0
##$ME_mod= 0
##$MI= 1.114404
##$NCOEF= 0
##$NC_proc= 0
##$NLEV= 6
##$NOISF1= 3.799351
##$NOISF2= 2.8
##$NSP= 1
##$NTH_PI= 0
##$NZP= 0
##$OFFSET= 15.70392
##$PC= 1
##$PHC0= -25999.89
##$PHC1= 12.18748
##$PH_mod= 1
##$PKNL= yes
##$PPARMOD= 0
##$PSCAL= 0
##$PSIGN= 0
##$REVERSE= no
##$SF= 200.130013532006
##$SI= 16384
##$SIGF1= 3
##$SIGF2= 2
##$SINO= 400
##$SIOLD= 16384
##$SREGLST= <1H.CDCl3>
##$SSB= 0
##$STSI= 0
##$STSR= 0
##$SW_p= 3612.71676300578
##$SYMM= 0
##$S_DEV= 0
##$TDeff= 0
##$TDoff= 0
##$TI= <>
##$TILT= no
##$TM1= 0
##$TM2= 0
##$TOPLEV= 0
##$USERP1= <user>
##$USERP2= <user>
##$USERP3= <user>
##$USERP4= <user>
##$USERP5= <user>
##$WDW= 1
##$XDIM= 8192
##$YMAX_p= 0
##$YMIN_p= 0
$$ End of Bruker specific parameters
$$ ---------------------------------
##NTUPLES= NMR FID
##VAR_NAME=  TIME,          FID/REAL,        FID/IMAG
##SYMBOL=    X,             R,               I
##VAR_TYPE=  INDEPENDENT,   DEPENDENT,       DEPENDENT
##VAR_FORM=  AFFN,          ASDF,            ASDF
##VAR_DIM=   8192,          8192,            8192
##UNITS=     SECONDS,       ARBITRARY UNITS, ARBITRARY UNITS
##FACTOR=    0.0002076,     1,               1
##FIRST=     0,             0,               0
##LAST=      1.7004516,     0,               0
##MIN=       0,             -319946,         0
##MAX=       1.7004516,     365577,          0
$$ Real data points
##PAGE= N=1
##DATA TABLE= (X++(R..R)), XYDATA
0@%%%%%%%Oj4J2j2J6j6K4l4M1m7N6o7P7r7J14j30J53j77K01k31K65l00L42l86
31b04M32m87N49o14O86p65Q49r43J049j161J286j427J578j746J934k144K382k654
49a400K963l319L741m244M855n625O619p959R884j2882J8263m1731K83338R8298
63C50801l12731k29278o0697K09573L27725L9060l55007k25883J40600K52294
73A36457J03653r3604k57181j41825J95643K91755k0670k71949j88653M6818K15159
84A5603K10216n5328l12475j77962J79933K72229Q0079j27959k26131j10032J88917
95f2910K74879O99k24016j44039M1050J68311J57396n9297k42964r7724J65078
106b3537J87147J1867j48187j87958l2297K01810J96512o5055k26942j28086O9152
$$ plain form
0 0 0 0 0 0 0 0 0 6 -8 4 -8 8 -8 16 -18 23 -24 32 -35 42 -55 59 -71 82 -95 106 -125 140 -160 182 -204
31 -204 228 -259 290 -324 362 -403 446 -497 552 -609 677 -750 828 -918 1016 -1128 1254 -1400
49 -1400 1563 -1756 1985 -2259 2596 -3029 3590 -4369 5515 -7367 10896 -30835 252503 350801
63 350801 38070 -191208 -251905 -42332 285393 324453 -30554 -256437 -115837 136457
73 136457 240110 146506 -110675 -252500 -56857 234898 214228 -57721 -246374 -199556 15603
84 15603 225819 170491 -141984 -319946 -140013 132216 212295 84336 -141795 -251827 -62910
95 -62910 211969 212668 -11348 -155387 -114337 53974 211370 152073 -90891 -188615 -23537
106 -23537 163610 175477 27290 -160668 -192965 8845 205357 140302 -86640 -214726 -145574
117a45574J93424J39286q5577k29998q5730J49768J82502L4027j18511j57016
127a23399k2685J67583J55010n7201j74323p7791P7282J52222Q0507j08667j93980
138a25442l1608J62789J44690j7814j46023j46460Q967J79828J33371p7606j70647
149h5955o9492P5173J43078P2473r6130j55548j0632J36464J05572k3716j12001
160b0714r1512L9328J50383P6006r8822j41993k6065R5927J23844K8233j20889
171A3726j43115J2387J40971R3545l5927j18023r1392L7496J38149O5971q3786
182C0002j13827j7217P9228R8377J6198r9636r8037L4292J20176O0838n1514j03605
194d4725n5840O0984J23552L7015r7542j09370m520Q6072Q9630M674r9576r4271
$$ plain form
117 -145574 47850 187136 101559 -128439 -214169 -64401 118101 152128 33617 -123399
127 -123399 -146084 21499 176509 119308 -55015 -132806 -55524 96698 177205 68538 -125442
138 -125442 -157050 5739 150429 132615 -13408 -159868 -150901 28927 162298 84692 -85955
149 -85955 -155447 -80274 62804 135277 39147 -116401 -127033 9431 115003 91287 -20714
160 -20714 -112226 -72898 77485 153491 54669 -87324 -113389 -17462 106382 134615 13726
171 13726 -129389 -117002 23969 117514 81587 -36436 -127828 -90332 47817 113788 30002
182 30002 -83825 -101042 -21814 76563 92761 -6875 -104912 -70620 49556 110394 58880 -44725
194 -44725 -100565 -39581 83971 120986 23444 -85926 -90446 -4374 85256 89930 -9646 -103917
206a03917K8711J06911M9650m5647q2494m2723N0660R8179J9193q4381p4140J8928
218f1070P8551O3443j6952r3563o2213N3672J01607L0019o0512q4780k9379O2988
230a8189R2186R000q5327p2799J5073P1662N4085j8205p8974m9858M5628Q0475
242D4757J5212n6005o1366p195O1550P1804q615q2423n1013L4245P2496M1411
254G4858l0047p9310l9486N3383P7349J0899n4464n9387r814N3123O0501j0289
266D7316o8442l9144K8560N5016K5768l1016o0895j8888N3385N9017n081n5094
278i498m4382R223N8777M9371k1258o8171l0945L5580N6018K2455l2919n8037
290c3786j6321M7552M9469o928m7393l5873R537M7186L3118k5742n6291j5693
$$ plain form
206 -103917 -75206 31705 81355 35708 -46786 -89509 -38849 59330 78523 -5858 -79998 -61070
218 -61070 17481 80924 63972 -29591 -91804 -38132 63475 93494 32982 -51798 -81177 -18189
230 -18189 73997 82997 -2330 -75129 -60056 11606 65691 47486 -31488 -81346 -35718 44757
242 44757 59969 3964 -57402 -64597 -3047 68757 60142 -22281 -73294 -39049 33447 74858
254 74858 44811 -34499 -73985 -20602 56747 67646 13182 -46205 -56019 -2896 57605 47316
266 47316 -21126 -60270 -31710 23306 49074 18058 -42837 -61725 -8340 50677 45596 -9498
278 -9498 -53880 -44657 14120 63491 42233 -25938 -56883 -21303 34715 57170 24251 -33786
290 -33786 -50107 -2555 46914 39986 -7407 -43280 -33743 13443 46561 20819 -35472 -51165
302e1165L8247M5743Q192l8474m8544j430N2612M4823j5556m7292l0157J4503
314b8498M8340L1464k4603n2110j3962L3826L7589N756l1073l9320n1M3127K9536
327D0021k0753m0536j7474J9179M0181J8091l1844m4806k199L9229L3011j502
339C0598l3888l4996O546M4277K8200j9520l6494j4358J8450L4063J4442k8127
351I193l6466K359L2959K2588q793l0250k4585J1984L9618J6172k7035l4804o524
364c3584K3550L2420Q785l1873l3772N718L4721K2040p973k7794k1329J2692L4939
377A8540J3197k2935k6819k323K0450K4712O96k8261k4916J0562L0824J3748j4507
390A2968k8006j4809J6853L2098P323k5321k5844J50K2064K2495m0k5647k1007
$$ plain form
302 -51165 -12918 32825 41017 2543 -46001 -47431 5181 50004 34448 -12844 -43001 -28498
314 -28498 19842 51306 26703 -25407 -39369 -5543 32046 37802 6729 -32591 -32642 10485 40021
327 40021 19268 -21268 -38742 -19563 20618 38709 6865 -37941 -40140 -911 32100 30598
339 30598 -3290 -38286 -31740 12537 40737 21217 -15277 -29635 -11185 22878 37320 9193
351 9193 -27273 -24914 8045 30633 21840 -8410 -32995 -21011 18607 34779 7744 -27060 -33584
364 -33584 -10034 22386 31171 -702 -34474 -28756 5965 28005 20032 -7762 -29091 -16399 18540
377 18540 31737 8802 -18017 -20340 110 24822 25518 -2743 -27659 -17097 13727 27475 12968
390 12968 -15038 -29847 -12994 19104 26427 1106 -24738 -24588 -2524 19971 19931 -5716 -26723
403b6723J1567K7073J0288j2690k1510q501J6561K5633J727k4965j8787O405K1350
416G428J6493o761k6973j6452J5693K6344N924j6392k1862o955J7190K4398L7
429A8112k2678j6428O241J9052J3457o017k1764j0930J5734K1294K248j6194j6275
442a4148j774J8581J9244m984k3047j3268R654J9003J0035r494k1880q711J5507
455e282J9054L32j4673j4279o05J6053J5100n889j8724p467J0547J5418N686j0321
469D950j7784k692J7421J5248l728j5819j1818L119J7386J2215q644j9195o493
482a5834J0964J4379M103j0503j5783j916J5256J2342m483j3974q133N286J4253
495E957Q731r837j5894j961J2390J2638P60j1566j4154J746J6151J0137o338j3646
$$ plain form
403 -26723 -15156 11917 22205 9515 -11995 -20496 -3935 21698 23425 -1540 -20327 -13922 7428
416 7428 23921 17160 -9813 -26265 -10572 15772 21696 5304 -16558 -23513 -6323 18075 18112
429 18112 -4566 -20994 -14753 4299 17756 11739 -10025 -20955 -5221 16073 18321 2127 -14148
442 -14148 -15922 2659 21903 16919 -6128 -19396 -9742 9261 19296 9802 -12078 -20789 -5282
455 -5282 13772 14104 -569 -14848 -15453 600 15700 9811 -8913 -16380 -5833 9585 15271 4950
469 4950 -12834 -15526 1895 17143 13415 -2404 -14222 -11103 6283 18498 9854 -9341 -15834
482 -15834 -4870 9509 13612 3109 -12674 -14590 666 13008 8525 -5449 -13582 -8296 5957
495 5957 14688 4851 -11043 -13004 -614 12024 12784 1218 -12936 -11190 4961 15098 8760 -4886
509d886p127N223J3602O543r767j3747j087J0757R411o23j0601r771L377J3891
523E195O188p594j1571l811P832J2498L580j1514j2064K243J1660Q415k064j0714
537a721r415M558J2988N140p696j0289k905O737J0435J338j0473r563L646J0054
551B834N975l891j0331o335O812J2242K549q596r642l88Q268J0037l27j0439q020
566i252L204J0339M930m154r066m632N992R839P56q357o930P72P052P547k275
581E765j0195n498N803R109K889n508q240k964P227R492l80q276o177J642P360
596B049N700k452q545m479N752P685J242n645o859j023O607P347k286q390m661
611g958L456P199M393l953q338k880O459P370M03n623o178p33P277O770k781p327
$$ plain form
509 -4886 -12013 -6790 6812 13355 3588 -10159 -11246 -489 8922 8299 -2302 -12073 -8696 5195
523 5195 11383 3789 -7782 -11593 -3761 8737 12317 803 -11261 -9018 2642 11057 8993 -1721
537 -1721 -11136 -6578 6410 11550 3854 -6435 -9340 -2603 7832 9170 -1303 -10866 -7220 2834
551 2834 8809 4918 -5413 -11748 -4936 7306 9855 1259 -8383 -8771 -503 9534 9207 -1232 -9252
566 -9252 -6048 4291 9221 5067 -3999 -8631 -2639 7200 7956 -401 -7331 -6559 493 8040 5765
581 5765 -4430 -9928 -4125 4984 7873 2365 -5875 -8839 -1612 7880 7500 -776 -6953 -5311 2049
596 2049 7749 5297 -3248 -7727 -1975 5710 6952 1307 -5552 -6575 32 7379 5093 -3297 -7958
611 -7958 -4502 2697 7090 3137 -5201 -8081 -1622 5748 6151 528 -5650 -6383 894 7664 4883 -2444
627b444l389L309O074L070m237p107j030N879N845j309n966m813J220O869M586
642F557l343p555k305L961O449J604m255o365n64O398M764j234n196l823J709
657c198N969L327l769n871j384M823M606P39n315n423Q11O198L837k266n434l271
673e621K535N976K552m065n962p32M450M860k3l998m972J656N310L137k407n354
689b658j707K889N209J446m679m452K50M364L811n76n115m106J950N655K008k446
705A843m698j771L094M522R93m276m029Q00M794K585j139m547k306K359N180R83
721D387l807l779j91L231M174J77m855l704J528M140K336j471m533k053K638M395
737B613N14k888l064o94L460L547o03m589k086K123L739J510k288l638j126L042
$$ plain form
627 -2444 -5833 -2524 3550 6620 2383 -4724 -5754 125 5970 4661 -1305 -6118 -4898 1971 6557
642 6557 3214 -4341 -6646 -2685 3764 5368 1113 -5252 -5816 582 5346 4112 -1084 -4907 -3198
657 -3198 2771 6098 2329 -3542 -4926 -103 4503 5242 -73 -5496 -4685 1513 5350 3084 -2350 -5621
673 -5621 -3086 2890 5442 1377 -4585 -5317 -867 3993 3970 -28 -5000 -3344 1966 5103 2696 -2658
689 -2658 -4365 -1476 3733 5179 500 -3952 -3702 662 4473 3897 -1218 -5324 -3374 2281 4289 1843
705 1843 -2855 -4626 -1532 2990 3983 -293 -4322 -3522 1272 3857 2718 -1829 -4135 -1776 3404 4387
721 4387 580 -3199 -3390 -159 4015 4192 -663 -4367 -2839 1301 3637 2166 -2367 -4420 -1782 2613
737 2613 3127 239 -2825 -3519 -59 3488 2885 -1704 -3790 -1667 2072 3582 1294 -2344 -3470 -428
753d28L629K7k897l165J48L079L249j065l843k193J965L367J054k174l244q72
769c363L009L112o53l170j650M54L355K076j651l514j257K512L308M54k630k811
785b419q6K833K967q88l372j934J060K868J774j393l654k83K225K357L55k316
801I4k871L70L183K221j338l324p21J431K549J176j681l245l41K415K600j79k436
818i7k143K33K578K253j575k927n46J524K166N93j788k744Q4K885J397o42k012
835g61j757J050K635J505j823k634m28J779J858O01j757k198L89K083J873j359
851A056k042r57J162K068Q30j995j842m9J710J909l02k104j558L76L013P20r30
868A065j911j011J009K688l49j428j379N7J382J410r4j958j075R79J508P43j294
$$ plain form
753 -428 3201 3228 331 -2834 -2686 393 3642 2577 -1266 -3459 -1494 1873 2927 753 -2491 -3363
769 -3363 -354 2758 2105 -1065 -2715 -2261 1094 3170 1519 -1995 -3252 -740 2568 3022 392 -2419
785 -2419 -2505 328 3295 2407 -965 -2899 -1839 1029 2803 1410 -2244 -2527 -302 2055 2410 94
801 94 -2777 -2407 776 2997 1659 -1665 -2386 -955 1594 2770 1089 -2156 -2497 -82 2518 2339 -97
818 -97 -2240 -2007 571 2824 1249 -1678 -2224 -700 1466 2059 271 -2473 -2389 496 1893 1251 -761
835 -761 -2518 -1468 1167 2672 849 -1785 -2213 -434 1424 2025 268 -1930 -1541 542 2415 1056
851 1056 -986 -1943 -781 1287 2117 122 -1720 -1769 -59 1850 1548 -556 -2114 -1738 1275 1995 1065
868 1065 -846 -1857 -848 1840 1491 63 -1316 -1259 123 1533 1439 -519 -1594 -615 893 1636 342
885C42j530l63J103J905J91j978j556N09J738J234o47j790r55J219J813O8p73
902E30j538j48J143J430J79j939j071M87J684J222j338j851n8J158J310l51q43
919Fj758K17J673J224j25j869j185J021J224P92p71j141q36J532J127M1j222q87
937i37O6J237R64m81j403o41O74J354L29q81j192m40J178J674k80j564o06L71
955e78Q95O43k79j670k63J026J045J28q25j070J60J291Q21r34o20r56O90J262
973G66J00n03j076n9M97J065L04j235r91J92J318Q83j060r80k17O77O22N86j158
992b69m81K08L65J048l69o26m39j35J282L71m05j627N56N85N87K81p99j163J61
1011h69J185K32l4p51n61J85J203J70j004n00k59J125N31R3r98o61L20R29N32
$$ plain form
885 342 -1188 -1551 -448 1457 1648 -330 -1886 -1377 361 1595 948 -842 -1797 -578 1235 1303 530
902 530 -1008 -1156 -13 1417 1596 -343 -1414 -927 757 1979 641 -1210 -1268 -110 1200 849 6
919 6 -1752 -1535 138 1362 1237 -632 -1817 -796 428 1220 449 -692 -1528 4 1131 1172 -50 -937
937 -937 -871 366 1330 849 -554 -1195 -521 833 1162 281 -911 -1351 -173 1501 1221 -343 -949 -578
955 -578 317 960 681 -989 -1252 -226 819 947 122 -948 -788 503 1324 390 -230 -1186 -496 766
973 766 866 363 -713 -772 -275 790 1094 -141 -1132 -940 378 1261 201 -779 -996 -319 303 889 -269
992 -269 -750 -542 -177 871 502 -124 -563 -698 584 955 550 -1077 -521 64 651 932 133 -1030 -869
1011 -869 316 548 514 -237 -798 -613 590 760 -244 -744 -1003 122 653 746 -252 -913 -593 336 868
1030H68p13o16o61R96P86k07l51q22j41P54O43J19j046m55P60N80j65J44p14m85
1050g26L19J390K2r50o90K28O29N58k60o08q44M89J226n0m39o32m92R79Q40m33
1070E56r39n04O47M23L69j89r39k22P13L27M25p56p19K96P10Q38o90p88l19N12
1090b49N72K80p6j202N7M44R78j29q80l62L33M82P69p11o16m47O07N33K44m21
1110B06r90L93L24J013n70n13o18K95P48Q52n29r56k43N15R75j52o19m02j79O26
1130A76N78k40n54o75M09P65J56m29o87q2M20M16L96o43q27L61Q65K92l09o91
1150c03k72M49N13J46m96n36k2O30K57p8n70m21N48P40j82l65m83r1P5Q55k24
1171A70l77k59P6N84M46l03n53l58L92P20M7l79p46o6O50N65J38j017r0o8O72
$$ plain form
1030 868 155 -461 -1122 -126 660 453 102 -720 -861 -107 536 655 -391 -846 -86 494 329 473 -241 -726
1050 -726 -407 983 1005 55 -635 -407 222 780 520 -88 -932 -443 783 733 294 -338 -830 149 989 556
1070 556 -383 -887 -240 183 552 363 -576 -798 -85 242 667 -89 -808 -512 198 1036 346 -442 -761 -249
1090 -249 323 603 527 -675 -618 -174 804 675 -205 -567 -234 248 1017 306 -310 -757 -150 383 627 206
1110 206 -784 -391 -67 946 376 -137 -755 -460 288 1140 611 -345 -588 -73 902 750 131 -271 -450 176
1130 176 754 514 -40 -715 -306 459 615 186 -501 -583 -163 253 649 6 -821 -460 405 697 388 -303
1150 -303 -575 -126 387 533 37 -499 -521 109 366 288 -282 -703 -155 585 403 38 -445 -536 -461 394 170
1171 170 -207 -466 -390 194 640 337 -216 -574 -182 538 585 206 -540 -606 44 609 747 -270 -360 -428 244
1192B44K33k48l24q8K46N20l66l66k10l14R08K71l24m99j96L53M61Q8k23m82N2
1213b64K89N42Q7o29n01J78J64Q05l45q19P6Q1L51N56l33n80q9M33M55j63l78
1234h4j96k76R44R4k57p51M9O88O3L17p77k94o6N27O29l25l87m72L26L52j16K03
1256A91m34l44Q64K86j72l6r02J05L06O31n80l74K4K65O74r7m00l70k69Q12K39
1277D19k47k89k84K42J32O05m61n89J15J56P78k12o8n66pL84M10p4n73l74J51
1298c52O85J28m34l69m8M56K59k07r0n37R8P50J41j97m27j62J39P52k13k84l80
1319b92j69O65j05J93k89n34m6Q23K98l43j81n74K98M70J37k01p58L32L39J62
1339B25J44l48k96j13P10Q2j12k43l14L24L78l60R7o18r8O02L32j18n74r0K66
$$ plain form
1192 244 477 229 -95 -183 63 583 217 -149 -359 -673 235 506 182 -317 -513 -160 301 389 166 -316 -264
1213 -264 25 567 654 25 -476 -298 -134 671 326 -493 -417 -336 15 571 238 -342 -431 2 457 294 -84
1234 -84 -280 -556 388 482 225 -526 -477 211 274 591 -186 -480 -546 -19 610 285 -102 -574 -248 104 -12 191
1256 191 -243 -587 277 563 391 355 -547 -442 -136 495 -85 -459 -435 -170 504 407 7 -363 -632 180 419
1277 419 172 -117 -401 -159 -27 578 117 -472 -357 -201 577 365 297 -269 -276 108 518 444 -129 -503 -352
1298 -352 333 461 27 -342 -390 66 325 118 28 -509 -411 339 480 283 -144 -306 -167 585 372 88 -292
1319 -292 -461 204 99 292 3 -531 -577 246 544 201 20 -554 -256 214 351 150 -608 -276 63 225
1339 225 369 21 -275 -388 322 404 292 49 -265 59 437 77 174 -444 -542 60 392 274 -300 -390 -124
1360a24M45Q5o39P7K6q9L81L7k47j74j41M60J36O9n47j17O6M63R1K66q71K42J20
1383A5L18m39j65j41L07J26J62k32j38q6Q9J89J63m15O3J16K48k14J91j87k98
1404c28J91J35L29m50Q0j76L57L3p7q6k03J03J81J01J21m42r4J73K38j00J53m20
1426a81k4J79J93j01j86j09k89N06P2j89l0K37l19M06j5k9k16j26L53J0r9R0k5
1449A08m44N86j02m2k89j37J62K97m8J00m93J0N11K4k03j17j66J61L65m17N4k95
1471c75N0K89L06l3j41l58j20M87q1j46j00K68k98J41J72k82L48m52M71k43L8
1492e9J82k82R8j16L39k12K65q20P36k38M77l34R4j71j86L03L00m44j33L57j55
1513Aq5L24l83j19L78l05O09j81l77jN0M39j86k64l9Q8J56j59M2Q9n0l49N05J7
$$ plain form
1360 -124 321 406 -233 -156 -130 -219 162 199 -48 -222 -363 97 233 302 -245 -362 -296 167 258 524 -347 -105 15
1383 15 333 -106 -271 -412 -105 21 183 -49 -187 -273 -184 5 168 -247 -184 -68 180 -34 157 -30 -328
1404 -328 -137 -2 327 -123 -43 -219 138 171 94 8 -195 -92 89 190 311 -131 -225 -52 186 86 239 -181
1426 -181 -205 -26 167 66 -120 -229 -518 -12 60 -129 -159 78 -241 165 150 121 -95 -221 132 142 43 133 108
1449 108 -336 250 148 106 -183 -320 -158 139 91 191 -302 -292 219 243 40 -77 -243 -82 283 -134 -80 -375
1471 -375 -325 -36 270 237 96 -262 -382 105 24 -122 -222 46 -252 -111 61 -221 127 -325 146 -97 -59
1492 -59 123 -159 -61 -177 162 -50 215 -605 131 -107 370 36 130 -41 -227 76 376 -68 -201 156 1
1513 1 -84 240 -143 -262 116 -189 420 239 -138 -139 -89 350 164 -100 -139 -51 105 -54 -12 77 27 -322 183 200
1537B00Pl49k26K53J05K7j35r1K80j16j79K93j49J68k83L58n0N6j80k9J44o9K85
1560C20j28r3m39J75L88N5n50K17J10K35k94J8l84M29k09L4L3J50J08l63K35j01
1582e4N13q09J95L40J79l40l49J81J48O61j649J237k21k19p64J105l84j67j99
1601e96L12N76j318J001L42l94r22M27L4Q17p61J71M54L07k13j24J53n64J5L72
1621H9J44l40J27j19Q9K09j91k47l9J75NPJ28m69J65J62J81J58j90k00K29l00
1643b27K92J01l86k4J79%M11k92r0r9m4L81J42l87j41l2L91p7r4K32l24m4O7L45
1667B80l33j71K63R4k82M52l30j02J90J6J98j98no0k65L49J4o2m98M58q9L04O2
1690B85j49m14J39J64P1k11m0j39PL77J70k31k63K15Q4Q9R1m38L48L2J50j33k56
$$ plain form
1537 200 207 -142 -368 -115 -10 17 -118 -209 71 -45 -224 69 -80 88 -195 163 113 169 -11 -40 104 35 320
1560 320 192 99 -340 -165 223 278 -272 -55 55 290 -4 14 -370 59 -150 -116 -83 67 175 -188 47 -54
1582 -54 459 -350 -155 185 364 24 -325 -144 4 665 -984 253 32 -187 -951 154 -230 -397 -596
1601 -596 -284 292 -1026 -25 317 -77 -999 -572 -538 279 -482 -311 143 450 237 113 266 -298 -283 89
1621 89 233 -107 20 -99 -10 199 8 -239 -278 -103 -98 -91 37 -432 -267 -105 76 234 44 -156 73 -227
1643 -227 65 166 -220 -244 -65 -65 346 54 -36 -135 -179 202 344 -43 -184 -216 175 98 4 236 -88 -132 -65 280
1667 280 -53 -224 39 133 -149 303 -27 -129 61 77 275 77 72 12 -253 96 110 48 -450 8 -81 223 285
1690 285 136 -278 -139 25 96 -115 -155 -294 -287 90 260 29 -234 -19 65 154 245 -193 155 187 337 204 -52
1713e2k54L50m1K64l06K2j75L41k79J85p8N8l4K52M4k23j55m4P5j24K62J09l30
1736a33k47L50k7L75l11j41m8L16r2m8K0k27k2L85M5k47k03K69j03l1K05J07m02
1759b10K63m4N3o6k59j22K63J98L46o81J88o8K3J53k95L52k24j14R1M42M6j26
1781B09l84L28j00j44L08j75L5N5L7p6O0l47J69K28K23o1j93j01j19Q5Qj58n1
1804a64J67p1K61k87j80j37N22M5Pn8j54n26M46J91p1r1K33o6q4R2n0J43m13K3
1828b22O40l05k64L6P1Q1o5J8k75J33K82k32k7L91k05j87L44l43J04J14mj36K31
1851A80r0L05o93J73L34k39K37j95j5p1l7M6J93j25q2L9J09K26j74M7l13J80p8
1874d3M24l23l53M40l81J81L56k68o9L0J8L10k68l8n32M28M52l13k04P1K3J27
$$ plain form
1713 -52 -306 44 3 267 -39 -17 -192 149 -130 55 -23 35 1 253 297 74 -81 -125 -50 -174 88 197 -133
1736 -133 -380 -30 -57 318 7 -134 -182 134 42 -6 14 -213 -235 150 195 -52 -255 14 -89 -120 85 192 -210
1759 -210 53 9 62 -4 -263 -385 -122 76 422 -259 -71 -139 -116 37 -258 94 -130 -244 -153 289 335 209
1781 209 -175 153 53 -91 217 42 77 132 169 93 153 -194 -25 203 426 365 172 71 -48 37 45 -113 -164
1804 -164 3 -68 193 -94 -274 -411 111 156 163 105 -49 -575 -129 62 -9 -100 133 67 -17 75 25 168 -245 -222
1828 -222 418 113 -151 -115 -44 37 -28 -10 -285 -152 130 -102 -129 262 57 -130 214 -129 -25 89 85 -51 180
1851 180 90 395 -298 -125 209 -30 207 12 -3 -74 -111 -65 128 3 -79 -40 69 295 121 168 -145 35 -43
1874 -43 381 58 -295 145 -236 -55 301 33 -36 -6 12 322 54 16 -516 -88 364 51 -153 -82 -59 68
1896F8p6K6j91k85L21K27J97j30P3j60J33k24K8k58M00k12J63r2j9k8k9J50l17
1919b35j8K71j58j62K40M64l10j7k22j31O10j84k14j57J54J35J95j65m3J38l98
1940b07M08k33q6J39J81l00J46M3o1p3p3L29l52L28p0k60J16J19M9j12K6o2J67
1963A62k13O9j48l0O2n9L85r2l2m25J51M32j92j93l2K53k56J98L9j53J68j93P6
1986b3M6K97o48J98l5J39k63J89J75P0j47J93k69K32k04p6K77p9k22P1J3J50P5
2009A59k74K13j87J13J4j07k8K47m61K93k14K46L64j72n19K20K07l65L28J04j42
2030C9q1J90k99K48j82r7M4L91j26l73M55k15K7j42m10N26l32M83N4k92K54n53
2052c91J29N48J3n99K81j7K9J86K7m01M0K24j4K03j24l86k04J94J47L99L8q43
$$ plain form
1896 68 -8 18 -173 -458 -137 90 287 157 230 70 203 -21 7 -251 149 -63 100 8 -11 -39 -68 82 -235
1919 -235 -253 18 -140 -302 -62 402 92 75 -147 -278 332 148 -66 -223 -69 66 261 96 53 191 -207
1940 -207 201 -32 -118 21 202 -98 48 91 30 -43 -116 213 -139 189 119 -141 -25 94 143 31 57 -5 162
1963 162 -51 18 -130 -160 -98 -157 228 136 104 -321 -170 262 70 -123 -155 98 -158 40 79 -74 94 -99 -23
1986 -23 23 320 -328 -130 -165 -26 -289 -100 75 145 -2 191 -78 154 -50 -126 151 72 -150 -79 -66 84 159
2009 159 -115 98 -89 24 38 -69 -97 150 -311 -18 -232 14 378 206 -313 -93 114 -251 77 181 39
2030 39 -42 148 -151 97 -85 -182 -138 253 127 -246 209 -6 21 -121 -531 -5 -337 146 200 -92 162 -391
2052 -391 -262 286 299 -300 -19 -36 -7 179 206 -195 -155 69 55 258 134 -252 -456 -262 -115 284 322 -521
2074e21P24J23l07K73l30j37J66q6k8j01j47M16Q5j50N5j23j46oJ40L02n40L03
2096c5k02K21J70j01M3k4k0k72M55j65K8j67j64J40L03k89j5k62J72P6K54R6m58
2119b16K75k64L38K24j24j12j06q2J65j29k39K17J30k01M5Q8j4L4J02L9l41K57
2141H6J78l92J85J0J56n27N11J63m67L36r5l98K00P6J37p1j89P3J6j7J45O1Pk39
2165e5J78Pj34k07K23j96J13j55L57j15j64J17J5Q4j98q6L45j22Q3j09m7o1M5
2188h2J39J21k60j92K76J0J75K2l67K49K17m15L34k23k17J57lJ71k9j16J79j61
2210a5P2r1Q5P7m40N83n8j0k30k59J99j51J44J19p0j66J76J73L5j57J10j88J51
2233H9J01mj44n1o3J91j11L7kr7J66L6K08M2o87L13R7j67l1J21j19O3J87L75m54
$$ plain form
2074 -521 203 326 19 292 -38 -175 -9 -95 -123 -224 -371 45 130 -20 35 -88 -234 -240 -100 202 -338 -35
2096 -35 -237 -16 154 53 96 72 52 -220 235 70 98 -69 -233 -93 210 -79 -94 -356 -184 -108 146 242 -216
2119 -216 59 -205 133 357 233 121 15 -67 98 -31 -270 -53 77 -124 -79 9 -5 29 131 170 -171 86
2141 86 264 -128 57 67 223 -304 207 370 -97 239 144 -254 -54 22 159 88 -101 -28 -12 -29 116 177 184 -55
2165 -55 123 130 -4 -211 12 -184 -71 -226 131 16 -148 -31 -16 68 -130 -216 129 7 90 -19 -66 -127 -82
2188 -82 57 178 -82 -274 2 12 187 209 -158 91 308 -107 227 4 -213 -56 -59 112 83 -33 146 -15
2210 -15 57 -34 51 128 -312 271 213 203 -27 -286 -87 -238 -94 25 -45 -211 -35 138 173 16 126 -62 89
2233 89 190 186 42 -9 -72 119 8 45 43 -54 112 148 356 398 -289 24 121 -46 -77 44 -75 -12 175 550 96
2258I6j20J59K50p13M75J96m31j82L1L31R3j29k03O9L1K83l39L76n12L42j82J22
2280D3J54j75k69K78j18K3R8k48M43q2o0k24j30M89n7j92K03q5r3J57l63L90j58
2303B4J30k22j20N99l19qj50j19K08n1J30m2j39K33j10J22n9j32K12j19L6J50
2325B54l78j71M15l95J56K98j85j64L93p8r9j05l8J17J85Ko32K94M53p26M42Q5
2347A23k75m7M19j49j45L51l59P5p7J41O1J37N5k23l18J19L13k36l3k66L93m2
2369A7O5L5m5k72K78M8mP2l21O7J33q6Q2k67k2J86l8J70j85J07P7j86L50l33k71
2394c43N03k35L32k00j98k31M68J03P7r7l6m33L03P0l04K32j08J39mQ9j91MJ69
2417A09j93k93K53J54q3J6J85k31J58o6j63%K51k10J89k38j97M87j42J82o5l6
$$ plain form
2258 96 -24 135 385 -328 147 343 -88 -270 -239 92 185 56 -147 -78 -47 236 -103 273 -239 103 -79 43
2280 43 197 22 -247 31 -87 -64 34 -214 229 147 87 -137 -267 222 165 -27 176 91 -2 155 -208 182 24
2303 24 154 -68 -188 411 92 84 -66 -185 23 -28 102 60 -79 154 44 166 107 -25 187 68 104 254
2325 254 -124 -295 120 -275 -119 179 -6 -170 223 145 46 -59 -97 20 205 207 -425 -131 322 -404 38 123
2347 123 -152 -199 220 71 -74 277 -82 -7 -84 57 118 255 310 87 -231 -112 201 -35 -68 -334 59 17
2369 17 82 117 72 -200 78 126 122 194 -127 -60 73 -13 69 -198 -220 -34 -72 98 -87 20 97 -89 261 -72 -343
2394 -343 160 -75 257 57 -141 -372 96 199 276 179 143 -290 13 83 -221 11 -97 42 38 127 -64 -60 109
2417 109 -84 -377 -124 30 -53 -37 148 -83 75 9 -154 -154 97 -113 76 -162 -359 128 -14 168 103 67
2439F7l17r1M26K3j33K02j00J07l86J96J66l3l58K74k75J74O9j70K29j22q6n0
2461a88L42m12K53j4K2K5k29K51K1k96N22k70j90j60M51J45m33K07j37K6J63r1
2483HQ2j02J62l19J75j61k1J80O4m2K99n28K5N7NK6k56J67K62k15k49L21L77l74
2507e7k00K81R5l5j10j68R5R2L1k31n6R0J94J70L0m73L11j71K05j6J87k93O1J56
2531A88J17j96j76J27m24K46J46N9J44K6k14p3J97j98j79J86P1l9J74l68J08n7
2553a35j53K23L27j91J13m23J55L23j23j04O3m06K00l7J7K74j78M06k42l09J19
2574h1l1K87j72J34m8l38L24K01j29K8o0k53K24r7J68k12J98r0r9J77J08m02r7
2597b60Q5J81j43O0k2M4M7k37M1J48l12O09j79P1k16K38l12K68j56K05j28j17
$$ plain form
2439 67 -250 -341 85 108 -25 177 77 184 -202 -6 160 127 -231 43 -232 -58 11 -159 70 -52 -138 -188
2461 -188 154 -258 -5 -19 3 28 -201 50 71 -225 297 27 -163 -323 128 273 -160 47 -90 -64 99 8
2483 8 90 -12 150 -169 6 -155 -176 4 68 26 325 -203 -178 -121 -116 -90 -346 -179 83 -132 -381 -60 317 -57
2507 -57 -257 24 119 84 -26 -194 -99 -7 24 -207 -263 -173 21 191 221 -252 59 -112 93 77 264 -29 32 188
2531 188 305 109 -67 60 -364 -118 28 87 231 257 43 -30 167 -31 -210 -24 47 8 182 -186 -78 -135
2553 -135 -288 -65 262 71 184 -239 -84 239 116 12 75 -331 -131 -168 -151 123 -55 351 109 -200 -81
2574 -81 -112 175 3 137 89 -249 75 276 147 175 115 -138 86 -11 157 -55 143 53 -46 131 239 -163 -260
2597 -260 -175 6 -137 -77 -99 -55 -8 -245 -204 -56 -368 241 62 133 -83 155 -157 111 -45 160 32 -85
2619h5M9K11J46m16J6o8L77l07J95p5J50j48j62L33m55N28m40R2K24j81k27K17
2641b6J62j64L00l33k58K50J12j08L21l0l14j4J87j9j90K9k0L08j26Q2j87j34
2663a72q7K19K01m9Ln8m3k74K23k1J96j75J26j64j00J38m3J28R0N5m6K1k88J34
2687A4NJ14j61K2k12L85J11k44J7J27j29n0J04m4J6j17j45K29N3p0j92K43j45
2710f9K15k45J06l26J25J54K42J53j33J28l81M6P5k12O5o0J26J90J8k15j00J81
2732H3k06J89j51k6J36N7j77L27m54L96j86j39o3J04J80r5L5R9m79L26K53n39
2754c30N09m31J71J59oP6k8l51J14M2r8K7J18L7k04J30j16K29L5p9L09j42j68
2777CK90l86K05m34L27L53o74J91L77k42p9J18J49k54J02p8J53k13P5m8J52n6
$$ plain form
2619 -85 -36 175 321 -95 -79 -147 230 -77 118 43 193 45 -117 216 -239 289 -151 -59 165 -16 -243 -26
2641 -26 136 -28 272 -61 -319 -69 43 -65 256 226 -88 -102 85 66 -124 -95 -115 193 67 149 -38 -172
2663 -172 -259 -40 161 112 115 57 14 -260 -37 -58 138 -37 89 -75 -175 -37 -80 48 138 193 147 168 -120 14
2687 14 19 133 -28 -6 -218 167 278 34 51 178 49 -1 103 59 75 -42 -187 42 95 25 -167 76 -69
2710 -69 146 -99 7 -319 -194 -40 202 355 222 350 -31 15 90 -122 -57 -117 9 199 217 2 -98 83
2732 83 -123 66 -85 -111 25 82 -95 232 -222 174 -12 -151 -214 -110 70 -25 10 109 -370 -44 209 -330
2754 -330 179 -252 -81 78 72 148 120 -231 -117 -75 -173 -146 -28 9 -195 -65 -181 48 83 4 313 171 3
2777 3 293 -93 112 -322 5 358 -316 -125 252 10 -69 49 198 -56 46 -32 121 -92 -17 -65 87 31
2799C1j55pj36L50K53n52K99j7R5k50m7L45k01j46J73PJ30j31L10k95j06j29J51
2822b8K28l44K8j00M79n33L27L4q9k68L57j23K04k14j27L80j70q7O8k43K00j39
2844a60L03j30K38l60R3q7K18j00L7J17j67R6n7O9j21R2m96L26O9l0k35L93j24
2867a6Q5j62J63q7k9R2R2j97N19m71J32l5J77l13P7J0j84K70pl9n1K38k64N8k43
2892a85J08J63L36l82k76J98J04q4Q2j33K44k29P9j36O1K19j28L6k52J49M8O3
2914H5j6p6k12K31r2M8n8J63j22K03m4k87j29N15k33K58j45k67L45k71O6K68J11
2937C41m11j89J06q6L80k72O3m5Q4k40J20oK05o5J22L0j2k65K74j90l91N12mn6
2961EL7j8j76J63k18R5L35m88J61L13k27j7j88P5J84R5m7j69K12j84L51k54L2
$$ plain form
2799 31 -124 -131 -267 83 336 -216 83 66 161 -89 -136 209 8 -138 35 42 172 41 351 56 -50 -179 -28
2822 -28 200 -144 -116 -216 263 -270 57 91 2 -266 91 -32 172 -42 -169 211 41 -46 22 -221 -21 -160
2844 -160 143 13 251 -109 -16 -103 115 15 52 169 2 98 41 110 -11 81 -415 -89 -20 -50 -285 108 -16
2867 -16 69 -93 70 -17 -46 46 138 -59 460 -11 121 86 263 -50 27 37 -147 123 116 77 26 264 0 58 -185
2892 -185 -77 86 422 40 -236 -38 66 -18 64 -69 175 -54 25 -111 -50 169 41 77 -175 -26 22 85
2914 85 69 -7 -219 12 -80 -32 -90 73 -49 154 110 -177 -306 209 -24 234 89 -178 167 -104 -38 230 341
2937 341 -70 -259 -153 -239 141 -131 -68 -113 -29 -269 -149 -155 50 -15 107 137 125 -140 134 -56 -447 65 61 5
2961 5 42 24 -152 11 -207 -112 223 -265 -104 209 -18 -35 -223 -148 36 131 84 -85 127 -57 294 40 72
2984G2j8k34L09O0k05N7Q6j08k68N12m03J73J44o2K98o03L89p1k99M93m63K12
3006G1L9k08J6K45j81k89J99k9M0N8oK0L18m85J80k4J45j45M17k37K3J38m44K08
3030F9j92J84j96J19j4m2O0j94L04r4k1K74l68J64N1j36%K46k77J30L17n66L41
3053A59r1j32m9K3K62l38K5K05j75L2J76j67L1R4j69J27K6o5J41j89o2K12j56
3076h0m4M68j31j64JJ40j30L02m05M5m3j01J87k79oJ40K19L7j06j40J57q3j19
3099a35m0J66j93M0k15L27P0j4j50L66k75L78k70l8L29m48Q6j41M08j5k45O4M6
3122A01j42j13OOJ11K7o8J19K11j33J48j74j14J65j52j54J80m9J38k0j34j94M43
3145B08j40r4Q2l03J34J73l0l21M08k9l29L49k15J00lk02J28qJ21J63k75j40J34
$$ plain form
2984 72 54 -180 129 189 -16 41 127 19 -249 263 -140 33 177 115 413 -190 199 128 -171 322 -141 71
3006 71 110 -98 -82 163 -18 -307 -108 -137 -97 -39 -45 -25 293 -192 -12 -36 109 -36 381 144 167 305 -139 69
3030 69 -123 61 -135 -16 -30 -72 -12 -206 98 4 -17 257 -111 53 104 -32 -32 214 -63 67 384 -182 159
3053 159 68 -64 -113 -90 172 -166 -141 64 -111 -79 97 -70 -39 55 -114 13 39 -26 115 -74 -136 76 -80
3076 -80 -124 344 213 49 50 190 60 362 -43 2 -41 -142 45 -234 -240 -100 119 156 50 -90 67 -16 -135
3099 -135 -175 -9 -202 -162 -377 -50 20 6 -144 222 -53 325 55 17 346 -102 -16 -157 251 236 -9 55 101
3122 101 -41 -154 -148 -142 -31 -4 -72 47 258 125 273 99 -15 150 -2 -156 24 -25 113 93 -41 -235 208
3145 208 68 -26 56 -247 -113 60 30 -291 117 88 -241 108 -107 -7 -10 -212 -84 -92 29 192 -83 -223 -89
3168h9K32k38k18j41O14Kj58J80j87J5j10l9Q9L04j21j21k27M41n41pL53K12k27
3191A8lk67J09J42o9J68j32L17Ql17j64K34k5n1l8J62J69k73O7N9k05K11n9K05
3215B66l63k4J80R9K4j01L9j8M4r8o4NJ02j2k40J64j52J37J28n33J94K10N3k53
3239b13l1P9L44j70J64k42l61L30L06m17K41J10J24J35m92K42k44k11O70l76j00
3260a12J18q6K04l78J18J71k19j41O18l93p8J51MK35j76K6l7l1r9N3J6K61n9k04
3284c8K19l87M16j99r4J17o1J11L37l98R0J98j34J33l75N1Q6M3k87J68k23K57
3306C0k53M16K3l78K42m8j35K05J03k73L5k05M25o9j7j63m8O6Q7l80L74j42K41
3329A36j97K50m8l09L59n90O12j47j28K77k19J11k33J55Q6k82j10L12l17K38j09
$$ plain form
3168 -89 143 -95 -313 -454 160 162 4 184 -3 12 -98 -137 -48 256 135 14 -213 228 -313 -320 33 245 18
3191 18 15 -252 -143 -1 -70 98 -34 283 291 -26 -190 44 19 -32 -70 92 261 -12 55 114 -91 120 61 266
3215 266 -97 -121 59 158 182 81 120 102 146 48 -16 -11 91 79 -161 3 -149 -12 116 -417 -223 -13 40 -213
3239 -213 -244 -165 179 9 173 -69 -430 -100 206 -211 30 140 264 399 -93 149 -95 -306 364 -12 -112
3260 -112 6 -80 124 -254 -136 35 -184 -325 293 -100 -178 -27 -23 212 36 62 25 -6 -105 -52 -36 225 166 -38
3284 -38 181 -206 210 11 -83 34 -27 84 421 23 113 311 177 310 -65 -14 72 115 -172 -4 -227 30
3306 30 -223 193 216 -162 80 32 -103 102 205 -68 -33 -238 187 118 101 -62 -110 -44 43 -337 37 -105 136
3329 136 -61 189 141 -168 191 -399 213 66 -62 215 -4 107 -126 29 115 -167 -277 35 -282 -44 -153
3350a53K67k32P7L34m66q8J09L06j19j73K24j57J52j71R9q0J55l11M54j38Q6j96
3372b1l7K19k11J02M4m0j30K23l40RL20k3l96L55k26J84J01m7j66Oq9J6N3K2l6
3397a08J34K41J31o27N01j77Qrk22j58K05L96k24k14n6K15k89K49J16k7j6m1J47
3420A75r3k2p1%R2j25L27m40K85r5J78k3M1j17k84Q8k3J57k20J42j91K90k39J84
3444A6K77k79J17j7j90K98k20j5j59r2R0J54k7j7j16M13o0k12j64J42L11L2l15
3467c3J09j04J23R2l72L08J04k31p4p6K07p4oN5l58K45K61M3k17K3l61M08j02
3490c0lJ95k73OL6p4L5M28j69j4k04o3L18j96l11K96JlK9q9R6k50L31P9l51J57
3516b3L5j86j56N19m30J62J34M0k3j52R0J58j58k73J97O2P5l39k9L85J50l47j06
$$ plain form
3350 -153 114 -118 -41 293 -173 -261 -152 154 35 -138 86 -71 81 -90 9 -71 84 -227 227 89 175 -21
3372 -21 -58 161 -50 52 96 56 -74 149 -191 -182 138 115 -281 74 -152 32 133 86 -80 -74 -163 -147 -94 -72 -108
3397 -108 26 267 398 -229 272 95 103 94 -128 -286 -81 315 91 -123 -179 36 -253 -4 112 85 69 28 175
3420 175 82 60 -11 -11 81 -44 283 -157 128 33 211 188 229 112 -172 -84 -107 50 -170 -28 -219 71 -168 16
3444 16 293 14 131 114 -76 222 2 -13 -172 -264 -174 -20 -47 -64 -180 233 173 -39 -203 -61 250 282 -33
3467 -33 76 -28 95 187 -185 123 227 -4 -78 -154 53 -21 -27 28 -330 -85 176 219 2 25 -336 72 -30
3490 -30 -33 162 -111 -105 -69 -143 -108 320 151 137 -67 -130 188 -8 -319 -23 -22 -25 4 -85 11 -239 92 171 -180 -23
3516 -23 12 -174 -330 189 -241 -79 55 95 72 -80 10 168 10 -263 -66 -4 71 -268 -297 88 238 -109 -215
3539b15L25q3q8J49k90J70o0P1j05K73R5j08k87K43k24N8K28J22j33m21R0K48
3561E8j99J70J46k73J54J62j84r7k37K19m5J64J64j05l14L88r4n3on1L1J2m9m0
3585g9M9K16j09k35o4J03q4m7L4K28O9L74n17J29k60P1K9K2M0N4m9J2J64k04J54
3610A00J54l12J11J01o0j84L49j84k28J1l6J6k76O37l23p7Q1J05M98n69K12j73
3632d7N2K13m7k41O4k21j68K63K18K57k47N6j15o5L4j6j10J83R5r8K45n33M37
3655B09j50K5n3j77K35k56j4M6M03j70k31j07N21k41k76J59M77l80k15K31p8j36
3677a78J29o6N1K58n01M14k00j35K23O14q05K19r7J93j21N1l4M3k2k55M13j60
3699C4k9l43M28k65L08q7j89K14J2l24J54L0O3oJ61l18op5J74l0R0J13j57O8p
$$ plain form
3539 -215 110 27 -61 88 -202 -32 -92 -21 -126 147 242 134 -153 90 -134 -76 152 274 141 -280 -190 58
3561 58 -141 29 175 -98 56 218 34 -63 -300 -81 -126 38 202 97 -217 171 77 24 18 -33 -2 10 -39 -79
3585 -79 -30 186 77 -158 -222 -119 -203 -250 -216 12 81 455 -62 67 -193 -122 -93 -71 -31 23 -26 -14 150 -54 100
3610 100 254 -58 53 154 94 -90 259 75 -153 -142 -178 -162 -438 199 -124 -201 -120 -15 483 -86 126 -47
3632 -47 5 218 171 -70 -6 -227 -395 -132 86 343 96 152 37 -28 6 -10 -120 63 158 60 305 -228 209
3655 209 59 84 31 -146 89 -167 -181 -135 268 98 -133 -240 281 40 -236 -77 400 20 -195 36 -42 -178
3677 -178 -49 -115 -64 194 -307 107 -93 -228 -5 609 -196 23 -74 119 -2 49 15 58 36 -219 194 34
3699 34 5 -338 90 -175 133 46 -143 71 83 -241 -87 -57 6 0 161 -157 -163 -238 -64 -94 -4 109 -48 20 13
3724A3j7J66j53j93O4j13J81L3p7L37m23J27K35j51j70R0p0Q8R5p8J83p0k83J99
3748A3J9k16j04N72j67k51L05k18L6J58q3j6k07M22k40l5k34J00J84J53l34L50
3770B07Ok48O1p7k37L6M25j52k4L8J09k41j3L17m40L3K21m3l0r3j49K09P9P6R0
3795A60J05k40O5Rk98K30k10L17k77K92k7l00Q4J26P6qK9Q1j03Jl43M63l48J9
3819i7R8k16M86o1l70L38j26k24Q0J05l33J29K71k88N5M15m6k6j06k02k3M34l46
3842e3J54K71m97r2J73j30K12J09k50KL0K9j02J84m2J61j91K6R1M4j37j96P2L08
3866A76J33m34J55L53l88jj49K97J45k99L04M0m27L77n06L06k66J86J80l3j27
3887B2r5K51Q3R3m21r4J19K59N5m43L72j01k47O48p10L57j38j21M6j19j02M37
$$ plain form
3724 13 -4 162 9 -184 -120 -233 -52 -19 -96 241 -182 -55 180 29 -141 -51 -121 -33 62 -16 167 97 -186 13
3748 13 32 -184 -288 284 117 -134 171 -47 -11 147 64 48 -159 263 23 -12 -246 -146 38 191 -143 207
3770 207 213 -35 26 -51 -288 -252 173 21 -3 35 144 -97 -110 207 -233 -200 21 -22 -52 -145 -294 -85 -6 70 160
3795 160 265 25 90 99 -199 31 -179 138 -139 153 126 -174 -90 36 112 104 133 214 111 112 -231 232 -116 -97
3819 -97 1 -215 271 210 -160 178 52 -172 -92 13 -320 -191 80 -208 -153 262 216 190 84 -118 -141 293 -53
3842 -53 101 372 -125 -217 -44 -174 38 147 -103 -101 -71 -42 -144 40 -2 159 -32 -6 85 129 -8 -204 -132 176
3866 176 309 -125 30 383 -5 -6 -155 142 287 -12 292 332 -95 282 -224 82 -184 2 182 149 22
3887 22 -73 178 261 354 -67 -161 -42 217 272 -171 201 100 -147 501 -209 148 10 -111 -65 -184 -286 151
3909A51l01M20J08l86r9J96J65n30L06J11J3j64M02l75j63J38m9J66J93l02R0
3930I0j15J60r6q9J60K40m52K64L1m74M68j18K33j71o6p6N0R2q8P0k94L44j13
3953E0j88K38j28J0J68j0M6k60k58J56N4J74J22j95k9K62n17M6Q5K75j31j12K19
3976G7m44M08j6k53L65m9j03j84M99l17P9j70J92l81L60N3j12K9j15P1j30n5K18
3999B2N2Ol71J02P3J22n6J64k54k6J68O5j27m9j92K41j5M2P1j59J68J31l2L2l72
4024a94M36l9n7j02M2J79n64L35k85N5L87l09K45j90L19j75k03L40l31L18j69
4045C8l56r2K49M8l41L30N0j08j02L7J90K18J48l51R7nJ2k17M67j68j30J05r5
4068B4J47j70J98l95J70J40n0j06L4Q2j35N6J96J39l30K85j68j17L86o29J78K59
$$ plain form
3909 151 -150 270 378 -8 -107 89 254 -276 30 141 154 -10 392 17 -146 -8 -57 109 302 0 90
3930 90 -25 135 39 -50 110 350 -102 162 193 -281 187 69 302 131 65 -11 39 131 43 113 -181 163 50
3953 50 -138 100 -28 -18 150 140 186 -74 -332 -176 -122 52 174 -21 -50 212 -305 -259 -174 101 -30 -142 77
3976 77 -367 41 25 -228 137 88 -15 -199 300 -17 62 -108 84 -297 63 116 4 33 -82 -11 -141 -196 22
3999 22 74 80 -291 -189 -116 6 -50 114 -140 -166 2 67 -60 -109 -301 -60 -75 -33 38 -121 47 178 146 178 -194
4024 -194 242 203 146 44 86 265 -299 36 -249 -194 193 -116 129 -61 258 83 -120 220 -111 207 38
4045 38 -318 -410 -161 -113 -454 -124 -74 -182 -284 -247 -57 161 309 -42 55 50 62 -155 312 144 14 119 24
4068 24 171 1 199 -196 -26 114 64 -42 -8 74 -61 -5 191 330 0 285 117 0 386 -243 -65 194
4090A94l65L99m28pQ4K89k04J15o9J05n7J62k46k05P70o59L77M0n65O69m4q5j62
4113A08J6j36k24L58m41R5K45J94r3M2k42L27n05N34l41k25M26J60k31m9O8k09
4135a23K64M9j90j93J93o9Ll17J72K27j5p9l6K87J43l17N2K31on11L59j86K61
4158A99j23n8KL33l47N2K00l06m8j38K48O3o0j73J11m2K7K48n08N34o03M41l08
4181b56K8K75q3N38k42j13l50L99k21k01K14J07J4n8J36k55J02N6k90L36n0K17
4203C03m86J3K85j93m0J34J48q2J1j2q7n2J79l07l5J57jj52J97j42P3J4KM7l0
4228e6l57L43K41l63K22qJ73j30j21J15L12m50J38J87m5q7o9J47j65J88j6j35
4250F4M4j51l50O81k55r1K06l0k97rK85k16q9J12l01M13R4l18L67l24K32j89R0
$$ plain form
4090 194 -171 228 -200 -207 -123 166 -38 77 8 113 56 218 -28 -233 537 -122 255 295 -270 399 355 270 108
4113 108 124 -12 -236 122 -319 -224 21 215 122 164 -78 249 -256 278 -63 -288 138 298 67 18 86 -123
4135 -123 141 190 0 -193 0 -69 -66 -383 -211 16 1 -78 -114 173 316 -1 51 282 276 -235 124 -62 199
4158 199 76 18 20 353 6 58 258 -48 -96 -234 14 77 17 -156 -45 -87 -60 188 -320 214 -389 52 -256
4181 -256 -228 47 -36 502 260 147 -203 196 -25 -226 -12 95 109 51 187 -68 34 90 -200 136 86 303
4203 303 -183 -170 115 -78 -118 16 164 82 93 81 -6 -58 121 -186 -221 -64 -65 -217 -20 -162 -89 -75 -73 -26 -56
4228 -56 -413 -70 171 -192 30 22 195 65 -56 59 371 -79 59 246 201 114 45 192 27 215 199 64
4250 64 108 -43 -393 288 33 -58 148 118 -179 -188 97 -119 -208 -96 -397 16 110 -208 159 -165 67 -122 -32
4273c2J65j36K26l17j35L68J48p0k1j81j32J84l74L91P3l0k73OK76j63Lk82M06
4296A00L4mk17L8J99k09L5m3K8Lj21J76n2K36j13K75m56j04pR9R9j26n9q3K64
4321hq3L04j87q5K18k2J79m67n8L75m39K15Q5j43j62L83Q9k02R6j48K94J28k01
4344A61p4k23K7Q5K48j94J6o7K78l31R3j45J18M4R8k0j3Q3J0Qm27J16j09K57K30
4369B69l95L49j54p3j65J72N2p9j68K55l5l7J5K25k08J1l21J32K56j37K85k40
4391IJ75k8j23L02j68j95o2l15K58J38j18K92J27k10j33J90n6r4r9L83k35j3L9
4414F4J27J6l40K05j30K2J92l02J21O0J89k4j40k29P2j26M62j46q9K77l11J36
4436A06L2N2K43l45l38j88L88J11l16K55L58j59q4j84M6j60L23R9k91K9k7Q3k25
$$ plain form
4273 -32 133 -3 223 -94 -229 139 287 217 196 15 -117 67 -307 84 157 127 -146 -140 136 -27 -24 -306 100
4296 100 134 130 -87 -49 150 -59 -24 -67 -39 -36 -157 19 -33 203 90 365 -91 -195 -202 -103 -4 -130 -189 -272 -8
4321 -8 -91 213 26 -59 159 137 316 -151 -209 166 -273 -58 27 -116 -278 105 194 -8 88 -60 234 362 161
4344 161 87 -136 -109 -24 224 30 46 -21 257 -74 19 -126 -8 36 134 114 101 184 194 202 -225 -109 -218 39 269
4369 269 -126 223 69 -4 -169 3 55 -24 -192 63 28 -9 6 231 23 34 -287 -155 101 -36 249 9
4391 9 184 156 33 335 167 -28 -90 -405 -147 -9 -127 165 292 82 -51 139 83 -11 -110 273 38 25 64
4414 64 191 207 -133 72 -58 -36 156 -146 -25 35 224 200 60 -169 -97 -223 239 93 4 281 -30 106
4436 106 138 190 433 88 -250 -438 -50 61 -255 0 358 199 115 -69 -23 -183 140 239 -52 -23 -50 33 -192
4459a92K17l6j93K76J55k45j14R4Q0j85J83j25O2j09k48K70N44o98J97J61o3k15
4481a84J71N0l5m2n8k07J5M2K98QK8j30K10j04j09L54k78m20K57J25l28L63q0
4504e4J30j26J41R0R6k74l92L47J67k46j9q8L58Rr4N7j99L32j22j25o6K55j49
4527B8k5j19M2J41K92m16L26m85K75j33Q3oj75L00k75p3K67j01m6J77k68K08m14
4550c97O41m75M15k3m13J89j16J32J56m35N51k85J75K4j21j51J46K06n01L49j12
4571d5P2l04K27R4M0l6K32m40O4j97J64J19K00l2l3l99O4J83M3J86n3j20K8k54
4595a97K09K97j92M4J65k62q1n4K8P8M0Jj96J35R2l88N11l47J90m1k65K86O3J67
4619B83k14K40n44K68np8L3k00L0J81o8O7L9R2j02l26L16j09m0O3j60L21j4j56
$$ plain form
4459 -192 25 -11 -204 72 227 -18 -132 -38 42 -143 40 -85 -23 -132 -380 -110 434 -264 -67 94 31 -184
4481 -184 -13 37 2 -40 -98 -305 -290 -248 50 58 86 -44 166 62 -47 307 29 -391 -134 -9 -337 26 -54
4504 -54 76 -50 91 181 277 3 -389 -42 125 -121 -140 -228 130 139 45 102 -97 235 113 -12 -78 177 28
4527 28 3 -116 -74 67 359 -57 269 -216 59 -74 9 3 -172 128 -147 -220 47 -54 -100 77 -191 17 -397
4550 -397 244 -231 184 161 -252 -63 -179 -47 109 -326 225 -60 115 139 18 -133 13 219 -282 67 -45
4571 -45 27 -277 -50 44 84 48 280 -160 -96 -293 -129 -10 190 158 125 -274 -210 -27 16 202 149 29 57 -197
4595 -197 12 309 117 161 326 64 -17 -71 -43 35 75 76 -120 15 107 -281 230 -117 73 32 -233 53 116 283
4619 283 69 309 -235 33 28 -50 -17 -217 -187 -6 -74 -7 32 124 22 -304 12 -97 -137 -74 -234 87 73 -83
4643h3p1L59k18J49Qm17K86m8R5R9m5j65J52j67l1K70k52J38j79J80k24K32P7
4666A45j01j24K7J44j91J14j57J72M4k18k9K48j66J84J3m2j96N11k83l97P8OK25
4689GK73l30J35k04O0R8j45n6J49J07k63J88j6J69R6j29K83l19qL7l69N07k10
4712F0J66l85L28k84M14j57j92J21j81L11k39J56l90J9j35M22k8q9n5O4J07R0
4734A23l73K93j70o5L2K44j35K52j67o3J80j68n6R7k38j02L81o6J04R7l68n5L33
4757A10l0l6K52o11K07J56k95N71k49k21J46pk07M26m19M31n6j32J3j76K76k91
4779a42J70k10K99k36L12l12J37K05P2k04l44K9K20K22m54N6K2K68j79j34K52
4800D9j27O3K2J27j82l5L14o4k60J22K34j76m2M7j28K10j51j21K67m16J42qj25
$$ plain form
4643 -83 -154 205 -13 136 144 -273 13 -35 60 159 114 -51 101 -66 -97 173 -79 59 -120 60 -164 68 145
4666 145 44 -80 -53 91 -100 14 -143 29 73 -145 -174 74 -92 92 105 63 -133 378 95 -302 -224 -218 7
4689 7 280 -50 85 -119 -59 39 -106 -162 -13 94 -169 19 3 172 268 139 422 103 95 132 -237 270 60
4712 60 226 -159 169 -115 299 142 -50 71 -110 201 -38 118 -272 -253 -388 34 6 -83 -138 -74 33 123
4734 123 -250 43 -127 -192 -160 84 -51 201 34 -29 151 -17 -73 24 -214 -316 65 -1 103 200 -168 -223 110
4757 110 80 44 296 -315 -108 48 -247 324 75 -146 0 -7 -214 212 -207 224 168 36 49 -127 149 -142
4779 -142 28 -182 117 -119 193 -119 18 223 295 91 -253 -224 -4 218 -236 -180 -158 110 -69 -203 49
4800 49 -78 -15 7 134 -48 -83 231 167 -93 29 263 87 45 92 -36 174 23 -98 169 -247 -105 -113 -238
4823b38L58k04l1M9k87J82K56k03q4Q4j70L9K86k78J45l1O2L6l0L27k20p6J17
4846H9n5J13l08Q1j0J91j08j01L84n08K00K27r0q7j50L07k98L54l32L44k82L78
4868C39Km12j95J00Q1Q5oJ9O7Mq0l62N67k92k50L33K32j73Q5k66J18J26k50J93
4892F5k6j87j80J40Pl5L41k77K01lk46M8j55n1M22K17k64j52j27J67N4Lk8J47
4916H1R0j34K19k35J11j57o5L06r9j74q6K07K57o3j69n0k72M75j39j75J75P4j78
4939aO3j02R8j93j83K57l03K40J70J8k3l12K04O4l9Om3j01K00J44nn12J29J09
4963a15J25M6K3K14m98K77j81L05k53j8J42k74K6Q2K67r3k7Nl44K66J4j3K02o5
4987A13J8q1k12OQ8K82n89J82K81j30L9ok00L26j26l18K05r9M87j5j18k15O1k72
$$ plain form
4823 -238 120 -84 -115 -66 -353 -171 85 -118 -202 -118 -288 -249 37 -241 -96 -127 -65 -29 -59 268 48 -28 89
4846 89 34 147 -161 -80 -90 101 -7 -108 276 -232 -32 195 105 18 -132 175 -123 231 -101 243 -39 339
4868 339 341 -71 -266 -166 -85 0 -6 13 80 84 4 -358 209 -83 -333 0 232 59 144 -122 -4 122 -128 65
4892 65 39 -148 -328 -188 -181 -216 125 -152 49 46 -200 -152 -307 -358 64 281 17 -135 -262 -95 -41 -38 -66 81
4916 81 171 37 256 21 132 -25 -90 216 117 -57 -143 64 321 258 89 39 -233 242 103 -72 103 177 -1
4939 -1 62 -40 58 -135 -318 -61 -364 -124 46 64 41 -271 -67 -3 -42 -36 -79 -180 20 164 159 -353 -224 -115
4963 -115 10 56 79 293 -205 72 -109 196 -57 -75 67 -207 -181 -99 168 75 48 53 -291 -25 -11 -24 178 113
4987 113 131 50 -162 -156 -68 214 -375 -193 88 -42 -3 -9 -209 117 -9 -327 -122 -221 266 251 133 -82 -21 -293
5011b93K02J55k50L26p7j59J11J28m79K09K80m4r5P8k22J38j4l2k12L35j24J45
5033A06m71M63j50k78N67k50O6j80J18jJ97n4j53j86J71o0r7M25k27O2k29J5j77
5056c23J99M07j93j32Q3n3k13L34j35R2P1j56j9J32j2p3N7j66K32j07O6j83j02
5079a94L21k43J92j2l79L20k6qQ5L23l00m45K29L59q7m46L00nQ3k98L43j71oJ8
5103d7j25Q8K74k88l9L36j41j32p6L86l72k10N75j30O1J61l34MK2P8P3j65k53
5126b54L17j30oK3L89l19J46j84k32N40l36p9O6J2nR3J29k53j21J36J77n8l93
5149c42N83k55j13j15K71p9M6M7R7L2l99M78j5pk30j27K17j85K77l87j69M27J6
5172F8m34K07lN4L61k83j93L39k62J63j48L33j63lJ61m14J39K14Lj45j04nJ51
$$ plain form
5011 -293 -91 64 -186 140 63 -96 15 143 -336 -127 153 109 14 92 -130 8 -6 -38 -250 85 -39 106
5033 106 -365 98 -52 -330 237 -13 53 -127 -9 -10 187 133 -20 -206 -35 -95 -192 233 6 68 -161 -146 -323
5056 -323 -124 283 90 -42 41 -12 -225 109 -26 66 137 -19 -38 94 82 9 66 -100 132 25 91 -92 -194
5079 -194 127 -116 76 64 -315 5 -21 -29 56 379 79 -366 -137 222 135 -311 -11 -16 67 -231 112 -59 -65 -47
5103 -47 -172 -84 190 -98 -137 199 58 -74 -150 236 -136 -346 229 99 160 321 -13 -9 13 91 164 -1 -254
5126 -254 63 -67 -73 -50 339 20 166 -18 -250 290 -46 -125 -59 -47 -52 41 170 -83 -204 -68 109 51 -342
5149 -342 241 -14 -127 -242 29 -50 -4 43 140 172 -227 251 236 229 -1 -128 89 -96 181 -206 -375 52 68
5172 68 -366 -159 -162 -108 253 -30 -223 116 -146 17 -131 202 39 36 197 -217 -78 136 139 -6 -110 -115 36
5195C6m6M07l85Jj80J60Q1k3k16n6K2J49L48m39J66J16o5k28K91k30l2K27J19
5218B23k52O5J40m38J96P8J17j09k23J98M1k27n5K52j29J69j91J9m1L60j30r9
5240c6j81L75j33oj97K61k17J84o5Jj84L27j3j4M8p9k04o7OJ05J74lm3j23J44
5265F0J91k71k27K28m2Q7k79L65m6m3k37K53L2p6j68P2K53k32j84J60M30k11j53
5288c8Q1k6J22J3m17K60P9J16k25j14K37j97L79k05j82J11L53j51l93M95Mj95
5310A07J18j67J37Rj73r8j71O54m29l4O5M5k58L7M07l18n6K72k45K82l25j4K49
5333I4K67p47M40P1j20q0k37P31l21m86K98J37M7r1J5j42K58k42K7J94k05q7L35
5356A56l8j93J08Pj98M3K11jj2j40J52l75K7M62m46J38J50N7j09j16k05M07k81
$$ plain form
5195 36 -10 397 12 13 -167 -7 74 51 -165 -221 -199 -50 298 -141 25 141 76 -152 139 -91 -123 104 223
5218 223 -29 36 176 -262 -66 12 129 20 -203 -5 36 -191 -246 6 -123 46 -145 -126 -167 193 63 -36
5240 -36 -217 158 25 19 -178 83 -134 50 -15 -14 -198 129 116 102 150 71 -133 -200 -194 -89 85 82 39 -84 60
5265 60 251 -20 -247 -19 -61 26 -253 112 66 23 -214 39 71 -5 -173 -101 152 -80 -264 -104 326 115 -38
5288 -38 43 17 139 152 -265 -5 74 190 -35 -149 88 -109 270 65 -117 -6 347 196 -197 298 302 107
5310 107 225 58 195 204 31 -67 -238 416 -13 -47 18 63 -195 -158 249 -69 -125 147 -98 184 -141 -155 94
5333 94 361 -386 54 125 5 -75 -312 419 98 -388 -90 47 94 3 18 -124 134 -108 -81 113 -92 -179 156
5356 156 118 -75 33 40 -158 -115 96 95 83 -57 95 -280 -253 209 -237 -99 51 108 -1 -117 -322 85 -196
5379a96Lj74M09K31p06O17J12l20n4n4O7K98l97J5J51J98j83o0R3J96j65j93J28
5402A6j45K36j41P3j60Q1L11n45J03N73o44J25K6q9J27J29L40l37m3j85j8L19
5424A52k11Q3J45oj3j31k56N30j30o10M56m41L21J17J13k17J14j9R9n5O8qj56
5447e5J41K13l69k7J13k6j92M93j18M4l18m2K16R6k28r4K53l41M26Jj37j70L65
5470B44n18J64K36j64kJ01J81l07M7m8J20j05M8J14k28J85Rj97L83k89K14m64
5492b76K19K0n0o3m9k93N57j71J32q5k16K78k44L50j05J44l8L6P6m50K4P6L06
5515A78k18J13Pj96N5k6j15L7L43j85K1p8J40J86k12k97J92j28j63L48J29M0m41
5538b70OM15k95l6q4O42k71kn5J3j14K83k44k31J69j67O1J16M4l2J80J7l61J39
$$ plain form
5379 -196 -193 -367 42 273 -433 184 296 -24 -78 -132 -65 233 -164 -149 2 200 17 -43 50 246 81 -112 16
5402 16 -129 107 -34 39 -121 -40 271 -274 -171 402 -242 -117 -91 -180 -53 76 416 79 36 -149 -167 152
5424 152 -59 24 169 163 150 19 -237 293 163 -447 9 -432 -111 6 119 -98 16 -3 96 41 109 101 -55
5447 -55 86 299 -70 -97 16 -10 -202 291 173 217 -101 -143 73 169 -59 -153 100 -241 185 186 49 -121 244
5470 244 -274 -110 126 -38 -40 61 242 -65 -18 -66 54 -51 -3 111 -117 68 77 -120 263 -26 188 -276
5492 -276 -57 -37 -87 -150 -199 -492 65 -106 26 -59 -275 3 -241 109 4 148 110 146 222 -228 -204 -128 178
5515 178 -40 73 80 -116 -61 -87 -202 -165 178 -7 14 -64 76 262 50 -247 -55 -183 -346 2 131 171 -270
5538 -270 -264 151 -144 -180 -264 378 107 105 50 63 -51 232 -12 -243 -74 -241 -180 -64 -20 -52 128 145 -216 -77
5562g7k45J30J25L02j0j10o5n33L99J46K5j86l2P3q3m3K68j9l57M70l05K78J04
5585B55k61j97L5K88j3m20K67p4R1N9N7j4j90j38J92J59k94j19K75J32q2P0o3
5608A5k19K35j71J12K34n79M78j1q4j67J45j87K28k04K50J31l82L09m08K65M6
5629C6P7j70Q2J33m93L76k20M5K51l75J06J29J26j79K76j91K44l37J42l63K99
5650fr6J46L05k59m31M54m0o5J01k00J18K21m58M9J69J14K5j67J75k25K77p0j53
5673a6KK6M0J53j7k31m3J23m2j9J40j3j49j97N02k61l38M71k21j90M25M1k98K10
5697I8J51j38J00l76lM20m17J25j69K30N7n7k54L79M2j30m1o5l2k66K06P7O4O
5721Gj23L98k54r5K05o8nn6L6o5Q8j34p7J97j2J02k69PJ17j16K69k24N3n1Q1P6
$$ plain form
5562 -77 -322 -192 -67 235 225 115 50 -483 -84 62 87 -99 -131 -58 -141 -184 84 65 -292 178 -127 151 255
5585 255 -6 -203 -168 120 107 -313 -46 -120 -29 30 87 73 -117 -255 -63 96 -198 -317 -42 90 8 78 15
5608 15 -204 31 -140 -28 206 -373 105 94 10 -157 -12 -199 29 -175 75 206 -176 133 -275 -10 36
5629 36 113 -57 25 158 -335 41 -179 -134 117 -258 -152 -23 103 -76 200 9 253 -84 58 -305 -6
5650 -6 -102 44 349 90 -341 113 73 8 109 -91 27 248 -210 -161 8 122 147 -20 155 -70 207 137 -16
5673 -16 -14 12 52 205 188 -43 -86 37 -5 -24 116 103 -46 -243 259 -2 -340 131 -90 -280 145 186 -112 98
5697 98 249 111 211 -165 -168 252 -165 -40 -209 21 78 21 -233 146 188 58 17 -48 -80 -346 -140 -63 1 7
5721 7 -116 282 28 -67 138 70 65 9 45 -20 68 -66 -143 54 42 144 -125 -118 -1 -117 152 -72 -19 -70 11 87
5747H7l23J68R7O7j83j6J03k10L78p7j18R9j26j68J97L65k46j52r6J64R5j26j66
5770a87L56j91J20j00R9rl06K83J59j95J18k7m3J19l02J68j94K61j64m9M34m74
5792a24J19K77m77O3J45o8j11L24k87L10j51L0P5k97p5J70M8j01l3J0M04K7k94
5815a6K20l1n3M9P7l29L21k65J73l30J90q0K0J51k55K28o2j31j03J12K40m77M88
5838A37n1j79L11j29q5J29j09r9N3J22P2j0j00j13k20M3L31j58n0L00m30L20j31
5861d6j0K47k24J66Q8j41j18m8L61l78m0N49n07K74n54M61O6j21n7l02L41k27
5883b20o0L89Q1j82n1J81l25K84Rk67M87n20K62O2J16k92J7p5K80j12J55k44O6
5906D1P6j64o7n7P6p3J18k18L0K66j55K32m56K51K05k68K61j34p5J35k46K05K27
$$ plain form
5747 87 -236 -68 29 96 -87 -103 0 -210 168 91 -27 72 -54 -222 -25 340 94 -58 -154 10 105 -21 -187
5770 -187 169 -22 98 -2 97 88 -218 65 224 29 147 120 77 196 -106 62 -132 129 -35 -84 350 -124
5792 -124 -5 272 -205 -142 3 -65 -176 148 -139 171 20 50 125 -172 -247 -77 -29 -130 -163 -153 251 278 -16
5815 -16 204 173 120 169 246 -83 238 -27 146 -184 6 -74 -54 97 -158 70 8 -123 -226 -114 126 -351 137
5838 137 86 -93 218 89 4 133 24 -75 -22 100 172 162 62 -51 -271 -228 103 -55 -105 195 -235 85 -46
5861 -46 -56 191 -33 133 221 80 -38 -86 275 -103 -143 406 -101 173 -381 80 146 25 -32 -334 7 -220
5883 -220 -280 109 190 8 -43 138 -187 97 106 -161 326 -194 68 130 246 -46 -29 -104 176 64 219 -25 41
5906 41 117 -47 -114 -171 -95 -168 -50 -268 -238 28 -127 105 -351 -100 105 -163 98 -36 -111 24 -222 -17 210
5929B10m45K05M9k4Q2j45K92k30q2K44k68K9j26K39j05o6J36j37K91l9j26MR5
5952H3k19K72m87N08M9l8n22J30K73l79L40M9l8L24j78j15q3q9K18k10J51N0J0
5975I9j07l9J91k39n8K20k57J72k02J59jK68L0j63k63K73k94Q1j03l1J93J63L6
5998A28j78j47J87J49l95J56O1K59k48L27j51j97J24j42K4K55k59M8j51N8K09
6019A17J42j11j13j21L09j69j27J01r5K46j46L29o16J79J75j7k32Q0P0L2j53J13
6041gJ44P1j43k12K22k4J6j36PK7J35j52j04J47K7j2N96o70K18L9m05qK00J85
6065A61j63J57j07q3J57r5J11l98M47l08K65k21J55Jk3M2kj08K40m42M51o5J46
6088C18m68K25K16m80N6L72l87J34j07P4J55k14J93J3N6k52J69N6j78K8M86o75
$$ plain form
5929 210 -235 -30 19 -5 77 -68 224 -6 -88 156 -112 -83 -209 30 -75 -141 -5 -142 149 110 -16 -12 83
5952 83 -136 136 -351 157 206 168 -354 -224 49 -330 10 59 21 345 167 52 -31 -120 98 -112 39 89 99
5975 99 -8 -47 144 -95 -153 67 -190 -18 -220 -61 -62 206 236 73 -190 83 -211 -130 -233 -264 -71 92 128
5998 128 -50 -197 -10 139 -256 -100 -39 220 -28 299 148 -49 75 -67 -43 212 -47 1 -150 -92 117
6019 117 259 148 35 -86 223 54 -73 28 -67 179 33 362 -254 -75 100 83 -149 -69 1 33 -120 -7
6041 -7 137 208 65 -147 75 51 67 -69 -62 -35 100 -52 -156 -9 18 6 602 -68 150 189 -216 -224 -24 161
6065 161 -2 155 48 -35 122 27 138 -260 187 -121 144 -77 78 79 56 98 96 -12 228 -214 237 172 318
6088 318 -150 75 291 -189 -133 239 -148 -14 -121 -47 108 -106 87 100 156 -96 73 129 -49 -21 465 -210
6110b10M13p0J60k93j09j2J38J7j60M91l89j62J85jO8n8P3j39J02r8N4O9j79J42
6134C2k3N4j48r8K26k0j88J58n1K94QM6r0O8j93k95M73k93O8q2N5j51K6K32j11
6159cK0r4J87k40K06k13o7J96n2j32K44k31L34j60p2J35k94L46jm92M01K48k28
6182C8j59J7j23J29J4J40n6Pl24P5M07r0P3J01m07R3R7j98K07J96k50K39o5k64
6206a03J97l03K03m6P4R8l01j65L52p3Jj64k20M00J28q3R1Q6m12M74j21q2J8k07
6230a58K03k43J41J9k67O53n17kL00k26L13l64K02j00m3q7Q3L50o6l9j50J59p3
6253H8n6k05O9P3L40m39K20L00k47k2r1o0k12M67kj47N6k15P3M3J2p6L2q2P7K26
6279B22k81J12k4J85k11o5J99q9l32J54o4J54N4K35j19k03N8K05k33r1J88r0M2
$$ plain form
6110 -210 203 133 293 0 -109 -121 17 34 -126 365 -24 -186 -1 -2 66 8 81 -58 44 -54 0 69 -110 32
6134 32 9 63 -85 -183 43 23 -165 -7 -58 236 244 290 200 268 75 -220 253 -40 28 -54 1 -150 -124 108 -3
6159 -3 17 -77 110 -130 76 -137 -204 -8 -60 -192 52 -179 155 -5 -77 58 -236 110 109 -383 18 266 38
6182 38 -121 -104 -227 -98 -84 56 0 7 -317 -242 165 75 148 249 -158 -65 32 -166 41 237 -13 226 161 -103
6206 -103 94 -209 -6 -52 22 120 -181 -346 6 -67 -66 -230 -450 -50 78 -5 86 172 -240 234 113 31 49 -158
6230 -158 45 -198 -57 -38 -305 348 -169 -171 129 -97 216 -148 54 -46 -89 -176 -93 257 191 152 2 161 88
6253 88 32 -173 -104 -31 309 -130 90 390 143 121 30 -30 -242 225 223 76 132 -83 -10 33 45 -31 1 -81 -4 222
6279 222 -59 53 29 214 3 -62 137 48 -284 -130 -194 -40 14 249 130 -73 -15 190 -43 -134 54 -36 6
6302FJ52m35L86k47M42j60k01l0L0k94M12n9Pj19L63N3m84L37k69k0J24L48j73
6325A69k12J69m25L34j24L00k13n46L50N94l12N0j06j67L06j56K07k94K8R1J1
6346E4j04l9K28j95L43Ll46j25oJ76j2K65m53J08j7J75k21J66J40m8L4r1n0J38
6370A23n5R3p6j38J98k01M1K18k16k4Q1j53r6m1J36J91j67K94J09l6r9k57N16
6393D41l30o5r0K2N8m0M7l3k9N1o7L2q3O8J88o8O2j66O2k01K41k93L03k25L76
6418B61j47m00L80K17l21j34J13j90K33j56O4L0N28l70m4j80M91l54J61j90J37
6439A29K68n25K58j80K42j1k05k87L8J79K57q6K43r9m32r8M05p3l6m4j51L41L0
6462A63j01j27J70j53J00n36L31K55rM9l4n8O5j09p0RK54l86J76j03p3RO4P3j74
$$ plain form
6302 6 158 -277 109 -138 304 144 -57 -87 -57 -351 61 2 9 -110 253 306 -178 159 -110 -130 -6 342 169
6325 169 -43 126 -299 35 -89 211 -2 -548 -198 396 84 134 28 -139 167 11 218 -76 -48 43 54
6346 54 -50 -89 139 -56 287 290 -56 -181 -187 -11 -23 242 -211 -103 -120 55 -166 0 140 92 126 35 -15 123
6370 123 68 161 85 -53 145 -56 -15 203 -13 -37 44 -109 -205 -246 -110 81 -86 208 317 281 182 -75 441
6393 441 111 46 -44 -22 36 -4 43 10 -19 32 -35 -3 -86 -18 170 102 164 -2 60 -141 100 -193 110 -115 261
6418 261 114 -286 94 311 -10 -144 -31 -221 12 -144 -80 -50 478 108 64 -116 375 21 182 -8 129
6439 129 397 -128 130 -50 192 181 -24 -311 -273 -94 163 77 320 221 -211 -309 96 23 -13 -57 -208 133 163
6462 163 62 -65 105 -48 52 -484 -153 102 93 142 108 50 115 6 -64 -55 199 -187 -11 -114 -187 -178 -114 -41 -215
6487b15K04K28l60K27l75J30J96J11Pj90j47J29m5J30J5Oj97J92K24l05J27j66
6509g4k9P3L51m17k68J24L52j41M7p1j67L97m71L50o3j58p1K99J05n44P3L05j35
6532a33K19j00j63J91N5M8j17q9J41K15k82J79k61J3J83l8J21L9j20K54k98J09
6554A66j42j81M05k63r9j29L21K22p73L76L65j79J07j32j68m4J59k17k0K36j01
6575i1j4L20q0j48l21L44R3K06l67J74l19N73j29m91K23J60k4r1J23k85P4M19
6597C49l67j43J59j60J10k47N52l68K56K80m36kK82n45K56k54J28J69L6j04P3
6618B4j73K56k67L81m31M16j54j36J69q0k54K50j41K3L13l73N0k7J90K45k67j07
6640i3L71k60m30N59k94j72M43j10N1j82K91N6kk09rJ69k37K1O6j0Q3j61rK61
$$ plain form
6487 -215 -11 217 -143 84 -291 -161 35 146 153 -37 -184 -55 -100 30 45 51 -146 46 270 -35 92 -74
6509 -74 -103 -30 321 -96 -364 -240 112 -29 18 -53 -220 177 -294 56 -7 -165 -236 63 168 -376 -303 2 -133
6532 -133 86 -14 -177 14 69 117 0 -89 52 267 -15 164 -97 -84 99 61 182 221 101 355 57 166
6554 166 24 -157 248 -15 -114 -243 78 300 -473 -97 268 89 196 64 -104 -148 11 -206 -226 10 -91
6575 -91 -105 215 135 -13 -334 10 103 309 -58 116 -203 370 241 -250 -27 133 109 18 141 -144 -70 349
6597 349 -18 -161 -2 -162 -52 -299 253 -115 141 421 -15 -17 265 -280 -24 -278 -150 19 55 -49 24
6618 24 -149 107 -160 221 -210 206 52 -84 85 5 -249 1 -140 -117 196 -177 -127 -154 36 281 14 -93
6640 -93 278 18 -412 147 -147 -319 124 14 65 -117 174 230 228 19 10 179 -58 -37 29 19 102 -59 -68 193
6664A93n6j93n8O5P3lK2n3p1J13L8p7J36k62k16N43K5j67K6k32K05p1j28K6J36
6689A4r7r9M03k27P9J23j61r5j60J70m2J43J90k18R3J86l85K74n4n1J8L6j51K27
6713B16o5p3k55K14J6M5j68K7J75k31L18q8k63K71k76l23N85k03L06j31R9l44
6735a48M75n16N5n1j65P17j26n00K15K62j21l07K76l37L65q0k68L12j84L3J09
6756A6l37N99l97K4K53k8j68l0J66p7P0J81n76P7K60k57J75J07k16M35l02p2K22
6779A25m43J65J31n9m7J51k28L47k03j6K38j07n3j0N5n8l05N88p8L7l95P4K14
6802A23j81K6j2O4k43L97K9j4l84J68J76n1m7J05l36K32l38L30K08k13P7p5J05
6825A46j67O0j91J05R0K32j09m79O29l19N8k04K09J7j47Lk22N13j89o6K83j54
$$ plain form
6664 193 137 -56 -114 -49 24 21 43 -10 -81 32 70 -7 129 -133 -349 194 219 52 78 -154 51 -20 -148 -122 14
6689 14 -83 -182 221 -6 73 196 35 -60 -220 -50 -92 51 241 23 116 302 -83 191 137 86 104 140 -11 216
6713 216 151 78 -177 37 53 98 -70 -43 132 -99 219 131 -132 139 -137 -460 125 -78 228 97 196 -148
6735 -148 327 -189 -134 -185 -350 367 241 -259 -44 218 97 -210 66 -271 94 14 -254 58 -126 -93 16
6756 16 -321 278 -119 -95 158 130 -38 -68 98 21 91 272 -304 -227 33 -224 -49 58 -158 277 -25 -97 125
6779 125 -318 -153 -22 -81 -128 23 -205 142 -61 -77 161 54 1 -9 46 -12 -317 271 193 230 -165 -91 123
6802 123 -58 -32 -44 20 -223 174 203 189 -195 -27 149 98 51 156 -180 52 -286 44 252 39 116 41 146
6825 146 -21 39 -152 -47 43 275 166 -313 316 -3 55 -149 60 77 -70 -67 -289 224 35 -31 252 98
6847I8m5J6l50L13j00j41K90j10J31k81K52J08k44l3n4P4j12J28j02K22P7kk05
6870g0L12j78j64J83K27o43O23q5L1mk35L36k63q7K46k38k25M61j74m7J13m7J59
6893B31m49L50O1m01k48N08K40n62K47R6q1L1Q4n1J23l18K65K5Jk16N3K5j60L31
6917A85n5j86L9K25k06l69M54j55J44j52Q2m2K3n0o7L34k94j12J71j0l2J13j2
6940B8j5J1L12l84m9j01K63j15j66K66j99J44L73k49l7k36J08N09p3j78l37O9
6962e6J72l3j32J68j60K33l37K68J79l57J60J37j99o1j26K24J66l86K80Q9p2j31
6984B6j76N29m35J0J34q9j28K63N5j22o8Q8J09K6j10q5j04J9nK66j34p1j0K60
7008B48l83L38j98lJ48r0j61N2R1N6l50O9K89l87K64k19L76%k01qL57l00N4r3
$$ plain form
6847 98 53 69 -281 32 -68 -209 81 -29 102 -179 73 181 -63 -96 -150 -76 -188 -60 -162 60 137 135 -70
6870 -70 242 64 -100 83 310 -333 290 205 236 232 -3 333 70 -17 229 -9 -234 227 53 6 119 72 231
6893 231 -218 132 193 -208 -456 52 292 -270 -23 73 -8 23 107 56 179 -139 126 151 152 -64 -11 14 -146 185
6917 185 130 -56 -17 208 2 -367 87 -68 76 -76 6 -36 -13 -63 -130 204 -90 -202 -31 -41 -73 40 28
6940 28 13 24 336 -48 -97 -198 65 -50 -216 50 -149 -5 368 119 82 -154 -46 463 390 212 -125 -56
6962 -56 116 83 -49 119 -41 192 -145 123 302 -55 105 242 43 -18 -144 80 246 -140 140 229 157 26
6984 26 -150 379 -56 -46 88 -1 -129 134 189 67 -1 87 196 222 112 27 -77 -58 -63 203 69 -2 -12 248
7008 248 -135 203 5 2 150 60 -101 -49 42 98 -252 -183 106 -281 -17 -236 140 140 -61 -69 288 -12 42 -51
7032e1J11j82l9K73j47J27J22l13K10j18n5J30k44K49j45J2J10Oj01N3l45L45
7054HO4J03k73j82L63l32K34J69l69P50j96k17p9q7k6K89n71O76m05j57N13j92
7076H3k06R2J36m24K55K30l44r3L44P7k12j76M79j41R0j88op3j0%Q1J23j38J13
7100I2oJ12k85J50j74K58j44Q4j6rQ9n03L82J79r0k86K75j42k26L03J57j34r9
7123c3k59O7pJ35N5q3K04j84KJ95k48K12l94J12L47J62j60j78j99M05l34J15M5
7146b3o0m2j16J40L3j09k9M16m15l0K96k03R6j8R5r5o5J29q3J3L27j69JM6j90
7171e5K00j66L8M0K90m52RL59k56J02p7l86K49j06J96j38Q5J83j10k2j12L24Q1
7194B76J4m7j14J06Q9m22K07m79K47L86j62k99K96Km89P54n92J54K2J26j51K59
$$ plain form
7032 -51 60 -122 -161 112 -35 92 214 -99 111 -7 -62 68 -176 73 -72 -60 50 56 -45 8 -337 8
7054 8 72 175 -98 -280 83 -249 -15 154 -215 535 339 122 43 -44 -70 219 -352 324 -81 -238 275 83
7076 83 -123 -31 105 -319 -64 166 -178 -271 73 150 -62 -238 241 100 190 2 -4 -77 -87 -87 -6 117 -21 92
7100 92 86 198 -87 63 -111 147 3 87 71 62 151 -352 30 209 119 -167 108 -34 -260 43 200 66 -33
7123 -33 -292 -225 -232 -97 -42 -125 79 -105 -103 92 -156 56 -338 -226 121 283 123 -55 -254 151 -183 -68 -23
7146 -23 -83 -125 -241 -101 -68 -177 -206 210 -205 -235 61 -142 -46 -64 31 -64 -129 0 -83 -70 257 88 89 135 -55
7171 -55 145 -21 17 57 347 -105 -96 263 7 109 32 -354 -105 -211 -15 -153 -68 115 5 -17 -129 195 276
7194 276 290 243 129 235 324 -98 109 -370 -123 263 101 -198 98 100 -389 365 -227 -73 -51 75 -76 183
7216A83j32J22l25N0K49m77L81J4J43o8j2l49n1L04j14m2m9J95R7r4K26Kj38k74
7240a59J00R4J26Q9K3l96J10L46m15K42j60L3k9J80k3j28m3J51k47LK14k35J29
7263EJ66O7m47J41J21j65K61l10K80k1j20J26J05J05k50j69j16M96k7j91k67K24
7285A4j44n2J36k1K71l04J93N6k56J42Kk65K75M7n8q0L9MK09q2j67j59Q4L89o2
7310B11J1l56J75L14j26k07j42L08r9j32J02n9j21J06K5j60L56l30K00j93K25
7331A08k0Rk75J30RO2K00n29L48j56j82L10J71q6j68J77k28K81kJ56l99k4L83
7354B75M5l06j9n5L5j90J1K92M6k7m09O12m83K0J06r3K55J33R0j17j97n9o1j23
7378b19M43l23j42J78K11j11J68n2j86J30mJ43j06Nj63J9n6J21o7K11l32N06m54
$$ plain form
7216 183 51 173 -152 -102 147 -330 51 65 208 140 128 -221 -272 32 -82 -124 -173 22 119 25 251 253 115 -159
7240 -159 -59 35 161 250 273 -123 -13 333 -82 160 0 33 4 184 161 33 -10 141 -106 -103 111 -124 5
7263 5 171 238 -209 -68 53 -112 149 -161 119 98 -22 104 209 314 64 -105 -221 275 248 57 -210 14
7285 14 -130 -182 -46 -67 204 -100 93 149 -107 35 37 -228 47 94 36 -44 -5 -1 208 126 -41 -200 -116 273 211
7310 211 222 -134 41 355 229 22 -120 188 89 -43 59 0 -121 -15 10 -150 206 -124 76 -117 108
7331 108 88 97 -178 -48 -39 23 223 -306 42 -114 -296 14 185 99 -69 108 -120 161 159 315 -84 -108 275
7354 275 320 14 -5 -60 -25 -215 -204 88 134 107 -302 310 -173 -153 -47 -140 115 248 338 221 24 -35 -96 -219
7378 -219 224 -99 -241 -63 148 37 205 153 -33 97 93 236 130 135 -28 -9 -65 56 -11 200 -132 374 -80
7401h0L39l29J00L8q9q1N3q1O9J28K2o4J15l22rL54n26L39j06j91K87j28L31j6
7425A53M6J21l74R0L8j49J59k71O9P1K68k08P9q6r2k8m3m0M54k99N6j43P2K41
7449A84m00K4M18O5l03j4j8l8M4O4o8k07J32J44K14m68J44Q8J04p9o7n9p9J97
7473B2P3K21j23r3O5k32N1J61j21k6j55J95L4l06R4N1O1O6Q3j22p2K09l69K72
7497C9r8M00j02j75j31K18j20k14j6J25L0L47l09R0j50J38l7L6j45M2L49m19k5
7520a27j07L2K21KM4k46J79J3j46L96m84K69J68j38j33J75J11o4o3O6k6l58L52
7543A36l34L92k84K66j8l73L41Rm17M92p3K93n24J0K03m24L34Q2J8k79K20P8o1
7566H7J35j16l9r2j60j90R9K24j20j05K52O8k42M34j27j40r9K24j27J77n4l59
$$ plain form
7401 -80 259 -70 30 68 -21 -102 -49 -130 -61 67 89 25 140 -182 -191 163 -363 -24 -130 -321 -34 -162 169 153
7425 153 199 320 -54 36 74 -75 84 -187 -118 -47 221 13 92 6 -86 -114 -157 -197 257 -42 14 -129 -57 184
7449 184 -216 -192 226 291 -12 -26 -44 -82 -38 26 -42 -249 -117 27 241 -227 -83 5 109 30 -37 -96 -175 22
7473 22 95 316 193 100 165 -67 -16 145 24 -2 -157 38 72 -234 -140 -89 -28 38 121 -1 -73 136 -233 39
7497 39 -59 341 239 64 -67 151 31 -183 -199 -74 -44 303 -6 84 -66 72 35 71 -74 -32 317 -102 -127
7520 -127 -234 -202 19 21 65 -181 -2 11 -135 261 -223 46 214 76 -57 118 229 165 102 168 142 -216 136
7543 136 -198 194 -90 176 158 -215 126 135 -282 210 137 430 -94 -84 119 -305 29 111 129 -150 70 148 87
7566 87 222 106 67 -25 -185 -375 -276 -52 -172 -277 -25 43 -199 235 108 -32 -131 93 -34 143 89 -270
7588b70J27P3J84K00m83J96l33L83r0M1j10J21j21k31L62j94K54J10l60m4K04
7609A9R2j77L46m26o2k24P07m99K76oM5k50L58j32l8o2l8o6K10j5m7pp1N1r5K60
7635A49m15L27o1J76j57k7l26M81j07j6J19j65J79l02jJ91J52l86K21n5O9R2l7
7658A01j96L17k82J51j63k85J52L45l32OL10j10K06j49j05j55K90j54j34Q1JJ00
7680eJ8l6L2J11l60J4L13o6p6o7p5L33r0N3j51m1J6L15lk58j16L5P8k1O2k31J66
7707e0L2j8L27j42r2j22j62L46j62p8K40q3j81J09M6l1J76j11l28L34k55L65k86
7730a26J59J55m06J42pjk0J8K77k8k19J86r0J0j08J4l6J6j79Q6J40Q5j14qJ5L8
7756ao5N6J15k03p1J69J04j46M9j86J98o1j25RN9J06l45L15J05q9m7L05j75k14
$$ plain form
7588 -270 -143 -70 114 314 -169 27 -306 77 -13 28 -82 39 -82 -313 49 -145 109 219 -141 -185 19
7609 19 111 -66 280 -146 -208 -432 275 -224 52 46 91 -159 199 67 29 -33 -71 -137 73 58 11 4 -67 -16 -111 149
7635 149 -266 61 0 176 19 -8 -334 147 40 24 143 -22 157 -145 -146 45 197 -189 32 -23 46 138 101
7658 101 -95 222 -60 91 -72 -357 -205 140 -192 -186 124 14 220 71 -34 -189 101 -53 -187 -106 -105 -5
7680 -5 13 -23 9 120 -240 -226 87 21 -55 -122 -197 136 46 99 -52 -93 -77 238 235 -23 -139 -104 -26 -47 15 -216 -50
7707 -50 -18 -36 291 149 57 -65 -227 119 -43 -121 119 36 -145 -36 10 -21 155 44 -284 50 -205 160 -126
7730 -126 33 188 -218 -76 -83 -84 -104 -86 191 163 -56 130 40 50 -58 -44 -80 -64 -243 -157 -17 68 -46 -54 -39 -1
7756 -1 -66 -10 105 -98 -169 0 104 -42 7 -179 19 -42 -167 -158 -99 7 -338 -23 82 -7 -54 251 76 -138
7780a38N64k93k61n2K65m2K5L4K88k89k95K50R3M2q5j09m17N15N6j71j52J01L4
7803c7q3J49mL5l66q5K71K66m97K56K58j57o6R9j92K06j4k83L93q1K21m34M38
7826B93j92j71j2K16k33J63p1J13K1l28J75j18L68l01n7m1L08j84L4J10K74l35
7848C2j18K98k58J90k09j2p3J29j28J85j23K36j65q6N4rN4k84L93Pk78P1M51J54
7872E11n25J39mj65P1O4j41L87k08j9l58L7L22K2k98K5J27Mj75M23l30m9L5k8
7896a33J75J20p8j66p6O1K07j13Q8l69k6L16R4j32K41l86n6J97J01q9N8J64j35
7919F3l8K86j79j91O6P8k3m08J76J97J59k36J35K55j79m87K00M73n23j9J64K16
7941A85j19j13K6J56j19L0k82J89J6K2L2O2J0j52J1p7J6L08p45P64l05K08j50
$$ plain form
7780 -138 426 133 -128 -180 85 43 68 102 390 101 -194 56 149 191 106 -3 -420 95 151 -20 -172 -71 -37
7803 -37 -120 29 25 60 -306 -391 -120 146 -351 -95 163 6 -60 39 -153 53 39 -244 149 68 289 -145 293
7826 293 101 -70 -82 134 -99 64 -7 106 127 -201 -26 -144 224 -77 -134 -175 133 -51 -17 93 367 32
7848 32 -86 212 -46 144 -65 -77 -150 -21 -149 36 -87 149 -16 -102 -48 -57 -3 -287 106 113 -165 -94 357 511
7872 511 -14 125 121 -44 27 91 -50 337 129 110 -248 -211 111 133 -165 -140 -13 -9 -184 239 -91 -140 -105 -133
7896 -133 42 162 84 -82 -158 -97 110 -3 85 -284 -310 6 100 -32 209 -177 -233 -36 65 -24 34 198 63
7919 63 25 311 132 -59 7 85 62 -346 -170 27 186 -50 85 340 161 -326 -126 347 -176 -195 -31 185
7941 185 66 -47 -21 135 16 46 -236 -47 -31 -9 23 85 95 -57 -46 -123 -107 201 -544 220 -85 123 -27
7964b7J16J2j26Q6k24L83n45K58K9J84o7n8L07k60o6Pk6q2M4o0m3J44m2M52l03
7989I3l26J51P5j05j06L90j10n8j23K28k88L07m1p4L34n96K76K51m86J65j57J61
8011c9K33j75k20M14j54P8l27l7L78%m8j9l37M06o3j30p3N0J04J48l70l2M84k60
8035A1K5pM3%k24J39K35j26j61J29P1o9j21K15k41J32Q0J47k69J63j11j46n9n9
8059b03J20K09r0j06q7J56N8n4k18K13oJ95k21j80J37J9n3L48k18k44O62m31Q2
8082H8n2l3L4K76j70k29R7r2k7J03J09o2j58M5n1j00L9M76j88k59L01k20J63j21
8106c1J56k20J83n8j00M44n54K31P0j15k85J37J83M7l51M97l42J1j01M2L83o6
8128A61j12l15K96k14M46j45m7j3j1p8k20k5J46n4N01l01k80K88o1L86k28l40
$$ plain form
7964 -27 89 101 -25 61 -163 220 -325 -67 -38 146 79 21 328 68 2 9 -17 -99 -55 -115 -158 -14 -56 396 93
7989 93 -233 -82 -7 -112 -218 172 62 4 -119 109 -179 128 87 13 347 -249 27 278 -208 -43 -200 -39
8011 -39 194 19 -201 213 59 137 -190 -227 151 151 103 84 -253 153 90 -40 -113 -63 41 189 -181 -213 271 11
8035 11 36 29 72 72 -152 -13 222 96 -65 64 135 66 -55 160 -81 51 131 278 9 172 61 -85 -144 -203
8059 -203 -83 126 36 -70 -157 -1 57 3 -215 -2 -8 187 -34 -214 -77 -58 -111 237 19 -225 437 6 88
8082 88 36 3 37 313 143 -86 11 -81 -108 -5 104 42 -116 -71 -122 -222 -183 293 105 -154 147 -73 90 -31
8106 -31 125 -95 88 30 -70 374 -180 51 121 6 -279 -142 41 88 -263 234 -108 -97 -198 -156 227 161
8128 161 49 -266 30 -184 262 117 70 57 46 -32 -252 -277 -131 -185 316 15 -265 23 -38 348 120 -220
8150b20L48k20m7l32N36j9j33J7K32rl07J02J49k24J17n7l4J14k45J03J6J69L57
8173D13k88L09o70K55O34L70j295q24J954p12K40j086P52K18n11R48o88o62
$$ plain form
8150 -220 128 -92 -139 -471 65 46 -87 -70 162 153 -154 -52 97 -127 -10 -67 -101 13 -232 -129 -113 56 413
8173 413 125 434 -236 19 653 1023 -272 -1096 858 146 386 -700 52 270 -241 707 19 -643
8191f43
$$ Imaginary data points
##PAGE= N=2
##DATA TABLE= (X++(I..I)), XYDATA
0@%%%%QqQj6J6k4M0m8N6p2Q8j04J28j60J88k20K57k97L48m04M64n34O10o91P84
29D17q89J000j124J265j413J576j760J960k178K419k680K968l290L642m030M464
45B347m950N497o120O831p651Q617r772J1174j2926J5191j8241K2605k9406M1562
59B4758o9944K54598J56165m80784j41400R8355K72207J96470q4367l94639j41670
70c10251K50964K69062k5153j87672k11534k1669K42739K38306j23843l04356
80a83407r6092J82989K29495R5792j53641k83999o4109K78623K55975m6020k23475
91g869j73072J0227K33382K13498j01375k76359q7239J39351J71707O2256j29357
102E5150k22543k3505K19705J53416q6088j88467j12603O7295K18723J25585j47599
$$ plain form
0 0 0 0 0 0 8 0 8 -8 8 -16 24 -24 32 -40 48 -56 72 -88 100 -120 137 -160 188 -216 248 -286 324 -367 417
29 417 -472 528 -596 669 -744 832 -928 1032 -1146 1273 -1407 1561 -1729 1913 -2117 2347
45 2347 -2603 2894 -3226 3605 -4046 4571 -5201 5973 -6953 8238 -10003 12602 -16804 24758
59 24758 -45186 209412 365577 -115207 -256607 -158252 113955 310425 226058 -168581 -310251
70 -310251 -59287 209775 184622 -3050 -214584 -236253 6486 244792 120949 -183407
80 -183407 -279499 -96510 132985 228777 75136 -208863 -272972 5651 261626 215606 -7869
91 -7869 -180941 -170714 62668 276166 174791 -101568 -188807 -49456 122251 184507 55150
102 55150 -167393 -190898 28807 182223 96135 -92332 -204935 -137640 81083 206668 59069
113E9069k34004l5165J69031J86420M2966j54923k04001J094K11606J53561n9396
124A36258j66986j08435N1725J78080R6647j23912j82880j5070J36365J25482
134A27274j853j48070j52653M2765J95964R7513j00651j64031p2412Q9310J84467
145I7623P1430j40315j67979L292J37920J22429J462j31037j25867M6419J60834
156G6211O5772q6859j20718l8408Q3092J31511J6821j39812j22236L8850J31693
167C5917Q2900l9970j38503r5654P4348J58452M7767r7472j18723l1650Q7861
178c4727J29821J8348j20752r8722L6257J07665O5531l4059j09163o2162P3917
189b8046J19129J4088r6486r3087k383R1432R8556j5548j24382q2976M9926J09832
$$ plain form
113 59069 -174935 -210100 -41069 145351 188317 33394 -170607 -169513 42093 195654 136258
124 136258 -30728 -139163 -87438 90642 187289 63377 -119503 -134573 1792 127274
134 127274 125421 -22649 -175302 -132537 63427 160940 60289 -103742 -176154 -86844 97623
145 97623 169053 28738 -139241 -135949 1971 124400 125862 -5175 -131042 -84623 76211
156 76211 141983 55124 -65594 -104002 -20910 110601 127422 -12390 -134626 -95776 35917
167 35917 118817 78847 -59656 -155310 -80962 77490 125257 27785 -90938 -122588 -34727
178 -34727 95094 113442 -7310 -106032 -69775 37890 103421 69362 -39801 -101963 -28046
189 -28046 91083 105171 8685 -84402 -86785 4647 103203 87655 -36727 -119703 -69777 40055
201D0055N3925m5770j06127n5005P0689J12310J4435q2363p3454J564P4757P8488
213H3504j6088r9399n1054N7604Q4611K4516n4560q7094k4966Q1507Q9879j3802
225G4658r1274o6147J6721Q2509O7249l0312r8957m6197N4680Q0574K3231m9299
237A7436p3799j6972O9426P2252j5302p4138m1850K7822O9378M3515l9688q4906
249d6826k3808O4128O9062M174n8810o8444n791P3634O4751k2685p4322m1570
261f6507K4233O2647L8884l4629p0563j6297N3184N2779o27m6761m7310P975O4009
274B1017M3292l2355o3149k1842L6699N7764K2675m5798o6217n926N7023M9067
286E2250p297n0637m6107Q485N8179L6443k9957n3782j6419L1349M5585J3340
$$ plain form
201 40055 93980 48210 -57917 -112922 -42233 70077 84512 2149 -71305 -69741 5016 83504
213 83504 67416 -31983 -83037 -25433 59178 83694 29134 -57960 -82926 -1419 88460 74658
225 74658 -16616 -82763 -66042 16467 83716 53404 -45553 -91750 -37070 43504 66735 17436
237 17436 -56363 -73335 -3909 68343 53041 -21097 -62947 -35125 34253 77768 38080 -46826
249 -46826 -70634 -6506 62556 66730 7920 -60524 -66315 7319 72070 49385 -24937 -66507
261 -66507 -42274 20373 59257 24628 -45935 -62232 -9048 43731 43104 -3657 -50967 -42992 21017
274 21017 64309 31954 -31195 -53037 -16338 41426 64101 18303 -47914 -53840 3183 52250
286 52250 44953 -5684 -51791 -43306 14873 51316 21359 -32423 -48842 -17493 28092 41432
298D1432l9638m8763O373N3003L4556j6605m6589l0909K1528N6675K6136l7387
310A9812n1336r388L4235M3922R529m1034m7158M333M7044K8591j5531l8372k5375
323d0728J6759M5119J6018l5051l8037J659L3409L2859j102l9583l4088J7197
335b5569M6905K0687k1875l8355j8542K3194M4311J1938l5348l6031J737L0096
347C148K7058k964l4920k8201J5812L8036J0916k3154k9862q338K3740L5143K489
360B8903l6841k8504J2160L3299K2361q115l5895k3137K1054L8364R948k3205
372A0392k7812q198K2138L1145L24l1865k2342J0375K6183J4680j1704k9727j4215
385c0626K1574L0052J831k5260k3349R2K5355K6190m657l1639j8970J4727K7308
$$ plain form
298 41432 1794 -46969 -40596 12407 46963 30358 -16231 -47140 -25612 31063 57199 19812
310 19812 -31524 -40912 -6677 37245 46774 5740 -41418 -37085 9959 38550 23019 -15353 -40728
323 -40728 -23969 21150 37168 2117 -35920 -34261 -852 32007 30905 -8678 -42766 -25569
335 -25569 21336 42023 20148 -18207 -36749 -13555 30756 42694 7346 -28685 -26948 3148
347 3148 30206 27242 -7678 -35879 -20067 17969 28885 5731 -24131 -32469 -8729 26414 28903
360 28903 -7938 -36442 -24282 9017 31378 23263 -12632 -35769 -14715 23649 33597 10392
372 10392 -17420 -25618 -3480 27665 27989 -3876 -26218 -15843 10340 25020 13316 -16411 -30626
385 -30626 -9052 21000 22831 -2429 -25778 -25686 -331 25859 21202 -10437 -29407 -14680 12628
398A2628J2625j1264k6919j1421K0226K7087l26k2351j7695K160K0938J8704q878
411A5514k8150j1625J6902K2117N538j6088k4476n196K3387K4486n556k3770j5894
424b2811N450K2265J7835r238k5706q801J5988J9538M740j3857j9573k429K0694
437D095J7200p446k0542j0684Q044J9527J0654j2876k4054m602J7866J7753L27
450A5262j5788j7921R2K1190J5584p989j8825q097P938J7133R036j2233j8381
463a2999r29J6368J2653k625j4061j3019M398J9096R724j1682j7753m940J0740
476e029J6402M378j4346j7453J146J6331J2199l970j3801j1044M874J7239P979
489A4905j0558j4338j824J0519J2809J646j3451j3204M651J5169Q421o810j3632
$$ plain form
398 12628 25253 13989 -12930 -24351 -4125 22962 22636 285 -17410 -15250 5688 24392 15514
411 15514 -12636 -24261 -7359 14758 20296 4208 -20268 -25464 -2077 22409 16853 -6917 -22811
424 -22811 -17361 4904 22739 13501 -12205 -21006 -5018 14520 19260 5403 -14170 -16599 4095
437 4095 21295 13849 -6693 -17377 -9333 10194 20848 7972 -16082 -20684 -2818 14935 15262
450 15262 -526 -18447 -18355 2835 18419 10430 -8395 -16492 -8554 8579 17615 5382 -12999
463 -12999 -13928 2440 15093 12468 -1593 -14612 -10214 8882 18606 6924 -10829 -15769 -5029
476 -5029 11373 15751 1405 -16048 -14902 1429 13628 9658 -4143 -15187 -10313 6926 14905
489 14905 4347 -9991 -11815 -1296 11513 13159 -292 -13496 -8845 6324 14745 7935 -5697
502e697q306P384J6537N281j2674j3715j175J0558J1896Q37j3037j1281M516J3234
516D358O445o379j0340n596Q000J3127J828j1811r951K674J0610Q722k423j3595
530d331p894P189J3042L733q212j0843m066Q566J2353M49j1976q615L091R444
544A930P174l190j1291n732P397J1077J497q064q555j219R539J0207k429j1486
558c145o704M794R645N900m887j1116m572P837R932Q54q076q053m19Q236Q121
573H347k699j0208m024M865P933L437n100r263j855Q717Q298j926p724o036J007
588f231R367O594m296r768l589N399P633K485n518q280p56P253O864k628p359
603b830m617K896P780M271m973q528j569O496P017O57o368p022O45Q595N768l188
$$ plain form
502 -5697 -14003 -6619 9918 15199 2525 -11190 -12365 -1807 10089 10926 -2111 -13392 -8876 4358
516 4358 10803 4424 -5916 -11512 -3512 9615 11443 -368 -10319 -7645 2965 11687 9264 -4331
530 -4331 -12225 -5036 8006 11739 3527 -7316 -11382 -2816 9537 9986 -1990 -10605 -7514 1930
544 1930 9104 5914 -5377 -11109 -3712 7365 8862 798 -7757 -8976 563 10770 8341 -3145
558 -3145 -9849 -5055 4590 10490 5603 -5513 -10085 -2248 7684 8538 462 -7591 -8010 226 8347
573 8347 5648 -4560 -8584 -3719 4214 7651 2551 -6712 -8567 150 8448 6522 -1202 -7238 -6231
588 -6231 3136 9730 5434 -4334 -7923 -2524 5109 7594 2076 -6204 -6960 293 7157 4529 -2830
603 -2830 -7447 -4551 3229 7500 2527 -6001 -7570 -1074 5943 6600 232 -6790 -6145 2450 8218 5030
619E030p590l413K570P169M081n421p301j188O026N669r40n318n742J294P549
634B475L538l965o270k245M247O707J550o022o114O03O459M706q14n875n146K849
650c317O640K982l669n892j359L550N470J147n946m804J344N921K943k459n560
665c009l105L386O263J570m397n382n69M212N723K28o000m218J970N711K794k136
681C041n052k665L027N667J037m673l966k15M503L657p36n388l614K879M800K052
697D354l152m722j590L710N187L16m425l994J113L810L908j195n098k864L088
712a554M731J027l208l595q03L651M053j042m567k712J509M330K106j738n204
727c016j635L159M456O51l319l375q10L894L878j113m005k269J668L228K308k001
$$ plain form
619 5030 -2560 -5973 -3403 3766 7847 2426 -4875 -6063 -37 5632 4692 -626 -6368 -5074 2475
634 2475 6013 2048 -4222 -6467 -2220 4487 6037 15 -6099 -5496 963 5669 4855 -1020 -6166 -3317
650 -3317 3323 6305 2636 -3256 -4615 -1065 4405 5552 -394 -5198 -3854 2067 5010 2551 -3009
665 -3009 -6114 -2728 3535 5105 708 -4674 -5243 -1031 4692 4920 -1080 -5298 -3328 2383 5177 3041
681 3041 -2011 -4676 -1649 4018 5055 382 -3584 -3799 704 4361 3625 -1763 -5377 -2498 2302 4354
697 4354 1202 -3520 -5110 -1400 3787 4103 -322 -4316 -3203 607 4515 3320 -1778 -4642 -1554
712 -1554 3177 4204 996 -2599 -3402 249 4302 3260 -1307 -4019 -2510 1820 3926 2188 -3016
727 -3016 -4651 -1492 2964 3615 296 -3079 -3889 5 3883 2770 -1235 -3504 -1836 1392 3700 1699
743A699m451p77L464L576j81l645l042P35L971K456j725l979k016K442L498J179
759C204k200l760j211L878K963m03k946k780J068L066K394j682l690p96K642K901
775B648L16k776l075M93L430K257j020k888k300R07L350K141k523l301n80K305
791f16K630M37k322k771L59K991K164j457k793j141J222L077J313k560l223O40
807b050K290K376j16k682k811J109L220J770j846l032o22J392K847L81j755k413
823a942j48K485J635m88k280j548J473K256R42j851k048n85J729K564J96k955
839e65j766O58K466J591j333k148j214J370K495M90j851j553p16J898J911k87
855A446k197j524J277K175Q11j221k152q60K099J919J88k016j450J97J659J526
$$ plain form
743 1699 -2752 -3529 -65 3511 3330 -315 -3357 -2622 1349 3805 2080 -1899 -3915 -1473 2025 3204
759 3204 1004 -2756 -3967 -89 2874 2471 -475 -3255 -2187 879 3273 1591 -2099 -2895 -253 2648
775 2648 2964 188 -2887 -2394 1036 3293 2273 -615 -2915 -2008 1342 3483 960 -2341 -2921 -616
791 -616 2014 2451 129 -2642 -2283 708 2872 1415 -1378 -2519 -1297 1780 3093 533 -2690 -2050
807 -2050 240 2616 2500 -182 -2993 -1884 1336 3106 1260 -1772 -2394 -1002 1845 2226 471 -1942
823 -1942 -2090 395 2030 1542 -738 -2286 -813 1443 2385 534 -1514 -2099 -370 2194 2390 -565
839 -565 -2331 -1673 793 2384 1051 -1097 -2311 -941 1554 2044 193 -1360 -2076 -178 1733 1446
855 1446 -751 -2275 -998 1177 1988 767 -1385 -2245 -146 1773 1961 -55 -1505 -1308 351 1877
871A877l10k253j347R99K069N99j027j776l10J409J665n62j573r82J49J686J114
888A427m00j897p19Q02J845N91j249j453l83J874J401l16j730j330R18J439M49
905A269m48k027k16J246J300m1j309j121K63J614J163q93j794n85Q96J437J015
922A769j395j683KJ419R90j13j109j138N9J426J353q28j384m45O00J129M49o47
940D54j951K94J304J078m56j086j110P91J476K80p62q55p62J134J105K10j121
957B3j172K8J339J032p91q86o43Q13J134L35j050j146K7Q91R01j71j056r94N93
976g93J034J046r14r08n07O40J280J89j139r32Q9R56O28K35j252l83N16Q78K28
995H91p96o71m64N86J305K2j133r27N58R29Q98p57j054n84P21J058J03o31p31
$$ plain form
871 1877 1567 -686 -2033 -1034 1035 1634 607 -1169 -1479 -70 1595 1033 -540 -1522 -1373 313 1427
888 1427 1027 -870 -1589 -787 1058 1649 400 -1053 -1436 438 1839 1523 -207 -1537 -619 820 1269
905 1269 821 -1206 -1422 -176 1124 1083 -226 -1347 -1084 530 1693 800 -994 -1579 -683 754 1769
922 1769 374 -1309 -1307 112 1102 989 -120 -1258 -1199 227 1580 752 -632 -1077 -477 652 1101 454
940 454 -1497 -1203 101 1179 723 -363 -1473 -682 794 1074 312 -543 -1305 -171 934 1144 23
957 23 -1149 -1121 218 1250 459 -427 -1070 -257 877 1212 162 -984 -957 -66 835 664 -392 -1386 -793
976 -793 241 1287 373 -535 -1042 -402 878 1067 -72 -1004 -915 41 669 904 -348 -731 -215 663 891
995 891 95 -576 -1040 -454 851 873 -260 -1187 -629 300 1198 441 -613 -1197 -476 582 685 54 -677
1014f77l16J092P48k50q03q12P28P69K05l37o79n01O19J122k36o83o33m06J172
1033A22P58pj402k18L45O96L78k84p80p01R03R35l82m43o86J24Q72M29k07r36
1053d84k55K65R76M08n21r17l54J146M31K14j078m25J65P29M10m05p93j64M36
1072b16M13N26p93m62R1N41N41k27p71j98J48J043J08n19j144L40P22Q19l99m12
1092A51r17k11J357M10m61o85k70K13J139k38l71q83L49P16J13R0o40k54o8J026
1112E66M72p66n43o14O61P57J42o06j010N46N69K34J03q56k77K15P41L10l87o06
1132c49j00N71L00K98r54p98O94Q56M9k01j086%M50Q06j08m69m15l74P88Q57n89
1153B26l88m56Q1P60M07lr41l61K94J053k04q66l66J17P87O08n12n00l77N06L65
$$ plain form
1014 -677 -993 99 847 597 -206 -1018 -290 479 684 347 -332 -833 -214 908 672 -11 -644 -1050 122
1033 122 880 873 -529 -747 -402 294 672 388 -392 -1093 -190 745 363 -80 -766 -642 230 659 452 -484
1053 -484 -739 -474 502 910 389 -528 -882 264 695 909 -169 -594 -429 300 710 305 -488 -652 -216
1072 -216 197 723 -70 -532 -441 100 641 414 -357 -555 -407 636 744 225 -919 -579 143 962 563 151
1092 151 -766 -977 380 790 329 -356 -626 -413 726 488 117 -766 -417 299 412 502 -138 -392 -460 566
1112 566 1038 272 -271 -885 -224 533 675 69 -941 -395 174 408 511 -345 -622 -407 334 644 257 -349
1132 -349 -449 122 422 720 -234 -1032 -338 518 567 366 -720 -720 -270 536 428 -41 -456 -830 -42 815 226
1153 226 -162 -618 -537 223 630 627 -314 -675 -381 672 468 -398 -764 -647 140 748 236 -264 -641 -135 230
1174B30K19m93n25J46L93O42j03q81k71M97J46M61l28m72l24N19O82j32l32p90
1194g16J96N48N45m7o84m94K64O52N63o04l97n02N24N37n2m10n79J84P61K36l32
1215A93m44j93K66M48L13m85o94O7O98N11l57m45l79K29O94L9j94m76k01J42M04
1236A36J0J52p42J51N14K17j21n77l0P9M62K59k94n73K75q7M87J58o42n03K82
1257c87O50Q2k52l58p4k67P46M33o19l12J9L79L59k37m80k59K49N12K47m4n98
1278b11k61M47L50M57o74n95K8O09K17k45L2n43J24Q17m2m47k08k55K60P56q4
1299E32m02o28L82L88J16j08n44n19O06N87l2k53n44j13M33M56q7o05l34N00K85
1320A16K18k96j04j67J25M28n9J48p42M2J63L61j06k59m15N74K25O1m6k47l22
$$ plain form
1174 230 449 -44 -569 -423 -30 612 509 -372 -643 -146 0 461 133 -339 -663 -144 538 406 74 -716
1194 -716 -520 28 573 526 -158 -652 -388 264 827 223 -174 -676 -152 385 333 -77 -656 -472 289 525 193
1215 193 -251 -444 -178 270 583 98 -596 -529 169 680 323 -122 -501 -272 422 461 267 -209 -410 -268 136
1236 136 146 298 -444 -293 221 438 317 -260 -290 -211 251 510 216 -357 -82 -169 318 476 -166 -669 -387
1257 -387 263 345 93 -265 -339 -606 140 573 -46 -358 -339 40 399 162 -318 -577 -328 184 431 387 -211
1278 -211 -472 -25 325 782 108 -487 -459 150 367 122 154 -389 -265 552 510 63 -145 -400 -140 616 532
1299 532 130 -498 -116 272 388 280 -264 -783 -177 410 378 125 -419 -532 -99 357 270 -335 -669 -169 116
1320 116 334 38 -66 -233 -108 320 261 409 -333 -291 -128 233 127 -132 -547 27 252 313 267 20 -302
1341c02Q9O22j41j43m65n7O06J46j4n72m34P19J62K69m45l12J4J83M92m16o4j92
1363b55J12L59J57j28l45m29N13L45M1j66n56n2M18J90R4m61p5L00O4N0k72k42
1385c38j20N35P8L91o71j07j51L02K58K55m82j72J23J93L04m3m39k34N48j03J82
1406C09n37k7J31K69k46L20l21m56M64O5K24k43k42j12L14K82k50l3k94K03J92
1427A2r9k6j1j77K72j02N57l72j09k6K29M4l7j59k06O4M14N5l48L6L1o4K36m37
1451b23M49l00k47N60j62l39J50m3K76%L05n29j88P9K13J21j15p9k99R1K69q2
1473i3m9Q7l60K32L96k36nq7j00J41K84J41k70k40L3K19Q4m34K03m3J01J6l4j71
1497a85l7M4J28K6J49p0m21L37LK31j8j29n0l56M68k8o8l05N10J50k44r1J1l37
$$ plain form
1341 -302 -213 409 268 125 -340 -397 209 355 341 -231 -665 54 216 485 40 -272 -258 -75 417 1 -63 -255
1363 -255 -143 216 373 245 -100 -529 -16 329 370 204 -352 -404 14 204 298 -163 -238 62 126 176 -96 -338
1385 -338 -458 77 155 546 -125 -232 -383 -81 177 432 -50 -222 -99 94 398 355 -84 -318 230 127 309
1406 309 -228 -255 -124 145 -101 219 -102 -558 -94 -29 195 -48 -290 -402 -88 194 -56 -89 -383 -180 12
1427 12 -87 -113 -124 -301 -29 -131 426 54 -55 -81 148 192 155 -4 -210 -146 268 323 -25 11 42 -22 214 -223
1451 -223 226 -74 -321 239 77 -262 -112 -155 121 121 426 -103 -291 -212 1 122 7 -72 -371 -280 -11 -93
1473 -93 -142 -55 -415 -183 213 -23 -28 -115 -215 -74 210 351 81 -159 -126 93 177 -257 -54 -97 4 20 -14 -185
1497 -185 -222 -178 -50 -24 125 55 -366 -29 -26 205 187 58 8 -348 120 92 24 -281 229 379 135 44 55 -282
1521b82J63L34l35K23N1j14N4k09L12j21k24L1J59P7k96J05j55J89k59M38K9K8
1543A98J9j77N4J13j42k27J73p9J58j51k5Q6j32K34k09J26L6m31M55J62n16K24
1565e1J14n03N31Q1k01n9j11q5j09J86J37m04K47J90P4O1K48m73O4J73m40M56
1587A26M1m13J70O8M23J94n80m27O68j48k61R26j370J027q97J42L70j04L04n43
1607b84m49J204n46m1l58K87L82k8k81j48L04n3k4K15k54N4j75J02L55j66k12
1628a16K99n54M81N3j4J8l14j08K28K41l22j41K54J0M1J35l90k3K96M1J18l13
1650h0l84L35Q8K54M5j57q9j73K40r9p8J13m23K14K35K7j66j83J33K19L18l05
1672H4k39K06k51K61O0n1m7p3K8J9J43j00l51J99j08K42L7k74J10k4J25K35l56
$$ plain form
1521 -282 -119 215 -120 103 154 40 94 -115 197 76 -148 -117 42 119 -177 -72 -227 -38 -297 141 170 198
1543 198 217 40 94 207 65 -162 11 -68 90 -61 -86 0 -132 102 -107 19 55 -376 79 241 -275 -51
1565 -51 63 -440 91 172 -29 -88 -199 -284 -393 -207 -70 -474 -227 -37 37 98 346 -127 -63 110 -330 126
1587 126 167 -246 -76 -8 415 609 29 -398 270 122 -139 787 -583 444 -453 -311 59 -45 259 -284
1607 -284 -733 471 -75 -116 -474 -187 195 167 -114 -262 42 -11 -35 180 -74 -20 -195 -93 262 96 -116
1628 -116 183 -371 110 163 149 167 -147 -255 -27 214 -108 -249 5 15 56 191 -199 -222 74 115 233 -80
1650 -80 -464 -129 -41 213 258 101 12 -161 79 -20 -98 15 -408 -194 41 68 -98 -281 -148 71 389 84
1672 84 -155 51 -200 61 121 70 23 -50 -22 -3 140 40 -311 -112 -220 22 59 -215 -105 -129 -4 231 -125
1695a25J7o7j58N93l64J97j19j4K82q9l47J44j78J52M04j63m04m6L38p8K11M6
1717B32j96j2PJ07J86l08j87n3J54J87j57R7o0J4M68j23k82j13J12o6K5J64k54
1740e8j00J32K64j95J51k41k85J93P0N2J5l52J78N01l51M5l51K2R2M68nk27j82
1763a64k08M24l25L39K05k47j06L27lP3k38k00L7K82k45J36l3k32K16L59l21j29
1785e3mJ15P3l5k8k47j40J51M03j05j92j45k16M78J22k27r5J80k18J63P6l29L24
1808E1j45K59k24K51m57K85n8L35n13R7r9j35K48J55L2j92L42m28K68k7j4Q5p
1831A09m3k53M10o9l41J22J89J92k05j23j58R0RJ42k85J45j20M21p4Ok40K18p4
1854F8j57K79O1n8o55N11k0O8J79j29l75K11j80N44l55O3p9O9j03j30J79jl52
$$ plain form
1695 -125 -108 -175 -333 260 -104 93 -26 -40 242 153 -194 -50 -228 -76 328 165 -239 -285 53 -25 186 232
1717 232 36 24 31 138 324 16 -171 -224 -70 117 -40 57 -3 11 479 356 74 -39 73 7 32 196 -58
1740 -58 -158 -26 238 43 194 -47 -332 -139 -69 -17 -2 -354 -176 325 -26 19 -332 -310 -218 250 245 18 -164
1763 -164 -372 52 -273 66 271 24 -82 245 242 315 77 -123 -86 196 -49 87 54 -178 38 397 76 -53
1785 -53 -57 58 131 96 68 -179 -319 -168 235 130 -62 -207 -423 55 177 -50 -145 35 -183 -20 56 -273 51
1808 51 -94 165 -59 192 -265 20 -38 297 -216 -119 -218 -353 -105 50 82 -110 232 -196 72 45 31 116 109
1831 109 66 -187 223 154 -187 -65 124 316 111 -12 -170 -80 -71 71 -214 -69 -189 232 158 164 -76 142 68
1854 68 -89 190 251 193 -462 49 29 97 276 147 -228 -17 -197 347 -8 55 -24 45 -58 -188 -9 -10 -362
1877c62P41j27n21M50m08J66O6P8j09J65k78J13N25n33J15k82J77K99pk32l01
1898b65L11j36J0L1J64q6j69K22n5j4j27Q6k41P79l53r0R3j23j71K92J53l85R8
1921B4J82j83J45l0N1m61M40J05k75j30R5J16q9L06m0q05L34K35M52m36m34K29
1943a69K71k4j70K51k29J0K88l32M36j86m07k08N95KJ21j48j77J69J51j52n3J01
1965A40l65J06R2j69J02L4NJ95O3l83K20Q6J30k77J86j01j31l02K89J21L1j67
1987i5P4j19p9L10j93K13j69K08N3N9k01p5K29l80L80p1K13n25K82k21L68l72
2009a11k72L4K16J83J16K97n50J07J30J98k81j67j45K12P5m6L72n23k90M32L02
2030B89j71l16R6J32P8k51l43M96J9J15mj22j4j2q5J73K8j55K05n5k76K54J16
$$ plain form
1877 -362 379 252 -269 181 -227 -61 5 83 -26 139 -139 -26 499 -34 81 -201 -24 275 268 36 -265
1898 -265 46 -90 -80 -49 115 29 -140 82 27 13 -114 -28 -269 510 157 67 160 37 -134 158 311 -74 24
1921 24 206 23 168 138 189 -272 168 273 -2 -132 -37 79 -10 296 256 -549 -215 20 472 36 -398 -169
1943 -169 102 78 -92 159 -70 -60 228 -104 332 146 -261 -469 126 128 249 101 -76 93 244 92 39 140
1965 140 -225 -119 -27 -196 -94 -60 -55 140 203 -180 40 126 256 -21 165 64 -67 -369 -80 41 72 -95
1987 -95 -21 -140 -219 91 -102 111 -58 150 203 262 61 -14 215 -165 215 144 357 -168 114 -107 261 -111
2009 -111 -383 -349 -133 50 166 463 -87 20 150 348 67 -100 -245 -33 42 -4 368 -155 -445 -13 289
2030 289 118 -198 -102 30 108 -143 -486 10 29 144 140 18 4 -8 -93 80 108 -47 158 103 -173 81 197
2053A97k85J82j5l5j6L4j82K28L7j07J13j23J07K18j00k08K85j49k72n2J85J73
2075B15j52J75l49q0J27R0j43J70m14J0L90J05k4q0J03k96J89JN8Nl24K86J1J01
2099A74k96J27L01k17J25j80l1K21m34M54m0o8k14O4L52r5k18j39Q3r1JK85M7
2122B11J51m00J59J44k17P5j60J66j92JL38k24N2N5j33k9j21l1K51k61L18k51
2144i8R5l52L58J3qk46J71j85L98j71j55j68J35R3L20k03m57L07R1J24nj8j14
2167g5l0R2k4r6K8j21J87K23k92j72L86k11k1J31j5j26K71m35K31O3n4N0j43J88
2191C5j19N4nJ56l17l9L56Jk41N8l2K95l38j8J4O8J01n3j30pJ03M1j35Nj04MJ54
2218i3j8L50r8k08J31j66L31j24m03M26P2m77M69l23K79k99k9q7L89J7j66K78
$$ plain form
2053 197 -88 94 79 44 28 62 -120 108 145 38 151 28 135 353 253 45 330 181 -91 -143 42 215
2075 215 63 238 -111 -191 -64 26 -117 53 -361 -351 39 144 120 40 143 -153 36 37 95 100 -224 62 73 174
2099 174 -122 5 306 89 214 34 3 224 -210 244 204 136 -78 -14 338 243 25 -114 -31 -122 -121 164 211
2122 211 362 -38 121 265 48 123 -37 129 -63 -62 276 52 104 159 26 -3 -124 -155 96 -165 153 -98
2144 -98 -3 -355 3 16 8 -238 -67 -252 146 -25 -180 -348 -213 -120 200 -3 -460 -153 -62 62 57 39 -75
2167 -75 -105 -13 -37 -133 -105 -226 -39 184 -108 -280 106 -105 -126 5 -10 -136 135 -300 -69 -6 -60 -10 -153 35
2191 35 -84 -30 -35 121 -196 -235 121 122 -119 -61 -93 202 -136 -154 -140 -72 29 -24 -154 -161 -58 -17 -152 -147 -251 -247 -93
2218 -93 -111 239 141 -67 64 -102 229 105 -298 128 200 -277 192 -131 148 -151 -180 -267 122 139 -27 251
2240B51q0l08K05P8j26j91k05M06k12K64Oj38K69j23O4M1l10J37r0J48k06MP9
2263c7j99J02J91n9L6k95J74K31j3l71K92O8p7j3K9j46j04L62n0j74K48j46j40
2286i1k2PM04l96K25o6l00K33J65k27J28k62K10o7l9MpJ5J87p4j05J39j37Q1q7
2311h2L2R1l7r3Q8j5j79K15j31J83N8kK8l13N2K4m9L55k15q5N7j11N89p23J21
2336a42K22j5k88K18q1J27K19l28K62k81L66l47P3M8J21k26K00M4l34J73j84j45
2358b98L63n8J27l6j9k04P9r8J10K00k34K34r8n9J66J59k00n2j5P6j84k51M00
2381A08J8k96J65N8J74j37n26L64l7K33j20l3L61l84R4j54J9O3J72m33K71l00
2403c20N91k83M4Pj27J90q9m7J86j87J6K39j34j45p4J33o2L17k33k05K13k29K7
$$ plain form
2240 251 171 -137 68 146 20 -171 -376 30 -182 82 88 -50 219 96 160 201 -109 28 -62 86 -120 -116 -37
2263 -37 -236 -134 57 -2 34 -261 -87 144 131 -240 52 120 43 30 59 -87 -191 171 121 -53 195 49 -91
2286 -91 -113 -106 298 -98 127 61 -239 -6 159 -68 60 -202 8 -59 -98 -94 -101 -86 101 27 -78 61 -76 5 -82
2311 -82 -50 41 4 -89 -1 -16 -195 20 -111 72 130 128 156 -157 -105 -81 -130 225 10 -75 -18 -129 460 -263 -142
2336 -142 80 65 -223 -5 -86 41 260 -68 194 -87 279 -68 5 53 174 -52 148 192 -142 31 -153 -298
2358 -298 65 7 134 98 79 -125 -46 -144 -34 166 -68 166 68 9 175 334 134 82 67 143 -41 -292 108
2381 108 126 -170 -5 53 227 90 -436 -72 -109 124 4 -29 332 -52 42 -112 -93 -30 142 -291 -20 -320
2403 -320 271 -12 32 39 -88 102 13 -34 152 -35 -19 220 86 -59 -133 0 -62 255 22 -183 30 -199 -172
2426a72K94p4K31l56j34K28M5J15j11J67m48L8N89k63m5j06j64K70k43J95J67
2447B23k34K99m33J41L0N0k76P5K60L2j54r1N0N5J92j42j7O6j16o4p9J91k51J63
2471c0N9j75M66l38l0m9n0J68r2n5M5j99M53p9j93o5J99o9K18l5n53M29k16M3
2495a48L69O4l06K05k6l34R8l3N8J41j80N7K01j58l2j70KL53J15l71J47n7l4M7
2519Hp7K57k00M9Q8j54n0j35J72J20j42M51k42k78J12o0K96k95l27J96L02j12
2541b1l9N53n72J70J50j95O8n57L53k9n3k4K00J8l58N02q6j51R7J80l59K57r0
2564A4n4L24m90M14j08n06L51KJ60p2lq7j24P0M4j80J42K6J11j98K3L4J98N9L30
2589D80n43R2K9j91N50l46J6k64KM12m6j95J28k28K44J70m23r0J49l13K06K26
$$ plain form
2426 -172 122 48 279 -77 -211 17 62 177 66 233 -215 -177 412 149 104 -2 -166 104 -139 56 223
2447 223 -11 288 -145 -4 26 76 -200 -125 135 167 13 -78 -28 27 219 77 60 126 10 -54 -133 58 -193 -30
2471 -30 29 -146 320 -18 -48 -97 -147 21 -71 -126 -81 -280 173 94 -99 -164 35 -34 184 149 -404 25 -191 -148
2495 -148 221 285 -21 184 158 -176 -78 -111 -53 88 -92 -35 166 8 -24 -194 -192 161 276 -95 52 -5 -39 8
2519 8 -69 188 -12 37 125 -29 -79 -214 -42 78 -64 387 145 -133 -21 -81 215 -80 -407 -211 91 -21
2541 -21 -60 493 -79 91 241 46 114 -443 -90 -119 -172 -196 4 22 -336 166 80 -71 26 206 -153 104 14
2564 14 -40 284 -206 208 100 -406 -55 -53 107 35 32 -55 -179 -109 -65 -245 -103 -77 34 -164 -141 -107 91 150 480
2589 480 -63 29 58 -133 417 71 87 -177 -175 237 191 -4 124 -104 140 310 -113 -203 -54 -367 -161 65
2611F5o5L2j3l33K52n0j17L6K04o5q7kQ2J25j23L8j0j35J65L08m14J29j1q9p8
2636a56K69l00J85N4k78L00o8m8m8K67l97J78K00j67j30J90q6J44j19J96n9k2
2658A05J40j3m2j43k38L73n1j26j60K57k57L35k5k67K96m1j35k00J27M8R8n6q5
2681f0m00N01J20M5j87J42m4j08j81J21L2n1N8n7J33j82J50M0K53n46L07Q0q8
2704G8j1p8O3k40K56k41L35j08J70J3l73O1J21p0J50J53k98J70j04l84L27m6l
2727e9j78L29J83k94J0J55j79K1k70L40L76m63m03N03l50j08K96J85j65R7qM7
2749F5q8NM5O1m0j40K86k57P0r5K03k61L44R6Km70j69M61P2O8m46N09j40k58j29
2774b06L38j9j72P1j76J47k90M02K50l38J08k91O8J55J9k29J08J42K08l40M8n8
$$ plain form
2611 65 0 32 19 -314 -62 -112 -229 -193 11 -54 -141 -143 -61 64 -59 -21 -31 -166 -1 307 -107 22 11 -78 -156
2636 -156 113 -187 -2 52 -226 74 6 -42 -90 177 -220 -42 158 -9 -139 51 -35 109 -10 186 127 105
2658 105 245 232 190 47 -191 182 131 5 -155 102 -155 180 155 -112 184 143 8 -192 -65 -17 81 25 -60
2681 -60 -460 41 161 206 19 161 117 9 -172 -51 -19 -70 -12 -69 64 -118 32 72 325 -221 86 166 78
2704 78 67 -11 52 -188 68 -173 162 54 224 237 -136 -75 46 -24 126 279 -19 151 47 -337 -10 -56 -59
2727 -59 -237 92 275 -19 -9 146 -33 -12 -282 58 434 -29 -432 71 -279 -387 -91 94 -71 26 18 65
2749 65 -23 -18 27 88 48 -92 194 -63 7 -88 115 -146 198 294 296 -174 -343 118 190 258 -188 321 181 -77 -206
2774 -206 132 113 -59 12 -164 -17 -307 95 345 7 115 -176 -108 47 66 -163 -55 87 295 -45 3 -55
2796e5K49o2m89N72j91K34l14j3m1K86k42k16K16j15N30m74N06n2j95k45p0q3
2818b64K86J36l46J09J28O6j98M6J18n4N8j32K88%k62k1K70k59J54k47L81k26
2840C1J63j39K4Q8j1l58j5J7L25j21j20J72j97Q8Q2j65J41n6j50M22l40N4n8o4
2864a87R1M16l63J16N3k8p6k35K69j07J96j27j10K13J50l24j69K14k14K17M1J18
2886A54N5j72O5q4J20j64J30j02L77q21O93l91K72O4j39K52l19J6k7j16L87m35
2908a85r7K32p8J82P0M3l25K50L74m00k45N68l40P2m4r3K3qq9J78n3j96J56M6
2932D1J91l76N0n9K01m08L81P9k64k33N78l41N61o30M13J6l15J00J36j28P7k54
2954a84P6J72k35M00n35N83l39j3J91m90L79L07l01l0L14k95Rk2L12m4n90K63
$$ plain form
2796 -55 194 132 -357 215 24 258 -56 -69 -110 176 -66 -282 -66 -181 349 -125 381 329 134 -111 -181 -264
2818 -264 22 158 -188 -79 49 115 -83 -37 81 27 85 -47 241 241 -21 -42 228 -31 123 -124 257 31
2840 31 194 55 79 167 156 -202 -217 -200 125 4 -116 56 -141 -53 29 -136 5 -51 -201 221 -119 -65 -123 -187
2864 -187 -96 320 -43 73 126 98 22 -213 56 -51 145 18 -92 121 271 -53 -222 -8 -222 -5 36 154
2886 154 209 37 102 18 138 -26 104 2 379 -442 251 -140 132 196 57 309 -10 6 -21 -137 250 -185
2908 -185 -282 -50 -128 54 124 167 -158 92 466 66 -179 389 49 121 77 -16 7 -1 -90 88 35 -161 -5 41
2932 41 232 -144 -94 -153 48 -360 21 100 -164 -397 181 -160 401 -229 184 200 -115 -15 121 -7 70 -184
2954 -184 -108 64 -171 229 -306 277 -62 -75 116 -374 5 312 11 -19 295 0 9 -13 299 255 -335 -72
2976g2j99J29J79k43O9M09k28k60N00k57m2K10k73o4K25n2Lk04k25J90K43L64
2998D02m11p8L39Q3l26j49L19r0lj03P9r6j82J81O9M60l19l99M02l40L22O1R6
3021C17n26R0L23J57m24J0jK81m59J26J99N4MN4q6l88J56j04M30l25L07j23q7
3044a5j63J74K13k41J1l05L31K02l27j61L37O0J01l12O8j58K86k58K08j43R7j27
3066a22L68k64Q8k92K77N0m7l8J08j34J84k35k39L55k0j06M56l26j91M28o44M27
3088H3K57n5j41m04K51l4K33o03K85L05k28K64m7l08k4M32m89L48l70J79J02R0
3110A26j05J74l54L11J00j08j74q1K44r8j8J28k51L2q0J37K60k38K29p1o9o4j84
3133a54l2M59l23J33k03J02J97l20K24j05q0K3L97l20K62j89j13J66k75R5J07
$$ plain form
2976 -72 -271 -142 37 -206 -137 272 44 -216 284 27 -15 195 -78 -142 83 31 34 -170 -395 -205 38 402
2998 402 -9 -87 252 335 9 -140 179 89 86 -17 62 -34 -216 -35 34 494 175 -224 178 -162 160 221 317
3021 317 -209 -119 204 361 -63 -53 -54 227 -232 -106 93 147 151 205 119 -269 -113 -217 213 -112 195 72 -15
3044 -15 -178 -4 209 -32 -21 -326 5 207 -120 -281 56 116 217 -95 -27 -185 101 -157 51 -92 5 -122
3066 -122 246 -18 70 -222 55 105 58 20 128 -6 178 -57 -296 59 39 -67 389 63 -128 300 -344 83
3088 83 340 285 144 -260 -9 -43 190 -413 -128 177 -51 213 166 -142 -166 266 -223 125 -245 -66 36 126
3110 126 21 195 -159 152 252 144 -30 -111 133 35 17 145 -106 -74 -154 -17 243 5 234 163 94 30 -154
3133 -154 -186 273 -50 83 -120 -18 179 -141 83 -22 -102 -79 318 -2 260 71 -42 124 -151 -56 51
3154E1l18L96q2l62J72n4L46j57j4j44J42J07m4q4M87l06k29J17o5l7K00l18J21
3177g5K44m57K24jJ52Q1J17j35jj81Rj2N3J05k44R1J28o3m6r6n7J0J74j21R1j89
3203a99Q9Q5O4j26P7R8k39K56K6k75Q8r1K22j97l4J88l5K53l10QJ33k26Q8p9Q3
3228e3J46J36j17j24K44m06J58R9j28k18N1L4L28k21L95m31L26j51K48j60k08
3249e2O2n1J28j38J66m12K17K03q6O2j81o5K51k39j8j6J09q2J51M6l7k1j07J5
3273i5R8l3K70J21l81J39L8j27J06l28L58k40%J33j62J69m2j61R7j08K33J26j34
3296G7J9j40J27k79K53l74M67kr2k48J45J69N7R0oL7o5k09j84M7J0J94l41M98
3320B50l16m8K35p0j74R6J28k82L03J11n4n25N02L3k70J86k73J10j14J9J43MJ7
$$ plain form
3154 51 -267 129 47 -315 -143 -197 149 -8 -22 -166 -24 83 39 -45 442 136 -93 24 -41 -78 122 -196 -75
3177 -75 169 -288 -64 -65 87 168 285 150 149 -32 -23 -35 18 123 -121 -30 98 35 -11 -107 -164 -154 20 -101 -10 -199
3203 -199 -110 -25 39 -87 -10 88 -151 105 131 -144 -56 -147 75 -122 -156 32 -3 250 -60 -52 81 -145 -57 -136 -53
3228 -53 93 229 112 -12 232 -174 -16 83 -45 -263 -212 -178 150 -71 324 -107 219 68 316 156 -52
3249 -52 10 -41 87 -51 115 -297 -80 123 37 99 -82 -147 104 -135 -153 -169 -60 -142 9 55 18 -3 -110 -95
3273 -95 3 -30 240 361 -20 119 157 30 136 -192 166 -74 -74 59 -103 66 24 -137 -40 -148 85 211 77
3296 77 96 -44 83 -196 57 -317 150 148 56 -192 -47 122 179 269 263 300 235 26 -158 -111 -101 93 -248 250
3320 250 -66 -114 121 51 -123 -27 101 -181 122 233 179 -346 156 189 -81 105 -168 -58 -172 -153 -10 -6 11
3343A1P4j64P4j00P9l7K02k68K16j36pj52n8L70M5k08K83o0j12Q5r1K6K7m29L65
3368C5j0j9L7J03m56J99K90j10O6l02J08J73k58K72o5j96j43J62J91j33J39k6
3390E7K52l65J76p6J7n8N5J07k77J70k89Q9r4K65m6M1j01m3J55o0K61k27J66l55
3414a80R1P4p9R7Q2j37J72n8j64J45o3K10k46M05l58j0k25K67j65NL61q9J02l33
$$ plain form
3343 11 85 -79 -5 -105 -26 -63 139 -129 87 -49 -56 -208 -266 104 149 -59 224 164 52 137 46 72 99 -330 35
3368 35 25 6 43 146 -310 -111 179 69 135 -167 -59 114 -144 128 63 -133 -276 -114 77 -56 83 57
3390 57 309 -56 120 44 61 3 58 165 -112 58 -231 -142 -236 29 -17 24 -77 -120 35 -25 236 9 175 -180
3414 -180 -89 -15 -94 3 85 -52 120 62 -102 43 -20 190 -56 349 -9 -19 -244 23 -142 -137 224 135 237 -96
$$ [...]
8191c29
##END NTUPLES=NMR FID
##END=
