##TITLE=1H_DE-27_Etsh
 D2O
 8 sc, 
 30.11.2023
##JCAMPDX= 6.0         $$ Bruker NMR JCAMP-DX V2.0
##DATA TYPE= NMR FID
##DATA CLASS= NTUPLES
##ORIGIN= UXNMR, Bruker Analytische Messtechnik GmbH
##OWNER= root
$$ XWIN-NMR		Version 3.5
$$ Thu Nov 30 16:42:36 2023 Russian Standard Time (UT+4h)  she@DPX200
##.OBSERVE FREQUENCY= 200.1313
##.OBSERVE NUCLEUS= ^1H
##.DELAY= (6, 6)
##.ACQUISITION MODE= SIMULTANEOUS
##.ACQUISITION SCHEME= undefined
##.AVERAGES= 8
##.DIGITISER RES= 18
##SPECTROMETER/DATA SYSTEM= spect
##.PULSE SEQUENCE= zg30
##.SOLVENT NAME= CDCl3
##.SHIFT REFERENCE= (INTERNAL, CDCl3, 0, 15.7039)
##AUDIT TRAIL= $$ (NUMBER, WHEN, WHO, WHERE, WHAT)
$$ ##TITLE= Audit trail, XWIN-NMR		Version 3.5
$$ ##JCAMPDX= 5.01
$$ ##ORIGIN= Bruker BioSpin GmbH
$$ ##OWNER= she
$$ F:/spectra/data/she/nmr/H-F/1/audita.txt
$$ ##AUDIT TRAIL=  $$ (NUMBER, WHEN, WHO, WHERE, WHAT)
(   1,<2023-11-30 16:41:41.10 +0400>,<she>,<DPX200>,
      <created by zg, POWCHK disabled, PULCHK disabled
       configuration hash MD5:
       00 E9 B6 7A A2 85 ED C7 34 08 36 98 17 FE 4E 26
       data hash MD5: 16K
       5D 0A 18 34 71 F3 4D 2D 0F C1 F5 60 B2 BF E3 39>)
$$ ##END=
$$ 
$$ hash MD5
$$ 4E 47 82 90 0B F4 51 BA 2C B0 E5 C6 84 56 15 DB
##$RELAX= 
##$RELAX= 
##$RELAX= 
##$RELAX= 
##$RELAX= 
##$RELAX= 
$$ Bruker specific parameters
$$ --------------------------
##$DU= <F:/spectra>
##$EXPNO= 1
##$NAME= <H-F>
##$PROCNO= 1
##$TYPE= <nmr>
##$USER= <she>
##$AMP= (0..31)
100 100 100 100 100 100 100 100 100 100 100 100 100 100 100 100 100 100 
100 100 100 100 100 100 100 100 100 100 100 100 100 100 
##$AQSEQ= 0
##$AQ_mod= 1
##$AUNM= <au_zg>
##$AUTOPOS= <>
##$BF1= 200.13
##$BF2= 200.13
##$BF3= 200.13
##$BF4= 200.13
##$BF5= 200.13
##$BF6= 200.13
##$BF7= 200.13
##$BF8= 200.13
##$BYTORDA= 1
##$CFDGTYP= 0
##$CFRGTYP= 5
##$CHEMSTR= <none>
##$CNST= (0..31)
1 1 145 1 1 1 1 1 1 1 1 1 1 1 1 1 1 1 1 1 1 1 1 1 1 1 1 1 1 1 1 1 
##$CPDPRG= <>
##$CPDPRG1= <>
##$CPDPRG2= <>
##$CPDPRG3= <>
##$CPDPRG4= <mlev>
##$CPDPRG5= <mlev>
##$CPDPRG6= <mlev>
##$CPDPRG7= <mlev>
##$CPDPRG8= <mlev>
##$CPDPRGB= <>
##$CPDPRGT= <>
##$D= (0..31)
0 1.2 0 0 0 0 0 0 0 0.06 0 0.03 0 0 0 0 0.0002 0 0 0 0 0 0 0 0 0 0 0 0 
0 0 0 
##$DATE= 1701348100
##$DBL= (0..7)
120 120 120 120 120 120 120 120 
##$DBP= (0..7)
150 150 150 150 150 150 150 150 
##$DBP07= 0
##$DBPNAM0= <>
##$DBPNAM1= <>
##$DBPNAM2= <>
##$DBPNAM3= <>
##$DBPNAM4= <>
##$DBPNAM5= <>
##$DBPNAM6= <>
##$DBPNAM7= <>
##$DBPOAL= (0..7)
0.5 0.5 0.5 0.5 0.5 0.5 0.5 0.5 
##$DBPOFFS= (0..7)
0 0 0 0 0 0 0 0 
##$DE= 6
##$DECBNUC= <off>
##$DECIM= 32
##$DECNUC= <off>
##$DECSTAT= 4
##$DIGMOD= 1
##$DIGTYP= 9
##$DL= (0..7)
0 120 120 120 120 120 120 120 
##$DP= (0..7)
150 150 150 150 150 150 150 150 
##$DP07= 0
##$DPNAME0= <>
##$DPNAME1= <>
##$DPNAME2= <>
##$DPNAME3= <>
##$DPNAME4= <>
##$DPNAME5= <>
##$DPNAME6= <>
##$DPNAME7= <>
##$DPOAL= (0..7)
0.5 0.5 0.5 0.5 0.5 0.5 0.5 0.5 
##$DPOFFS= (0..7)
0 0 0 0 0 0 0 0 
##$DQDMODE= 0
##$DR= 18
##$DS= 0
##$DSLIST= <SSSSSSSSSSSSSSS>
$$ [...]
##$SUBNAM2= <"">
##$SUBNAM3= <"">
##$SUBNAM4= <"">
##$SUBNAM5= <"">
##$SUBNAM6= <"">
##$SUBNAM7= <"">
##$SUBNAM8= <"">
##$SUBNAM9= <"">
##$SW= 18.0517328524113
##$SWIBOX= (0..15)
0 0 2 0 0 0 0 0 0 0 0 0 0 0 0 0 
##$SW_h= 3612.71676300578
##$TD= 16384
##$TD0= 1
##$TE= 0
##$TE2= 300
##$TE3= 300
##$TEG= 300
##$TL= (0..7)
0 120 120 120 120 120 120 120 
##$TP= (0..7)
150 150 150 150 150 150 150 150 
##$TP07= 0
##$TPNAME0= <>
##$TPNAME1= <>
##$TPNAME2= <>
##$TPNAME3= <>
##$TPNAME4= <>
##$TPNAME5= <>
##$TPNAME6= <>
##$TPNAME7= <>
##$TPOAL= (0..7)
0.5 0.5 0.5 0.5 0.5 0.5 0.5 0.5 
##$TPOFFS= (0..7)
0 0 0 0 0 0 0 0 
##$TUNHIN= 0
##$TUNHOUT= 0
##$TUNXOUT= 0
##$USERA1= <user>
##$USERA2= <user>
##$USERA3= <user>
##$USERA4= <user>
##$USERA5= <user>
##$V9= 5
##$VALIST= <valist>
##$VCLIST= <CCCCCCCCCCCCCCC>
##$VD= 0
##$VDLIST= <DDDDDDDDDDDDDDD>
##$VPLIST= <PPPPPPPPPPPPPPP>
##$VTLIST= <TTTTTTTTTTTTTTT>
##$WBST= 1024
##$WBSW= 4
##$XGAIN= (0..3)
0 0 0 0 
##$XL= 0
##$YL= 0
##$YMAX_a= 36209
##$YMIN_a= -36608
##$ZGOPTNS= <>
##$ZL1= 120
##$ZL2= 120
##$ZL3= 120
##$ZL4= 120
##$ABSF1= 10
##$ABSF2= 0
##$ABSG= 5
##$ABSL= 3
##$ALPHA= 0
##$AQORDER= 0
##$ASSFAC= 0
##$ASSFACI= 0
##$ASSFACX= 0
##$ASSWID= 0
##$AUNMP= <proc_1d>
##$AZFE= 0.1
##$AZFW= 0.1
##$BCFW= 1
##$BC_mod= 2
##$BYTORDP= 1
##$COROFFS= 0
##$CY= 11.3945322036743
##$DATMOD= 1
##$DC= 2
##$DFILT= <>
##$DTYPP= 0
##$F1P= 15.7292609196834
##$F2P= 12.9074282941183
##$FCOR= 0.5
##$FTSIZE= 0
##$FT_mod= 4
##$GAMMA= 1
##$GB= 0.15
##$INTBC= 1
##$INTSCL= 1
##$ISEN= 128
##$LB= 0.24
##$LEV0= 0
##$LPBIN= 0
##$MAXI= 10000
##$MC2= 0
##$MEAN= 0
##$ME_mod= 0
##$MI= 1.114404
##$NCOEF= 0
##$NC_proc= 0
##$NLEV= 6
##$NOISF1= 3.799351
##$NOISF2= 2.8
##$NSP= 1
##$NTH_PI= 0
##$NZP= 0
##$OFFSET= 15.70392
##$PC= 1
##$PHC0= -24606.9
##$PHC1= 28.85271
##$PH_mod= 1
##$PKNL= yes
##$PPARMOD= 0
##$PSCAL= 0
##$PSIGN= 0
##$REVERSE= no
##$SF= 200.130013532006
##$SI= 16384
##$SIGF1= 3
##$SIGF2= 2
##$SINO= 400
##$SIOLD= 16384
##$SREGLST= <1H.CDCl3>
##$SSB= 0
##$STSI= 0
##$STSR= 0
##$SW_p= 3612.71676300578
##$SYMM= 0
##$S_DEV= 0
##$TDeff= 0
##$TDoff= 0
##$TI= <>
##$TILT= no
##$TM1= 0
##$TM2= 0
##$TOPLEV= 0
##$USERP1= <user>
##$USERP2= <user>
##$USERP3= <user>
##$USERP4= <user>
##$USERP5= <user>
##$WDW= 1
##$XDIM= 8192
##$YMAX_p= 0
##$YMIN_p= 0
$$ End of Bruker specific parameters
$$ ---------------------------------
##NTUPLES= NMR FID
##VAR_NAME=  TIME,          FID/REAL,        FID/IMAG
##SYMBOL=    X,             R,               I
##VAR_TYPE=  INDEPENDENT,   DEPENDENT,       DEPENDENT
##VAR_FORM=  AFFN,          ASDF,            ASDF
##VAR_DIM=   8192,          8192,            8192
##UNITS=     SECONDS,       ARBITRARY UNITS, ARBITRARY UNITS
##FACTOR=    0.0002768,     1,               1
##FIRST=     0,             0,               0
##LAST=      2.2672688,     0,               0
##MIN=       0,             -36608,          0
##MAX=       2.2672688,     36209,           0
$$ Real data points
##PAGE= N=1
##DATA TABLE= (X++(R..R)), XYDATA
0@%%%%%%%%%%%%%%%%%%%%%%%%%jNrJ2j5J6j6J6j7J9k2K5k9L2l4M0m5M8n4O0o6
$$ 0 0 0 0 0 0 0 0 0 0 0 0 0 0 0 0 0 0 0 0 0 0 0 0 0 0 -1 4 -5 7 -8 8 -8 8 -9 10 -12 13 -16 16 -18 22 -23 25 -29 31 -35
46c5P4q1Q9r8J07j18J30j42J57j74J93k16K43k74L11l58M14m89N96p51R99j464
$$ -35 39 -42 47 -51 56 -62 68 -74 83 -91 102 -114 129 -145 166 -192 222 -267 329 -422 577 -887
68h87K633j0582k6382j390O243J6083K1621K1651P148m559j5231k1125k0464j0377
$$ -887 1746 -8836 -35218 -36608 -30365 -14282 7339 28990 36138 31579 16348 -4777 -25241 -35618
82c5618K189J5103K2665J9709R844j045j3494k2093j9388r660J88J1040J9949
$$ -35618 -33429 -18326 4339 24048 33892 32847 19353 -2740 -22128 -31788 -31600 -20560 -611
95f11K0611J1642J46j0780j9250k0224j2325j175J0408J8925J8650J2603L338
$$ -611 20000 31642 31788 21008 1758 -18466 -30791 -31966 -21558 -2633 16017 28620 31958
108C1958q853j8532j8533j2555m650P007J7433J9650J2903M059o589j6050j8339
$$ 31958 23105 4573 -13960 -26515 -31165 -24158 -6725 12925 25828 29887 23298 7248 -11091
121a1091j3731m966N972J5547J7492J4473O689n298j5311j7551j3869p536M014
$$ -11091 -24822 -29788 -23816 -8269 9223 23696 30385 25087 9776 -7775 -21644 -29180 -25166
134b5166J4509J6841J3624P650k652j2294j6635j4757p975K092J1855J6180J5176
$$ -25166 -10657 6184 19808 27458 24806 12512 -4123 -18880 -26855 -24763 -12908 3272 18448
147A8448Q603k163j1535j5444j4366r595O57J0741J5102J4269R877J100j0149
$$ 18448 27051 24888 13353 -2091 -16457 -26052 -25395 -14654 448 14717 24594 25694 15545
160A5545j4758j4345j0095r40Q619J4070J4598R914J747p718j3296j4482j1109
$$ 15545 787 -13558 -23653 -24593 -15974 -1904 12694 22608 24355 16637 3341 -11141 -22250
173b2250k699P601J3176J4088J1621K954o564j2764j3928j1257l957N450J1852
$$ -22250 -24949 -17348 -4172 9916 21537 24491 17927 5163 -8765 -20022 -23979 -18529 -6677
186f677J4165J1690M171m642j1255j4111j1755m327M231J0405J3459J2117N059
$$ -6677 7488 19178 23349 18707 7452 -6659 -18414 -22741 -18510 -8105 5354 17471 22530
199B2530l445r963j3380j2137o149K861R452J3687J1958O140j473r034j2911j2419
$$ 22530 19085 9122 -4258 -16395 -22544 -19683 -10231 3456 15414 21554 20081 11047 -1864 -14283
213a4283o342J328P662J2533J2301P214p20p881j1843j2547p574oP635J1692J2371
$$ -14283 -20625 -19297 -11635 898 13199 20413 19693 11812 -31 -12578 -20152 -20158 -12523 -831 11540
228A1540P754Q08o211j1810j2406q166j508N853J1136J2518Q429J506n133j0324
$$ 11540 19294 20102 13891 2081 -10325 -18491 -19999 -14146 -3010 9508 17937 19443 14310 3986
242C986j2474q830k328N096J0239J1868R269L106m458j0075j1743r481l472L242
$$ 3986 -8488 -17318 -19646 -14550 -4311 7557 16826 19932 15474 5399 -6344 -15825 -19297 -16055
256a6055R738J1801R264M156k539r061j1759j0040m259K494Q447J1533J0155M713
$$ -16055 -6317 5484 14748 18904 16365 7304 -4455 -14495 -18754 -16260 -7813 3720 13875 18588
270A8588j928q173j1237j0159n654J542P826J0934J0398N843r18p033j0743j0613
$$ 18588 16660 8487 -2750 -12909 -18563 -17021 -9195 1739 12137 17980 17062 10029 -714 -11327
284a1327n792K1O436J0705J0440O289L38o108j0286j0507p016p40O093R922J0428
$$ -11327 -17119 -17098 -10662 43 10483 16772 17110 11002 716 -9791 -16807 -17547 -11454 -1532 8896
299H896P293J365n254r738j0779p222k159M527R572J0818P716K018l937r094j0311
$$ 8896 16189 17554 12300 2562 -8217 -15439 -17598 -13071 -3499 7319 15035 17053 13116 4022 -6289
314f289q113k660L729Q449J0346Q286L590l792q158j0406q414l527K545Q305J0264
$$ -6289 -14402 -17062 -13333 -4884 5462 13748 17338 13546 5388 -5018 -13432 -16959 -14414 -6109 4155
329D155Q398M252k326p083j0460q863m292J638P204R657Q711N021j250o636r703
$$ 4155 12553 16805 14479 7396 -3064 -11927 -16219 -14581 -7377 2280 10991 16012 14762 8126 -1577
344a577r158n030O18O545R744Q753N836j84n732r594r610n750j64N070R211R448
$$ -1577 -10735 -15765 -15147 -8602 1142 9895 15731 15547 9815 221 -9389 -15139 -15303 -10233 -1022 8426
360H426O173P92m971q613r408o623q18M474Q308R102O852J928m197q369r210p195
$$ 8426 14599 15391 10420 1807 -7601 -14224 -15042 -10568 -2260 6842 13694 15622 11425 3056 -6154 -13349
376a3349k354L526Q291R392P264K300k766p786r249p631k845K857P108R389P644
$$ -13349 -15703 -12177 -3886 5506 12770 15070 12304 4518 -4731 -12362 -15207 -12350 -5242 4147 11791
391A1791L296k459o944q999q001l590J818O912R129P920M127j483o216r311q242
$$ 11791 15087 12628 5684 -3315 -11316 -14906 -13088 -6176 2953 10873 15000 13517 7301 -2010 -10252
406a0252m198R51N845Q673Q606M553k52n870q626q193n206K30N116Q397Q391N433
$$ -10252 -14450 -13499 -7654 1019 9625 14178 13926 8056 -570 -8763 -13969 -13739 -8623 -226 8165 13598
422A3598N87m669q816q450n542r73M430Q283Q764N755R58l653p851q543o294j916
$$ 13598 14185 9516 700 -7750 -13292 -14265 -9835 -1552 7212 12967 13925 10272 2421 -6122 -12416 -14332
438a4332L994P223Q721O321K216l129q006q276o285k661K935P049Q469O826K893
$$ -14332 -10338 -3115 5606 11927 14143 11014 3008 -5268 -11553 -14214 -11279 -4230 4239 11065 13958
453A3958k137o754q639o972l301J693O489Q483O699M075j647o119p895p488l957
$$ 13958 11821 5067 -3572 -10544 -13845 -12152 -5663 2820 9519 13594 11947 5828 -2067 -9555 -13512
468a3512R43O112Q212P473M336j025n520p938p569m619K16N054P480Q110M922
$$ -13512 -12569 -6457 1755 9228 13564 12539 7019 -919 -8488 -13107 -12891 -7837 -357 7753 12675
483A2675K39m667p656p609n640l81M765P100P650N608Q20m225o846p801o080j039
$$ 12675 12914 8247 591 -7018 -12658 -13039 -8274 -1174 6476 12084 12904 8679 1833 -5968 -12048 -13087
499a3087L509O869Q195O217J279l503o431p618o415j861K779O328P514O994K295
$$ -13087 -9578 -2709 5486 11703 12982 9479 3048 -4570 -10985 -12846 -10067 -3739 3775 10769 13064
514A3064k726o355p571o893k418K277O018P562O962K843j864n258p718p229l536
$$ 13064 10338 3983 -3588 -10481 -12899 -10622 -4604 2958 9920 12763 10899 5641 -2077 -9306 -12842
529a2842J455N198P679P392L496j220m859p241p335l521M75M526P382P308M111
$$ -12842 -11387 -6189 1490 8882 12378 11158 6299 -942 -8277 -11798 -11323 -6797 585 7893 12004
544A2004j46m155p700p459m422p9L940O926P870M474O49l515o519p750n134q96
$$ 12004 11858 7703 3 -7456 -11878 -11957 -8017 -1091 6779 11253 11902 8387 1868 -5882 -11016 -11912
560a1912L227O768P376N096J305k891o644p243n264j660K477O259P572N587J898
$$ -11912 -8685 -1917 5459 10555 11860 8969 2325 -4918 -10182 -11842 -9365 -3106 4466 10053 11951
575A1951k136n992p766n956j850J844N770P309N579K822j338n637p381n655l089
$$ 11951 9815 3823 -3943 -9899 -11749 -9905 -4135 3174 8753 11575 10237 4600 -2781 -8436 -11525
590a1525Q65N573P529N883K953m16n238p196o124l480K05M699O881O474M153j8
$$ -11525 -10660 -5087 2442 8325 11278 10862 5624 -1572 -7696 -11176 -10971 -6272 609 7083 11236 11218
606A1218m432p158o352m082k16M388O405O508M303L56l365o671o572m470j459
$$ 11218 6786 -372 -6724 -10806 -11022 -6634 -229 6279 10582 10938 7573 902 -5670 -10140 -11599
621a1599L964O220O888M674R40k965o006o481n510j351K987N626O365N597J896
$$ -11599 -7635 -1415 5473 10147 11087 8122 2116 -4365 -9875 -11226 -8239 -2613 3752 9349 11245
636A1245k578n843o465n328k251K412N630O068N791K606k208n012o572o010k854
$$ 11245 8667 2824 -3641 -8969 -11220 -8808 -3178 2890 8681 11287 9079 4067 -2505 -8515 -11369
651a1369J989M910O407O093K925j530m883n971n730l523Q05M369O371O181L571
$$ -11369 -9380 -4470 1937 8030 10955 9425 4542 -1429 -7159 -10682 -9877 -5508 863 7044 10615
666A0615o79m475o068o414l516O08L651O147O274L914J20l556n538o578m575p2
$$ 10615 9936 5461 -607 -7021 -10537 -9929 -6278 -131 6143 10057 10177 6621 1083 -5495 -10070 -10142
682a0142L397N539O289M359M98k761n295o850m189r57K498N668O412M658J038
$$ -10142 -6745 -1206 5083 9442 9940 7179 1884 -4966 -9155 -10112 -7614 -1946 4466 9124 10162
697A0162k245n279o585m629j588J992M928O416N011J928j644m928o454n039k118
$$ 10162 7917 2638 -3947 -8576 -10164 -8172 -3244 3172 8183 10111 8467 3539 -2915 -7954 -10072
712a0072J562M857O044N230K220j064m707n991n290k355M68M468N928N377L117
$$ -10072 -8510 -3653 2391 7621 9841 8777 4070 -1921 -7211 -9566 -9098 -4630 1298 6675 9792
727I792r08l645o275n418k919J95L694N785N683L180K63l643n771n878l250J02
$$ 9792 8884 5239 -1036 -6454 -9373 -9178 -5484 301 5984 9164 9427 5784 13 -5865 -9115 -9013
743i013K969N580N555L860O26k882n580n744m054j033K905N345N749L745J457
$$ -9013 -6044 -464 5091 8951 9577 6695 1115 -4629 -8683 -9716 -6811 -1466 4283 8028 9485
758I485k544n195n450m420j198K160M877N921M196J538k173m303n963m590j900
$$ 9485 6941 1746 -3704 -8124 -9322 -7162 -2285 3636 7832 9370 7197 2894 -3069 -7659 -9559
773i559J809M314N815M996K029j298m388n627m771k496R43M218N523M750K399
$$ -9559 -7750 -3436 2379 7375 9404 8106 3718 -1909 -6680 -9176 -8233 -4015 1508 6258 8657
788H657n63l724n705m853k982P62L560N552N427K762j29l599n194n066l447k42
$$ 8657 8094 4370 -1335 -6188 -9170 -8408 -4848 704 6131 8893 8764 5165 -29 -5095 -8542 -8784
804h784L339N142N320L215N95l369m986n411l227o01K777N026N172L634P01k009
$$ -8784 -5445 -303 5017 8232 8827 5458 472 -4939 -8166 -8767 -5990 -964 4208 7842 8543 6534
820F534n140n215m115j114K328M898N148M028J526k021m639n315l808j759J575
$$ 6534 1394 -3821 -7936 -9050 -6722 -1824 3324 7352 8878 6857 2218 -3097 -6905 -8664 -7089
835g089M409N326M503J422j597m286m966m620j876J584M135M628M435K756j197
$$ -7089 -2680 2646 7149 8571 6974 2688 -2278 -6898 -8774 -7190 -3055 1573 6008 8764 7567
850G567l700n306m478k511Q32L235N336M517K785q34k880n063m534k892M8L202
$$ 7567 3867 -1439 -5917 -8428 -7596 -4361 975 5492 8277 7443 4563 -500 -5034 -7926 -7878 -4676
866d676M868M663K767J75k833m650n119k899k37K458M740M889K870Q80k141m741
$$ -4676 192 4855 7622 7797 4964 314 -4805 -7704 -7941 -5483 -743 4146 7016 7896 5755 1014
882A014m880l180o64J928M249N087L230J149k063m196m898l653j285J915L883
$$ 1014 -3866 -7046 -7710 -5782 -1533 3554 6784 7933 5870 1674 -3224 -6877 -8162 -6247 -2364
897b364N026L991J481j641l842m840l962j855J314L705M940M019J829j175l182
$$ -2364 2662 6653 8134 6493 2651 -2189 -6151 -8006 -6692 -2987 1953 5972 7801 6626 3444
912C444n127m400j643O06L653M549M353K333o95l333m294m635k396R1L386M525
$$ 3444 -1683 -6083 -7726 -7120 -3467 1082 5435 7768 7073 3740 -554 -5189 -7585 -7494 -4108 417
928D17M327K623j94k713m300m535k857M5K416M417M671L173J45k739m084m491
$$ 417 4744 7367 7173 4460 160 -4375 -7232 -7187 -4771 -354 4317 7490 7635 4896 812 -3679
944c679l318o47K489M194M231L238Q92k094l775m491l507r99J661M093M457L537
$$ -3679 -6997 -7644 -5155 -961 3270 6508 7400 5306 1531 -2960 -6467 -7466 -5805 -1712 2745 6282
960F282J158j250l913m825l559j179J297L718M071M099J442q05l889m182l886
$$ 6282 7440 6190 2277 -2548 -6107 -7286 -5989 -2271 1800 5899 7341 6536 2647 -1535 -5421
975e421k034R10L574M183M007K141q18l256m308l965k087P41K561M441M244K125
$$ -5421 -7455 -6545 -2971 1212 5219 7360 6542 3286 -1022 -4987 -7074 -6333 -3772 669 4913 7038
991G038l92k691l991m424k378J42K354M351M073K800J60k355m191m262k650k89
$$ 7038 6646 3955 -36 -4460 -6838 -6696 -4342 9 4082 6882 7042 4687 496 -3766 -6416 -6705
1007f705K223L621M576K844L8j828l509m317l323m89J399L563M701L382Q38j706
$$ -6705 -4482 -861 3715 6559 6597 4769 1260 -3057 -6380 -6869 -5470 -1907 2794 6176 7014 5308
1023E308l579m230l119j015J225K962M536L383J286r89l125m269l618j689R57
$$ 5308 1729 -2501 -5620 -6635 -5410 -2448 2088 5471 6757 5768 2643 -1626 -5244 -6933 -5976
1038e976L163M258L509J422m40k870l931l759j817L26K640M033L902K064l03k524
$$ -5976 -2813 1445 4954 6376 5936 3066 -865 -4624 -6441 -6115 -3475 558 4460 6524 6221 3697
1054C697m348l784k104L66K259L961L622K726J0k049m324l849k287m48K192L888
$$ 3697 -651 -4435 -6539 -6173 -3914 47 3669 6395 6405 4356 32 -3817 -6104 -6552 -4360 -472
1070d72L623K422R46k056l641l598k721q78J650L508L919K623R99j486l389m128
$$ -472 3151 5573 6519 4463 822 -2776 -5497 -6375 -4725 -1217 2702 5325 6324 4838 1449 -2679
1086b679k797j141J808L120L804L134J213j095l284l906l114j619J288K955L909
$$ -2679 -5476 -6617 -4809 -1689 2115 5249 6462 5367 2083 -1823 -4937 -6556 -5268 -2313 1596
1101A596L232J247n57k803l669l724j582M84K989L578L392J993n15k726l441l497
$$ 1596 4828 6075 5518 2715 -954 -4678 -6260 -5776 -2787 791 4183 6176 5661 2935 -506 -4003
1117d003k174J96K590L575L466K198J85k315l574l579k345l29K194L236L837K478
$$ -4003 -6177 -5981 -3391 184 3650 5848 6033 3718 144 -3435 -5780 -6109 -3915 -679 3158 5636
1133E636J37j790l142l697k649p21J991L019L740K759R57j637l326l380l255m09
$$ 5636 5773 3983 841 -2856 -5505 -6226 -4235 -1216 2524 5283 6240 4603 1277 -2103 -5358 -5767
1149e767P38L175L634L077J127j430k801l505l004j143J253K422L825L139R74
$$ -5767 -5029 -1854 1780 4857 5984 4554 1753 -1752 -4756 -5899 -4646 -2224 1601 4740 5714
1164E714o44k703l622l259j167M50K188M036L132J293l77j954l705l478j373J87
$$ 5714 5070 2367 -1255 -4514 -5681 -5231 -3043 993 4125 5418 5041 3087 -618 -4096 -5469 -5282
1180e282K140L367L205K303m54k349k992l538j993J3K183L285L295K228k7j179
$$ -5282 -3142 225 3430 5733 5279 2930 -62 -3600 -5593 -5580 -3397 -112 3183 5411 5384 4205
1196D205l625l302k455m14J500L203L750K081O59j245l268l495k416o64J121L006
$$ 4205 580 -2722 -5177 -5591 -4091 -888 2862 4943 5602 4357 1089 -2406 -4822 -5486 -4365 -1359
1212a359L571K499Q27q91k902l734k488j163J234K487L481K652J135o35k431l391
$$ -1359 2212 4711 5538 4647 1745 -1989 -4477 -5640 -4406 -1919 1562 4214 5349 4714 2283 -1108
1228a108k970j346O54K401L264L119J452o62k077l622k751j791O00K031L161K950
$$ -1108 -4078 -5424 -4770 -2369 895 4014 5466 4804 2727 -895 -3646 -5437 -4837 -2806 355 3305
1244C305J594K22k030l451k901j859k72K118L351K745J965N67k105l077l082j979
$$ 3305 4899 5121 3091 -360 -3261 -5120 -5392 -3274 77 2822 4787 5354 3249 172 -2910 -4889
1260d889k64J727K945K955K193N57j430k971l072k410n79J357K807L006K519O52
$$ -4889 -5153 -3426 -481 2474 4667 5224 3794 823 -2249 -4659 -5238 -3881 -1074 1932 4451 5103
1276E103j026k776l192k438j047J402K529K820K733J170r44k547k877k868j182
$$ 5103 4077 1301 -1891 -4329 -5376 -3974 -1445 1375 4108 5278 4334 1787 -1090 -3958 -5140
1291e140R79K439K793K741J244o95k305k821k683j496O83J946K844K781J640k43
$$ -5140 -4161 -1722 1071 3812 5056 4361 2056 -765 -3448 -4944 -4261 -2315 529 3310 4950 4707
1307D707k079k969k783j865J77K094K543L031J878j66j440l076k542j957l52J446
$$ 4707 2628 -341 -3124 -4989 -4812 -2718 -175 2856 4734 4568 3128 52 -2490 -4447 -4799 -3353
1323c353K671L213K099N0j455k629k610k402m75J350K708L120J917Q36j348k699
$$ -3353 -682 2531 4630 4680 3225 596 -2014 -4416 -4891 -3541 -833 2287 4204 5040 3692 993
1339I93k867k318j000J251K466L131K386P76r03k303k962k609q65Q14K243K906
$$ 993 -1874 -4192 -5192 -3941 -1475 1656 4042 4818 3915 1612 -1350 -3959 -4824 -4010 -1767 1139
1355A139K510J051n71j893l148k761q76K84K261L104K277J284k90k008l052k610
$$ 1139 3649 4700 4129 2236 -912 -3673 -4549 -4265 -2004 1100 3377 4661 4371 2363 -689 -3299
1371c299j354K64J986K542K409J670K15j779k630k741j620k18J772K415K819J716
$$ -3299 -4653 -4389 -2403 139 2548 4218 4433 2654 24 -2717 -4337 -4555 -2783 -368 2451 4167
1387D167L13j609k401k599j946m33J295K406K910J803Q66j388k379k735j967r33
$$ 4167 4480 2871 470 -2129 -4075 -4508 -3213 -807 2103 3906 4772 3384 1005 -1730 -3697 -4630
1403d630J175K224K828K081Q67q34k048k865k494o60N26K264K549K469J400q31
$$ -4630 -3455 -1231 1597 3678 4545 3711 1663 -1202 -3696 -4356 -3830 -1566 983 3452 4852 4021
1419D021k250k641k300j186L70K159K598K250J440m08j731k893k145j659K46J514
$$ 4021 1771 -870 -3170 -4356 -3986 -1827 771 3021 4461 4053 2322 -571 -2716 -4375 -4129 -2615
1435b615K723K862J369J5j873k264k846j545K01J351K236K627J871J63j642k135
$$ -2615 108 2970 4339 4354 2481 217 -2629 -4174 -3973 -2622 -386 2241 4112 4275 2633 498
1451D98k717j833k68J357K428K418J640P67j307j991l050j736m42J007K196K630
$$ 498 -2219 -4052 -4320 -2963 -535 1883 3523 4290 2983 992 -2058 -3794 -4236 -3229 -1033 1597
1467A597K105L63r09j911k509k021n66N36J666K812K235O15n37j785k729k200
$$ 1597 3702 4065 3156 1245 -1264 -3285 -3851 -3315 -1649 1163 3398 4013 3476 1691 -1038 -3238
1483c238j185J064J622K262K520J065n84j659k493k278j214J27J933K237K414
$$ -3238 -4423 -3359 -1737 525 3045 4110 3526 1867 -626 -2904 -4118 -3991 -2058 179 2593
1498B593J192L0j408k380k282j411r9J376K350K460J448q4j241k491k127j408
$$ 2593 3785 3815 2407 27 -2255 -3666 -3765 -2389 -39 2421 3869 3785 2544 53 -2074 -3482
1514c482l20J078K543K114J818J24r32k226k542j644j56P61K022K594J643O89
$$ -3482 -3802 -2724 -181 1933 3751 3875 2943 717 -1825 -3469 -3625 -2864 -842 1752 3395 4084
1530D084r46k328k275j655p78P40J737K606J924Q15n72j856k510k242q11O00J751
$$ 4084 3138 810 -1465 -3120 -3898 -3158 -1421 1185 3109 3924 3352 1496 -1014 -3256 -4067 -3467 -1716
1547a716K513K020J198l67k002k234j890j167LJ690K535K001J020k56j383k370
$$ -1716 797 2817 4015 3648 1646 -588 -2478 -3645 -3642 -1952 583 2584 3604 3348 1965 -405
1563d05j695j449j96J530K039K113J875k29j383k306j806j640jJ199K014K212
$$ -405 -2100 -3549 -3745 -2215 -176 1937 3812 3583 2200 -106 -1912 -3552 -3553 -2354 -340 1872
1579A872J575K3p29k075k353j881m94J328K136K033J859M02j009j786k497j587
$$ 1872 3447 3470 2741 666 -1687 -3568 -4062 -2734 -598 1435 3294 3696 2687 901 -1596 -3183
1595c183p13J206J737K147J928P14p02j752k441j749p32M32J799K153K087Q26
$$ -3183 -3896 -2690 -953 1194 3122 3836 3134 1382 -1059 -2808 -3540 -3108 -1309 844 2931 3757
1611C757o33j709k066k166r01Q86J113K149K198R72l61j299k001k270j156P4J367
$$ 3757 3124 1415 -651 -2817 -3718 -2832 -1719 430 2628 3600 3239 1940 -61 -2331 -3487 -3413 -2046
1628b046K090K143J147M1j358j831k477j138L5J195J883K360J256J53j077j912
$$ -2046 44 2187 3334 3375 2017 186 -2291 -3429 -3394 -2199 -316 2044 3300 3453 2376 464
1644D64k042j782J12O64J688K479J569M80q23k190j711j681n39O36J883K096J786
$$ 464 -1578 -3360 -3248 -2584 -896 1583 3152 3632 2809 619 -1092 -2773 -3312 -2676 -793 1303 3089
1661C089L87p09j591k220j398q71M74J546K421J818L21m12j421j964k016o92K46
$$ 3089 3476 2767 1176 -1044 -2442 -3313 -2839 -1293 1128 2946 3267 2855 1434 -530 -2546 -3238 -2992
1678b992J409K277J763R45l61j301k318j611j047P0J245K089J980J094M3j385
$$ -2992 -1583 694 2457 3402 3041 1740 -578 -2189 -3236 -3166 -1921 168 2148 3242 3285 1900
1694A900j898j846j044j16J091J761J877J297J17r64j851k014j134m68R57J826
$$ 1900 2 -1844 -2888 -3004 -1913 -152 1725 3022 3139 2175 324 -1690 -2824 -3292 -2335 -509
1710e09J920J363L58p19j887k071j111p15R34J756J725J557P95n15k067j962j253
$$ -509 1411 2774 3132 2413 526 -1545 -2656 -3371 -2437 -681 1044 2601 3396 2881 814 -1148 -2401
1727b401r18O54J573K078J666O38m09j801j767j805p76M26J583J774J777P02K5
$$ -2401 -3319 -2665 -1092 986 2652 3290 2881 1080 -687 -2492 -3268 -2842 -1259 515 2292 2994 3019
1744C019j350j741j838j390L98J388J997J642Q28J74j558j518k210p72j09P78
$$ 3019 1669 -72 -1910 -3300 -2902 -1514 483 2125 2953 3127 1569 51 -2159 -2931 -3040 -2262
1760b262K168J880J268j27r01j720j775j600P3R67J702J875J269K69q01k035j685
$$ -2262 -94 1786 3054 2927 2026 306 -1469 -3069 -2996 -2029 -327 1548 2817 3086 2285 250 -1435
1777a435j072n32Q75J624J534J547N35n84j838j737j156r08P29J500J642J411
$$ -1435 -2507 -3039 -2164 -540 994 2541 3076 2492 654 -1083 -2239 -3147 -2418 -918 724 2135
1793B135O05j90j529j464j781p57M47J199K052J460Q00l54j117j721k020n41O4
$$ 2135 2740 2550 1021 -443 -2224 -2981 -2534 -1335 717 2177 2977 2623 1506 -215 -2235 -2776 -2712
1810b712J269J684J815R15l46j011j437j964j208K25R54J939J556R39Q8r43j654
$$ -2712 -1443 241 2056 2971 2625 1614 177 -1787 -2995 -2770 -1816 123 1679 2618 2706 1763 109
1827A09j884r30r3P41J744J646J384J0o14j541k011j243pQ87J418J641J350K72
$$ 109 -1775 -2705 -2798 -2057 -313 1333 2717 2727 2113 572 -1439 -2682 -2689 -1802 -384 1257 2607 2879
1845B879o76j357k018j064o64O03J666J573J296Q64r39j384j628j390o83O58J255
$$ 2879 2203 846 -1172 -2236 -2900 -2297 -631 942 2238 3102 2163 779 -849 -2239 -2922 -2264 -1009
1862a009J576J508O53l69r58j871j481r19K79J280J694J285J026j49j021j635
$$ -1009 567 2075 2728 2359 1401 -470 -1951 -2870 -2591 -1311 383 1668 2694 2545 1524 -111
1878a11j527j211J51J382J453J587J014j04j154j401j751q21J9O25J673J575J283
$$ -111 -1638 -2849 -2698 -1316 137 1724 2738 2634 1480 79 -1672 -2493 -2474 -1849 -176 1399 2682
1895B682L02j156j568j637j046l37R10J211J707J189M63q67j224j712j276k24
$$ 2682 2984 1828 260 -1377 -2423 -2760 -1850 -639 1068 2257 2720 1853 629 -1083 -2359 -2583
1911b583M87J381J671J110M41m78j111j744j269n68K95J813J356J199N09j82j262
$$ -2583 -2096 -715 956 2066 2507 2029 918 -826 -2095 -2663 -2368 -555 801 2000 2509 2327 1065
1928A065j782j517j69O9J345J508J353P24j42j061j824j172p16lJ083J485J353
$$ 1065 -717 -2234 -2403 -2334 -989 519 1872 2596 2454 1393 -431 -1603 -2319 -2322 -1239 246 1599
1945A599P08L26j163j605j064j183P8P37J511J119J509j6j186j149j433j086j85
$$ 1599 2307 2633 1470 -135 -1199 -2382 -2304 -1567 -56 1063 2572 2556 1370 221 -1212 -2298 -2483
1962b483N69J491J484J126N32r64j305j650j015l11P38J316J567R29M93o22j311
$$ -2483 -1914 -423 1061 2187 2719 1755 450 -1200 -2215 -2526 -1788 -472 1095 2024 2517 1895 584
1979E84j490j172j47J03J048J667J374M45q6j488j304j431n31L09J127J609R88
$$ 584 -906 -2078 -2225 -2122 -1074 593 1967 2412 2326 838 -466 -1897 -2428 -2119 -992 617 1605
1996A605P14j86j089j478j135p89J27J046J528J411P64m14q63j341j211j149J54
$$ 1605 2319 2133 1044 -434 -1569 -2358 -2231 -1185 343 1754 2518 2104 1241 -100 -1311 -2460 -2306
2013b306Q82J667J120Q07J12p50j490j516p24l0O47J283J582Q42J84n34j392j472
$$ -2306 -1424 243 1363 2170 2282 1532 42 -1474 -2198 -2228 -1581 -298 1284 2126 2310 1776 384 -1088
2031a088j017l62O49J267J401J208L41o50j103j528r19m48N96R38J474J100N82
$$ -1088 -2105 -2467 -1818 -551 850 2058 2399 1749 646 -882 -1801 -2249 -1653 -715 759 1859 2441
2048B441l78j321j551q43n30K53J179J057J369Q47m14j348j181j182n69R4J075
$$ 2441 2063 742 -809 -1652 -2182 -1929 -750 307 1676 2523 2109 761 -420 -1602 -2171 -2077 -1002
2065a002J396J231K09J41r16j079j549p41L58O39J165J563P45J79r21j616j013
$$ -1002 394 1625 1834 1975 1059 -20 -1569 -2310 -1952 -1313 -148 1415 2160 2339 1418 -198 -1211
2082a211j112K63Q81R88J317J151M3o30j383j594p26j53P33J004J529J137M3r48
$$ -1211 -2323 -2060 -1179 -191 1126 2277 2320 1690 307 -1287 -2013 -2166 -1433 -429 1100 2237 2280 1332
2100A332o29j291j197k55J69J327J300J262J90p33o35j461j107m76N20Q10J431
$$ 1332 703 -588 -1785 -2040 -1871 -544 756 2018 2208 1475 840 -621 -1728 -2204 -1684 -874 557
2117E57J235K87l19r37j093j673l28M78Q32J421J077P13l99p54j062j411n82o7
$$ 557 1792 2079 1760 823 -270 -1943 -2271 -1793 -961 460 1537 2250 1851 1097 35 -1376 -1958 -2025
2135b025R32J129J263Q35k97l97j561j112o19j82P61J139J147R43K12q98p56j526
$$ -2025 -1093 36 1299 2134 1837 1440 -121 -1233 -1852 -2034 -1273 -134 1013 1956 2168 1270 514 -1012
2153a012j249Q4P38J340J164J033Q1o19j161j216j035j31L29R72J549Q66J29k09
$$ -1012 -2261 -2177 -1439 -99 1065 2098 2179 1560 399 -817 -1852 -1983 -1654 -682 867 1733 1862 1653
2171A653r49j519p22n24J64J192J400O68P49m59r55j015j104o11K61R07J121J043
$$ 1653 704 -815 -1537 -2061 -1897 -705 695 1363 2112 1653 698 -317 -1421 -2032 -1771 -864 257 1300
2189A300M99L3p06j413j038q18M01N50J493Q18P43K63j074j230j079n78j89P09
$$ 1300 1799 1832 1126 -287 -1325 -2143 -1742 -1192 301 1119 1862 2125 1051 -179 -1258 -1836 -2025 -1316
2207a316J209J238Q46K39o92j403j033j035O3M92J002J606L66O09r03r99j133
$$ -1316 -107 1131 1977 2216 1524 121 -912 -1947 -1884 -1392 -390 1216 1582 2191 1288 289 -844
2224h44r69p0N42O25J466R51J63m73r28j095q75o17L00J113J265R35O15n21j176
$$ -844 -1813 -1883 -1341 -716 750 1701 1864 1391 463 -632 -1507 -2124 -1824 -711 554 1489 2104 1583 407
2243D07q36j003m92N59O56Q93J082O51k56r01j012j250m17J41O94J239J293N61
$$ 407 -429 -1432 -1924 -1365 -709 184 1266 1917 1661 760 -252 -1502 -1919 -1778 -1084 155 1448 2009
2261B009n28l20j372j079l47j69O01J214J080P24K07p48j125j138q32n0O73J125
$$ 2009 1481 1161 -211 -1290 -1637 -1806 -1205 9 1089 1813 2020 1272 147 -991 -1823 -1873 -1200 -75
2279g5J130P34J76n82j032j210p02m69N90J338Q42J019r2k81j091j027p66n47
$$ -75 1055 1789 1965 1383 351 -859 -1561 -2030 -1440 -102 740 1759 1667 1386 295 -732 -1498 -2045
2297b045O78J120R76P40L20k88q49j054r98m31L55P21J147Q56M12r7o84q86j444
$$ -2045 -1367 -247 729 1469 1789 1501 652 -402 -1400 -1831 -1476 -755 392 1248 1660 1563 879 -7 -1451
2316a451l46O8P18J236P00O98K25q35j023j257m32J06N47J258Q04O10K9o73j083
$$ -1451 -1797 -1729 -1011 225 925 1623 1848 1013 -10 -1267 -1699 -1593 -1046 212 1016 1626 1655 982 -101
2335a01p32q01j16O46Q24J240O91K5p89q95p43p62k22P66M69J364P14J65k88j092
$$ -101 -833 -1634 -1750 -1104 -280 960 1651 1676 887 -8 -751 -1513 -1735 -969 -500 864 1578 1743 1455 363
2355C63j009q72l35O28P91R91Q63K50m43n66j274p20m10L64J106N24J114L94l09
$$ 363 -646 -1518 -1853 -1225 -434 557 1420 1670 1227 661 -613 -1333 -1743 -1379 -273 251 1365 1759 1450
2374A450o31j311o41o02j05R36R83J352L67J6j084p66q93n46o9N18J406M35N78
$$ 1450 819 -492 -1133 -1735 -1840 -904 79 1431 1798 1814 730 -36 -929 -1475 -1544 -1026 380 815 1393
2393A393j07j37j302q37n97p2N37Q10J136Q40K0n73p04j215n85k84O00Q31J096
$$ 1393 1286 1149 -153 -990 -1587 -1659 -1122 -312 824 1664 1684 1111 407 -808 -1393 -1677 -1077 -246 850
2412H50N20L74n70q00q98r14j31L29Q87Q48Q27K63l18q71o67j203l15N58O84J017
$$ 850 1370 1744 1174 374 -524 -1438 -1569 -1240 -353 495 1322 1585 1267 396 -271 -1474 -1789 -1231 -547 470
2432D70O50M69k99p77q57q14n69K14R48R17R15L09n44j71j385n61n02k72J114
$$ 470 1120 1589 1290 513 -344 -1158 -1727 -1513 -565 352 1267 1576 1032 861 -524 -1085 -1587 -1859 -745
2451g45Q39R48O95r6n84j193p17j054L49P94O50R06O16j02j11q24j049q37n7L80
$$ -745 94 1042 1737 1641 1057 -136 -853 -1907 -1558 -764 -114 792 1408 1306 1195 371 -678 -1515 -1572 -1192
2471a192J236O22Q98J84n50o36j258p14j01L87Q19R44N61M10m85o37r55o94m99
$$ -1192 44 666 1564 1748 1198 562 -696 -1410 -1511 -1124 -305 639 1200 1610 1125 488 -467 -1161 -1660
2490a660L31Q03J000Q76M17m13r26j011n65j44k3R43P04Q65N07j37r65r00r20
$$ -1660 -1329 -526 474 1350 1767 1354 428 -583 -1148 -1292 -1315 -372 332 1197 1704 1567 602 -298 -1218
2509a218l48K61O58R02P69M15m8o22j055n20o63K6N51J092O07P25jq16o45q55
$$ -1218 -1566 -1305 -647 255 1024 1439 1391 769 -286 -806 -1469 -1443 -892 200 807 1532 1531 715 70 -785
2529g85n95l13P47N24J290L64L04p00q59p89p33Q2M24R53N66N85N29l66p30j200
$$ -785 -1380 -1693 -946 -422 868 1232 1536 836 -23 -812 -1545 -1463 -1039 -86 480 1065 1594 1228 498 -702
2549g02m24m75M43O46R67P36M90p34n90q53p27k82J32P88Q39P78N74k67p86r30
$$ -702 -1126 -1601 -1158 -512 455 1191 1681 947 357 -496 -1223 -1505 -1373 -585 254 1032 1606 1339 553 -377
2569c77o42m65K00O88P37R70L37q0o12o74j000k55k33O60Q90P68M57J44o77r99
$$ -377 -1019 -1484 -1284 -596 141 1111 1448 1368 756 82 -918 -1173 -1406 -746 144 912 1369 1513 836 -163
2589a63p75l33r3M55Q12P09O71L1l81q18r80n78J78M44O19Q37Q99q4m12q77q05
$$ -163 -938 -1271 -1364 -909 -97 612 1283 1314 933 115 -865 -1443 -1265 -821 -202 635 1534 1450 1038 161 -644
2610f44n22p8K29O02P91P46J44j77m51j185p95K18k05R41P76P27L04j33n95p43
$$ -644 -1166 -1244 -1015 -413 378 1124 1268 1091 640 -545 -1340 -1122 -1327 -386 390 1117 1421 1288 693 -50
2630e0p70n92J86N17J124N29M46k73J3j380n85o14J60O30O89P30M78J1r3j036
$$ -50 -820 -1412 -1226 -709 415 944 1390 1117 1130 -250 -835 -1449 -1289 -659 30 760 1238 1249 1156 120
2650A20p69p36J84K19Q57J061K87J13n95o62p78l87k09L91P73O98Q47k16k91o16
$$ 120 -649 -1385 -1201 -982 -125 936 1223 1336 741 79 -699 -1086 -1295 -904 -131 567 1414 1198 907 291
2670B91p31o04l00p3J010J085O48k10o0p50p15p61j35K64N66P98P27M55k13p68
$$ 291 -440 -1044 -1344 -1417 -407 678 1326 1116 1056 306 -409 -1170 -1305 -1041 -475 323 1050 1505 1292 524
2690E24o64q35n85M34M41J093M51L02K29p63q13o96n02J60O33O42Q26K54J75q57
$$ 524 -140 -975 -1560 -1126 -685 408 859 1161 1390 627 -186 -882 -1384 -1224 -591 51 877 1131 1306 449
2710D49l30o85o90L88K2J024N46K58J68m89o91n90n49k91M28Q37Q29N48Q3j86
$$ 449 119 -566 -1256 -868 -846 178 724 982 1150 661 -30 -620 -1169 -1460 -1032 -195 634 1182 1265 1079
2730A079r28n07q09J00K22L73J081M23J61p9q10q93j80m07K19J78J340O79r3l49
$$ 1079 151 -356 -1165 -1065 -843 -470 611 1034 1195 1116 306 -587 -767 -1174 -955 -777 563 1242 1149 800
2750H00k43r16n25p7k07Q53O04O45N45m99k96j031m34n13k6P71L86J045M19r2
$$ 800 557 -359 -884 -961 -1168 -315 289 934 1479 980 684 -347 -781 -1294 -1320 -549 -163 882 1301 1209
2770A209m35q14m04q28K85L88K37P33Q95j8n40n40q91l42k28M21O41P92L78M7
$$ 1209 774 -40 -444 -1272 -987 -599 -362 371 1266 1248 708 168 -723 -1065 -1293 -872 -231 561 939 986
2790I86j03n54r27o31J44J29P61N75O16K30m59n32o81p21j74K46O90R15O59r5
$$ 986 883 329 -598 -1229 -1085 -956 -195 380 996 1226 767 235 -446 -1167 -1341 -1095 -405 510 1169 1074
2810A074R9q00n42o67l36K49L51P95O66L28n67o7r24m27k09J1M25N04R51K00k28
$$ 1074 1173 373 -169 -836 -1172 -923 -572 223 889 1217 650 583 -341 -768 -977 -966 -541 -37 914 1114 886
2831H86j82p62o43l57j16M98P78N00N14j0l76o62q65k62j62N39L16R74O55j77
$$ 886 704 -58 -701 -1058 -1174 -676 102 602 1116 1106 730 68 -797 -1059 -1221 -682 -366 608 1263 1086
2851A086l18n78p90l60k8L19M36P90N39R4l86n51o93n30o9k4P52N61P31R5l20
$$ 1086 768 190 -600 -960 -988 -669 -233 557 1096 1190 804 253 -440 -970 -1039 -1063 -311 250 981 1076 756
2872G56m11n46p81l42K17O54O84N75K52J69q40o73m73l74J71L18M03R15K42J4
$$ 756 345 -201 -982 -1324 -1107 -453 231 806 1058 1227 387 -286 -759 -1133 -962 -644 -241 674 916 930
2892I30l66o04p52j93L5M38P83N61L41O8q91j18o93p46J58L12O01N18M62J93p2
$$ 930 564 -40 -792 -985 -950 -512 271 832 1173 1241 350 232 -461 -1207 -1049 -737 -136 382 844 1037 965
2913I65p18p22l10k18L6P65M26Q50r9j8q25p58k43R8L7M22P05O12J06k29n23n33
$$ 965 247 -475 -785 -1003 -967 -202 224 1074 975 957 132 -626 -869 -771 -734 -312 393 1005 1111 882 359 -174
2935a74r09J09j2M08O33Q86o2K45l62j020n82m61J66N10P11N66L22r8k98o08o80
$$ -174 -1083 -974 -986 -578 55 941 879 1124 762 -258 -840 -1301 -1135 -625 86 652 974 876 578 -30 -710
2956g10l06Q8Q2P30Q23K24L58p29o50l91o34J2L30Q36M99M80K11o36l47o83p36
$$ -710 -1016 -928 -846 -116 707 931 1289 560 -90 -481 -1115 -1103 -773 63 562 1042 1253 617 270 -413 -1149
2977a149L31J27L92N23O13K63o43o3p96n11j20L21M84O80M33K44k64n05o68o81
$$ -1149 -818 -691 -299 224 837 1100 457 394 -402 -913 -1033 -712 -228 452 885 1129 865 360 -308 -989
2997i89r7K16O19O76M17r5q7k10m46o37m77L23M98L12O91J84J61n01n87n17p29
$$ -989 -1086 -870 -251 425 842 747 660 450 4 -633 -1110 -787 -289 23 714 898 1059 558 -29 -546 -1275
3018a275L87K73L78N81P29j46k77o63o21k37J15Q4N61N97N09j13n62k91p00j35
$$ -1275 -888 -615 -237 344 1073 927 650 -13 -634 -871 -756 -672 -111 486 995 882 320 29 -671 -806
3038h06k91M00M41N48Q19j30r7n28p64k96k99K37O62M35O35Rj02r94k91n32J23
$$ -806 -1097 -697 -256 292 1111 981 884 356 -408 -704 -1003 -766 -104 331 966 975 873 -121 -412 -944 -821
3059h21P3K82P72P01Ln2o89o16j31p13L11L12P79J41O64j52l89q72j63m59R5M69
$$ -821 -748 -466 306 1007 1010 958 269 -347 -478 -1191 -880 -568 211 352 1016 864 475 -397 -560 -1019 -924 -455
3081d55N74N51K95k10j54n32o47j70n7P2O21M38O63Qk89m60p52l13R5R1M00O78
$$ -455 119 670 965 755 601 69 -578 -748 -805 -733 -112 326 989 997 708 248 -504 -817 -722 -631 -231 447
3103D47K29K52%n20p86k34l63L52O34L84K82M67o85k64l35o48j42P2N27R19J66
$$ 447 676 928 928 408 -378 -612 -975 -623 11 395 677 1144 459 195 -140 -788 -930 -858 -331 588 754
3124G54J34O2m03p76m34p1j05N57N08K85L68K66q38m81l82k28J98k4N71P21R4
$$ 754 888 950 547 -229 -663 -734 -839 -282 226 511 879 1145 307 -174 -556 -784 -586 -610 -39 682 776
3145G76L23m45r25j51m65j23J68R59L37K81J90l27m60n50m77k99Q35J68O37M47
$$ 776 1099 654 -271 -422 -887 -1010 -842 117 454 735 925 598 138 -412 -889 -1188 -353 -185 452 899
3165H99Qm83k61n63m68m9K0O38L78O15K15m38j19o21m92k99L45L03Q13L45K1j11
$$ 899 907 424 163 -400 -868 -917 -897 -259 119 734 949 511 392 -229 -721 -1020 -675 -372 441 786 807 696
3187F96j39m74q89n9J81O0P70L80N07k36n46o22j35k38q1K42N79L93L34K52m06
$$ 696 557 83 -806 -865 -684 -624 146 526 1033 797 251 -371 -506 -744 -825 -583 -4 389 723 975 569
3208E69k50n94o15P9L31L08P71J88K50m99n28l91m76m3K92M72N10M79k66J13m89
$$ 569 319 -275 -890 -811 -480 -172 599 787 1037 538 10 -381 -857 -900 -608 -136 374 853 587 700 211
3229B11q53O0k04L02L64K44J77N67j32o02l99k94j80rL78L42N57M01j14m51o82
$$ 211 -642 -582 -786 -484 -120 124 301 868 736 134 -265 -559 -739 -748 -370 -28 529 930 816 365 -317
3250c17j31n23L09K27N17N62L63j63l04n37n86l29K07K41M62P37K13j73n21k15
$$ -317 -448 -971 -662 -435 82 644 1007 844 540 3 -583 -912 -705 -464 -2 735 948 775 254 39
3270C9m35k99l25N64N27N31J66m8k03o47m44k37j35M06N95M45M0N9J15o65p8o65
$$ 39 -396 -695 -1020 -456 71 602 768 720 517 -130 -574 -811 -946 -540 55 500 540 599 714 49 -29 -694
3292f94j87O45j46O17L81L90n64k03n57l80r8L92J13M80M68N5p0k31n95o44j48
$$ -694 -881 -236 -382 235 616 1006 442 239 -318 -698 -796 -404 -291 189 657 712 642 411 -184 -828 -976
3313i76K64L99N82J4M72l2k63n03k59n23M5L63M09N60L4J80j79o34k89m30j49
$$ -976 -712 -313 269 283 755 723 460 -43 -302 -825 -780 -417 -8 552 586 766 587 -47 -336 -766 -915
3334i15M78N57K81K51p4q1o11j57m67Q0k12P06N06K34L89m35m12m42n63j10M97
$$ -915 -437 120 401 652 578 497 -114 -271 -738 -658 -870 -164 342 576 965 530 118 -324 -887 -997 -500
3355e00M36K61P13L3m98k25l19p87P4L41M95K41K26L03k20k56m37m43l90M34K09
$$ -500 -64 197 910 943 445 220 -99 -886 -812 -471 24 265 491 794 574 318 -119 -562 -952 -518 -309
3376c09L12O78o8K85m12n59n08k96J21K58N48N27N7m0N2n13o14j76J17m5O10L01
$$ -309 3 681 613 898 486 -73 -581 -877 -756 -498 50 577 634 594 646 133 -481 -657 -540 -585 25 326
3398C26N01J67m00m35o52k98NK65O10J52L83lq7l72n77k52j48J08M59N91J03L24
$$ 326 827 994 594 159 -493 -791 -786 -521 89 241 624 621 534 162 -415 -667 -815 -707 -248 343 446 770
3420G70k11m95l78l33k31K02M92K84P03J43n07r9n93k06j58P3J24L14M76K25J85
$$ 770 559 64 -314 -647 -878 -676 -184 100 803 946 439 340 -253 -459 -617 -544 -420 -106 370 595 780
3441G80n00l19l28l10J74L18K87M11Q9J79m66k42n69l28j9M76K82L40L74L39o09
$$ 780 280 -39 -367 -677 -503 -185 102 513 602 781 315 73 -496 -824 -843 -367 -85 255 629 968 359
3462C59k34o30k39N6r2P27M15J8L13j62n67k96j22k09J91M83K81M03j65L18n40
$$ 359 125 -505 -744 -688 -780 -53 362 380 693 531 -36 -332 -454 -663 -472 11 292 695 530 848 308
3483C08l55m55j05J53J99M96M80j60J14m14m68m20j4K33J82K66M04L59j20m53
$$ 308 -47 -502 -607 -454 -255 241 721 561 675 261 -207 -627 -641 -408 -226 40 444 803 683 230
3503B30k83m93j9k95M91K68P21r0K27n59n01k77J7n1qN45N28M1J34l04l69n74
$$ 230 -53 -546 -565 -860 -369 -101 620 530 757 198 -303 -580 -563 -614 -622 -77 451 492 626 322 -47 -621
3525f21k6L11r9K79L87N04J0l73j93k87l53k09j07N58K12O28j09j11n01k77l02
$$ -621 -647 -336 -435 -156 231 735 745 372 179 -108 -461 -670 -777 -219 -7 621 512 401 -100 -377 -679
3546f79P2J4Q9M90M32K28n2l93j89n63J71k85M56M86J27L05j24k90j48n96l48
$$ -679 -607 -593 -504 -14 418 646 594 201 12 -551 -380 -665 -209 277 404 709 585 295 147 -449 -797
3567g97P3N53K7L17N05j69k66r0m96k30k06K62O87J58K31j11j90k33p02K97n08
$$ -797 -724 -171 -144 173 678 509 243 153 -343 -573 -779 -517 170 328 559 448 258 25 -677 -380 -888
3588h88N17K41M42K10L8k15m15k21n73J91K58K82M81j1J62j34k13n16j68J40j5
$$ -888 -371 -130 312 522 560 345 -70 -291 -864 -673 -415 -133 348 337 499 365 152 -364 -532 -392 -407
3609d07N01Q1K14L70l25l25p2m25l36J10L97L88K68J39j02l50j59n20l9p3M96
$$ -407 94 175 389 759 434 109 37 -388 -724 -614 -217 171 439 578 476 126 -33 -553 -592 -665 -169
3630a69o4P90j24K48k79m03n99K9P0K29L73J24L28K93m21k99m21j76j18J17L01
$$ -169 -233 557 433 681 402 -1 -600 -571 -501 -272 101 225 553 846 425 126 -295 -471 -589 -472 -171
3651a71K78K14L15j39l84k54m91L17j51N09K03K41J48k51r8m15l71P1J48l4M42
$$ -171 107 321 636 497 113 -141 -632 -315 -466 43 246 487 635 384 286 -129 -500 -429 -281 -315 127
3672A27N02kl72o6k93k87j30m1N41J79K26K09n8m21j23l30l62o6L51N55J30L26
$$ 127 629 627 255 189 -104 -391 -521 -562 -21 158 384 593 535 114 -9 -339 -701 -767 -416 139 269 595
3694E95k51ol34m65j44O7K37L72K95K23R2l84o1n63m1l80K87L79kN52q2R2l90
$$ 595 344 338 4 -461 -605 -538 -301 71 366 589 681 297 236 -327 -368 -748 -461 -82 -84 468 386 478 88
3717H8n36J38m76M09L42J73L22J05L8o15n3k35j89K91j93N34J65M53j37n00j62
$$ 88 -448 -310 -786 -377 -35 138 460 565 603 -12 -65 -300 -489 -198 -391 143 308 761 624 124 -38
3738c8k72j09n4K87J83M02K65l87j76Q6n84l45L14M3L11M30J96k34j39j74l12
$$ -38 -310 -419 -473 -186 -3 399 664 277 101 187 -397 -742 -428 -385 -74 356 552 318 179 5 -307
3759c07m06J05J99N21J95L05k21L5l11m79l29K4N18Q6L96J38K60l02m39k49l99
$$ -307 -713 -608 -409 112 307 612 391 426 115 -364 -693 -669 -151 -65 331 469 729 427 -12 -261 -660
3780f60JJ74K63L50L28J39k44l08l06n6k52J77L32J6N15j90j27j46k28l55k0K79
$$ -660 -659 -485 -222 128 456 595 351 43 -263 -319 -571 -394 -62 -46 469 279 152 6 -222 -577 -597 -318
3802c18nN75J34LL9j42l32n69k3K29l8O88K5L6M8j98k23L7o82J20N73l6O21J89
$$ -318 -323 252 386 389 428 286 -46 -615 -638 -409 -447 241 266 302 350 152 -71 -34 -716 -596 -23 -59 562 751
3826G51r0m15l09l84J86j43J32K01K40L49q5K2n24k67l31N5L01K35J89K55K40
$$ 751 661 246 -63 -447 -261 -404 -272 -71 169 518 433 455 -69 -336 -667 -612 -311 -76 113 368 608
3847F08Rm82l1o29j38M47q3L53L34j0k65j62j16j97k18K19Q3K01M40J70j90L7
$$ 608 617 135 104 -525 -663 -216 -299 54 388 378 113 -49 -165 -362 -580 -361 -278 -77 363 533 343 380
3869C80k41n14j24oK91J75K77K54j47l63J02l3o16J23K39n0M43K41m4j87o2o27
$$ 380 139 -375 -499 -505 -214 -39 238 492 345 -18 84 51 -565 -442 -203 -253 190 431 387 200 138 -489
3891d89K3l71L56N52L23L45k91m59R8k66k93j44K20K22L31L07j7j09j28n18N0
$$ -489 -466 -837 -481 71 394 739 448 -11 87 -179 -472 -616 -396 -174 157 464 447 338 210 -308 -258
3912b58L0j70J20M16K16K78k77j41r2m56k62K56J87K95L07Nn4l08l12n7k0j26
$$ -258 -228 -398 -278 138 354 632 355 214 122 -334 -596 -340 -153 142 449 454 400 92 -220 -277 -297 -423
3934d23K27K29L66J12j09l06J6m58j13j97M76j6L77J21J99j49p0k03o96J72K45
$$ -423 -196 33 399 511 402 96 112 -346 -459 -656 -180 -196 181 302 501 352 282 79 -617 -445 -200
3955b00L4M52L02O1l82l76j50j98q9J74K38K80L86L3j33m23j83k28r4J24K81J04
$$ -200 -166 286 588 649 267 -109 -259 -457 -546 -372 -134 146 532 565 432 9 -174 -402 -496 -372 -91 13
3977A3L88N5k07J18l83k11k41J54P6L87K97J78k3l70k49m37J04N3k32P97J66M1
$$ 13 401 456 249 367 -16 -227 -468 -314 -238 149 446 624 601 231 -18 -455 -351 -298 -530 267 433 474
3999D74n8k40k66Q3n34K10LJ77N00Q2k95K17l32k96j23j17j25N76L18L33l21J94
$$ 474 416 176 -90 -7 -541 -331 -328 -151 349 431 136 353 21 -275 -398 -515 -640 -64 254 587 266 460
4021D60l76j80j94k06O1K46K37L71p5L0m69n5l91l4K11K66K31K83p4K97m59l15
$$ 460 84 -96 -290 -496 -435 -189 48 419 344 374 -95 -150 -541 -575 -364 -98 133 416 342 639 180 -135
4043a35M6k80j10K84J23N63r6K8k13k71l7l90J67M79j44L77O7j72J62m85l22o7
$$ -135 -89 -369 -479 -195 -72 491 395 423 210 -61 -98 -488 -321 158 14 391 458 286 448 -37 -359 -426
4065d26o4q4M58J85M27n6m7k00m66o6n5J09L24P0K00j42J74m19k82j64p6P1N05
$$ -426 -490 -574 -116 69 496 440 393 193 -273 -339 -394 -285 39 109 309 167 341 -78 -360 -524 -600 -529 -24
4088b4K62J80k1N1k08m74om0k2L90l6L37J55m23Q5l95j38J14k15L35K51K64k23
$$ -24 238 418 397 448 240 -234 -240 -280 -302 88 52 389 544 121 206 -189 -327 -213 -428 -93 158 422 199
4111A99L47m42j67k67k06J13K04K02O4O93k14l71k38j7j80P3k52L49L49K4J72
$$ 199 546 104 -63 -330 -536 -423 -219 -17 47 740 526 155 -83 -100 -280 -207 -459 -110 239 263 435
4132D35j66k23l56j15p1J49L29K19L04r5k22P7l99k46J75k20K51K66L31j20o6
$$ 435 269 46 -310 -425 -496 -347 -18 201 505 410 188 265 -134 -380 -205 -425 -174 92 423 303 237
4153B37k36om54J86o2J59J42J60M30m25J47m51n5n8q0K78J49J51K36k83j78r5
$$ 237 1 -5 -459 -273 -335 -176 -34 126 556 131 278 -173 -228 -286 -366 -88 61 212 448 165 -13 -108
4175a08j47L5k51K74J90J96J2L65k68j94l29j34j68L01K30J16K69K9l23j27l11
$$ -108 -255 -220 -471 -197 -7 189 201 566 298 104 -225 -359 -527 -226 4 120 389 418 95 -32 -343
4196c43l46L62K5K92L2M26J27j28j47m35n8l87L16k0N82K43j26k63k17o2l56l1
$$ -343 -689 -327 -302 -10 22 448 575 447 300 -135 -193 -580 -264 -284 298 541 415 152 -65 -127 -483 -514
4218e14K94J60K6K32L49k08j5l36l36lp0L86q1K21L01k8j74l56q1n6m89N93J76
$$ -514 -220 -60 -34 198 547 339 324 -12 -348 -351 -421 -35 -116 105 406 378 204 -152 -233 -289 -778 -185 -9
4241iM07q6J99l25l06k45j24J18k4L51k0O61k75j4n10J39k07j04J04L28L71j78
$$ -9 398 312 511 186 -120 -365 -489 -371 -395 -44 -64 597 322 308 -202 -63 -270 -374 -270 58 429 251
4263B51J86n7l46l15J27n4k34L30K95J84J02k48L2m80j71p6J71MM04K00J81k82
$$ 251 437 380 34 -281 -154 -208 -442 -112 183 367 469 221 253 -227 -398 -474 -303 -299 105 305 486 204
4285B04r0m16j73N9j41M13K00M7K57j52R6l37k9j73j95L85K0J98K31q6j64k55
$$ 204 114 -302 -475 -416 -557 -144 56 103 360 208 304 -33 -62 -235 -430 -45 -25 173 404 318 154 -101
4307a01K3j97q2j1K39J70M28Q9o03l6j17j67M1J20R7J89J98L09k89l48r3m7p1
$$ -101 -78 -275 -357 -368 -129 41 469 558 -45 -81 -198 -365 -324 -204 -107 82 280 589 300 -48 -141 -188 -259
4330b59j82O33p9r9M10j79J38p02pk3J96l7K61L82L8J18o20k17l2j3k85J78N76
$$ -259 -441 192 113 14 424 245 383 -319 -326 -349 -153 -190 71 453 491 609 -11 -228 -260 -273 -558 -380 196
4353A96K92j71N7n3k93k24K8l07M5L68J84L68k30J83l30l73k26o7O0M75j9M79
$$ 196 488 317 374 321 28 -196 -168 -475 -430 -62 122 490 260 443 113 -260 -486 -553 -493 -18 -37 442
4375D42Q8l53p3n34K46k16J08L11L45j19o9P4J9m75m1J7K8J58J21M4J53J18k00
$$ 442 530 177 104 -430 -184 -400 -292 19 364 245 176 250 269 -206 -247 -230 -202 -44 77 121 274 392 192
4398A92k85j98j65K59J56K32P2K98q8l22Jo57l06O70p7K84M33k36j20J09j93l76
$$ 192 -93 -291 -456 -197 -41 191 263 561 473 151 152 -505 -811 -141 -218 66 499 263 143 252 59 -317
4420c17m5q7K81j19P02k65J89j90r2m1o09K08j74O18K75O4QK8l20j57j04k63K19
$$ -317 -362 -449 -168 -287 415 150 339 149 57 16 -593 -385 -559 59 334 398 406 434 114 -43 -147 -410 -191
4443a91Q2L90j14K53j75K4m72k10J20K05k3J97n1K76Q0k2p64K04k77J45r7M88
$$ -191 -109 281 167 420 245 269 -203 -413 -293 -88 -111 86 35 311 391 369 -395 -191 -468 -323 -420 68
4465F8L39J44j75k00j78k63j09r5K10J27K97J63R8k30k82l14K67l29q5N21J06
$$ 68 407 551 376 176 -2 -265 -374 -469 -259 -132 165 328 426 196 -86 -400 -133 -462 -547 -26 80
4486H0J37L15r8l82l97j90M35m69Q37K30m69R9K34l97r2j19k76N05j02K18K46
$$ 80 217 532 434 52 -345 -535 -100 -569 268 498 29 128 362 -35 -127 -246 -522 -17 -119 99 345
4507C45j74K10j84l94q7J33l27J35L54M52j86K4k99k79J23l4l62L63J95L58M4
$$ 345 171 381 197 -197 -284 -151 -478 -343 11 463 277 301 2 -277 -154 -188 -550 -187 8 366 410
4528D10j75n8k67j66j60N9L21K74p1K23n2j07l88j39m7k56J57K87L69J23j09J5
$$ 410 235 177 -90 -256 -416 -357 -36 238 167 390 338 231 -157 -296 -343 -599 -442 -155 214 337 228 243
4550B43k31j94o0J44j72k06N07J78J34j13k42M0j83n30K46J06L73K60r5J85j36
$$ 243 12 -182 -242 -98 -270 -476 31 209 343 230 -12 28 -155 -685 -439 -333 40 300 205 390 254
4571B54m79j32J6K73N8RL68O8k92l0k25j11p7r0J85K66J53J02L4j84j16l85l11
$$ 254 -225 -357 -341 -68 -10 -1 367 435 143 113 -112 -223 -300 -390 -205 61 214 316 350 166 50 -335 -646
4594f46J30M20q2K91M49l83L41m35k29l10K49j81P46m5q0K35j22k15m12p4mQ3
$$ -646 -516 -96 -178 113 562 179 520 85 -144 -454 -205 -386 360 315 235 470 348 133 -279 -353 -357 -274
4616b74K69K20r2J71j42K44o15j78r4J11L65K94l8l15M07j46l05j82j51N9L60
$$ -274 -5 215 123 294 152 396 -219 -397 -491 -380 -15 279 241 -74 333 187 -118 -300 -451 -392 -32
4637c2J99J80m4J08o46J39oj74J81j28J18L72J3j1k03j30j0m51J10K13J34L27
$$ -32 167 347 303 411 -235 -96 -102 -276 -95 -223 -105 267 280 269 66 -64 -74 -525 -415 -202 -68 259
4659B59j71K12k07n3k41r9Q4L34j94J60O7L5Q7j79l84k63K83L9J91K14M52k55
$$ 259 88 300 93 40 -201 -300 -216 118 -76 84 151 186 273 94 -290 -553 -270 -231 -40 174 626 371
4681C71p8k46o1n57K5Q6M71J85K76j64k48j36J67k17m12K35J67L07j3Q6q4qk70
$$ 371 293 47 -14 -571 -546 -460 11 196 472 308 60 -76 91 -126 -538 -303 -136 171 158 244 160 152 -118
4704a18k36j50L47L36o0R7J60J4l39O9j69k19l0r6L10L67K49K7j89l10m09P7m8
$$ -118 -354 -504 -157 179 119 216 376 390 51 120 -49 -268 -298 -394 -84 283 532 559 370 60 -349 -272 -320
4727c20K70k59M71J11N8M6q5l88m43J17J96K23J66K61l6l44j2j16l19P2k26L17
$$ -320 -50 -309 162 273 331 377 292 -96 -539 -422 -226 -3 163 424 388 44 32 -84 -403 -331 -557 -240
4749b40L93k9K98j89J8m37j28q2m9J63L93K29k11J09j92O5n14KQ5J75K25J92J38
$$ -240 153 124 422 233 251 -186 -314 -396 -445 -282 111 340 129 238 46 111 -403 -401 -316 -141 84 276 414
4772D14J09o43O8k67O6N6J52k7Q6L75l28N1k85p1N2j66L1J83M28R6j9l41K27n96
$$ 414 523 -120 -52 -319 -253 -197 -45 -72 14 389 61 112 -173 -244 -192 -358 -327 -144 284 380 361 20 247 -349
4796c49M0L4k13O26Q1j10K79m31j44j5j92Q1J97l9J86J44K2j58mm67J60P9l98
$$ -349 -309 -275 -488 138 219 109 388 -43 -187 -202 -394 -313 -116 -155 31 175 197 39 35 -432 -272 -193 -591
4819e91L47L33J10m7L18n01l71L67l34L9J85J99K98K88k32k87k5j48l52J99j76
$$ -591 -244 89 199 152 470 -31 -402 -35 -369 -330 -145 54 352 640 408 121 96 -52 -404 -205 -381
4840c81L77K75P0P7K1n92J39j63P3N0J92J27O4j99M4p4l11j02p5K12L68O6n1L2
$$ -381 -4 271 341 418 439 -153 -14 -177 -104 -54 138 265 329 130 174 100 -211 -313 -388 -176 192 258 207 239
4864B39k20j30J54l84j26pN57P9K1K32l40M0l59kj23O7J29M40k60P1L62k60l42
$$ 239 19 -111 43 -341 -467 -474 83 162 183 415 75 115 -244 -246 -369 -302 -173 267 7 78 440 180 -162
4887a62l21K84k58K18N31j11Q4m8j90R0k52k58m0J17L16M15j40R6o6m51Q6l01
$$ -162 -483 -199 -457 -239 292 181 265 217 27 117 -135 -393 -433 -316 0 415 275 371 305 -146 -60 -361
4909c61K30k88N09J37m6J70k01k25k56RL06j08O9L03J36m2j0j35k69k66j1J88
$$ -361 -131 -419 90 227 181 351 150 -75 -331 -322 -16 -124 -55 248 384 342 332 197 -72 -338 -349 -161
4931a61K4L26j1L36n06K11l57j91J67j62O2L20K99m4j15k94N2j90j77Q1L59j63
$$ -161 -137 189 178 514 8 219 -138 -329 -162 -324 -262 58 357 313 198 -96 -44 -234 -411 -330 29 -134
4953a34K83L67j06m31L6p9k69j43K38K37J73J08J24m17r4l17l3L31k98L15N07
$$ -134 149 516 410 -21 15 -64 -333 -476 -238 -1 172 280 404 -13 -107 -424 -457 -126 -424 -109 398
4974C98j01j87J23n26K14l40J6l1L30J06K60M03l12r2n39J5j00J76K32J33J24
$$ 398 297 110 233 -293 -79 -419 -403 -434 -104 2 262 665 353 261 -278 -263 -363 -187 45 178 302
4995C02k45J61Pk38k84Q9l04M41K58j14M78l69O5l76j45m0P4P4L37P8j78K54K00
$$ 302 57 218 225 -13 -297 -208 -512 -71 187 73 551 182 247 -129 -274 -314 -240 -166 171 249 71 325 525
5018E25o70k07K5K31j78K61J97K15J34l71k82j82l2j42N36L4j2L58j22J58k74
$$ 525 -145 -352 -327 -96 -274 -13 184 399 533 162 -120 -302 -334 -476 60 94 82 440 318 476 202
5039B02l20k46O2L0K87J4J09J75N0j59k84j54l7K96k21K77J43K39l7r3l92j25
$$ 202 -118 -364 -302 -272 15 29 138 313 363 204 -80 -234 -271 25 -196 81 224 463 426 333 -59 -184
5061a84k35J93K4M71j46N14l45l56K8k71K53l49L27J58KJ48m4l21K8n14J96K79
$$ -184 -419 -226 -202 269 123 637 292 -64 -36 -307 -54 -403 -76 82 84 232 188 -133 -105 -619 -423 -144
5083a44k0K41J25j6J00K1k67l05Q6J12k18N18n9m1J77k65k7l93J16q1l8L97L88
$$ -144 -164 77 202 186 286 307 40 -265 -179 -67 -285 233 174 133 310 45 18 -375 -259 -340 -378 19 407
5106D07k42K1K23l20j76l22Q6J75L02J11J9nj42p8k58k99J13J41L57P3l6Q9l3
$$ 407 165 186 409 89 -87 -409 -323 -148 154 265 284 279 137 59 -199 -498 -385 -244 113 186 150 239 206
5129B06n7k17r3q1q8L65o8J74J38j1rl72l16J02KK43P3L00N7j95j44J82m70NP3
$$ 206 149 -68 -161 -242 -330 35 -33 141 279 268 259 -113 -429 -327 -325 -82 -9 291 348 153 9 191 -279 -274 -201
5154b01%J47M26k33J78k09J52m79k24J84P7N5L23j40K59n9j68l9j38l87K17N04
$$ -201 -201 -54 372 139 317 108 260 -219 -443 -259 -182 -127 196 56 315 256 88 49 -89 -476 -259 245
5176B45k28L94K33j90n98L5j93qJ87J61l59O98j99J22m4k50j47R3o4O2J44N7L05
$$ 245 17 411 644 454 -144 -109 -302 -310 -123 38 -321 377 178 300 256 6 -141 -48 -112 -50 94 151 456
5199D56k90k55O0l66P3n9K23L99J91j6L2n1m72k35l4P0K05O9K70jom20J92o2m81
$$ 456 166 -89 -29 -395 -322 -381 -158 241 432 416 448 397 -75 -310 -344 -274 -69 0 270 269 263 -157 35 -27 -508
5224e08M08k25L78r4L93j39r8m5k99M1j61M06j71L80K91l05K04l71k44P9l68K71
$$ -508 -100 -325 53 -41 352 213 115 70 -229 -188 -349 57 -114 266 557 252 456 85 -159 -80 -448 -177
5246a77QJ91k3N88m26l09O3j10j25K01K6N57k24j6q3j51j4j19Q6k17P8P9k7N36
$$ -177 -169 22 -1 587 161 -148 -85 -195 -320 -119 -93 464 240 224 141 -10 -24 -143 -57 -274 -196 -117 -144 392
5270C92j87P6q6k55l00J26O8K71L4K94j18j24k46m0j53j7J03J18K36o6L39n1l86
$$ 392 205 281 195 -60 -360 -234 -166 105 139 433 315 191 -55 -95 -248 -265 -162 -44 192 126 465 414 28
5293B8j88Kl44M20K52o2L01n5K3m82K66l62k65J19M45Q9K58O9k53k16k21j84J19
$$ 28 -160 -158 -502 -82 170 108 409 354 377 -105 161 -201 -466 -347 98 187 445 514 261 45 -176 -360 -241
5316b41K23j06J50K49J48j15q2j43m46k15K85K00J00L14J0r6n3j61p2m29L00p7
$$ -241 -18 -124 26 275 423 308 226 83 -363 -578 -293 -93 7 321 331 235 182 21 -51 -480 -180 -257
5338b57L14k5L05q6P7l20p3k20K05J05L7K30PJ55R0l53j95k74o8K62N7K49m5K00
$$ -257 57 32 337 251 328 8 -65 -285 -80 25 62 292 299 454 544 191 -4 -278 -346 -84 -27 222 177 377
5362C77k01j21k68j54K98k43L92J47R9k25K13k31l81P1l0J57n8K68J74K25k68
$$ 377 176 55 -213 -367 -69 -312 80 227 326 101 314 83 -298 -227 -257 -100 -158 110 284 509 241
5383B41J25k47m04O9j20L71J02Q2o6N7J7l84J6l00J43M04J42m2L59l92K7k5j4
$$ 241 366 119 -285 -216 -336 35 137 219 153 210 227 -157 -141 -441 -298 106 248 206 565 173 200 175 161
5406A61o14L96j08J49K62k96L85k77p6k69R9K6k9L04J2L03l65J78l28j76K6j54
$$ 161 -453 -57 -165 -16 246 -50 335 58 -18 -287 -188 -162 -191 113 125 428 63 241 -87 -263 -237 -391
5428c91L54m6M26J76j46K7l98j91k0j54J91J72K74Q0R9j26j74N2o44K98j82K67
$$ -391 -37 -83 343 519 373 400 2 -189 -209 -363 -172 0 274 354 453 327 153 205 -439 -141 -323 -56
5450e6M08k30K62k68q5j44k09J48o0R3K98L4J47k2m09J14l52J06K9q8M81j32K95
$$ -56 352 122 384 116 31 -113 -322 -174 -234 -141 157 191 338 316 -93 21 -331 -225 -196 -284 197 65 360
5473C60j05j12L6k82k99J58K6Q0K24J61K35q1m14k90Jm2q3L97K05j12K07j6n8
$$ 360 255 143 179 -103 -402 -244 -218 -138 86 247 482 401 -13 -303 -302 -344 -427 -30 175 63 270 254 196
5496A96l22k6o8j1l8K38L17k50K99j26l37J01m04L00p6K79J9L09j02l49L6j36
$$ 196 -126 -152 -220 -231 -269 -31 286 36 335 209 -128 -27 -431 -131 -207 72 91 400 298 -51 -15 -151
5518a51l64L65p0L48J01J74j04k09l43k6O1l3K41J32rR3M31o49Oj04j4J20j48
$$ -151 -515 -150 -220 128 229 403 299 90 -253 -279 -218 -251 -10 122 113 206 637 -12 -6 -110 -124 -4 -152
5541a52J32M14r7N0p2k30k35J77m5l9K17n7K08q0K69m28k72lj69L2M21j32L39
$$ -152 -20 394 297 347 275 45 -190 -13 -58 -97 120 63 271 191 460 32 -240 -243 -412 -380 41 -91 248
5564B48K82l48q5j74j88K31l29K98K31j6L20j98m67K42l28j14K73p5J12K84J62
$$ 248 530 182 97 -77 -265 -34 -363 -65 166 150 470 272 -195 47 -281 -395 -122 -197 -85 199 361
5585C61j80o6k85n0j78O3J75J84J60K89m57M6j65j19j21j92L74K04L46P4j37k73
$$ 361 181 115 -170 -220 -398 -335 -160 24 184 473 16 62 -103 -222 -343 -535 -161 43 389 463 326 53
5607E3j82PJ3r2p7j35N48J47j8j33L99n83l18P7jL14O2J63j00L9L1o65K93o3M5
$$ 53 -129 -122 -109 -201 -278 -413 135 282 264 131 530 -53 -371 -294 -295 19 81 244 144 183 214 -451 -158 -221 -176
5632a76kL76J43n00J99N1k03j99p1K60J82MJ57M9o4k3j87k9l70J86J46K35k82
$$ -176 -178 198 341 -159 40 91 -112 -311 -382 -122 60 64 221 270 206 183 -4 -33 -403 -217 -71 164 -118
5655a18N53k0k87n08N8P7MK48k03O01k16j31R5J27p09K69l1j97L17J72Q7qJ33
$$ -118 435 415 128 -380 -322 -245 -241 7 -196 405 189 58 153 280 -429 -160 -191 -388 -71 101 188 180 313
5678C13m39m1Jk68J93M86L9J35j12j07j41k94j15l4K7L98L6K21k2q8L1l20k2k54
$$ 313 -126 -167 -166 -434 -241 245 284 419 307 200 59 -235 -350 -384 -357 41 77 298 276 188 219 -101 -123 -377
5702c77k11K83N14N4J97l65Q4l51n0j8j7J31J4N32l52L29k42k77m9k04Q5J20p5
$$ -377 -588 -305 209 263 460 95 179 -172 -222 -240 -257 -126 -112 420 68 397 155 -122 -171 -375 -290 -170 -245
5725b45N79q0l0J90n81J08k56R0LO9K26K87L5j8l48Rj02m80K58L79n6K51k87m
$$ -245 334 254 224 414 -167 -59 -315 -225 -222 -153 73 360 395 377 29 38 -64 -544 -286 93 37 288 1 -3
5749cJ38j60k42L2o3L79j56J11J80j59J43k06k51l4L55k50K43J83N5m41K24m26
$$ -3 135 -25 -267 -235 -298 81 -75 36 216 57 200 -6 -257 -291 64 -186 57 240 295 -146 78 -348
5771c48J25j25k7K45J42K74P9k85K2n6l44PJ24J89j7M64k15J02k35j23k72J90
$$ -348 -223 -348 -375 -130 12 286 365 80 102 46 -298 -291 -167 22 5 469 254 356 121 -2 -274 -84
5793h4N0k45M98j84L5J70k34j16j72n7Q0O3K16K31M9J20K19o62j45k0P2o9J69
$$ -84 -34 -279 219 35 70 240 6 -110 -282 -339 -259 -196 20 251 300 420 639 -23 -168 -188 -116 -185 -16
5816a6J00K32j21J60k53k42k78L6Q1J59L29j04q9J04L5Pm78o2K93J76r9L44j49
$$ -16 84 316 195 355 102 -140 -418 -382 -301 -142 187 83 -6 98 133 140 -338 -400 -107 69 -30 314 165
5839A65o5K45l33l25r6P0K59k98O03L3o6j75L4l09J55P1k39M4M61o2q8P2k24j70
$$ 165 100 345 12 -313 -409 -339 -80 -378 225 258 192 17 51 -258 -103 -32 -271 -227 234 172 84 156 -68 -238
5863b38j00L14r4J79m5L33J0J51m49j93k61J43K94j86K00K78k88K65k69k0l47
$$ -238 -338 -24 -118 61 16 349 359 510 61 -132 -393 -250 44 -142 58 336 48 313 44 24 -323
5884c23k80M62k9J01J39j8J39l09o5mj79L57k70M01J47K12k41r7k52m2M7l15L13
$$ -323 -603 -141 -170 -69 70 52 191 -118 -183 -187 -366 -9 -279 122 269 481 240 143 -109 -151 -104 -419 -106
5907a06K05K46j47M7j15k60L3k14J54j23M28K6J90K1P3k35m91Qp1K19O1L42J78
$$ -106 99 345 198 245 130 -130 -97 -311 -157 -280 148 174 364 385 458 223 -268 -260 -331 -112 -51 291 469
5930D69l24o3k26M7l09P6N0L74N3k5J40l7j13O1n46L3L91J17j39J97j24K06k75
$$ 469 145 82 -144 -97 -406 -330 -280 94 147 122 262 225 112 173 -373 -340 51 168 29 226 102 308 33
5953C3j4j46l05L58o5L34J08j08k2j79q6L9N6m47M00p5K35J44Po4k2j72j38j32
$$ 33 19 -127 -432 -74 -139 195 303 195 173 -6 -92 -53 3 -444 -44 -119 116 260 267 203 181 9 -129 -261
5977b61K25J8K16R2Kl8j00l45N1J09j71L47j76K21K35k02k30q6l09pM02L5j08
$$ -261 -36 -18 198 290 292 254 154 -191 -140 -31 -202 145 -31 190 425 223 -7 -93 -402 -409 -7 28 -80
6000h0L12K00k54k08j31r4J06J28l48M30J74j5l1ql47J72n34M24O6R5N6J19j61
$$ -80 232 432 178 -30 -161 -255 -149 -21 -369 61 235 220 189 181 -166 6 -528 -104 -38 57 113 232 71
6023G1j77J29l07J44J86j45K26j55K41j01K2j78k11J68l37L98k87N02j31L64l08
$$ 71 -106 23 -284 -140 46 -99 127 -28 213 112 134 -44 -255 -87 -424 -26 -313 189 58 422 114
6044A14j06k62J14k01L25P7o7L85k37j10j65r7l03J99NM21R0l2L81n19o2p1k01
$$ 114 8 -254 -140 -341 -16 61 -6 379 142 32 -133 -230 -533 -334 -329 92 182 150 531 12 -50 -121 -322
6067c22J90J3K55p7K26J1k04K18m93j38QPJ08L07kL6k6L1k48q1j05r9K78J99N7
$$ -322 -132 -119 136 59 285 296 92 310 -183 -321 -313 -306 -198 109 107 143 117 148 -100 -181 -286 -385 -107 92 149
6092A49pR2K5k71k01j56r9N62o5J0k6K45q5k41j21o0J04M9J86k10N38m46J3k9
$$ 149 142 234 259 -12 -213 -369 -468 94 29 39 13 258 173 -68 -189 -249 -145 -96 90 -120 418 -28 -15 -44
6116d4k43j24K28k75M20J75K08Kk35q0j08j55n0K74L0J0j5M4J83j78p8j64j90
$$ -44 -287 -411 -183 -458 -38 137 345 347 112 32 -76 -231 -281 -7 23 33 18 62 245 67 -11 -175 -365
6139c65K37K2J88O1J65k22J15j14l19L2o7L79j38J84K08k43L23k17l70l17K50
$$ -365 -128 -106 82 143 308 86 201 87 -232 -200 -267 112 -26 158 366 123 446 229 -141 -458 -208
6160b08j94L11K61L09l89J14k84R2j68jj34K16K92L7n0N6r2r7j62J01m00L54K40
$$ -208 -402 -91 170 479 90 204 -80 12 -156 -157 -291 -75 217 254 204 260 168 71 -91 10 -390 -36 204
6183B04R0k5k28J30k14k66k0M84j22r1J78J15j97J34l33K37j64j63K87L9L81j70
$$ 204 294 269 41 171 -43 -309 -329 155 33 -58 120 235 38 172 -161 76 -88 -251 36 75 456 286
6205B86j92K36m69l54K62J99j42J89K08j13Rj9J88n35q8J56K5MN80l8l0k78k46
$$ 286 94 330 -139 -493 -231 -32 -174 15 223 110 119 100 288 -247 -335 -179 -154 -150 430 392 362 84 -162
6228a62K29j33k92M53k3J42R6j37Jl7j91r1J25k05M08O2M0j54j59J04j6k43r3
$$ -162 67 -66 -358 95 72 214 310 173 174 137 -54 -145 -20 -225 183 245 285 131 -28 76 60 -183 -276
6251b76R8J56J79j4pK99j72l69n7R6R2l2K53l2L1l2j89J5k81j7R0k3L10J02k3
$$ -276 -178 -22 157 143 136 435 263 -106 -163 -67 25 -7 246 214 245 213 24 39 -242 -259 -169 -192 118 220 197
6276A97K37m23J63k58o1J16j71K94m6L36k08k7k65M5K6r2J71j14K60j00j3q8Q3
$$ 197 434 11 174 -84 -145 -29 -200 94 48 384 176 149 -116 -71 -45 -137 34 -80 180 80 67 -21 62
6299F2l7m33K61l3N9L48JJ25j23j14l42J39j33J78k25L75Q2q0K29k80M8j67j8
$$ 62 25 -408 -147 -180 -121 227 228 353 230 116 -226 -87 -220 -42 -267 108 190 110 339 59 107 -60 -78
6322g8l20K5L36L48p8k90JJ18l19l1K65j12K47L56j41j27K3k22o6j47j64L02N6
$$ -78 -398 -373 -37 311 233 -57 -56 62 -257 -288 -23 -135 112 468 327 200 223 1 -65 -212 -376 -74 -18
6345a8J32K63j14j95N6k23q8j7J3J69M8M71j23k86m67J48j88J36m4L11J81r9L67
$$ -18 114 377 263 68 124 -99 -187 -204 -191 -22 26 497 374 88 -379 -231 -419 -283 -327 -16 165 66 433
6368D33l73J4Kl34M3R0n5L42J52r0l3l32J3n3j73Q8L84m7J08N4r4k07j31J69J8
$$ 433 60 74 76 -258 -215 -125 -180 162 314 224 191 -141 -128 -181 -354 -266 118 71 179 233 139 -68 -199 -30 -12
6393a2Rk44J21R2K81j29o8q6j54K38k99Q3qJ87J26o2j39j53J67j66J97l65L54
$$ -12 -3 -247 -126 -34 247 118 50 -36 -190 48 -251 -168 -176 11 137 75 -64 -217 -50 -216 -19 -384 -30
6416c0K65j97J31o8J0l04K25l88J33Q5L53M8J5k41j44k80M77l19K81k0O8O9J33
$$ -30 235 38 169 101 111 -193 32 -356 -223 -138 215 263 278 37 -107 -387 90 -229 52 32 100 169 302
6439C02j71L3m00Q1j98L44k56K49L56K1k55k40J33%n7m47L13L53r8K87k9k91m8
$$ 302 131 164 -236 -155 -353 -9 -265 -16 340 361 106 -134 -1 -1 -58 -505 -192 161 63 350 321 30 -18
6462a8j47j55J32L9M35n4j2nl4m79o5K35O6m4K24q3K05Q1k69n5o6k05l8K16O6
$$ -18 -165 -320 -188 -149 286 232 220 215 181 -298 -363 -128 -62 -106 118 35 240 321 52 -3 -69 -274 -312 -96 -30
6487c0%J47m4j7k33j19J81j70p5L22J45R5J81p1l34Q2m81K57J21m8P9L09l4j69
$$ -30 -30 117 73 56 -177 -296 -115 -285 -360 -38 107 202 383 312 -22 60 -421 -164 -43 -91 -12 297 263 94
6511I4k80rJ0j63L25j93K92JJ97n4k28q1o0k61K62M15q9RO4q8J69m22oj19j10
$$ 94 -186 -195 -185 -348 -23 -216 76 77 274 220 -8 -89 -149 -410 -148 267 178 187 251 163 332 -90 -96 -215 -325
6536c25R9L92p6oJ93k63k28n2O4L1J46n9K16J05J7j39R8k68k1m6m7O4j81L45J38
$$ -325 -226 166 90 84 277 14 -214 -266 -202 -171 -25 -84 132 237 254 115 213 -55 -76 -122 -169 -105 -286 59 197
6561A97J74k89Kl5m39K02K2N21J19j19l6j70l05j5q7J31M8Q8j36J49r8M19m01
$$ 197 371 82 84 49 -390 -188 -166 355 474 355 319 149 -156 -171 -258 -127 -79 9 -127 22 -76 343 -58
6584e8q0j08q4M76l36R6J48L29k14m09J51J15k01K41J52j98K32R5k45k75l65M93
$$ -58 -138 -246 -330 146 -190 -94 54 383 169 -240 -89 26 -175 66 218 20 252 347 102 -173 -538 -45
6606d5J63j92PN9K34J8k22j24L21o97K96J60K57m40L83K63l34m67J00j14L6J29
$$ -45 118 -74 -67 -8 226 244 22 -102 219 -478 -182 -22 235 -205 178 441 107 -360 -260 -374 -338 -209
6628b09K81K42j72k25P5J62j46j8j62k31M14P4K4Q5J02k35j11L4l52K9L05J30
$$ -209 72 314 142 -83 -8 154 8 -10 -172 -403 11 85 109 194 296 61 -50 -16 -368 -339 -34 96
6650I6m2K24j29j74M5j37qJ02j70J92K27O6kK9l10j71O6m3j50K67K86l37L81j29
$$ 96 54 278 149 -25 20 -117 -125 -23 -193 -1 226 292 290 319 9 -162 -96 -139 -289 -22 264 -73 308 179
6674A79j69l5j33q8N2K38K07k34J18R0j35n23J36q3K5K27N43l45J90qk35k29M1
$$ 179 10 -25 -158 -246 -194 44 251 17 135 225 90 -433 -297 -380 -355 -128 415 70 260 252 17 -212 -171
6697a71j23J75R4J64p1K08j63k90K10q7m5j64L09J28k2j5j36j9P9N5j11k12Q2
$$ -171 -294 -119 -25 139 68 276 113 -177 33 -54 -99 -263 46 174 152 137 1 -18 61 116 5 -207 -125
6720a25j5L44J6K12k96k26k58K55n9K11J02r9K61j26l6l38q3P8j04N2J33K10M8
$$ -125 -140 204 220 432 136 -90 -348 -93 -152 59 161 62 323 197 161 -177 -260 -182 -286 -234 -101 109 157
6743A57R2j34j59J3l8j73L2J69J24L44m34q1L79k30Q5n46Q3L35L1L10k37J12k52
$$ 157 249 115 -44 -31 -69 -242 -210 -41 83 427 -7 -88 291 61 146 -400 -317 18 49 359 122 234 -18
6766a8J61m62J1K31q6J74K06n7k03n1n0N4q3J82O3j00J67l0qJ14m60Q2Ok1p5J46
$$ -18 143 -319 -308 -77 -163 11 217 160 -43 -94 -144 -90 -173 9 72 -28 139 109 101 215 -245 -163 -157 -178 -253 -107
6792a07N1L19N5j63j68j04k58K74j04K26j8K20j97J03L9j0m80K77j13J67K90M5
$$ -107 -56 263 318 155 -13 -117 -375 -101 -205 21 3 223 26 129 168 158 -322 -45 -158 9 299 344
6814C44k62J49k17j90R4N2j53L50m6n4K31k81K30k98j82K63j04QK09o4K46j59
$$ 344 82 231 14 -176 -82 -30 -183 167 121 67 298 17 247 -51 -233 30 -74 -66 143 79 325 166
6836A66j33o7K1k61J6K63O8K00j53L9l24J03j8l00K85o6J01K30j01K17R1m27j11
$$ 166 33 -34 -13 -274 -258 5 73 273 120 159 -165 -62 -80 -380 -95 -161 -60 170 69 286 377 -50 -161
6859a61N5J0o2P5J37lJ33p1J77k29m22J35K46K9l9O0J08k1k01j01K0l48L53J05
$$ -161 -106 -96 -158 -83 54 51 184 113 290 61 -361 -226 20 49 10 70 178 157 -44 -145 -125 -473 -120 -15
6883a5Q5mP1L0o7J85n57K7j11Q3M69k06J41j68L70n54m6j9J67K0K39M3J90k76
$$ -15 70 66 137 167 100 285 -272 -245 -356 -273 196 -10 131 -37 333 -221 -267 -286 -119 -99 140 183 373 97
6907I7k6p7j02m4l36M14k33O84j69J6M7j01j89r4lQ4r0K21o6J7J70j77j15k5j17
$$ 97 71 -6 -108 -152 -488 -74 -307 377 208 224 271 170 -19 -113 -116 -32 -122 99 33 50 220 43 -72 -97 -214
6932b14K02k08K73J06O8k47R6J69k17j02O3p2J01J57M7J47l49j6p4p6K7J37J33
$$ -214 -12 -220 53 159 227 -20 76 245 28 -74 -11 -83 18 175 222 369 20 4 -70 -146 -119 18 151
6955A51P0j12K34m98J34q1J39j47K29k49K56k72K74J29m03J27KJ03j7j16J30O0
$$ 151 221 109 343 -155 -21 -102 37 -110 119 -130 126 -146 128 257 -146 -19 -17 86 69 -47 83 143
6977A43j89M4J3k80j95N08M1J56o6N8l1j31j5l80J53J00O1N9L25k36K59m86J38
$$ 143 -46 -2 11 -269 -464 44 85 241 175 233 202 71 56 -324 -171 -71 -10 49 374 138 397 -89 49
7000D9k22k0N2k0j5M15r1O7j40j79J52p4K5k31J40L08ROj22k6k06p3MJ70r1J79
$$ 49 -173 -193 -141 -161 -176 239 148 215 75 -104 48 -26 -1 -232 -92 216 225 231 109 83 -123 -196 -192 -22 -113 66
7026F6R6k27K95k07J44k16k29K31K13j71k23N60j89q0L9l16n4J02J43K27j10Q7
$$ 66 162 -65 230 23 167 -49 -278 -47 166 -5 -228 332 143 63 102 -214 -268 -166 -23 204 94 181
7048A81J24k77m7j72j43K33r0K93k25K43J86j71k72N3Mk22oL33J14J27j83p5j00
$$ 181 305 28 -19 -191 -334 -101 -191 102 -123 120 306 135 -137 -84 -80 -302 -308 25 139 266 83 8 -92
7071i2O4l37J93K36O4K23m3q3K1j16k4k27k13k5K34L4L80n8k68K64j59k39j57
$$ -92 -28 -365 -172 64 128 351 308 225 246 130 106 -121 -334 -359 -125 -91 289 231 -37 227 68 -171 -328
7094c28K81k70K92J8J43J75m84q1J52j58j48K26K10N0j8P6l5n0j33k7p7k6J05
$$ -328 -47 -317 -25 -7 136 311 -173 -254 -102 -260 -408 -182 28 78 60 136 101 51 -82 -109 -186 -212 -107
7117a07J66M0J61m6j47l52l3K35O1j08J46J44j1q2j93K09l34K21l7j35J20J90
$$ -107 59 99 260 214 67 -285 -318 -83 -22 -130 16 160 149 67 -126 83 -251 -30 -67 -202 -82 108
7139A08Q5k21N2q9pk12L00k7j49M60k69J32j13m1o7N6K13l09J59M7k52N76k21
$$ 108 193 -28 24 -65 -72 -284 16 -11 -160 300 31 163 50 9 -58 -2 211 -98 61 108 -144 432 211
7162B11l36K8M0N4J42p1j44M76j30l14Q7L3l0o6j43J04J9J6K48n2p1j53O7j90
$$ 211 -125 -97 -57 -3 139 68 -76 400 270 -44 43 76 46 -20 -163 -59 -40 -24 224 172 101 -52 15 -175
7186a75J39M5RK38l05L0J32o3n18K77N6J72J54k39K65J13l10j79j76O09m05j5
$$ -175 -36 9 18 256 -49 -19 113 50 -468 -191 -135 37 191 -48 217 330 20 -159 -335 274 -131 -146
7208a46J7K54J58rj95j0j69j85M9J46J29J21q3J3m9J67j97k44K81l09L36R1k04
$$ -146 -129 125 283 274 79 69 -100 -285 -236 -90 39 160 77 90 41 208 11 -233 48 -261 75 166 -38
7231c8J33l0k00j0J2k21J30M87j28J3K25l70n7L16M7k00l36K77n7J4K21R3n31
$$ -38 95 65 -135 -145 -133 -354 -224 263 135 148 373 3 -54 262 309 109 -227 50 -7 7 228 321 -210
7254b10M2k2m2J15k22M45o8oJ22j89Rl20K73q6Q4k0L66j67J22j64l67O2o8L25
$$ -210 -168 -190 -232 -117 -339 106 38 32 154 -35 -26 -346 -73 -159 -75 -95 271 104 226 62 -305 -243 -311 14
7278A4j48K5J90K4N7N4l61J69J90l08k15K55K66k04L06N2l81l80M39l61oO04j76
$$ 14 -134 -109 81 105 162 216 -145 24 214 -94 -309 -54 212 8 314 366 -15 -395 44 -317 -323 281 105
7301A05J32j09j58j1J18l49J03o5J86K08J81k63n2M2L8k48K1j26K38J30J11j41
$$ 105 237 128 -30 -41 77 -272 -169 -234 -48 160 341 78 26 68 106 -142 -121 -247 -9 121 232 91
7323I1j79l4J32m23Q0K06J4Q0R7p1J6K08k86K9j69K53O0o1l3K74J43m38p6m15
$$ 91 -88 -122 10 -413 -333 -127 -113 -33 64 -7 9 217 -69 -40 -209 44 104 43 10 284 427 -11 -87 -502
7347e02J39K64JK13K4J80l89N0O5J42l91k0J86K05Q2J35k73O8l24l9J51j1K16
$$ -502 -363 -99 -98 115 139 319 -70 -20 45 187 -204 -224 -38 167 249 384 111 179 -145 -184 -33 -44 172
7370A72r9L68k59l5K46k76k06n1l3L7J17K46j33J44l35K02q6j62M1j65P9K20p8
$$ 172 73 441 182 147 393 117 -89 -140 -173 -136 -19 227 94 238 -97 105 19 -143 -102 -267 -188 32 -46
7393d6J50m8k7k51M77l49Ml01L94J78J79j60K14m46k62K88k24L8M85o4j26R8J08
$$ -46 104 56 29 -222 255 -94 -90 -391 3 181 360 200 414 -32 -294 -6 -230 -192 293 229 103 201 309
7416C09l63l4K0k34K64J88j38P2K04p2k2l80K78l12J32J4J21RJ58j17j11n8L0
$$ 309 -54 -88 -68 -302 -38 150 12 84 288 216 194 -186 92 -220 -88 -74 47 56 214 97 -14 -72 -42
7439d2j21q5L50j8J88m1j74K1k48J84k70L65k22L05k7Oj47J48j37q3l04J29K53
$$ -42 -163 -248 102 84 272 231 57 78 -170 14 -256 109 -113 192 165 171 24 172 35 -48 -352 -223 30
7462C0OJ74K24k81k89j70L75l90K32k32M02J93k98k5J53J55m76L4j13K69Q5K09
$$ 30 36 210 434 153 -136 -306 69 -321 -89 -321 81 274 -24 -49 104 259 -217 -183 -296 -27 58 267
7484B67Q4k41Nk95p7L95m51K01J89R4p3k66L44n0k38ql6J29m5J24J37N4n2j42
$$ 267 351 110 115 -180 -257 138 -313 -112 77 171 98 -168 176 126 -112 -120 -156 -27 -72 52 189 243 191 49
7508D9j42J2J4nj12J76L73l42J94k17k0j78N6j52K39j0J21K16j11j22j15moj00
$$ 49 -93 -81 -67 -72 -184 -8 365 23 217 0 -20 -198 -142 -294 -55 -65 56 272 161 39 -76 -80 -86 -186
7532a86M7K47K73J8l52M0j70j18K5Q6J21n3J36j95K54j02K6J5k28K1P8J11j80
$$ -186 -139 108 381 399 47 87 -83 -201 -176 -90 31 -22 114 -81 173 71 97 112 -116 -95 -17 94 -86
7555h6M46l86K3j7R2Q2j21j66P9J76j4p7M1j68o8N3j24M16j14L9j13J49k9O1j53
$$ -86 360 -26 -3 -20 72 154 33 -133 -54 122 108 31 72 -96 -164 -111 -235 181 67 106 -7 142 113 174 21
7580B1l40J87L3NJ06J09L7J16L0m90N2q9K14k19P1M17k78K06qk00j47O3j90K19
$$ 21 -319 -132 -99 -94 12 121 158 274 304 -186 -134 -223 -9 -228 -157 260 -18 188 180 -20 -167 -104 -294 -75
7604g5J47O7J2r0J17k24j6k94J04J01j6L20l6Qk26K55k31k73P1K5L55m0J19l4
$$ -75 72 139 151 61 178 -46 -62 -356 -252 -151 -167 153 117 125 -101 154 -77 -350 -279 -254 101 61 180 146
7628A46J48l80R5j80J68j18K20R9m6J51m54K67l82L57k7j10L4O7m0J95M0j23k23
$$ 146 294 -86 9 -171 -3 -121 99 198 152 303 -151 116 -266 91 64 -46 -12 55 15 210 250 127 -96
7651i6l50L23k4n4J66p5M22p0k54j27Nl4J9J92j06J74Q9j89J45j03j34j42J05
$$ -96 -446 -123 -147 -201 -35 -110 312 242 -12 -139 -134 -168 -149 43 -63 111 200 11 156 53 -81 -223 -118
7674a18K35k14J31N6L5L8j14j5j66J61p3K3J24j2J89k31j19N7L6k39J29n0K68
$$ -118 117 -97 34 90 125 163 49 34 -132 29 -44 -21 103 91 280 49 -70 -13 23 -216 -87 -137 131
7697A31j6J05k23J4k08K0l46N17j32M05PJ9k3j92k90J80K94m64O1J88J61k31J18
$$ 131 115 220 -3 11 -197 -177 -523 -6 -138 267 274 293 270 78 -212 -32 262 -202 -141 47 208 -23 95
7720I5j79J32p7l4P7j22r9L31J50j24j08k91Q1j8p2M50k10R3MP9j35m8l8r0q9
$$ 95 -84 48 -29 -63 14 -108 -207 124 274 150 42 -249 -168 -186 -258 192 -18 75 79 158 23 -25 -63 -153 -242
7745b42N1o6K02K82j97p1M4k12j4k2J95l02N56O1j96J12l64J04j64j56N36k13
$$ -242 -191 -257 -55 227 30 -41 3 -209 -223 -245 -50 -352 204 265 69 181 -183 -79 -243 -399 137 -76
7767g6K62l84K27K30j91J09m72J63n7L06j82L0J65J35j84m2l40M2K72l4jJ74k46
$$ -76 186 -198 29 259 68 177 -295 -132 -189 117 -65 -35 130 265 81 39 -301 -259 13 -21 -22 152 -94
7790i4L66k28m6k68J5j71J74N09j37L99k61j06Nk09J41r4n7J05p5K21k52J97r0
$$ -94 272 44 -2 -270 -255 -426 -252 257 120 519 258 152 157 -52 89 -5 -62 43 -32 189 -63 134 44
7813D4j02N7J4kp4rL61l7j43n1k53j2J9Q4%K65j95O1P6K7k00j26J91j61K35m1
$$ 44 -58 -1 13 11 -63 -72 289 252 109 58 -195 -207 -188 -104 -104 161 -34 27 103 130 -70 -196 -5 -166 69 28
7839B8K30o6j46k26q0J80j51K13j59N1K24j99Q6P9P1p5m51N09j52J67pk01K08
$$ 28 258 192 46 -180 -260 -80 -231 -18 -177 -126 98 -101 -15 64 135 60 -391 118 -34 133 126 -75 133
7862A33K21l91N6o2j11m7M26j62L5K44m68K85k85K16m22K25q0J42K63J69l41K64
$$ 133 354 -37 19 -43 -154 -201 225 63 98 342 -126 159 -126 90 -332 -107 -187 -45 218 387 46 310
7884C10l58k26M6n4K09N9J06J59j22k58ok25K25o7K3P1K17j80J28O9k14N2l1n3
$$ 310 -48 -274 -228 -282 -73 -14 92 251 129 -129 -135 -360 -135 -202 -179 -108 109 -71 57 126 -88 -36 -67 -120
7908a20k7K6Q9L81j63J4j39j07Km7J24J48j95J91J2R9m1k1m42N1Q1L6J1K94p5
$$ -120 -147 -121 -32 349 186 200 61 -46 -44 -91 33 181 -14 177 189 288 247 226 -216 -165 -84 -48 -37 257 182
7933A82K74m59o4j75J65N3j83L52k3J10k31O3j24r7k7M38n31N04j29K8R0l37J54
$$ 182 456 -3 -67 -242 -77 -24 -207 145 122 232 1 64 -60 -157 -184 254 -277 227 98 126 216 -121 33
7956C3j06Q8l45L58O7J40r2r8n9lo0l23L42N2l4nJ50N6k05j76M6J57j28lJ48J45
$$ 33 -73 15 -330 28 95 235 143 45 -14 -17 -77 -400 -58 -6 -40 -45 105 161 -44 -220 -174 -17 -145 -148 0 145
7982A45J93j91j9O6l87Q4nM8q4L26q5j2oK00k44k54j26K96J1J64j58N2n0J4J21
$$ 145 338 147 128 194 -193 -109 -114 -66 -150 176 91 79 73 273 29 -225 -351 -55 -44 120 -38 14 -36 -22 99
8007I9n16L00Q2K3n2L38j30J0k87O4j71P8J23m8J21R3Pn3k20m4O9m6R2KJ18J43
$$ 99 -417 -117 -35 -12 -64 274 144 154 -133 -69 -240 -162 -39 -87 34 127 134 81 -139 -183 -114 -160 -68 -66 52 195
8033A95l5Rk7lk85r9J75M0r1L67j40k35K59j44j15k39L03k0K38j1n5n6j02M3l0
$$ 195 160 169 142 139 -146 -245 -70 -30 -121 246 106 -129 130 -14 -129 -368 -65 -85 153 142 87 31 -71 -28 -58
8058e8k63K41o9J87j63L91j76L7j11N6j09k97N25j63J3M20l47O4j39R4k32k5j04
$$ -58 -321 -80 -149 38 -125 266 90 127 16 72 -37 -334 191 28 41 461 114 178 39 133 -99 -124 -228
8081b28j30L29J34O9p1k51j10K97k22j18L89L2j07J88j69J04j36o0k97K11K9Q1
$$ -228 -358 -29 105 174 103 -148 -258 39 -183 -301 88 120 13 201 32 136 0 -60 -357 -146 -117 -36
8103c6k8K61P1k30p7J81j75n5J42k77N7M63K5l66J33k97N04l23K2J41j84K34L76
$$ -36 -64 197 268 38 -39 142 -33 -88 54 -223 -166 297 322 -44 89 -208 296 -27 -5 136 -48 186 562
8126E62l13j68p2k94J40k57K13K12K88j28j18K05j51j21j99L00O5k57L71p4l47
$$ 562 249 81 9 -285 -145 -402 -189 23 311 183 65 270 119 -2 -201 99 164 -93 278 204 -143
8147a43L4J88j75J48l83L14j9J87J35Lk10j21L1oj99J40J32j46J34J55J02k33
$$ -143 -109 79 -96 52 -331 -17 -36 151 286 289 79 -42 -11 -17 -216 -76 56 -90 44 199 301 68
8169F8p3j95L73k86j7K79J72p9Q3n82J22J25J04j97Q2J16L44l34P8Km38L62
$$ 68 -5 -200 173 -113 -130 149 321 242 325 -257 -135 -10 94 -103 -21 95 439 105 183 185 -253 109
8191A09
$$ Imaginary data points
##PAGE= N=2
##DATA TABLE= (X++(I..I)), XYDATA
0@%%%%%%%%%%%%%%%%%%%qJ6j6J6j6J6j7K5l2L3m0M7n1N9o7P6q6R5j07J20j33J48
$$ 0 0 0 0 0 0 0 0 0 0 0 0 0 0 0 0 0 0 0 0 -8 8 -8 8 -8 8 -9 16 -16 17 -23 24 -27 32 -35 41 -45 50 -57 63 -70 78
41G8j64J82k04K26k48K75l06L38l71M10m51M94n46O04o69P42q23R18j031J165
$$ 78 -86 96 -108 118 -130 145 -161 177 -194 216 -235 259 -287 317 -352 390 -433 485 -546 619
61F19j328J531j791K138k634L399m753P909l3344k732L3503J4348J8166J178r963
$$ 619 -709 822 -969 1169 -1465 1934 -2819 5090 -28254 -30986 2517 16865 35031 36209 26246
76B6246k2995j9096j6207l369Q602K0555K1006J7755L525r387j9129k0529j7577
$$ 26246 3251 -15845 -32052 -35421 -26819 -6264 14742 32497 36022 26635 7506 -13023 -30600
89c0600n076Q803J7644J9008J7385P806o376j7206j9545j7589p855N582J5505
$$ -30600 -35676 -26873 -9229 9779 27164 34970 28594 11388 -8157 -25746 -33601 -28019 -12514
102a2514J9700J7446P579n054j3485j8294j8185r011L893J2923J7650J8717J0461
$$ -12514 7186 24632 32211 27157 13672 -4622 -22807 -31818 -27925 -15002 2648 21365 31826
115C1826l174j3044j7388j7604j0136J137J1617J6952J7274J0362J25r737j6477
$$ 31826 28652 15608 -1780 -19384 -29520 -28383 -16766 186 17460 27822 27947 18210 1733
128A733j8316j0715l2Q737J5932J7817J1557N34r001j4451j6828j2317k057P648
$$ 1733 -16583 -27298 -27330 -18593 -2661 15156 26713 27247 18246 3795 -13033 -25350 -27407 -19759
142a9759J4619J7034J1912L228o395j4306j6979j1947l355N003J3143J6527J2664
$$ -19759 -5140 11894 23806 27034 20639 6333 -10646 -22593 -25948 -20945 -7802 8725 21389
155B1389L950m476j2053j6201j3333m519L926J2101J5521J3004N586l221j1389
$$ 21389 25339 20863 8810 -7391 -20724 -25243 -21317 -9216 6305 19309 24895 21674 10285
168A0285j5178j2761o475J624J0627J5582J3207O142j357r500j4861j3263o574
$$ 10285 -4893 -17654 -24129 -22505 -11878 3704 16911 23053 21696 12196 -2665 -15928 -22502
181b2502J227Q889J3667J3081Q013j56q768j3962j3186q193l12P956J3505J2848
$$ -22502 -21275 -12386 1281 14362 22375 22219 13451 -511 -13697 -21890 -22202 -14246 -741 12107
195A2107Q663J336p168j3021j3031q637j845O308J2216J3657R277J944o335j1812
$$ 12107 20770 22106 14938 1917 -11114 -19751 -21596 -15288 -3072 10585 19862 21806 15471 3659
209C659j2619j0083k642N464J1618J2630R736L824m561j1086j2821j0020m124
$$ 3659 -8960 -19043 -21685 -16221 -4603 8027 17763 21587 17026 5940 -6881 -16901 -21025
222b1025M082J0355J2802J0026M253l475r653j2194j0803m684K790R396J2029
$$ -21025 -16943 -6588 6214 16240 20493 17018 7365 -4829 -15632 -20316 -17526 -8130 3899
235C899J0731N682k359q843j2082j0803n830J148Q791J1891J0885O076o93p923
$$ 3899 14630 20312 17953 9110 -2972 -13775 -19605 -18457 -9666 2225 13110 19186 18493 10570
249A0570j1482j1239o631P53O956J0904J1694O898k85o639j0805j1220p442q26
$$ 10570 -912 -12151 -18782 -18029 -11073 -169 11525 18423 18138 11499 694 -10526 -17968 -18794
263a8794O561J0850J0867P695J579n804j0267j1373p970j758M677J0089J1265
$$ -18794 -12233 -1383 9484 17179 18758 12954 2687 -8686 -16656 -18414 -13737 -3648 7617
276G617Q527K063m770r055j1385q440k692M038R277J0912Q888L420l529r332j0824
$$ 7617 16144 18207 13437 4382 -7003 -15443 -18135 -14097 -4820 6092 14980 18400 14871 5539 -5285
291e285q999l869K810Q501J1014R330L973k334p597j0887r822m027J987P509J0373
$$ -5285 -14284 -18153 -15343 -6842 4172 13502 17475 15141 7544 -3343 -13165 -17192 -15205 -7696 2677
306B677R337N382j452p355j0438r750n539N34O929J0739R725N594j1o144r986
$$ 2677 12014 17396 15944 8589 -1849 -11599 -17138 -16604 -9675 1064 10789 16383 16372 10228 242
321B42r979o030l38N748R427R984O756N70n433r296j0118p060j034N227R230R599
$$ 242 -9737 -15767 -16105 -10357 -930 9054 15810 16380 10947 1651 -8467 -15527 -16561 -11334 -2104 7495
337G495P112K110m575q917j0269p123k260L829Q510J0170P866K355l440q124r895
$$ 7495 14607 16717 12142 3225 -7044 -14167 -16427 -12598 -4088 6082 13948 16303 12863 4739 -5156
352e156p866l080K905Q283R301Q241L427k567p722r455q034m168K007P220R643
$$ -5156 -13022 -16102 -13197 -4914 4387 12628 16055 13488 5766 -3689 -11723 -15891 -13884 -6664 2979
367B979Q461M241j662o453r414q934m514J324O150Q865Q856N212n02o273q921
$$ 2979 11440 15681 14019 7566 -1848 -10782 -15296 -13972 -7822 1043 9899 15111 14609 8336 -585
382e85q754n367n1N614R116Q591N757O71n048q642r307o046p66M757Q074Q996
$$ -585 -9339 -14706 -14757 -9143 -27 8564 14321 14992 9944 1302 -8005 -14051 -14817 -10060 -1986 7010
398G010O817R56m621q159q312p015j667M022P955Q989O887J967l350p746r018
$$ 7010 13827 14783 10162 2003 -6309 -13324 -14991 -10969 -3014 5975 12862 14829 11479 3733 -5285
413e285p080k458K831P700Q660P407K753k520o692r084p243l651K414O608Q578
$$ -5285 -12365 -14823 -11992 -4292 4368 11775 14528 12008 5316 -3768 -11011 -14662 -12248 -5640 2938
428B938P731L645j859o555q209p924l754Q58O430Q493P920M162q81n414q714p741
$$ 2938 10669 14314 12455 5900 -2309 -10233 -13987 -13129 -6699 1794 9714 13876 12995 7581 -1133 -8874
444h874m696P16M918P955Q110N177j37m866p996q089n321n92M694Q165Q381N339
$$ -8874 -13570 -12854 -7936 19 8129 13306 13169 8303 307 -7782 -13103 -13695 -9001 -836 7545 12884
460A2884O32m140p634q312n854r46L620O952Q334O492J387l299o929q365o464
$$ 12884 13516 9376 1742 -6570 -12424 -13370 -9750 -2798 5536 12028 13415 10116 3187 -5178 -11642
475a1642j576K721P033Q130O128K628k426p047p930o898k458K110O379Q373O890
$$ -11642 -13218 -10497 -3464 4666 10794 13422 10996 3949 -3981 -10879 -13337 -11227 -4848 3525 10415
490A0415K765j837n642q390o677l404J127N297Q090P191L985r27n723p831p061
$$ 10415 13180 11343 5701 -2689 -9366 -12770 -11643 -6346 1744 8935 12920 11993 6270 -1561 -8622
505h622l970M28N241P684P201M440J16m891q062p165m380n16M497P525P439M748
$$ -8622 -12592 -12164 -6923 761 7962 12402 12518 7627 -435 -7600 -11980 -12496 -7999 -474 6965 11713
521A1713N33m114p208o863n467j240L819P554P159N468J215l274p413p278n433
$$ 11713 12246 8132 924 -5939 -11406 -12646 -8827 -1273 5886 11354 12569 9295 1882 -5396 -10829
536a0829k049L441O554P279N792K234k491o474p081o529k697K705O299P029O130
$$ -10829 -12878 -9437 -2883 4396 10188 12422 9931 3457 -3624 -10153 -12850 -10145 -3846 3183 9313
551I313L062k145n983p030o256l006J119N507P926O289L744j519n425p148o639
$$ 9313 12375 10230 4247 -2783 -9039 -12045 -10926 -5419 2507 8796 12540 11021 5596 -1552 -8191
566h191l785R75M902O757O844M303m46m900o452o978m697J38M503O615P061M576
$$ -8191 -11976 -11001 -6099 658 7502 11805 11359 6459 7 -6971 -11668 -11530 -7027 -412 6649 11225
582A1225Q2l758o542p173n050l45L657O160P233N309O53l344n978o852n690j209
$$ 11225 11307 7549 1007 -6166 -11216 -11561 -7904 -1744 5489 10798 11451 8107 2129 -4723 -10413 -11622
598a1622L382N257P472N565J387k460n706p298n870j486K248N404P417N713K028
$$ -11622 -8240 -2983 4489 10054 11441 8981 3275 -4023 -9893 -11379 -9131 -3727 3690 9403 11431
613A1431j943n046p027o259k782J626N386O641O301K845j342m904o787o072l337
$$ 11431 9488 4442 -2585 -8844 -11626 -10000 -4614 2027 8328 11173 9831 4927 -1860 -7932 -11269
628a1269J243M560O675O520L380j019l764p098o285l934N38L831O712O326L760
$$ -11269 -10026 -5466 1209 7729 11109 10090 6326 -772 -7057 -10991 -10453 -6622 90 6416 10176
643A0176K83l434o275o513m172q54L298O540O636M179Q25l153o242o667m233j013
$$ 10176 10459 7025 750 -5763 -9935 -10789 -7491 -951 5685 9864 10689 7536 1294 -5373 -9606 -10619
659a0619K460N892O656M888J535k649n726o442m938k064K422N507O564M905K134
$$ -10619 -8159 -2267 4389 9277 10812 8163 2437 -4005 -8943 -11007 -8585 -3078 3486 8391 10525
674A0525j981n067o534n124k510J574M977O583N644K547j390m833o622n199k860
$$ 10525 8544 3477 -3057 -8181 -10691 -9117 -4140 2443 8087 10634 9244 4411 -2211 -7410 -10270
689a0270Q16M630O118N668L386p69m395o232n451l191J02M241N948N929L159J16
$$ -10270 -9454 -4824 1294 6962 10348 9579 5184 -1048 -6499 -9690 -9588 -5347 601 6530 9689 9805
705I805l751n873o191l750q4L415N805N980M229N08l450n806n550m550m60K750
$$ 9805 6054 181 -6010 -9760 -9844 -6429 -624 5356 9585 10093 6643 837 -4713 -9263 -9723 -6973
721f973N547N704M239J430k703n539n870m350j377K543N032O036M540J933k455
$$ -6973 -1426 4278 8517 9947 7244 1705 -4165 -8515 -9892 -7349 -2317 3719 8259 10192 7737
736G737m821n807m802k128J671M896N775M731K344j446m464n739n017k416J075
$$ 7737 2916 -2891 -7693 -9821 -8150 -3254 2521 7252 9596 8150 3686 -2053 -7070 -9486 -8411
751h411M357N821N161K427r22l918n801n319k740Q35L699N153N616L257n03l458
$$ -8411 -4054 1767 6928 9355 8433 4515 -1286 -6605 -9345 -8510 -4811 342 5958 9215 8712 5254
767E254n640n000l527K00L148N302N534L336J79k822n321n858l477k38K848M943
$$ 5254 -386 -5386 -8913 -8713 -5565 -263 5271 8607 8786 5964 643 -5215 -8692 -8930 -6082 -1139
783a139N847L658N40k448m982n760l718j297K663M572N494M115J448k038m949
$$ -1139 4708 8366 8906 6458 1476 -4284 -8002 -9299 -6636 -2064 3430 7545 8993 6955 2006
798B006n246m180j611J600M733N525M468J672j603m311n463m482j936J289L990
$$ 2006 -3240 -7420 -9031 -7431 -2698 2827 7295 8967 7364 3053 -2410 -6892 -8828 -7539 -3549
813c549N432M390K591r42l951n396m919k039O37L613N363M622K676p61l088n068
$$ -3549 1883 6273 8864 7922 3971 -1425 -6344 -8383 -7746 -4133 1230 5852 8528 7767 4679 -389
829c89m997l048N38L171M662N172L230m7k827n083n158l223k16K516N028M778
$$ -389 -5386 -8434 -7896 -4725 -63 5109 8339 8292 5465 382 -4776 -7999 -8215 -5699 -671 4107
845D107L586M80k326m872n207l359n55K210M527M985L919J121k509m191n199m037
$$ 4107 7693 8173 5847 975 -4232 -7591 -8146 -5936 -1409 3576 7495 8616 6107 1916 -3283 -7320
861g320j253J880M338N050L818J669j253m415m762m165j653J457L593N162M030
$$ -7320 -8573 -6693 -2355 2695 6513 8182 6929 2514 -2248 -6413 -8066 -6609 -3016 2146 6176
876F176K148j303l684n027m439k073J083L538M884M432K369o54l302m910m868
$$ 6176 8324 7021 3337 -1690 -6129 -8202 -7119 -3581 1303 5735 8104 7450 4148 -762 -5630
891e630k060J10L225M868M552K394Pk637n041m607k676j62L077M658M272L087
$$ -5630 -7690 -7580 -4355 513 5065 7459 7466 4829 -212 -4819 -7495 -7657 -4580 78 4350 7437
907G437L99k738m328m659l137o97K177M360M729L307P45j833m330m781l282r85
$$ 7437 7836 5098 770 -3889 -7026 -7723 -5546 -1186 3543 6850 7595 5762 1432 -3349 -6631 -7616
923g616J851M064M855L511J216j729m010m888l566j632J823L533M713M169J259
$$ -7616 -5765 -1701 3154 6665 7881 6152 2142 -2746 -6312 -7944 -6121 -2588 2125 6294 7553
938G553j185l395m866l714j835P96L325M965L832J589K6l669m459m131k205O06
$$ 7553 6368 2973 -1893 -5607 -7442 -6646 -3321 1644 5476 7065 7091 3422 -1037 -5168 -7373 -6767
954f767K944M574M183K312q9l078m295m284k621K3K772M499L849K870Q3k110m438
$$ -6767 -3823 751 4934 7246 7157 4079 -216 -4500 -7121 -7098 -4326 173 4022 6892 6975 4865 427
971D27m132k882m94K259M073M563K797O13k145m049m389k993j008K121M061L933
$$ 427 -3705 -6587 -7081 -4822 -749 3814 6611 7224 5079 1030 -3359 -6352 -7360 -5239 -1178 2755
987B755L455R81j341m044m558l116j160J210L948M231L239J612j451l139m660
$$ 2755 6210 7191 5850 1806 -2752 -5868 -7028 -5818 -1870 2361 5600 7212 5761 2622 -2038
1002b038l470j770R06L609M287L779J779r00k916m406l483k127L85K673M510L638
$$ -2038 -5508 -7278 -6372 -2763 1524 5303 7082 6182 3266 -1140 -4623 -6750 -6365 -3692 818 4456
1018D456J943k6k886l981l648k699M46K727L580M133K407K54k612l911m054k478
$$ 4456 6399 6373 3487 -494 -4142 -6841 -6395 -3668 -88 4045 6452 6706 4094 183 -3871 -6349
1034f349n44K530L836L819L268L64k221l814m040k631q85J796L616L990L189Q78
$$ -6349 -6893 -4363 -527 3292 6560 6924 4703 889 -3151 -5782 -6667 -4871 -1255 2735 5924 6802
1050F802j968l353m123l324r73J774L466L908L023J461j394l084m016l447j362
$$ 6802 4834 1481 -2642 -5966 -6939 -5165 -1699 2209 5232 6693 5299 2215 -1801 -5248 -6610
1065f610J081K862M309L454J334q53l026l876l746j348P38K695L684M283J370
$$ -6610 -5529 -2667 1642 5096 6430 5577 2551 -1325 -5071 -6419 -5681 -2986 698 4981 6351
1080F351n43k360m151l633j761J85K503L948L368J941Kj976l683m086k046Q0J791
$$ 6351 5808 3448 -703 -4336 -6097 -5912 -3409 539 3907 5848 5850 3874 191 -3895 -5941 -5861 -4070
1097d070L725L890K430Q8k170l256l813k456l86J711L426L666K641O48j426l273
$$ -4070 -345 3545 5975 6063 3893 637 -3176 -5632 -6018 -4307 -881 2785 5426 6074 4648 1375
1113A375l954k796q73J550L042M123K577P38q29k871l963l051j081Q52L009M227
$$ 1375 -2579 -5375 -6248 -4698 -1656 2467 5044 5782 4953 2082 -1881 -4932 -6013 -5161 -2152 2075
1129B075K933J048q07k865l687l244j441K99K848M009K865J762j61k709l672l407
$$ 2075 5008 6056 5249 2384 -1303 -4547 -5988 -5689 -2841 1168 4033 5795 5634 2925 -747 -4154
1145d154j707M34K523L408L248J888M3k133l713l215k287m24K493L513L320K111
$$ -4154 -5861 -5427 -2904 504 3752 5640 5683 3550 -163 -3378 -5665 -6089 -3596 -83 3237 5348
1161E348M44j805l745l225k259l98J575L291L441K313O83j474l342l307k532r19
$$ 5348 5792 3987 242 -2983 -5242 -5640 -4065 -774 2667 4980 5663 4189 847 -2460 -4992 -5911
1177e911J689L136L496K351R97j232l045l288k703j116R81K733L262L335J033
$$ -5911 -4222 -1086 2410 4761 5758 4526 1481 -1807 -4510 -5626 -4645 -1912 1350 4685 5718
1192E718j264k249l494l009j459J116K317L285L069J692o18k665l171l214j334
$$ 5718 4454 2205 -1289 -4298 -5757 -4641 -2324 961 4030 5722 5104 2439 -732 -3946 -5280
1207e280J80K258L375K944J931j15k087l307l163k300L06J995L139L341K121j66
$$ -5280 -5100 -2842 533 3477 5408 5293 3206 -101 -3264 -5564 -5258 -3263 -124 3217 5338 5172
1223E172j922k942l134k482r2J653L171L061K548K32j490k806l525k233n89J298
$$ 5172 3250 308 -2826 -5308 -5400 -3747 -576 2485 5033 5265 3775 969 -2556 -4789 -5378 -4080
1239d080K795L694K030Q11j054k551l610k655p93J233K855K919K754J076r97k609
$$ -4080 -1285 2409 4439 5250 4196 1645 -1965 -4620 -5413 -4180 -1325 1594 4348 5424 4427 1818
1255A818l442k533j180P53K530L299K842J294p68k392l284k505j640M32K537K764
$$ 1818 -1624 -4157 -5337 -4584 -2054 1245 4087 5381 4613 2221 -1063 -3568 -5208 -4776 -2239 525
1271E25K844J866m54k098l079k834j800K49J785L182K703K178j65j647l469k566
$$ 525 3369 5235 4781 2683 -396 -3230 -5030 -4781 -2996 186 2889 5067 4902 3255 -214 -2780
1287b780k015j63J473L223K937J866K44j609k593k769k396m29J353K907K945K376
$$ -2780 -4795 -4958 -3485 -262 2675 4541 4785 3176 583 -2186 -4582 -5011 -3658 -751 2194 4570
1303D570L89j167k675l194k385k95Q05K485L071K519J031j149k377l082k495r33
$$ 4570 4959 3792 1117 -2077 -4462 -4757 -3952 -1467 1604 4123 5154 4005 1628 -1454 -3949 -4882
1319d882Q04K254L057K344J512o44k551k945k491j245K29K036L396K302J730m24
$$ -4882 -4078 -1824 1233 3577 5089 4445 1894 -1051 -3542 -4787 -4558 -2522 874 3176 4906 4482
1335D482k289k671k407k113N66K020K611K734J833j83j800k813k737j735j47J586
$$ 4482 2193 -478 -2885 -4998 -4432 -2412 199 2933 4766 4583 2783 -30 -2767 -4502 -4649 -3063
1351c063K792K930J781J06j253k716k800k208k65J153L097K696K090M07j482k338
$$ -3063 -271 2659 4440 4546 3293 577 -2223 -4431 -4696 -3543 -446 2250 4340 4747 3265 927
1367I27k950k124m50J100K565K689K097P79q85k500k722k266j004R10K389K686
$$ 927 -2023 -4147 -4597 -3497 -932 1757 3854 4633 3748 1248 -1474 -3740 -4744 -3834 -1445 1241
1383A241K563J017r74k048k830k364j065O85J724K948K316J180k29k064k576k522
$$ 1241 3804 4821 3847 1799 -1031 -3395 -4460 -3775 -2051 897 3213 4393 4164 2100 -476 -2998
1399b998j294p6J895L061K154J599K2j937k432k717j697M1J762K387K808J980
$$ -2998 -4292 -4368 -2473 588 2742 4341 4363 2426 -6 -2723 -4420 -4379 -2617 -230 2578 4558
1415D558j39j683k353k775j772m3J276K430K840J657L59j164k622k607j680o65
$$ 4558 4419 2736 383 -2392 -4164 -4207 -2931 -501 2339 3996 4355 3191 569 -2038 -3718 -4383
1431d383R08K423K665J871R86r82k311k660k034q11P22K224K644K016J019m66
$$ -4383 -3475 -1052 1613 3484 4470 3488 1177 -1483 -3517 -4328 -3606 -1382 1262 3278 4297 3831
1447C831k405k744k000p99L63K091K477K102J368l28j982k390k699j004K46J817
$$ 3831 1426 -1318 -3318 -4117 -3754 -1663 814 2916 4284 3956 1974 -416 -3115 -4119 -3873 -2056
1463b056K536K065J683m03j757k253k496j383J22J493K665J962K163j15j305k846
$$ -2056 480 2545 4228 3825 2068 -185 -2681 -4064 -3942 -2449 216 2178 4341 4226 2921 75
1479G5k472j306l29J129K471K295J756L43p69k460k564j611m36R89K101K605J779
$$ 75 -2397 -3703 -4032 -2903 -432 1863 3619 3962 3193 733 -1831 -3442 -3878 -2889 -788 1817 3596
1496C596N21q81k414k348j929q74Q13K322K670J796P43o79j980k136k356r57P40
$$ 3596 4117 3236 822 -1526 -3455 -4329 -3516 -1194 1476 3272 4015 3336 1356 -780 -3136 -4093 -3353
1513c353J906K277K086R94o55j489k192k316j140M61J210K659K149J449l38j634
$$ -3353 -1447 830 2916 3910 3255 1766 -426 -2742 -3882 -3421 -2211 448 2597 4046 3708 2074
1529B074k321k220j608L85J739J995K526J234j63j560j839k470j656LJ471K277
$$ 2074 -247 -2467 -4075 -3690 -1951 44 2570 3804 3641 2081 242 -2228 -3884 -3881 -2410 -133
1545a33K304J601L14j464k023k521j488m99J093K123K445J724K08o76k083k598
$$ -133 2171 3772 4086 2622 599 -1922 -3410 -3909 -2816 -693 1752 3476 3684 3008 925 -1673
1561a673j445n23O72J877K348J720O31m25j938k445j910o40P12J572K422J875
$$ -1673 -3118 -3641 -2969 -1092 1256 2976 3607 3182 1244 -1201 -3111 -3751 -3039 -1467 955 2830
1577B830R37n97j539k335k180r30L80J734K096K227J019l52j573k254k114r72
$$ 2830 3767 3170 1631 -704 -2884 -3814 -3434 -1700 396 2623 3642 3290 1717 -537 -2651 -3623
1593c623R7J563K169K345P43Q1r80k528k080j289o7J076K495K211J222J53j077
$$ -3623 -3526 -1963 206 2551 3294 3375 2395 -133 -2213 -3502 -3569 -2493 2 2213 3435 3588 2511
1610B511k256j834j524m11O98K336K203J472L23q03k046k093j523n51Q79J732
$$ 2511 255 -1579 -3103 -3514 -2816 -480 1723 3195 3518 2715 669 -1424 -2947 -3498 -2619 -887
1626h87K244J597M37n60j674k365j430j102Q18J818K026J787O91m42j796k001
$$ -887 1357 2954 3391 2831 1157 -1208 -2638 -3740 -2922 -1104 922 2709 3400 2958 1162 -839
1642h39j909n93K78J371K362J708J262l34j699k249j646j175K07J327K128J811
$$ -839 -2748 -3341 -3063 -1692 670 2378 3640 3306 1607 -642 -2288 -3463 -3256 -1929 199 2010
1658B010J089K3j343j658k141j411j57J617K109J773J143K36j280j587k170j577
$$ 2010 3099 3122 1779 121 -2020 -3431 -3588 -1971 138 1911 3054 3290 2010 423 -1747 -3324
1674c324J28J041J581K120J308N49j250j410j980j585m38N62J876J991J746K34
$$ -3324 -3196 -2155 -574 1546 2854 3403 2153 743 -1237 -2822 -3260 -2698 -822 1169 2915 3149
1690C149m98j858j860j632p21O97J532K144J794O22p62j128k127j904o26L69J421
$$ 3149 2651 793 -1067 -2699 -3420 -2723 -1191 953 2747 3369 2607 1479 -648 -2552 -3178 -2809 -1388
1707a388J889K043O07l29j361j700j697j359J81J532K219J490P90L03j326j822
$$ -1388 501 2544 3151 2822 1461 -239 -1936 -3295 -3114 -1582 637 2127 2917 3220 1894 72
1723G2k317q17K0J175J693J989J099N9q94j695k213j056k40J101J612K213J137
$$ 72 -2245 -3062 -3042 -1867 -174 1815 2914 2973 2079 384 -1829 -2885 -3125 -2024 -412 1801 2938
1740B938o7p27j872j679j358k77O76J894J649J476P15r36j690j942j496l99P36
$$ 2938 2871 2144 272 -1407 -2765 -3042 -2366 -472 1177 2653 3368 2432 742 -1200 -2696 -3095 -2359
1757b359J311J998J570O01m91j640j670j947j36K33J176K112J461P39l36j445
$$ -2359 -1048 950 2520 3121 2630 990 -680 -2627 -2763 -2530 -1354 758 2219 2958 2622 1177
1773A177j407k000q08J61J418J817J659J004n5j550j778j391r62N2Q29J920J543
$$ 1177 -230 -2230 -3038 -2877 -1459 358 2017 3021 2966 1416 -362 -1753 -2715 -2663 -1834 86 1629
1790A629J080j45o62j728j930j003o1Q48J536J669J536J26q29j701j946r67m15
$$ 1629 2709 2564 1902 174 -1756 -2759 -2820 -1972 -436 1233 2769 2895 2066 365 -1581 -2548 -2963
1807b963N56J942J630J530J42o68j675j555j652l31P35J434K042J207L96m25j399
$$ -2963 -2407 -465 1165 2695 2837 2169 494 -1061 -2713 -3044 -2309 -875 1167 2374 2770 2345 946
1824I46j851j679j50L13J334J690J536Q99n07j211j899j185j161M79J116J810
$$ 946 -905 -2584 -2734 -2421 -1087 603 2139 3038 2531 1320 -579 -1764 -2925 -2446 -1330 480
1840D80J281J067j28j455j720j446j058K48R38K112J519Q92K62j499j367j826
$$ 480 1761 2828 2700 1245 -475 -1921 -2979 -2731 -1793 319 1838 2730 2992 1493 126 -1700
1856a700r04k9Q07J516J678J394J5r60j414k116r26K2N95J617J722R93J25l83
$$ -1700 -2604 -2633 -1826 -310 1368 2762 2777 1817 403 -1713 -2639 -2617 -2022 -405 1317 2310 2435 2052
1874B052j396j695j478l01O90J469J550J568M27j035j141j551j324n87P59R94
$$ 2052 656 -1039 -2517 -2818 -2128 -659 891 2459 2886 1851 710 -841 -2165 -2752 -1993 -999
1890i99J765J398M66o51j268j438j477l08m8J329J737J291P98q3j285j576j393
$$ -999 766 2164 2630 1979 711 -727 -2204 -2512 -2560 -1231 506 1797 2595 2512 1227 -349 -1742
1907a742q09J0J075J743J446P25K09j445j342j601r19nJ223J454J351J210p3q32
$$ -1742 -2551 -2541 -1466 277 1723 2448 2657 1212 -130 -1731 -2650 -2655 -1432 22 1373 2583 2510 1678
1925A678j461j710j027j95R58J456J193J229N39p59j257j782q66n63N56J202J900
$$ 1678 217 -1493 -2520 -2715 -1757 -301 892 2121 2660 1901 644 -1138 -2004 -2567 -2011 -809 1091
1942A091J100M82o41j354j657q62q06M65J442J372J091R35n14j169j532j581l89
$$ 1091 2191 2673 2032 678 -979 -1841 -2647 -2182 -740 632 1723 2658 2144 975 -557 -2138 -2527
1959b527J71J279J618J251O41j76j224j229j461p04J16J047J335J472P22L0j027
$$ -2527 -2356 -1077 541 1792 2433 2257 1033 -196 -1657 -2361 -2245 -1198 137 1609 2331 2361 1334
1976A334j732j334o15j0J052J088J700P19K00q57j598j065j206j19P28J530J447
$$ 1334 -398 -1732 -2347 -2357 -1305 -217 1483 2202 2402 1545 -53 -1118 -2324 -2443 -1715 -185 1262
1993A262R55L44q99j506j348j088k99P74J548J146J092M53n65j237j302j455l94
$$ 1262 2217 2561 1662 156 -1192 -2280 -2579 -1805 -257 889 1981 2434 1869 632 -670 -2125 -2519
2010b519P73R89J460J447L48n50j175j365j289o16M80J128J309J343M83j63j080
$$ -2519 -1746 -757 703 2150 2498 1948 773 -592 -1881 -2497 -2017 -889 420 1763 2246 2083 1003
2027A003j557j179n48K45O87J608J364P46l26p08j651j210p28K24O83J493J211
$$ 1003 -554 -1733 -2281 -2036 -1349 259 1623 2369 2043 1335 -316 -1526 -2254 -2030 -1347 146 1357
2044A357R78q2p84j328j237j192n6Q83J544J191Q19Mo32q88j756p81k50O17J203
$$ 1357 2335 2253 1469 141 -1096 -2288 -2344 -1461 83 1274 2093 2097 1465 577 -1179 -1960 -2210 -1593 -390
2063c90J435J230K4o96j220j392p91l77K95J232J697Q01O40n25j348j296q88n50
$$ -390 1045 2275 2299 1603 383 -1009 -1800 -2177 -1882 -650 1047 1848 2488 1963 615 -681 -1569 -2119
2081b119L44J052J194J380K55k39r97j244j385o75K25J033J611J451L16n3j102
$$ -2119 -1775 -723 471 1851 2106 1867 870 -374 -1759 -2434 -2209 -1176 435 1886 2202 2149 1047
2098A047j219j252o95K74N73J393R64R55j2r14j222j236r76M14Q54R67J258P94
$$ 1047 -172 -1424 -2119 -1845 -1272 121 1085 2040 2028 1114 -108 -1344 -2320 -1906 -1052 -85 1173 1967
2116A967o4m96r75j437j201n4Q05J317R70J379j46n28j204j197j078k38N15J202
$$ 1967 1903 1407 432 -1005 -2206 -2260 -1455 -138 832 2211 2065 1537 333 -864 -1942 -2180 -1665 -463
2134d63J319Q33N02p07j042j073j160k67L72P46J446J173L95m45r17j454r77m19
$$ -463 856 1689 2191 1484 442 -631 -1791 -2058 -1686 -940 506 1679 2074 1629 712 -742 -1719 -2138
2152b138K88R50J611Q01M96k9p25j206j214j123L16N83J399J191O89r9o72j158
$$ -2138 -1850 -900 711 1512 2008 1979 1254 48 -1166 -2289 -1973 -1390 9 1200 1889 1790 1118 -40
2170d0j550m63J57O22J212R72J219k30p41q43j491q81R4O98N12J783N91L00o18
$$ -40 -1590 -2053 -1896 -1274 -62 910 2129 1899 1158 315 -1176 -2057 -1963 -1265 -753 1030 1621 1921 1303
2189A303r61j295o99m20J100M15J282J165L91n32j213j399o91m56M00Q61J105
$$ 1303 342 -953 -1652 -2072 -972 -557 725 1890 2281 1749 536 -863 -1554 -2010 -1610 -749 356
2206C56J275N24p26p27j122j164m16J11Q89J490Q04O39k72p65j313q83n07o4R49
$$ 356 1631 2155 1429 702 -420 -1584 -2000 -1889 -1000 490 1294 1933 1661 896 -417 -1300 -1807 -1871 -922
2225i22J273J160J80K40j019r89j021p59q2P45J238P92R37J52p54j106j168p39
$$ -922 351 1511 1691 1931 912 -77 -1098 -1857 -1939 -1194 44 836 1773 1925 1171 65 -1103 -1842
2243a842j01N61J281J022J036O9p26r50j195o17n35P66P77J272N69M91l74j002
$$ -1842 -1943 -1382 -101 921 1957 2026 1300 350 -845 -1462 -1997 -1231 -454 818 1387 1878 1504 502
2261E02j301r46j96M15R09J142Q99M90k76r36j206r75m31K71P41J284Q75O74m19
$$ 502 -799 -1745 -1941 -1526 -617 525 1424 1914 1638 702 -504 -1479 -1910 -1639 -898 386 1261 1935 1516
2280A516o68j186p47o58L22O30P73J214N77q4p41q20j334p77K54P91J106R30O33
$$ 1516 848 -338 -1085 -1743 -1421 -791 -18 1196 1773 1689 948 128 -1206 -1983 -1729 -938 168 1098 1731
2299A731J37p11j002j247m98k68J043O74J103M78K98n95r72r35p24l30N25Q90
$$ 1731 1868 1157 155 -1092 -1590 -1858 -815 -141 962 1440 1738 1143 171 -764 -1488 -1818 -1293 -403
2317d03J431M67N46n89j164r57r57%J91J006O95J066L53j94j057r58r74n29O38
$$ -403 1028 1495 2041 1452 288 -669 -1626 -1626 -1435 -429 266 1332 1685 1491 434 -524 -1498 -2027 -1389
2336a389Q29J177P48K93n9r97q54j019o54K25J077P76J071M43o5p98q74j045o71
$$ -1389 -560 617 1365 1658 1599 602 -252 -1271 -1925 -1700 -623 153 1224 1667 1602 804 -70 -1115 -1786
2355a786N84K78J154J050K28J33q05j156n44p54K19K74R67J149P40Qn58r96r10
$$ -1786 -1202 -924 230 1280 1508 1641 836 -320 -864 -1618 -1399 -1125 -158 991 1731 1739 1181 185 -725
2374g25j041K57O51P14J152M37K61l62r73r75r27p9J98J029R65Q74P1l31l09j498
$$ -725 -1766 -1509 -858 -144 1008 1445 1706 1344 371 -604 -1531 -1610 -1412 -383 582 1456 1527 1196 887 -611
$$ [...]
8191b73
##END NTUPLES=NMR FID
##END=
