##TITLE=1H_DE-27_Et_EA
 D2O
 8 sc, 
 29.11.2023
##JCAMPDX= 6.0         $$ Bruker NMR JCAMP-DX V2.0
##DATA TYPE= NMR FID
##DATA CLASS= NTUPLES
##ORIGIN= UXNMR, Bruker Analytische Messtechnik GmbH
##OWNER= root
$$ XWIN-NMR		Version 3.5
$$ Wed Nov 29 14:25:31 2023 Russian Standard Time (UT+4h)  she@DPX200
##.OBSERVE FREQUENCY= 200.1313
##.OBSERVE NUCLEUS= ^1H
##.DELAY= (6, 6)
##.ACQUISITION MODE= SIMULTANEOUS
##.ACQUISITION SCHEME= undefined
##.AVERAGES= 8
##.DIGITISER RES= 18
##SPECTROMETER/DATA SYSTEM= spect
##.PULSE SEQUENCE= zg30
##.SOLVENT NAME= D2O
##.SHIFT REFERENCE= (INTERNAL, D2O, 0, 15.7039)
##AUDIT TRAIL= $$ (NUMBER, WHEN, WHO, WHERE, WHAT)
$$ ##TITLE= Audit trail, XWIN-NMR		Version 3.5
$$ ##JCAMPDX= 5.01
$$ ##ORIGIN= Bruker BioSpin GmbH
$$ ##OWNER= she
$$ F:/spectra/data/she/nmr/H-F/1/audita.txt
$$ ##AUDIT TRAIL=  $$ (NUMBER, WHEN, WHO, WHERE, WHAT)
(   1,<2023-11-29 14:24:26.00 +0400>,<she>,<DPX200>,
      <created by zg, POWCHK disabled, PULCHK disabled
       configuration hash MD5:
       00 E9 B6 7A A2 85 ED C7 34 08 36 98 17 FE 4E 26
       data hash MD5: 16K
       93 0C E6 45 3C C3 67 45 78 61 ED B3 21 D5 CF BF>)
$$ ##END=
$$ 
$$ hash MD5
$$ 76 44 F8 32 8E E8 49 73 FF 05 BC 04 5A 93 5C B7
##$RELAX= 
##$RELAX= 
##$RELAX= 
##$RELAX= 
##$RELAX= 
##$RELAX= 
$$ Bruker specific parameters
$$ --------------------------
##$DU= <F:/spectra>
##$EXPNO= 1
##$NAME= <H-F>
##$PROCNO= 1
##$TYPE= <nmr>
##$USER= <she>
##$AMP= (0..31)
100 100 100 100 100 100 100 100 100 100 100 100 100 100 100 100 100 100 
100 100 100 100 100 100 100 100 100 100 100 100 100 100 
##$AQSEQ= 0
##$AQ_mod= 1
##$AUNM= <au_zg>
##$AUTOPOS= <>
##$BF1= 200.13
##$BF2= 200.13
##$BF3= 200.13
##$BF4= 200.13
##$BF5= 200.13
##$BF6= 200.13
##$BF7= 200.13
##$BF8= 200.13
##$BYTORDA= 1
##$CFDGTYP= 0
##$CFRGTYP= 5
##$CHEMSTR= <none>
##$CNST= (0..31)
1 1 145 1 1 1 1 1 1 1 1 1 1 1 1 1 1 1 1 1 1 1 1 1 1 1 1 1 1 1 1 1 
##$CPDPRG= <>
##$CPDPRG1= <>
##$CPDPRG2= <>
##$CPDPRG3= <>
##$CPDPRG4= <mlev>
##$CPDPRG5= <mlev>
##$CPDPRG6= <mlev>
##$CPDPRG7= <mlev>
##$CPDPRG8= <mlev>
##$CPDPRGB= <>
##$CPDPRGT= <>
##$D= (0..31)
0 1.2 0 0 0 0 0 0 0 0.06 0 0.03 0 0 0 0 0.0002 0 0 0 0 0 0 0 0 0 0 0 0 
0 0 0 
##$DATE= 1701253465
##$DBL= (0..7)
120 120 120 120 120 120 120 120 
##$DBP= (0..7)
150 150 150 150 150 150 150 150 
##$DBP07= 0
##$DBPNAM0= <>
##$DBPNAM1= <>
##$DBPNAM2= <>
##$DBPNAM3= <>
##$DBPNAM4= <>
##$DBPNAM5= <>
##$DBPNAM6= <>
##$DBPNAM7= <>
##$DBPOAL= (0..7)
0.5 0.5 0.5 0.5 0.5 0.5 0.5 0.5 
##$DBPOFFS= (0..7)
0 0 0 0 0 0 0 0 
##$DE= 6
##$DECBNUC= <off>
##$DECIM= 32
##$DECNUC= <off>
##$DECSTAT= 4
##$DIGMOD= 1
##$DIGTYP= 9
##$DL= (0..7)
0 120 120 120 120 120 120 120 
##$DP= (0..7)
150 150 150 150 150 150 150 150 
##$DP07= 0
##$DPNAME0= <>
##$DPNAME1= <>
##$DPNAME2= <>
##$DPNAME3= <>
##$DPNAME4= <>
##$DPNAME5= <>
##$DPNAME6= <>
##$DPNAME7= <>
##$DPOAL= (0..7)
0.5 0.5 0.5 0.5 0.5 0.5 0.5 0.5 
##$DPOFFS= (0..7)
0 0 0 0 0 0 0 0 
##$DQDMODE= 0
##$DR= 18
##$DS= 0
##$DSLIST= <SSSSSSSSSSSSSSS>
$$ [...]
##$SUBNAM2= <"">
##$SUBNAM3= <"">
##$SUBNAM4= <"">
##$SUBNAM5= <"">
##$SUBNAM6= <"">
##$SUBNAM7= <"">
##$SUBNAM8= <"">
##$SUBNAM9= <"">
##$SW= 18.0517328524113
##$SWIBOX= (0..15)
0 0 2 0 0 0 0 0 0 0 0 0 0 0 0 0 
##$SW_h= 3612.71676300578
##$TD= 16384
##$TD0= 1
##$TE= 0
##$TE2= 300
##$TE3= 300
##$TEG= 300
##$TL= (0..7)
0 120 120 120 120 120 120 120 
##$TP= (0..7)
150 150 150 150 150 150 150 150 
##$TP07= 0
##$TPNAME0= <>
##$TPNAME1= <>
##$TPNAME2= <>
##$TPNAME3= <>
##$TPNAME4= <>
##$TPNAME5= <>
##$TPNAME6= <>
##$TPNAME7= <>
##$TPOAL= (0..7)
0.5 0.5 0.5 0.5 0.5 0.5 0.5 0.5 
##$TPOFFS= (0..7)
0 0 0 0 0 0 0 0 
##$TUNHIN= 0
##$TUNHOUT= 0
##$TUNXOUT= 0
##$USERA1= <user>
##$USERA2= <user>
##$USERA3= <user>
##$USERA4= <user>
##$USERA5= <user>
##$V9= 5
##$VALIST= <valist>
##$VCLIST= <CCCCCCCCCCCCCCC>
##$VD= 0
##$VDLIST= <DDDDDDDDDDDDDDD>
##$VPLIST= <PPPPPPPPPPPPPPP>
##$VTLIST= <TTTTTTTTTTTTTTT>
##$WBST= 1024
##$WBSW= 4
##$XGAIN= (0..3)
0 0 0 0 
##$XL= 0
##$YL= 0
##$YMAX_a= 67767
##$YMIN_a= -74358
##$ZGOPTNS= <>
##$ZL1= 120
##$ZL2= 120
##$ZL3= 120
##$ZL4= 120
##$ABSF1= 10
##$ABSF2= 0
##$ABSG= 5
##$ABSL= 3
##$ALPHA= 0
##$AQORDER= 0
##$ASSFAC= 0
##$ASSFACI= 0
##$ASSFACX= 0
##$ASSWID= 0
##$AUNMP= <proc_1d>
##$AZFE= 0.1
##$AZFW= 0.1
##$BCFW= 1
##$BC_mod= 2
##$BYTORDP= 1
##$COROFFS= 0
##$CY= 11.3945322036743
##$DATMOD= 1
##$DC= 2
##$DFILT= <>
##$DTYPP= 0
##$F1P= 15.7292609196834
##$F2P= 12.9074282941183
##$FCOR= 0.5
##$FTSIZE= 0
##$FT_mod= 4
##$GAMMA= 1
##$GB= 0.15
##$INTBC= 1
##$INTSCL= 1
##$ISEN= 128
##$LB= 0.24
##$LEV0= 0
##$LPBIN= 0
##$MAXI= 10000
##$MC2= 0
##$MEAN= 0
##$ME_mod= 0
##$MI= 1.114404
##$NCOEF= 0
##$NC_proc= 0
##$NLEV= 6
##$NOISF1= 3.799351
##$NOISF2= 2.8
##$NSP= 1
##$NTH_PI= 0
##$NZP= 0
##$OFFSET= 15.70392
##$PC= 1
##$PHC0= -24594.05
##$PHC1= 13.0527
##$PH_mod= 1
##$PKNL= yes
##$PPARMOD= 0
##$PSCAL= 0
##$PSIGN= 0
##$REVERSE= no
##$SF= 200.130013532006
##$SI= 16384
##$SIGF1= 3
##$SIGF2= 2
##$SINO= 400
##$SIOLD= 16384
##$SREGLST= <1H.CDCl3>
##$SSB= 0
##$STSI= 0
##$STSR= 0
##$SW_p= 3612.71676300578
##$SYMM= 0
##$S_DEV= 0
##$TDeff= 0
##$TDoff= 0
##$TI= <>
##$TILT= no
##$TM1= 0
##$TM2= 0
##$TOPLEV= 0
##$USERP1= <user>
##$USERP2= <user>
##$USERP3= <user>
##$USERP4= <user>
##$USERP5= <user>
##$WDW= 1
##$XDIM= 8192
##$YMAX_p= 0
##$YMIN_p= 0
$$ End of Bruker specific parameters
$$ ---------------------------------
##NTUPLES= NMR FID
##VAR_NAME=  TIME,          FID/REAL,        FID/IMAG
##SYMBOL=    X,             R,               I
##VAR_TYPE=  INDEPENDENT,   DEPENDENT,       DEPENDENT
##VAR_FORM=  AFFN,          ASDF,            ASDF
##VAR_DIM=   8192,          8192,            8192
##UNITS=     SECONDS,       ARBITRARY UNITS, ARBITRARY UNITS
##FACTOR=    0.0002768,     1,               1
##FIRST=     0,             0,               0
##LAST=      2.2672688,     0,               0
##MIN=       0,             -74358,          0
##MAX=       2.2672688,     67767,           0
$$ Real data points
##PAGE= N=1
##DATA TABLE= (X++(R..R)), XYDATA
0 0 0 0 0 0 0 0 0 0 0 0 0 0 0 0 0 0 0 0 0 0 0 0 3 -8 8 -8 8 -8 8 -10 12 -16 16 -19 19 -23 27 -28 33 -35 40 -43 49 -55
44 -55 60 -67 75 -81 89 -97 109 -119 131 -146 160 -179 199 -221 248 -282 323 -373 435 -522 646
65 646 -831 1147 -1785 3586 -18620 -74358 -45423 -22215 -31773 -11534 44043 56327 25206 4103
79 4103 1040 -17770 -45761 -46935 -9185 27610 32223 31000 46568 35711 -16376 -46179 -31557
92 -31557 -28133 -40918 -16181 32139 43334 25126 18090 12772 -15763 -44266 -38347 -8956 9416
105 9416 15868 31789 47723 31079 -5910 -22840 -25856 -40825 -44646 -13542 21442 29473 26399
118 26399 28510 18537 -10217 -33009 -31702 -18094 -9284 3680 32533 49969 31505 3218 -7928
131 -7928 -22609 -47808 -45208 -11904 10363 15610 29099 39930 21672 -8701 -24131 -26691 -26999
144 -26999 -18867 5025 32147 40884 27413 12797 1922 -20662 -44961 -40201 -15514 -2344 7834
157 7834 31719 42729 21285 -4136 -13410 -21512 -31413 -23718 2451 23315 28386 27976 25023 9306
171 9306 -18543 -37295 -35290 -23967 -13166 5481 29738 36966 22931 7044 -3964 -18825 -31774
184 -31774 -26813 -5248 13838 23010 29198 30361 13533 -13995 -29903 -30765 -28823 -20848 1670 24641
198 24641 31736 26192 18024 2941 -17286 -30315 -27025 -12269 4578 18031 28514 31298 17521
211 17521 -5655 -21559 -27910 -32511 -26618 -3919 19551 26999 27262 24672 9497 -13417 -26408
224 -26408 -24695 -17468 -5958 11354 26898 30324 20089 3623 -12440 -25977 -33829 -28352 -9003
237 -9003 10081 21860 29092 28619 14186 -6711 -20634 -24690 -22862 -12764 6081 22732 28747
250 28747 22729 10794 -5221 -22163 -32170 -29273 -14969 1990 17272 28154 29796 18988 1266
263 1266 -15110 -23977 -24410 -17357 -1937 16159 26543 24319 14938 1698 -14421 -29148 -30664 -18932
277 -18932 -3608 11011 24023 30769 23965 6715 -9192 -19307 -24336 -21535 -8267 10610 22564
290 22564 23698 18687 8223 -8431 -25398 -29813 -21285 -9838 4236 20062 30383 25868 11316
303 11316 -2535 -14536 -24136 -24606 -12909 4201 16318 21657 21838 13457 -3112 -19792 -26286 -22944
317 -22944 -15132 -1829 14978 27799 26305 15902 3787 -8810 -21626 -25972 -16308 -1083 10344
330 10344 17951 22965 18264 1947 -14686 -21538 -22420 -19391 -7932 11404 24649 24583 18613 11047
344 11047 -3270 -20066 -25212 -17658 -6825 2500 14598 24019 20045 4923 -7850 -15309 -22180
357 -22180 -23650 -11371 7704 18561 20928 21750 16614 -7 -17047 -21797 -17466 -12566 -3477 12660
371 12660 23022 18592 8004 -459 -10350 -22328 -24028 -11579 2753 11218 19198 24439 18302 2160
385 2160 -11866 -17121 -19273 -17607 -7015 9513 19079 17637 11602 5533 -6494 -20404 -23335 -12729
399 -12729 -2368 4963 16864 25605 19167 4429 -5693 -12346 -20176 -20917 -8474 6442 13640 15224
413 15224 15194 9926 -4042 -17516 -19573 -13017 -7841 566 15294 24943 18240 6330 -32 -8106
427 -8106 -20555 -22405 -9362 2449 7561 13470 19048 13225 -2991 -13774 -15177 -14203 -12725 -2380
441 -2380 14151 20766 16091 11072 6308 -6564 -20248 -20396 -10687 -3059 3792 13599 19338 13025 69
456 69 -8398 -11481 -15550 -15878 -4370 11631 16848 14977 15374 9720 -6710 -18708 -16653 -12428 -8451
471 -8451 1066 13372 17391 12517 4881 -2894 -10754 -16714 -16109 -5961 7210 13781 14514 16714 11479
486 11479 -4123 -14539 -14418 -13881 -13490 -2492 11986 16405 12494 8610 1684 -9673 -16888 -14990
500 -14990 -6615 2208 8628 14925 18606 12464 -917 -10178 -13487 -16867 -15866 -3181 10487 13528
514 13528 11763 11636 4818 -7291 -15004 -13440 -8099 -3027 5167 15791 19279 11707 1375 -5352
528 -5352 -12010 -18439 -15456 -3953 4812 9039 13925 15133 7336 -4389 -12039 -14375 -11950 -5269 3810
543 3810 13760 17660 12048 4131 -1526 -9692 -18585 -16796 -6879 550 6773 15467 16526 8046 -1656
558 -1656 -8651 -12851 -12962 -7647 147 9597 15984 14852 8611 1517 -8355 -18631 -18644 -9411 -1725 5861
574 5861 14804 16843 10144 1310 -5687 -11702 -14742 -10908 -2290 8376 14700 14995 10931 3136 -7474
589 -7474 -15799 -16181 -11594 -5973 2872 12106 15929 12855 6248 -2945 -11302 -14594 -12410 -4892 5499
604 5499 12877 13860 12205 7135 -3652 -13229 -15493 -14339 -9749 843 11025 15402 14347 9288 -512
619 -512 -9178 -12313 -13036 -9438 1130 10063 12625 13986 11648 452 -11633 -15594 -14839 -12387 -3010
634 -3010 8705 14347 14537 11746 4166 -5021 -12142 -14840 -11758 -2367 6940 12034 15129 12961 2075
649 2075 -8522 -12780 -14527 -14596 -6903 5545 12573 14522 14023 8185 -2458 -11582 -14925 -12079 -4854
664 -4854 2719 10048 15384 13344 5228 -3638 -9792 -15677 -16801 -8952 2142 10262 14558 15311 10630
679 10630 889 -8543 -13275 -13017 -8401 -2021 7238 15121 14470 7407 424 -6917 -15625 -17704 -10055
694 -10055 -923 5897 12498 16803 13014 3599 -5131 -11066 -13845 -11774 -5255 5425 13482 13621 9707
709 9707 4549 -3619 -14123 -17450 -11509 -4725 1518 10552 17778 14980 5553 -1424 -7678 -13767 -15067
724 -15067 -7351 3023 9371 11618 12663 8546 -1603 -11873 -14897 -12677 -9054 -2055 9207 16502
738 16502 14420 8501 2997 -4587 -13217 -15515 -8765 -498 5351 10449 14252 10776 400 -8623 -12097
753 -12097 -13124 -12345 -4511 7190 13892 14000 11259 6784 -2459 -12212 -14788 -10385 -4524 1152 8895
768 8895 14882 12066 2939 -4518 -8862 -13546 -14743 -6825 4670 10756 12473 13736 10391 -56 -10484
783 -10484 -12954 -10653 -8275 -2716 7779 14685 11801 4924 427 -5779 -14030 -15198 -7610 1882 6630
798 6630 11121 15684 12771 1682 -7695 -9911 -11552 -12027 -4938 6356 12185 10384 7579 4758 -3908
813 -3908 -13019 -14542 -7942 -2224 2311 9877 16058 12456 3428 -3180 -7077 -12107 -13596 -6595 3623
828 3623 8013 8970 10266 7226 -1637 -10805 -12143 -8935 -5776 -953 8814 15190 12279 5577 1048
843 1048 -4593 -11987 -14490 -7825 388 4443 8322 11862 9480 -386 -7987 -9721 -9786 -9365 -2782 7831
859 7831 13266 11389 8331 4585 -3171 -11977 -13998 -8169 -2492 1547 7453 12898 9717 1174 -4336
874 -4336 -6928 -10165 -11086 -4020 5979 10096 10037 10021 7061 -2139 -10594 -11151 -8344 -6516 -847 7252 11971
891 11971 8791 3514 -570 -5013 -10470 -11071 -4931 2849 6630 9429 11695 8582 -486 -7710 -9201
906 -9201 -9592 -9013 -3132 6102 10078 8325 5942 2916 -3681 -10184 -10585 -5895 -284 3964 9210 12141
922 12141 9261 1146 -4782 -7867 -10549 -10415 -4458 4067 8289 8350 7401 4888 -2684 -9590 -9712 -6054
938 -6054 -2682 1577 8435 12260 8467 2248 -1957 -5924 -11109 -11368 -4687 1831 5671 8310 9323
953 9323 5959 -1315 -6862 -8506 -7135 -4789 -198 7379 11522 8430 4544 1065 -4834 -11570 -11357
968 -11357 -5203 -632 3206 8014 9894 6452 215 -4233 -6872 -8430 -6347 -1140 5544 9667 8721
983 8721 5841 2446 -3996 -9871 -10810 -6814 -3110 1226 7589 10450 7577 2359 -2402 -6473 -8932
998 -8932 -7654 -2295 4528 7802 8275 8050 4549 -2573 -8570 -9702 -8019 -5405 435 7293 9936 7829
1014 7829 4112 -521 -5118 -8079 -8149 -4158 2229 5863 8031 9116 6076 -1885 -7560 -8467 -8558 -7070
1030 -7070 -449 6282 8235 7772 6820 2130 -4224 -8075 -8537 -5976 -362 5278 7871 9160 6913 37
1046 37 -5601 -7317 -9052 -8707 -2988 4378 7463 8481 8387 3626 -3326 -7342 -8084 -6484 -2342 2970
1062 2970 6656 8475 7628 2696 -3243 -6946 -9683 -10177 -4405 2649 6574 8518 8833 4983 -1451 -5978
1078 -5978 -7752 -7247 -4491 551 5962 9764 8228 3766 -1363 -5623 -9974 -9752 -4847 318 4175
1093 4175 8186 10101 6815 1225 -4058 -7452 -8324 -6116 -1429 4771 8925 8279 4938 1530 -3493
1108 -3493 -9478 -10239 -5845 -2219 2111 8179 10886 7598 2179 -2326 -6506 -8515 -6859 -2530 2153
1123 2153 6757 8445 6987 3548 -1928 -8585 -10849 -7632 -3830 687 7167 10374 8132 3909 242
1138 242 -4570 -8593 -8846 -4866 857 5619 8077 8485 5394 -912 -6985 -8829 -7617 -6155 -1374 5581
1154 5581 9370 8751 6507 2728 -3126 -8463 -9201 -5820 -977 3152 6781 8814 6922 571 -4807
1169 -4807 -6664 -8843 -8840 -3043 4526 8251 8495 8507 4383 -2088 -7455 -8519 -7004 -3548 956 6053
1185 6053 9639 7807 2456 -2318 -5611 -9059 -9681 -4067 2603 6219 8133 9551 6772 -379 -5764
1200 -5764 -7621 -7613 -5923 -1106 5295 8505 7532 4018 134 -4298 -8627 -9368 -5109 420 3750 7623
1216 7623 10251 7727 1198 -4181 -6493 -8040 -7781 -2780 3857 6931 7095 5825 3216 -2218 -8210
1231 -8210 -8982 -5911 -2784 1240 7180 10616 7882 2551 -780 -4756 -8502 -8874 -3928 1600 4980
1246 4980 6931 7677 5023 -1439 -6840 -7727 -6645 -4776 -518 6368 9610 7837 4619 1648 -3519
1261 -3519 -8910 -9042 -4884 -668 2492 6569 8582 5693 109 -4292 -6463 -7441 -6677 -1572 4802 8217
1277 8217 7797 6532 3880 -2171 -7966 -8563 -5950 -3031 708 5718 8753 6459 1855 -1972 -4827
1292 -4827 -7793 -7744 -2805 2993 6167 7500 8123 4962 -1177 -6472 -7613 -6539 -5265 -1000 4870 8131
1308 8131 6339 3319 579 -3776 -7738 -7453 -3390 712 3613 6689 8849 5954 -135 -4186 -6167
1323 -6167 -7517 -7039 -2222 3713 6175 6197 5248 2515 -2776 -6949 -6835 -4490 -1758 1869 6368 8488
1339 8488 6129 1901 -1637 -5054 -7766 -7302 -3220 1629 4600 6270 6396 3668 -1459 -5545 -6345 -5350
1355 -5350 -3649 490 5615 7653 6331 3241 56 -4367 -7685 -7796 -4246 -323 3121 6255 6911
1370 6911 4369 65 -3602 -5671 -6301 -4334 -522 4225 6970 6723 4666 1328 -2992 -6664 -7059 -5005
1386 -5005 -1860 1724 5638 6880 4725 1360 -1785 -5218 -6332 -4812 -1534 2211 5296 6541 5668
1401 5668 2155 -2078 -5360 -7083 -6148 -3147 825 4411 6239 5298 3373 -554 -4006 -5998 -5154 -2494
1417 -2494 728 4558 6550 6119 3236 -490 -4050 -6506 -7021 -3791 -136 3304 5531 6303 4600 568
1433 568 -3316 -5079 -5432 -3970 4 3690 5649 5816 4252 871 -3342 -6020 -6324 -4992 -1725 2285
1449 2285 4947 6379 4899 1516 -2238 -4531 -5609 -4935 -1474 2519 4400 5830 5169 2249 -2346
1464 -2346 -5322 -6006 -5684 -3206 1024 4550 5929 5218 2953 -407 -3449 -5558 -5235 -2363 876 3810
1480 3810 5410 6004 3008 -1809 -4192 -5411 -6164 -4095 136 3623 5398 5362 4123 1213 -3138 -5675
1496 -5675 -5466 -3092 -732 2481 5666 5823 3096 130 -2535 -5158 -6695 -4808 -842 2651 5073
1511 5073 5897 5133 1835 -2139 -4759 -4792 -3863 -2235 1574 5648 5956 3497 1781 -1153 -5307 -7539
1527 -7539 -4559 -1643 908 3801 6439 5582 2484 -660 -3279 -5086 -4896 -3556 863 4616 5517 4574
1543 4574 3357 -507 -5019 -6428 -4537 -3129 -968 3262 6417 6239 3173 432 -2270 -5239 -6109
1558 -6109 -3783 320 2951 3842 5260 4290 627 -3719 -5439 -4889 -4732 -2384 2794 6071 6020 4031
1574 4031 2108 -1111 -4592 -6040 -4233 -1075 1565 3539 5918 5862 1261 -3210 -4190 -5016 -6027 -2684
1590 -2684 2510 4944 4659 5309 4025 -235 -4276 -5668 -4920 -2666 227 3099 5983 5484 1896 -1357
1606 -1357 -2688 -5443 -6968 -3512 1372 3280 4585 6691 5270 -20 -3567 -4444 -4711 -4411 -1017 2622
1622 2622 5316 5060 3031 1185 -1831 -5654 -6835 -4196 5 1721 4409 7318 5553 827 -1894
1637 -1894 -3316 -5276 -5646 -2401 2056 4610 4801 4379 2852 -1358 -5249 -6084 -4091 -2281 -111 4317
1653 4317 7194 5568 2461 164 -2746 -5825 -6512 -2918 811 2980 4424 4988 3379 -132 -3808
1668 -3808 -5464 -4373 -3846 -1246 4084 6792 5401 3206 1892 -1962 -5872 -6204 -3629 -1121 1129
1683 1129 4339 5649 4417 805 -2644 -4532 -5144 -4988 -1931 3063 5481 5145 4664 3141 -1046 -4859
1699 -4859 -5881 -4324 -2746 247 3864 5775 4423 1797 -764 -3569 -5298 -5352 -2405 1210 3524
1714 3524 5276 5860 4013 31 -3783 -5036 -5368 -4028 -746 2975 5072 4861 3081 697 -2690 -4958
1730 -4958 -5373 -3406 -262 2415 5022 5817 4756 1012 -2154 -3985 -5647 -4974 -1837 1845 4235 5044
1746 5044 4024 1918 -1321 -4668 -5360 -4155 -1497 1193 4195 6116 4850 2218 -636 -3489 -5606
1761 -5606 -5375 -2931 222 3322 4773 5032 2755 -712 -3332 -4560 -4596 -2420 209 3500 5383 5243
1777 5243 3167 543 -2744 -5252 -5435 -3750 -710 2133 4447 4783 3693 678 -2192 -4285 -4838 -3391
1793 -3391 -789 2427 4698 5074 4075 1430 -1627 -4506 -5713 -4619 -1909 1034 3379 4443 4179 2147
1809 2147 -1232 -3521 -4605 -3609 -1919 1283 4002 5188 4428 2325 -313 -3284 -5358 -4964 -2939 -76
1825 -76 2459 4663 4682 2711 -325 -2437 -4035 -4361 -3020 48 3083 4448 4563 3045 674 -2843
1841 -2843 -4814 -4715 -3355 -1253 1358 4062 4961 3448 946 -1134 -3639 -4606 -3585 -592 1957 3648
1857 3648 4419 3993 1506 -1869 -4047 -4402 -3878 -2444 831 3823 4629 3365 1925 -422 -2957 -4447
1873 -4447 -3704 -1215 939 2635 4359 4477 2243 -1025 -3089 -3984 -4471 -3358 275 3094 3574 3801
1889 3801 2836 951 -2727 -4184 -3651 -2064 -393 2048 4403 4653 2326 -210 -2046 -3433 -4955 -3461
1905 -3461 -629 1669 3272 3891 3816 1340 -1845 -3470 -3159 -2975 -1655 1573 3885 4177 2674 1214
1921 1214 -899 -3735 -5173 -3477 -1315 775 2638 4293 3817 1939 -1212 -2329 -3450 -3538 -2123 806
1937 806 3235 3686 3113 2484 10 -3549 -4848 -3409 -1985 -728 2135 4588 4166 2131 -1 -1730
1953 -1730 -3435 -4130 -2271 419 2398 2967 3506 3001 414 -3129 -4013 -3552 -2992 -1416 1792 4361 3870
1970 3870 2630 1633 -637 -3669 -4308 -2436 -125 1080 2893 4343 3288 492 -1957 -2968 -3863 -4089
1986 -4089 -1961 1455 3305 3330 3419 2358 -571 -3122 -4013 -2829 -1419 294 2380 4112 3426 986
2002 986 -785 -2132 -3722 -4587 -2231 753 2172 3255 4221 3418 -466 -2424 -3104 -3147 -2616 -442 2111
2019 2111 3727 3541 2005 314 -1606 -3752 -4571 -2494 76 1434 2865 4485 3787 478 -1468 -2530
2035 -2530 -3437 -3805 -1375 1600 3147 3429 2966 1302 -1142 -3790 -4270 -2687 -1085 368 2900 4747
2051 4747 3580 1433 -687 -1879 -3730 -4110 -1463 803 2453 3286 3349 2074 -601 -2909 -3882 -3184
2067 -3184 -2419 -616 3257 4494 3586 2551 602 -1437 -3999 -3540 -2171 -579 1370 3297 3965 2601
2083 2601 144 -2245 -3577 -3715 -3007 -940 2439 3720 3557 2966 1624 -1177 -3626 -3673 -2714 -1687 953
2100 953 3129 3798 2757 855 -1181 -3020 -3711 -3555 -1404 1239 2835 3842 3733 2440 -500 -3279
2116 -3279 -3469 -3134 -2281 -41 2595 3511 3173 1606 17 -2183 -3716 -3918 -2075 224 2301 3816
2132 3816 4096 2810 -71 -1937 -3152 -3614 -2858 -488 1487 3184 3707 2638 744 -1727 -3273 -3836
2148 -3836 -2758 -542 1582 3130 4276 3544 1244 -760 -2669 -3864 -3711 -1427 636 2356 3679
2163 3679 3525 1008 -719 -2541 -3657 -3407 -1608 555 2515 4178 4019 1822 -251 -2466 -3707 -3623
2179 -3623 -2063 -105 1877 3483 3444 1884 -10 -1847 -3751 -3594 -2464 -194 2099 3777 3709 2436
2195 2436 394 -1389 -3248 -3668 -3037 -1241 1222 2993 3539 2836 1076 -1273 -3300 -3565 -2461 -1226
2211 -1226 1069 3125 4259 3149 1423 -593 -2967 -3707 -3389 -1746 583 2605 3306 3341 1917 -304
2227 -304 -2572 -3129 -2959 -2013 256 2725 3823 3270 2188 338 -2027 -3402 -3679 -2352 -639 1407
2243 1407 3160 3530 2484 35 -1565 -2627 -3320 -2888 -734 1893 2965 3059 2961 1252 -1442 -3294 -3557
2260 -3557 -2769 -1696 498 2825 3488 2553 1238 -548 -2283 -3389 -2875 -774 1005 2428 3370 3475
2276 3475 1559 -1078 -2577 -3305 -3147 -2216 9 2273 3293 2750 1798 414 -1990 -3174 -3053 -1582
2292 -1582 135 1570 3272 3585 2326 -106 -1562 -3032 -3551 -2818 -590 1593 2659 2758 2582 1033
2308 1033 -1353 -2599 -2818 -2151 -1070 999 2822 3644 2369 521 -1065 -2579 -3903 -2911 -1121 858
2324 858 2318 3240 3251 1422 -772 -2239 -2563 -2497 -1437 790 2837 2980 2410 1921 -137 -2343 -3440
2341 -3440 -2876 -1821 -481 1452 3203 3279 1819 -66 -1284 -2351 -3165 -1915 203 2000 2683 2611 2253
2358 2253 464 -1822 -2931 -2877 -2127 -832 1026 3129 2965 2071 831 -480 -2423 -3150 -2120 -373
2374 -373 1033 2086 2795 2333 580 -1668 -2510 -3027 -2471 -1298 534 2572 2752 2456 1516 3 -2116
2391 -2116 -3262 -2451 -1055 312 1746 2928 2911 1278 -630 -1718 -2472 -3286 -1685 466 1842 2692
2407 2692 2365 2118 343 -1752 -2755 -2350 -1647 -279 1553 2775 2904 1459 104 -1192 -2759 -3092
2423 -3092 -2126 -243 1289 2255 3186 2429 570 -1044 -1988 -2726 -2107 -841 890 2366 2586 2021 744
2440 744 -592 -2089 -2853 -2338 -836 637 2041 3286 2747 1142 -450 -1748 -2632 -2228 -1263 506 1899
2457 1899 2318 2192 1179 -427 -2064 -2744 -2654 -1485 -30 1689 2891 2538 1540 196 -1174 -2253 -2681
2474 -2681 -1598 62 1384 2643 2434 1938 259 -1571 -2464 -2647 -1975 -700 1376 2492 2587 2369 926
2491 926 -745 -2337 -2678 -2081 -921 604 2160 2452 2000 840 -933 -2346 -2251 -1979 -885 1032 2304
2508 2304 2438 2292 1483 -453 -2080 -2723 -2113 -1203 325 1793 2411 2249 1371 -317 -1857 -2699 -2712 -1640
2526 -1640 383 1995 2528 2846 1714 -11 -1532 -2512 -2414 -2023 -497 1197 2506 2893 1819 -28 -1555
2543 -1555 -2472 -2670 -1884 -121 1201 2232 2812 2317 828 -1105 -2063 -2869 -2234 -896 803 2101 2586
2560 2586 2034 431 -942 -1888 -3003 -2568 -660 662 1823 3095 2985 1218 -524 -1948 -2813 -2525
2576 -2525 -1228 291 1617 2606 2422 1370 -117 -1632 -3089 -2687 -1202 -24 1489 2713 2726 1647
2592 1647 77 -1038 -2513 -2730 -1984 -385 1034 2381 2352 1615 304 -996 -2429 -2688 -1743 -680 1055
2609 1055 2425 3070 2024 642 -1015 -2176 -2913 -2248 -514 798 1940 2330 2184 971 -752 -2151
2625 -2151 -2393 -2475 -1336 648 2492 2941 2470 1128 -242 -1874 -2928 -2532 -1535 -11 1542 2173 2383
2642 2383 1688 -533 -1683 -2294 -2551 -1917 -50 2124 2533 2284 1868 711 -1443 -2429 -2536 -1512 -462
2659 -462 830 2632 2692 1815 -4 -1005 -1873 -2542 -2208 -236 1310 1943 2536 2298 1023 -1156 -2239
2676 -2239 -2452 -2013 -1142 374 1869 2442 2266 1082 -447 -1582 -2577 -2434 -566 572 1826 2679 3023
2693 3023 1302 -604 -1493 -2290 -2325 -2101 155 1680 2385 2238 1783 558 -1232 -2715 -2455 -1261 -318
2710 -318 1398 2603 3078 1675 278 -964 -2321 -3108 -2173 -512 796 1832 2577 2173 839 -895
2726 -895 -1929 -2503 -1603 -968 512 2287 2628 2004 829 -250 -1811 -3099 -2253 -837 355 1225 2265
2743 2265 2578 1527 -504 -1640 -2129 -2551 -1623 371 1926 2301 1841 1505 278 -1622 -2832 -2390 -1451
2760 -1451 -635 1150 2340 2676 1421 358 -1009 -1786 -2476 -1902 -196 1154 1839 2088 2296 654 -1120
2777 -1120 -2069 -2259 -2096 -936 1089 2434 2515 2014 1135 -334 -1832 -2599 -1881 -526 604 1353 2595
2794 2595 2455 960 -803 -1697 -2212 -2534 -1548 447 1978 2105 1864 1611 -121 -1361 -2290 -1843 -1288 -356
2812 -356 1252 2286 2644 1236 -31 -873 -1880 -2601 -1784 3 1296 1817 2173 2079 308 -1080 -1668
2829 -1668 -1780 -1642 -844 1035 2052 1944 1439 474 -585 -2089 -2734 -1973 -673 500 1640 2840 2207
2846 2207 1110 -622 -1527 -1904 -2248 -863 666 1798 2309 1779 1304 -255 -1812 -2321 -1861 -908 -101
2863 -101 1323 2420 2069 981 -49 -786 -1850 -2092 -1530 117 1212 1986 2084 1458 253 -1599 -2039
2880 -2039 -1850 -1543 -390 1020 2106 2100 1457 558 -760 -1920 -2356 -1649 -348 793 1479 1948 1770 389
2898 389 -1266 -1727 -1979 -1873 -1177 959 2018 1948 1840 1252 -149 -1676 -2003 -1502 -582 219 1392 2048
2916 2048 1677 475 -214 -1558 -1885 -1785 -985 457 1360 1992 1751 1328 -215 -1214 -1806 -1811 -1318 -308 1143
2935 1143 1907 1741 1124 215 -993 -1836 -2106 -1170 164 1198 1817 2309 1618 391 -755 -1833 -2031 -1389
2953 -1389 -376 666 1575 1651 1274 310 -879 -1577 -2232 -1676 -673 577 1534 1932 1624 394 -398 -1499
2971 -1499 -1776 -1497 -1059 76 1300 1864 1856 724 -332 -1624 -2183 -1607 -653 233 990 2233 2147 848
2989 848 -200 -1119 -1792 -2074 -940 44 922 1902 1532 633 -198 -1048 -1802 -1983 -1308 -287 1000 2091
3007 2091 2069 1548 317 -691 -1738 -1963 -1450 -609 691 1652 1747 1383 250 -464 -1886 -1785 -1315 -709
3025 -709 488 1595 1994 1676 457 -127 -1599 -1865 -1695 -1031 -47 1416 1845 1898 938 -339 -1717 -1823
3043 -1823 -1566 -1263 241 1733 1925 1568 1464 56 -1100 -2019 -2208 -1201 18 1064 1709 1671 1112 -125
3061 -125 -979 -1641 -1640 -1507 -204 1342 1657 1981 1691 387 -1186 -1796 -1851 -1502 -433 540 1431 1637 1533
3080 1533 401 -519 -1472 -2078 -1703 -597 1003 1482 2031 1991 714 -696 -1645 -1783 -1493 -1214 284 1633
3098 1633 2227 1875 768 81 -1186 -2340 -1749 -597 374 1182 1905 2224 1115 -251 -1198 -1841 -2086 -1670
3116 -1670 -187 926 1872 1792 1279 464 -888 -1900 -1514 -1142 -432 581 2028 2458 991 277 -504 -1689
3134 -1689 -2036 -1610 -581 266 1418 1945 1629 859 -465 -1526 -1955 -1752 -696 452 2004 2110 1230
3151 1230 935 95 -1218 -2429 -1877 -1023 119 1192 2318 2136 1249 -124 -1309 -1623 -1764 -1110 205
3168 205 1390 1770 1495 1502 628 -1298 -1951 -2056 -1228 -260 1009 1740 1583 1164 141 -705 -1378 -2044 -1493
3187 -1493 -174 891 1751 2010 1589 318 -955 -1632 -1595 -1845 -787 708 1510 1852 1276 611 -195 -1317
3205 -1317 -1619 -1550 -632 292 1189 1881 1667 741 -307 -1228 -1944 -2154 -1227 458 1062 1640 1715 1410 192
3224 192 -1415 -1373 -1742 -958 -214 823 1973 1860 1127 190 -1095 -1765 -2078 -1141 -121 956 1159 1667
3242 1667 1588 384 -453 -1376 -1802 -1405 -281 691 1667 1767 953 641 -661 -1961 -1950 -1452 -699 286 1153
3261 1153 2096 1707 669 -401 -1261 -1561 -1608 -915 417 1222 1489 1812 777 -286 -1351 -1712 -1516 -927
3279 -927 -84 1199 1787 1534 849 163 -914 -1520 -1601 -1024 135 870 1338 1506 1278 241 -932 -1835 -1655
3298 -1655 -1431 -299 925 1772 1590 1225 543 -599 -1425 -1842 -1140 -683 336 1485 1885 1313 363 -576
3316 -576 -1707 -1653 -1397 -622 308 1304 1994 1652 1099 -494 -1140 -1453 -1599 -816 99 1005 1409 1450 654 194
3336 194 -1112 -1601 -1439 -1100 29 839 1313 1586 1104 127 -760 -1301 -1590 -1068 128 637 1484 1378 1316
3355 1316 289 -694 -1414 -1551 -1348 -501 415 1472 1709 1217 641 -352 -1211 -1514 -1049 -325 475 1348 1792
3374 1792 1405 311 -485 -1078 -1515 -1524 -581 341 1322 1370 1541 1090 -427 -1234 -1516 -1518 -846 -171 1105 1528
3394 1528 1388 510 -52 -746 -1712 -1763 -678 142 727 1339 1519 1123 -162 -862 -1214 -1491 -1102 -240 913
3413 913 1745 1376 874 232 -674 -1810 -1719 -1036 -171 634 1278 1973 1353 192 -631 -1090 -1494 -1568 -294 745
3433 745 1141 1087 1401 588 -183 -1532 -1505 -1033 -743 190 1378 1686 1219 751 -66 -783 -1754 -1500 -513 319
3453 319 694 1002 1647 817 -203 -1174 -1133 -1378 -1139 -164 723 1606 1567 879 107 -828 -1488 -1405 -992 -244 479
3474 479 1354 1674 913 94 -389 -1237 -1602 -1417 -94 1012 1291 1265 1618 888 -871 -1631 -1254 -1112 -500
3493 -500 401 1289 1516 1002 366 -382 -1052 -1745 -1385 -209 612 1108 1284 1887 808 -748 -1185 -1405 -1632
3512 -1632 -1064 306 1135 1306 1068 744 42 -844 -1614 -1233 -616 -166 659 1845 1606 779 -74 -726 -1367
3531 -1367 -1493 -1251 -177 733 1135 1453 1031 291 -701 -1070 -1366 -752 -267 940 1357 1976 962 471 -226
3550 -226 -1233 -1626 -1237 -188 167 992 1374 1126 414 -507 -1003 -1428 -1352 -652 422 1419 1592 1134 757
3569 757 145 -1266 -1718 -1270 -604 -202 876 1545 1557 649 41 -658 -1206 -1614 -937 121 944 1321 1284 1063
3589 1063 74 -921 -1390 -1209 -1226 -467 606 1319 1608 924 336 -413 -1225 -1462 -1157 -32 829 937 1584
3608 1584 1397 339 -670 -941 -1094 -1454 -824 457 1337 1232 1310 771 -341 -998 -1301 -1298 -348 -11 1048
3627 1048 1544 1414 733 -253 -968 -1101 -1520 -694 56 649 1020 1421 1100 -140 -890 -1255 -1416 -940 -507
3646 -507 866 1064 1074 573 516 -613 -1359 -1549 -902 5 281 1118 1600 1050 226 -572 -1121 -1441 -1167 -348
3666 -348 578 1304 1425 1216 481 -81 -1290 -1636 -1372 -442 150 1019 1579 1255 379 4 -793 -1351 -1232 -683
3686 -683 107 859 1285 1344 552 -157 -1039 -1551 -1274 -730 -237 941 1303 1326 983 239 -649 -1373 -1417 -972 -325
3707 -325 530 1234 1300 722 224 -848 -1177 -1311 -918 -568 411 1005 1364 1171 425 -397 -965 -1463 -1342 -576
3727 -576 353 932 1457 1092 652 -268 -1249 -1286 -1134 -768 -57 1040 1474 1374 657 -240 -999 -1242 -1059 -694
3747 -694 -20 803 1165 1027 986 -258 -967 -1114 -1162 -865 -104 820 1039 1194 1179 247 -375 -1193 -1287 -755 -103
3768 -103 309 888 1297 1012 -12 -800 -997 -1450 -1140 -406 563 1312 1311 794 504 -414 -889 -1426 -1191 -460
3788 -460 68 1034 1184 1232 349 -94 -395 -1557 -1147 -429 86 636 1106 1374 618 190 -998 -1100 -1110 -853
3808 -853 16 870 1007 989 855 91 -450 -1232 -1041 -513 137 786 1187 1340 644 45 -676 -912 -1024 -1227
3828 -1227 -124 525 850 1121 866 368 -416 -1124 -918 -992 -340 401 880 1282 814 249 28 -854 -1126 -1007
3848 -1007 -501 404 769 985 1148 321 -373 -911 -1026 -1089 -676 97 1009 1119 1042 445 62 -676 -1337 -1279 -589
3869 -589 12 626 1142 1039 633 -204 -655 -1062 -1183 -824 89 732 908 939 1112 389 -623 -1055 -988 -904 -336
3890 -336 444 894 1202 670 285 -331 -887 -1239 -767 -44 776 834 1003 1284 354 -570 -1058 -967 -920 -503 168
3911 168 920 1238 818 119 -85 -918 -1305 -892 -430 -58 749 1261 1219 578 -219 -425 -950 -1243 -553 -48
3931 -48 663 1276 602 669 116 -561 -902 -1029 -530 -34 689 1093 1286 559 -346 -661 -977 -1198 -671 -102 613
3952 613 957 1199 980 305 -473 -823 -977 -695 -189 631 952 968 1060 140 -12 -906 -1174 -1064 -359 414 806
3973 806 1309 1111 466 -348 -662 -1060 -1134 -601 289 893 1310 720 693 63 -842 -1049 -1242 -597 35 572 974
3994 974 1009 385 121 -744 -933 -1050 -773 208 822 975 1295 805 -67 -828 -996 -1038 -754 -119 494 1106 1012
4015 1012 815 284 -581 -811 -943 -862 -257 90 994 1239 1089 245 -312 -860 -1128 -1268 -397 432 523 1207
4035 1207 1139 668 -77 -690 -962 -1101 -507 393 718 1202 1035 393 69 -728 -1253 -1095 -473 325 602 887
4055 887 1133 875 113 -491 -923 -1026 -648 -32 786 1245 1201 885 -20 -567 -1296 -1316 -1144 -137 122 1008
4075 1008 963 915 423 -232 -815 -1181 -990 -261 459 1062 1213 781 771 -284 -959 -1139 -867 -299 131 911
4095 911 1254 1093 580 -188 -685 -1058 -1028 -680 270 702 1030 1039 598 115 -748 -1029 -1078 -576 -240 658 1049
4116 1049 1110 691 128 -668 -935 -907 -730 -87 341 864 1065 571 395 -547 -1227 -1177 -638 -356 272 1143 1158
4137 1158 643 444 -168 -737 -1259 -1309 -472 244 687 906 809 347 -158 -870 -1071 -1048 -602 130 1005 860 895
4158 895 605 -28 -794 -964 -1087 -509 224 588 927 911 626 -58 -773 -1013 -633 -533 135 506 1117 1135 815
4179 815 263 -500 -1035 -1059 -770 -197 297 899 1235 817 113 -194 -807 -1104 -1104 -3 217 677 1090 733 362
4200 362 -73 -816 -838 -878 -358 364 667 962 598 506 -278 -709 -1163 -1111 -492 168 713 823 900 674 -159 -846
4222 -846 -995 -703 -747 179 590 947 554 582 62 -485 -927 -934 -483 -61 543 934 1016 613 212 -467 -894 -957
4244 -957 -817 -263 515 715 763 816 313 -493 -967 -858 -795 -388 168 577 890 680 754 -104 -847 -1049 -985 -338
4266 -338 100 496 1072 872 536 -170 -755 -665 -899 -515 2 905 766 794 412 336 -372 -965 -874 -364 -3
4287 -3 445 546 963 585 -67 -586 -478 -1109 -809 48 627 774 779 847 194 -512 -1003 -940 -708 -403 216 516
4309 516 829 653 270 -119 -701 -668 -786 -303 220 632 678 1106 455 -383 -644 -975 -776 -662 -213 690 1054
4330 1054 706 220 -235 -745 -1063 -759 -400 106 552 718 883 352 -130 -291 -807 -751 -539 -103 641 747
4350 747 1001 428 -7 -311 -757 -674 -676 -224 366 968 845 649 36 -50 -590 -951 -717 -130 374 635 645 549
4372 549 494 -331 -530 -1038 -589 -394 586 777 759 849 226 138 -723 -908 -557 -335 -16 291 795 743 217 -144
4394 -144 -778 -664 -914 -528 250 796 530 1017 588 -65 -620 -558 -883 -349 166 515 924 753 419 152
4414 152 -226 -1021 -853 -759 -181 325 847 670 675 139 -554 -876 -800 -486 -163 568 948 949 555 547 -281 -1021 -852
4437 -852 -700 -293 390 652 720 771 295 -123 -523 -782 -859 -236 256 644 862 663 425 -34 -758 -883 -903
4458 -903 -179 165 680 772 781 519 -198 -411 -810 -736 -822 -173 541 604 1101 688 -29 -574 -590 -882 -421 78
4480 78 698 926 763 515 284 -509 -447 -733 -575 -158 328 540 1138 738 414 -340 -658 -664 -806 -268 555
4501 555 686 995 903 409 -80 -824 -837 -894 -365 30 412 992 915 363 179 -518 -628 -778 -693 -7 824 681
4523 681 671 302 -260 -665 -811 -1015 -727 -115 339 804 875 658 129 -273 -832 -560 -655 -237 447 1065 626
4544 626 632 375 -379 -741 -824 -383 -344 8 617 804 915 184 -344 -672 -896 -473 -323 151 517 970 854
4565 854 317 -84 -566 -706 -866 -447 160 560 827 777 446 103 -324 -804 -783 -548 -244 549 622 826 447
4586 447 49 -592 -489 -711 -811 -126 567 813 928 761 544 -429 -877 -729 -616 -185 158 1007 682 542
4606 542 68 -120 -486 -1095 -696 -68 315 494 906 646 273 -47 -635 -872 -722 -208 -50 834 452 501
4626 501 430 -103 -539 -924 -860 -421 23 541 830 741 398 96 -475 -707 -765 -453 -177 499 765 771 408 64
4648 64 -346 -650 -651 -231 -72 39 834 1224 351 -2 -543 -928 -1082 -731 -248 550 722 755 583 637 -320 -698
4670 -698 -717 -638 -327 263 688 901 540 343 -161 -411 -710 -733 -471 232 589 723 964 443 -195 -576 -433
4691 -433 -908 -506 179 538 882 574 587 163 -766 -891 -836 -518 -77 332 615 661 482 -188 -327 -637 -712
4712 -712 -731 0 233 612 754 578 305 -399 -806 -495 -610 -354 170 828 755 454 295 -42 -645 -948 -581
4733 -581 -188 309 278 988 726 238 -217 -503 -741 -738 -238 -123 388 631 672 704 -41 -592 -757 -579 -145 -160
4755 -160 512 583 474 575 78 -8 -597 -640 -430 -53 438 309 775 435 -60 -310 -898 -643 -357 -333 144
4776 144 656 740 459 332 -157 -664 -820 -747 -568 -22 305 731 702 169 -117 -838 -531 -346 -651 285 715
4797 715 799 606 533 -40 -434 -861 -579 -203 -36 480 662 540 485 254 -64 -694 -501 -496 -137 199 783 907
4819 907 536 45 -471 -471 -636 -903 -309 98 861 685 624 115 -302 -463 -618 -461 -214 350 579 539 481 -51
4841 -51 -360 -532 -615 -660 -187 366 625 863 584 397 -176 -534 -516 -351 -83 -108 119 657 566 387 -119 -486
4863 -486 -895 -419 -121 -90 335 620 818 143 -199 -523 -577 -505 -297 -151 481 631 697 380 -131 -622 -668 -689
4885 -689 -449 -352 313 504 662 625 5 -352 -602 -851 -469 -78 430 489 646 622 215 -297 -662 -659 -887 -250
4907 -250 20 773 857 447 406 -338 -279 -593 -377 -421 210 495 930 513 145 6 -365 -852 -390 -486 157 380
4929 380 590 541 462 168 -217 -659 -535 -250 171 237 776 735 564 180 -296 -494 -904 -465 -72 452 601
4950 601 644 364 206 -44 -408 -823 -639 -225 393 553 595 394 285 -462 -819 -539 -458 -321 -7 530 730
4971 730 484 502 -28 -857 -933 -516 -169 499 594 804 711 240 -203 -535 -565 -533 -515 -339 577 566 541 377 210
4994 210 -309 -697 -581 -319 1 356 565 615 293 -80 -407 -417 -490 -548 -282 420 699 710 461 177 -49 -659
5016 -659 -492 -350 -187 -78 803 569 297 40 -265 -432 -810 -539 -45 500 275 698 844 343 135 -712
5036 -712 -763 -472 -426 -25 567 591 503 127 -153 -338 -797 -415 -194 -43 177 846 869 275 -284 -631 -342 -613
5058 -613 -403 199 358 647 705 342 354 -303 -713 -813 -451 -58 173 944 795 231 162 -197 -602 -918 -466
5079 -466 -193 117 212 391 589 224 -194 -409 -432 -685 -404 340 405 666 323 271 133 -436 -720 -456 -255
5100 -255 28 456 681 587 151 121 -113 -710 -554 -184 138 0 487 839 425 47 -355 -464 -642 -410 -205
5121 -205 107 589 429 700 24 -68 -389 -625 -539 -234 342 545 437 236 217 -138 -541 -725 -550 -253 63
5142 63 268 771 564 64 -290 -486 -897 -462 -236 385 393 421 406 164 -81 -224 -630 -573 -275 154 295 554
5164 554 556 373 241 -525 -319 -561 -263 85 173 361 566 486 61 -298 -465 -667 -551 -213 386 417 611 405
5186 405 236 -300 -671 -601 -499 -231 289 371 356 684 400 -144 -339 -767 -434 -559 47 500 621 156 345
5207 345 -196 -370 -577 -454 -217 183 507 417 521 147 172 -455 -250 -461 -543 -182 408 371 368 290 11 -458
5229 -458 -457 -540 -533 -35 581 403 414 105 152 -324 -594 -561 -332 22 251 555 871 543 216 -470 -540 -579 -386
5252 -386 -286 -47 587 457 341 15 -123 -517 -619 -348 -350 196 408 436 585 245 -255 -446 -264 -500 -450
5273 -450 283 333 487 414 289 -63 -577 -589 -473 -249 -135 132 451 702 335 34 -215 -529 -512 -326 -17
5294 -17 676 348 547 696 101 -441 -496 -667 -608 -252 275 389 504 460 -13 -297 -573 -494 -434 -253 145 143 347
5317 347 600 73 -125 -466 -584 -490 -308 6 322 444 455 385 -1 -134 -421 -567 -134 -146 352 379 668 289
5339 289 -21 -186 -634 -490 -312 271 169 518 632 612 -16 -196 -405 -777 -541 -119 395 538 394 206
5359 206 -1 -317 -437 -464 -355 -26 137 253 488 412 -21 -56 -446 -735 -433 -227 222 171 476 439 310 -160
5381 -160 -443 -520 -500 -372 15 346 595 259 138 127 -459 -546 -562 -236 114 318 539 391 173 -150 -328 -445
5403 -445 -747 -321 171 432 639 518 248 -307 -182 -509 -711 -159 -62 129 599 794 287 157 -381 -577
5423 -577 -407 -597 104 30 302 560 456 212 -251 -559 -331 -537 -9 257 546 430 574 299 236 -322 -518
5444 -518 -477 -215 409 364 683 569 231 48 -663 -502 -425 -408 183 183 477 288 206 131 -228 -457 -423 -478 24
5467 24 357 375 576 265 20 -227 -487 -863 -274 -229 -21 361 406 428 277 -251 -231 -752 -463 -190 468 462 619
5490 619 232 203 -13 -391 -578 -312 28 340 563 496 603 167 -219 -344 -359 -533 -343 168 452 377 508
5511 508 381 155 -312 -641 -385 -95 -147 296 485 296 358 147 -453 -333 -493 -476 -141 119 536 417 417 -51
5533 -51 -136 -502 -567 -485 -202 360 585 913 84 -68 -259 -394 -471 -188 -301 136 213 507 416 169 -38 -364
5555 -364 -278 -358 -333 1 634 448 388 21 0 -327 -657 -434 -507 -102 226 587 589 117 -105 -169 -548 -554 -204 -188
5579 -188 21 210 510 385 -142 -334 -470 -305 -419 124 402 557 286 566 154 -227 -387 -556 -287 -258
5599 -258 160 287 387 209 21 -458 -419 -316 -395 103 150 474 438 443 288 -138 -368 -372 -412 -29 -8 285 509
5622 509 328 94 66 -88 -417 -387 -127 269 165 595 500 99 169 -133 -442 -570 -458 -101 204 360 102
5643 102 138 10 -459 -460 -574 -445 -263 259 351 367 526 285 -185 -257 -518 -195 115 365 347 581 445 111
5665 111 -290 -483 -369 -489 -16 23 251 504 471 81 83 -147 -584 -660 -116 149 207 264 309 64 286 121 -444
5688 -444 -463 -128 51 525 424 425 102 -164 -428 -314 -465 -253 58 270 329 484 56 150 -386 -510 -374 -299
5710 -299 39 239 613 470 255 83 -67 -373 -531 -532 -2 111 364 392 240 284 54 -427 -565 -384 -284
5731 -284 73 431 552 389 167 232 -414 -266 -243 -121 32 554 494 320 72 -79 -357 -658 -284 -179 94
5752 94 342 385 233 128 -168 -439 -554 -224 -66 161 211 339 686 519 -12 -106 -440 -351 -257 -25 162 288
5774 288 355 217 142 -328 -287 -311 -510 -117 401 354 561 234 38 -32 -271 -405 -363 -108 55 258 324 404 49
5797 49 -281 -530 -334 -613 -318 291 375 500 177 -37 -73 -129 -512 -366 -172 -35 380 324 368 169 -90 -258
5819 -258 -291 -463 -412 -231 207 530 270 264 -118 -130 53 -511 -509 -65 62 445 593 283 54 -207 -361 -364 -382
5842 -382 -308 127 272 519 445 310 -182 -224 -269 -194 -269 76 351 449 475 126 -120 -406 -532 -451 -215 -62 -33
5865 -33 290 111 336 -49 -282 -199 -502 -369 -13 303 376 367 27 179 -387 -336 -387 -203 -16 203 395 317 278
5888 278 119 -285 -431 -483 -225 59 56 200 250 360 -128 -98 -478 -223 -355 180 264 364 354 324 151 -79 -272
5911 -272 -424 -358 42 -36 446 466 445 360 34 -211 -186 -359 -240 188 320 453 440 401 57 -258 -443 -357 -382
5934 -382 213 289 259 289 209 -55 -558 -454 -593 -393 -98 -97 308 391 321 22 -392 -283 -333 -301 45 273 358 374
5958 374 441 44 -152 -421 -334 -459 -197 113 30 424 527 122 -214 -222 -505 -428 -242 221 141 587 280 97
5980 97 -121 -316 -447 -343 99 -217 131 419 410 253 -175 -20 -258 -202 -230 -156 67 301 205 243 -7 -414 -374
6003 -374 -407 -123 66 399 342 505 113 -96 -100 -172 -337 -604 106 295 329 439 273 -88 -134 -361 -651 -278
6025 -278 -162 101 444 503 493 340 -125 -276 -333 -417 -99 160 156 396 426 191 56 -92 -176 -454 -281 175 54
6048 54 472 371 208 -10 -218 -287 -502 -144 158 171 13 376 382 -53 -255 -242 -375 -402 56 287 398 470 257
6071 257 172 -248 -92 -275 -295 -124 165 591 199 -58 149 -366 -309 -481 -142 -398 273 134 456 315 31
6092 31 -161 -61 -293 -315 -210 110 178 212 491 -80 27 -158 -275 -156 -255 93 156 375 429 295 77 -438
6114 -438 -183 -337 -114 -233 186 50 381 78 -22 73 -547 -254 -281 46 -113 285 339 161 303 -76 -164
6135 -164 -143 -298 -87 -15 167 557 -2 113 53 -53 -175 -236 148 -102 440 232 187 137 -7 -111 -399 -543
6157 -543 -167 -9 -27 405 461 229 80 -261 -300 -328 -152 183 217 371 285 202 106 -296 -357 -414 -317 -192 227 230
6181 230 125 315 175 -196 -236 -321 -130 132 281 530 279 323 81 -53 -315 -491 -72 -411 23 520 216
6202 216 274 221 79 -117 -604 -179 -41 136 -68 506 251 135 61 -360 -72 -405 -249 0 385 449 342
6223 342 135 167 -279 -26 -69 -94 -59 212 355 349 349 -295 -57 -379 -385 -312 -26 373 -22 386 301 73 -261 -349
6247 -349 -148 -124 -115 349 128 324 184 -16 -132 -378 -591 -274 188 45 478 301 241 131 -193 -313 -345 -379
6269 -379 -147 124 308 136 29 43 -32 -154 -79 -251 -373 139 327 371 26 83 -65 -161 -349 -216 -89 128
6291 128 208 134 294 262 344 11 -307 18 -222 6 -176 171 378 297 208 -91 24 -316 -201 25 -65 211
6313 211 301 -66 167 -47 -483 -320 -186 -334 -24 195 350 207 202 -209 -73 -239 -244 115 -214 157 352 296
6335 296 -150 -146 -59 -375 -219 -351 312 265 402 231 109 159 -130 -238 -325 -81 -232 152 -130 245 -148 70
6357 70 -231 -418 -224 -107 -158 -45 355 414 252 -245 -103 -178 -469 -196 55 332 44 169 266 145 8 -121
6379 -121 -579 25 -85 168 182 363 425 8 169 -100 80 -152 -35 87 220 480 35 289 -390 -41 -347
6400 -347 -216 -245 -130 299 152 225 -66 339 16 -221 -178 -151 166 300 366 166 32 -176 -110 -102 -208 -27 69
6423 69 228 144 225 367 188 38 -57 -429 -253 -567 18 271 217 114 -163 -12 -295 -231 -298 -43 159 -13
6445 -13 371 133 -93 25 -358 -445 -165 -81 211 100 87 150 15 36 40 -169 -136 -93 151 -52 -157 250 82
6468 82 -252 -47 -202 -232 5 171 280 79 89 -166 -109 7 -375 -283 -202 82 75 213 392 94 46 -134 -198
6491 -198 3 -341 36 41 88 256 39 -44 74 -496 -276 -83 -242 -8 253 266 223 211 -66 -30 -202 -163 -253
6514 -253 -62 128 343 258 211 53 33 -224 -357 -144 -14 -51 285 126 257 6 -332 -111 -62 -166 28 -35
6536 -35 269 272 141 54 -223 -501 -299 -141 109 29 165 69 -62 297 -311 3 -187 -100 -14 -55 219 219 89 -65
6560 -65 10 -150 -531 -22 -69 117 66 262 6 -31 -95 -391 -301 -144 -281 174 -99 277 259 15 -53 8 -249
6583 -249 -203 -56 3 306 106 173 95 385 -79 -439 -164 -217 -6 150 65 377 115 163 -56 -259 -214 17 21
6606 21 18 23 289 267 120 -66 -131 -98 -136 32 124 11 177 120 118 -91 -467 3 -147 -212 -59 49 -39 36 105 -94
6632 -94 -172 -115 -113 78 -78 132 176 181 85 -137 -201 -86 -94 -231 0 161 124 -96 140 10 -55 -140 -223 -143 -171 326
6658 326 72 387 345 109 -23 -300 91 -350 41 -157 512 144 97 89 -211 -260 -119 -9 -451 -198 274 28
6680 28 327 83 40 174 -246 -137 -80 33 109 263 291 12 235 -68 -190 -269 -141 -147 -46 312 136 -195 -108
6703 -108 -66 -283 -234 -177 -92 6 404 205 244 -94 -57 -380 -254 -210 -268 210 174 98 194 83 -102 36 -245 4
6727 4 -4 -89 183 118 176 268 -112 -203 -78 -190 -103 -65 31 206 137 142 20 -181 13 -66 85 219 323 199 123 -31
6753 -31 373 43 -124 -165 67 55 -146 32 259 -24 -145 -4 -437 -72 -37 232 -3 329 83 5 -64 53
6775 53 -154 -176 103 29 31 264 193 95 -46 -194 -136 -103 -124 -32 210 158 418 235 -61 -174 -127 -447 -56 170
6799 170 -87 208 169 291 -26 -62 -245 -126 -323 11 235 95 90 -186 261 30 -185 16 -22 -169 56 126
6821 126 316 111 -13 -7 62 75 -102 -140 -161 -8 37 204 -107 -157 -51 39 -130 0 365 50 273 317 164
6844 164 -100 17 101 -130 -222 -113 411 156 115 167 69 17 -370 -184 -280 -280 38 239 32 -53 81 -148 -209 -304
6868 -304 -307 74 -165 -86 294 214 -227 -104 -46 -105 -90 -31 203 32 55 69 36 -29 -34 -55 -39 47 -140 314 295 294 61
6895 61 -189 -203 -37 -251 -286 71 25 183 218 130 97 -184 -190 -200 -299 53 64 85 124 69 81 143 -115 -166 -161 60 274
6922 274 169 -116 419 153 -198 -22 -149 167 -160 388 36 174 -27 89 -2 -100 40 -280 128 127 74 294
6944 294 239 156 -53 -365 -59 -255 -246 -138 251 109 141 -189 126 192 -10 252 -10 275 122 175 75 371
6966 371 181 -201 -293 -63 -171 2 206 16 12 180 124 35 -10 184 -196 -27 219 -69 -5 3 158 -31 -171
6989 -171 -167 -42 -36 27 10 -62 59 -64 248 -194 54 -92 41 -211 32 261 167 29 17 -234 -97 -250 -50
7012 -50 61 107 18 192 179 -24 -3 -47 -241 -6 25 -90 185 -88 173 87 -164 -212 -78 -197 -151 151 177 251
7036 251 6 -25 -133 -5 64 -220 -210 -65 151 -53 -99 82 24 -54 -113 -50 -147 56 169 388 -86 53 196
7059 196 -76 -68 11 -187 126 -2 47 -48 -12 -243 -94 143 -161 338 74 -95 127 83 -214 -85 -60 -92 -197
7082 -197 -65 -80 59 165 306 -155 -10 -72 -123 30 -7 -12 -123 152 116 205 147 165 -100 36 49 -15 145 117
7106 117 47 63 -115 61 -120 141 -71 -328 -51 229 5 30 -29 -67 -163 -176 -265 -181 73 -52 129 356 41
7129 41 213 162 -108 89 59 -97 137 -146 220 45 -66 130 -85 -156 -266 234 151 302 122 21 -42 32
7151 32 16 223 -144 -204 -191 149 52 209 -52 -112 -107 -208 -49 -78 86 -234 -17 103 183 31 -84 84 -123
7174 -123 -13 -296 -151 213 -53 164 -82 -52 -56 -182 -137 -78 150 -104 97 -152 -245 -71 -251 -244 -31 82 -21
7197 -21 -77 17 89 -196 -73 -124 -141 -44 -74 -150 -37 29 -74 -175 -43 121 -437 76 69 -13 4 157 46 -21 -214
7222 -214 136 35 -128 -53 38 31 69 238 199 -119 -17 -4 -169 -49 299 26 87 138 300 -181 -121 -73 -269 78
7246 78 -70 154 127 282 47 -30 -104 -10 -152 -133 10 104 -12 288 298 111 -22 -161 66 -343 -243 319 -129
7269 -129 270 170 38 92 -46 12 -22 107 -91 78 -43 83 41 214 -152 -137 -196 -143 -86 -37 136 163 93 -86
7293 -86 95 43 22 -102 7 0 34 -253 -29 24 -172 -180 -55 130 -36 -7 99 205 -87 -32 -31 -34 -135 29 8
7318 8 11 107 -8 66 -83 -232 -288 -110 -136 -88 -22 -36 -35 -47 65 43 110 128 -166 49 -8 195 -126 36 -64 -88
7344 -88 172 77 11 110 199 27 236 121 231 -164 115 -8 33 14 143 -117 158 -157 145 150 -205 -165 -99 -93
7368 -93 138 224 286 195 -81 309 183 53 51 -38 35 341 -89 122 90 32 -31 -126 128 50 172 214 253 60 -63
7393 -63 -93 119 -220 -201 -38 -281 39 270 -60 -11 -128 -141 -100 -188 41 -89 62 -151 -53 297 -60 -231 -117
7416 -117 -31 32 -283 109 220 -56 -39 -95 285 -71 -171 -133 34 50 -112 83 166 74 134 39 -16 171 126 -107
7440 -107 -230 19 15 -95 8 -138 -55 49 174 -6 67 128 223 130 -223 174 59 -74 59 2 -49 154 -204
7463 -204 -148 131 46 -145 -252 123 227 -150 -41 343 -24 -111 -23 197 4 47 -71 24 219 151 84 -94 72
7486 72 305 -10 131 130 63 -65 181 -84 26 -78 134 -86 54 109 129 9 25 80 -167 -61 -169 5 71
7509 71 227 122 100 17 10 63 221 116 62 16 153 314 21 67 173 79 -127 -126 -266 -247 -57 11 -166 -110 -152
7534 -152 -15 53 -26 104 27 199 369 205 -140 38 64 -33 -297 -108 -57 44 -180 -100 337 -17 -111 -92 -122
7557 -122 16 23 -174 92 214 -197 13 117 64 76 140 -25 -136 55 -55 233 94 89 27 76 306 -225 -135
7580 -135 -76 278 -351 66 -13 251 121 -18 114 -43 51 -9 -33 -159 172 84 79 -136 -61 37 -208 161 206 -18
7604 -18 45 -39 77 20 71 -29 -55 -69 135 -20 61 -85 -9 -253 147 67 74 -119 128 160 -25 -6 -81 -33 152
7629 152 -13 139 -4 -199 174 138 123 -36 68 65 -128 127 -20 -120 -126 87 -251 -35 -39 -129 52 -86 180
7652 180 -77 110 -100 -145 -80 -194 -196 -130 84 34 42 -75 102 -22 -104 -72 -130 2 -29 -22 223 144 -59 -257 201
7677 201 -204 -178 -119 10 103 -33 51 125 264 63 -298 256 -20 -103 -124 7 88 93 -39 -67 165 6 -85 34
7701 34 440 185 71 -272 -24 38 -7 -35 116 191 -20 -118 70 41 164 17 -103 -148 -259 -106 117 98 -267
7724 -267 94 -48 48 -46 193 94 -52 55 -5 260 64 89 -196 -44 166 -14 33 138 162 -38 85 -104
7746 -104 -320 63 29 104 -99 -245 0 -20 30 -42 -19 189 -217 -164 76 -65 -81 -77 29 -59 -153 -42 25 201
7770 201 -281 152 -32 -39 42 226 -44 50 -299 -212 -28 71 102 125 227 -258 -185 -127 90 -10 248 -147 88
7793 88 131 -345 41 47 123 154 -15 -204 -151 36 -73 409 96 34 -86 -200 -148 243 -138 20 -71 -31 39 185
7817 185 262 141 311 246 -117 184 -25 89 58 -160 105 -257 -158 -260 -11 -13 -13 215 -132 -347 -1 227 193
7840 193 -58 -372 6 -223 -114 -36 152 99 44 81 -83 50 -78 -75 52 -143 97 137 113 -31 -255 36 128
7863 128 -120 305 174 252 -19 -8 -7 221 -20 -157 106 -69 124 180 59 -57 119 -52 91 131 129 -64 155
7886 155 -47 -234 71 44 -12 26 -48 115 25 -78 -46 145 100 36 -39 52 -237 -244 89 130 -18 325 34 44 -184
7911 -184 -148 31 -139 -181 87 -65 39 9 7 -145 -106 -143 -303 -58 -13 172 77 100 13 -67 68 -14 84 -83 14
7936 14 -178 -139 202 155 -419 -119 -126 -249 37 204 -15 261 10 114 110 -44 -202 -121 179 -134 -61 58 189
7959 189 139 13 -116 -165 -60 -7 24 -98 123 92 24 34 -145 148 -112 -127 -267 32 -65 -87 -76 -35 -54 -284
7983 -284 43 32 47 255 85 -162 -19 -193 -314 74 -417 196 270 -101 119 -114 186 169 89 103 151 50
8005 50 -174 245 -84 23 79 222 -126 -103 164 135 -267 17 338 200 19 -317 -180 120 124 -26 -253 137
8027 137 197 158 -128 149 -331 159 82 131 -76 -308 -85 266 369 -208 -85 -58 91 102 267 54 200 -59
8049 -59 176 253 -129 -64 80 -159 -264 13 -58 -23 -87 8 56 -117 82 79 -147 123 -149 14 -250 -64 -92 -54
8073 -54 47 -28 -123 -24 169 -8 -86 108 -113 152 44 16 70 -208 -35 163 133 -184 236 250 4 -11 -15 161
8097 161 88 9 143 65 -73 55 -164 -152 178 -171 102 76 248 190 -74 79 -131 -43 97 250 -211 -60
8119 -60 137 160 -105 -47 1 30 -264 28 -349 36 130 80 125 177 -241 -174 124 -13 2 -178 69 317 71 112
8143 112 21 -169 88 27 -49 -19 74 -43 -25 -128 231 -97 79 37 -15 40 -158 -70 177 98 -68 117 110 186 24
8168 24 26 -253 220 -70 -49 223 -257 166 -150 130 -134 137 5 148 6 -109 189 -189 141 -7 27 -151
8190 -151 -63
8191f3
$$ Imaginary data points
##PAGE= N=2
##DATA TABLE= (X++(I..I)), XYDATA
0 0 0 0 0 0 0 0 0 0 0 0 0 0 0 0 0 -1 8 -8 8 -8 8 -16 16 -16 24 -24 29 -33 40 -44 49 -57 65 -74 84 -94 108 -118
38 -118 133 -149 166 -183 204 -226 250 -275 306 -336 370 -408 449 -495 546 -604 666 -737 818
57 818 -911 1020 -1147 1300 -1487 1724 -2034 2454 -3068 4052 -5879 10485 -52030 -53828 20654
72 20654 12076 33833 67767 62774 1329 -29247 -32697 -36049 -45678 -22116 25175 60029 48282
85 48282 25173 15546 -5318 -54985 -71224 -35967 -6921 -4962 22532 62687 57084 14078 -8841
98 -8841 -17716 -37755 -49756 -24087 17596 37598 34161 32906 29186 -580 -41317 -51356 -36144
111 -36144 -28177 -15525 22360 53445 46058 22742 8721 -8161 -34259 -45158 -26357 1222
123 1222 17216 26948 40874 38969 5032 -31219 -38588 -36874 -40610 -21410 21254 43050 34739
136 34739 29405 24557 -2593 -34347 -39204 -25100 -10451 5560 27238 41751 33037 5310 -17194
149 -17194 -25965 -35879 -42115 -21559 13698 28496 28870 35909 31356 -426 -29027 -29472 -22402 -19196
163 -19196 -3332 22972 35224 26202 11328 -924 -17420 -36463 -39301 -20879 2291 15950
175 15950 27774 37571 29465 3705 -15963 -22008 -24695 -24235 -8964 15611 28635 24782 16406 6405
189 6405 -12675 -33055 -35346 -19431 -4937 7249 24914 36223 27258 8284 -5610 -17448 -27333
202 -27333 -26139 -10677 9028 21225 23665 20007 10064 -8030 -26594 -30930 -21561 -11187 1173
215 1173 21505 34214 26829 11946 1057 -12385 -26947 -26409 -11577 3001 12600 21027 23415
228 23415 13423 -4460 -19136 -25308 -23927 -16466 -1550 17715 28777 25751 17182 6468 -9516
241 -9516 -23944 -25272 -14803 -3272 8299 19980 23643 15008 -314 -13723 -22053 -24613 -19006
254 -19006 -4463 12762 23789 25768 20380 9555 -5768 -19549 -24389 -18271 -6929 4993 15760
267 15760 21947 18181 4518 -9433 -18181 -22272 -21130 -9195 8351 20983 23878 20988 13821 -1326
281 -1326 -17148 -23419 -19183 -10043 -241 12345 21840 19673 7177 -5183 -14094 -21130 -22897 -12246
295 -12246 4883 16978 21605 22738 17501 2349 -13923 -21409 -19797 -14346 -4861 9396 20154
308 20154 19701 10513 310 -9738 -19824 -23082 -14257 437 11752 19110 23378 19962 6047 -10068
322 -10068 -18316 -19331 -17488 -9400 5909 17995 19067 12681 5238 -4887 -17863 -23424 -15940 -2995
336 -2995 6375 15658 24302 22589 8137 -6475 -13752 -19033 -21723 -13238 3769 15338 16815 15648
350 15648 11515 -1203 -17090 -21638 -15700 -8229 96 13835 25085 22670 9881 -785 -9334
363 -9334 -19638 -24550 -14852 1089 9765 14317 18739 15831 1038 -13896 -17476 -16045 -13759 -4106
377 -4106 12491 22951 20517 13284 5969 -6078 -20434 -24108 -15560 -4725 3879 13380 21111 17682
391 17682 4230 -8391 -14159 -17554 -18036 -8089 9546 19755 18881 16703 12262 -2743 -19529 -22857
405 -22857 -16063 -10444 -1892 12745 22082 18020 7238 -1804 -9682 -18225 -21070 -9734 5578 14041
419 14041 17246 20161 16754 -323 -16805 -19457 -16804 -16183 -7070 10738 20984 17294 10680 5551
433 5551 -5406 -19555 -22068 -10769 586 7512 15924 23743 18301 1682 -10252 -14317 -19442 -21686
447 -21686 -9584 7890 16314 16649 15874 10743 -3253 -17116 -19920 -12636 -5767 1285 13739 23874
461 23874 19188 5429 -3474 -10907 -21989 -23943 -10620 4138 10830 16046 20079 13482 -833 -12066
475 -12066 -16521 -16023 -11293 -1772 11801 21683 19353 9541 1436 -7741 -20443 -24108 -12878 -1567
489 -1567 4675 14526 22752 16994 2759 -7043 -13042 -18205 -16133 -4528 9033 16606 17599 14243 7400
504 7400 -4624 -18507 -22111 -15653 -7987 333 13949 23264 17399 5864 -1589 -9255 -17999 -18133
518 -18133 -7299 4337 11333 15676 18009 12156 -2870 -15737 -18445 -16534 -13239 -3185 11835
531 11835 18950 16097 11603 5322 -6368 -16937 -18650 -11632 -1401 8237 15183 18490 13542 1310
545 1310 -10917 -15150 -16730 -16727 -7170 7708 15510 16438 15954 9364 -4271 -14522 -16303 -13359 -6248
560 -6248 3804 12242 16580 15593 6713 -4949 -12948 -17636 -19283 -10641 4310 13734 16593 17148 11852
575 11852 -658 -11046 -14515 -14148 -10040 -1061 9798 16588 16157 8584 -1281 -9968 -16645 -18201 -10934
590 -10934 -189 7720 14091 17977 14073 4202 -5573 -13253 -16057 -12222 -3602 6060 14155 15902 9867
605 9867 2460 -5021 -13861 -17904 -12682 -4215 3521 12732 18391 14981 6284 -2341 -10747 -15508 -12421
620 -12421 -6332 553 10055 15504 11707 6040 -266 -10662 -18630 -14715 -6313 480 9325 17330 16107
635 16107 8583 1228 -6818 -13389 -14382 -9860 -2109 7695 13888 12832 8093 1753 -8687 -16221 -13790
650 -13790 -7939 -3082 5677 15434 16411 10534 3750 -3458 -12045 -15332 -11664 -3455 5043 10493 12406
665 12406 10506 4136 -5824 -12518 -13142 -11020 -6046 4153 13664 15620 12246 6660 -1313 -9763 -14406
680 -14406 -12222 -5970 1399 7668 11519 12559 6388 -3994 -10008 -11468 -12743 -8299 2339 11013
694 11013 12811 12034 9579 1961 -7829 -12981 -12068 -8122 -1948 4925 11539 12906 7097 -1370 -6692
709 -6692 -10194 -13496 -10191 554 8223 10924 12954 12595 3981 -6988 -11460 -11202 -9804 -5572 3808
724 3808 11105 11676 7095 2845 -2390 -9963 -14282 -9655 -1502 4616 9029 13782 13636 4870 -4347 -8873
740 -8873 -10532 -11933 -7872 2088 9558 10398 8224 6041 -441 -9584 -13354 -9090 -3353 981 7591
755 7591 13883 13491 5480 -1616 -5767 -10904 -13602 -9158 371 6966 8867 9537 8442 1137 -8071 -11942
771 -11942 -9082 -6199 -2516 6200 14028 13287 6599 1917 -3144 -10731 -15087 -9677 -1185 3608 6732
786 6732 11410 10622 2229 -6367 -9034 -9018 -9375 -4711 6042 12869 11669 8136 5290 -1499 -11304 -14786
802 -14786 -9211 -3466 -95 6297 12746 11232 3036 -3627 -6183 -9607 -11824 -5915 4632 10135 10171
817 10171 10264 8439 -247 -10164 -12577 -9441 -6683 -3055 5268 12335 11053 4367 241 -3881 -10192
832 -10192 -12741 -6675 2130 6729 9235 12092 10221 1235 -7968 -10664 -10360 -9939 -5498 4694 11823
847 11823 10472 6178 4129 -1893 -10446 -13115 -7150 -651 3560 8730 13861 11523 2327 -5341 -8403
862 -8403 -11265 -12732 -6680 3667 9606 9748 8741 7036 -394 -9889 -12008 -7354 -3575 288 8017
877 8017 14120 11330 3366 -1917 -5976 -12363 -14214 -7015 1555 5656 8960 11480 9033 421 -7505
892 -7505 -9434 -8813 -7093 -1933 6723 12870 10859 6060 2127 -3961 -11828 -14307 -8501 -1962 2936
907 2936 8119 13214 10594 2343 -4201 -7403 -9683 -10162 -3696 4716 10030 10641 8983 5263 -2467 -10894
923 -10894 -13197 -9670 -4895 -4 7305 12969 11227 4634 -999 -5384 -10131 -11875 -5879 2811 7694
938 7694 9779 10595 7931 -1032 -9078 -11505 -10334 -8436 -2939 6752 12074 11175 6861 2689 -3886 -10209
954 -10209 -11898 -6751 -262 4824 8563 11655 9409 1163 -6404 -9475 -11054 -11244 -4618 4922 10106
969 10106 10000 9234 5651 -2023 -8966 -10679 -8089 -4059 1802 8349 11624 10008 3587 -3279 -7394
984 -7394 -11024 -11827 -6549 2073 7635 9825 10903 8214 439 -6916 -9989 -9662 -6480 -766 6197 10629
1000 10629 10271 5272 -101 -5049 -10516 -12241 -8000 -711 4581 9280 11879 9179 2139 -4345 -8268
1015 -8268 -9640 -7930 -2780 3693 8950 10170 6904 2779 -2774 -10170 -12515 -8182 -2740 1602 7754
1030 7754 12217 9595 3730 -705 -5538 -10460 -9806 -4990 1072 6808 10090 8650 4632 -1062 -7924
1045 -7924 -11605 -9154 -5209 -1005 5573 11502 10459 6062 1798 -3914 -9592 -10011 -5802 -937 4587
1060 4587 8295 8435 5776 1599 -4872 -9709 -9642 -7231 -3211 4090 10507 10689 7163 3303 -2191 -7885
1076 -7885 -9803 -7208 -2918 2076 6549 9108 8149 2999 -3653 -7802 -9113 -8324 -4570 2824 8027
1091 8027 8827 8557 6117 440 -6463 -9066 -8663 -5449 9 5199 8449 8661 4168 -1599 -5797 -7680
1107 -7680 -9184 -6236 723 6004 8117 9589 8062 1147 -5282 -7807 -8221 -6546 -1329 3546 7034
1122 7034 7943 5764 907 -3462 -7108 -9856 -7461 -577 4399 6912 9251 8385 2457 -3354 -6294
1137 -6294 -7630 -7725 -4083 1756 6407 7914 6333 3030 -1572 -6566 -9244 -6914 -2058 1859 5222
1152 5222 8978 9040 4247 -1022 -4347 -7362 -8858 -5610 575 5345 6414 6454 4669 417 -5379 -8204
1168 -8204 -6728 -3553 -1353 4089 9582 9014 4456 696 -2514 -7630 -9230 -5899 -1002 2814 5490
1183 5490 6978 6439 1923 -4028 -7536 -6701 -5224 -2711 3376 8760 8305 5004 3089 -1045 -7070 -8763
1199 -8763 -6181 -2481 638 4572 7660 6655 2293 -2537 -5397 -6368 -6089 -3584 2296 7022 7150 6006
1215 6006 4751 148 -6380 -8266 -6125 -4092 -1046 4036 7624 6724 2808 -512 -3507 -6312 -7799
1230 -7799 -4448 1352 5134 6395 7544 6400 619 -5127 -6830 -6215 -5820 -2809 3159 7238 6428 4126
1246 4126 1804 -1858 -6608 -7948 -4357 287 2972 5359 8382 7079 1103 -3607 -5288 -6835 -7387
1261 -7387 -3795 2639 5863 5970 5664 3545 -1300 -6218 -7144 -4790 -1744 942 5104 8435 6922 2060
1277 2060 -1640 -4388 -7445 -8426 -4630 1312 4393 5686 6422 5270 -446 -4914 -6324 -5489 -3949 -556
1293 -556 4915 8083 6707 3419 402 -3305 -7398 -8567 -5007 -172 2544 5581 7620 5806 686
1308 686 -3692 -5323 -5951 -5505 -1929 4142 7132 6500 5049 2735 -2478 -7647 -8265 -5060 -2346 392
1324 392 4936 8246 6416 1943 -1289 -3869 -6659 -6485 -2584 2659 5291 6294 6340 4084 -1576 -6252
1340 -6252 -7392 -6496 -4477 -469 4493 7304 6593 3557 407 -3315 -6781 -7191 -3516 872 4033 6361
1356 6361 7356 5068 -4 -4301 -6954 -7472 -6063 -1434 3390 6830 6860 5490 2370 -2573 -6024 -7077
1372 -7077 -4557 -1477 2835 5779 7586 6017 1471 -2839 -5972 -7375 -6947 -2808 2398 5596 7120
1387 7120 6538 3727 -1143 -5340 -6577 -5709 -3086 1186 5224 6738 6335 3368 -1048 -4863 -7482 -7278
1403 -7278 -4180 36 3973 7056 7025 4683 546 -3293 -6135 -6648 -4700 -197 3634 6335 6794 4972
1419 4972 773 -3918 -6885 -7339 -5666 -1801 3110 6330 7407 5597 2518 -1338 -5676 -6875 -5484
1434 -5484 -2042 1674 5345 7404 5688 1998 -1899 -5391 -7862 -6859 -3121 1356 5220 7311 6747
1449 6747 3872 -395 -4433 -6759 -5900 -3587 269 4417 7055 5895 3222 319 -3760 -7623 -7095
1464 -7095 -3939 -651 3514 7182 7554 4809 1124 -2881 -5721 -6616 -4872 -1684 3002 6041 6257 4471
1480 4471 1570 -2878 -6782 -6917 -4633 -2036 1653 5863 7516 5716 2517 -990 -4745 -6889 -6191
1495 -6191 -2507 1716 4418 5955 5733 3078 -1883 -5404 -6533 -5891 -4010 461 5256 7355 6409 4181
1511 4181 558 -3691 -6327 -6560 -3668 -51 2489 5494 6669 4120 -681 -3494 -5020 -6755 -5351
1526 -5351 -153 4124 5580 6218 5664 1872 -2580 -5184 -6050 -4868 -2227 1742 5099 6847 4742 824
1542 824 -2066 -4663 -7022 -5788 -958 2390 4266 6517 6773 3334 -1795 -4699 -5523 -5829 -3684 657
1558 657 4750 5746 4538 2362 281 -3787 -6996 -5702 -2339 -16 2667 6579 7209 3473 -468 -3268
1574 -3268 -5057 -5913 -4586 -721 3267 4751 4634 4200 1928 -3496 -6696 -5112 -3264 -1790 2317 6498
1590 6498 6588 3385 1467 -941 -4613 -6571 -5200 -1948 1293 3834 5363 5112 2260 -2745 -5133 -4523
1606 -4523 -4159 -3342 1184 5798 5809 3861 3311 548 -4695 -6526 -4654 -2016 -230 2709 5387 4978
1622 4978 2556 -715 -2953 -4305 -5259 -4050 686 4533 4870 4467 4439 1145 -3772 -5952 -4683 -3850
1638 -3850 -1946 1753 5233 5117 3232 608 -1806 -4360 -5846 -4040 237 3116 3530 5411 5350 1670
1654 1670 -3046 -4268 -4709 -5087 -2896 1350 4691 4971 3550 1729 -470 -3589 -5725 -4019 -1121 865
1670 865 2842 5612 6009 1936 -1765 -2903 -4482 -5899 -3272 917 3202 3833 4201 2908 104 -3256
1686 -3256 -4838 -4104 -2068 -46 2781 5967 5347 2360 -217 -2098 -4625 -6306 -3675 -117 1828
1701 1828 3887 4946 4088 953 -2720 -4252 -4229 -3536 -1078 2467 4987 4782 3313 1541 -1377 -4628
1717 -4628 -5754 -3859 -1261 870 3327 4902 4158 1448 -1280 -3297 -4154 -3912 -2055 1345 4392 4655
1733 4655 4108 2390 -810 -4080 -5323 -4264 -2681 -222 2670 4809 4203 2404 -306 -2486 -4356
1748 -4356 -4307 -2442 538 3060 4410 4616 3437 96 -3107 -4665 -4813 -3602 -1360 2303 4549 4388
1764 4388 3299 1142 -1963 -4095 -4200 -2960 -611 2374 4017 4796 3894 1077 -2103 -4139 -5071 -4204
1780 -4204 -1811 1061 3575 4768 3932 1784 -1016 -3126 -4375 -4069 -1758 1215 3697 4690 4086 1957
1796 1957 -1198 -3824 -4993 -4733 -2548 346 2983 4699 4252 2592 237 -2718 -4506 -4137 -2388 463
1812 463 2704 4636 4477 2851 -371 -2951 -4750 -4677 -3615 -693 2630 4263 4312 3421 1256 -1694 -4260
1829 -4260 -4304 -2872 -808 1721 4224 5035 3198 976 -1799 -3905 -5310 -4504 -1732 1320 3798 4500
1845 4500 4340 2285 -1158 -3722 -4181 -3532 -1898 708 3514 4751 3420 1700 -449 -3357 -5523 -4766
1861 -4766 -2246 366 2586 4449 4785 3051 -308 -2645 -3910 -4124 -3039 -153 3070 4303 4067 2878
1877 2878 913 -2591 -5162 -4870 -2900 -957 1494 4405 5284 3372 925 -1088 -3254 -5013 -3585
1892 -3585 -835 1845 3448 4122 3785 1577 -2180 -4227 -4268 -3685 -2309 971 4011 5140 3936 2022
1908 2022 72 -2794 -4843 -4145 -1757 482 2518 4377 4727 2407 -1094 -3060 -4123 -4791 -3398 116
1924 116 3517 4550 4300 3089 826 -2341 -4500 -4258 -2474 -638 1681 4256 4778 2869 -155 -1890
1940 -1890 -3633 -5070 -4169 -477 2240 3347 4229 4425 1765 -1881 -3570 -4022 -3547 -2228 967 3835
1956 3835 4494 3291 1346 -772 -3298 -5198 -4185 -1333 877 2836 5061 4983 2332 -800 -2538 -3769
1972 -3769 -4639 -3162 143 3016 3720 3707 2868 284 -3148 -5074 -3872 -2173 -883 2170 4881 4885 2408
1989 2408 726 -1219 -3681 -4955 -3439 -522 2102 3177 4107 3503 1179 -2331 -4023 -3735 -3276 -2137
2005 -2137 1572 4604 4410 2976 2194 -202 -3419 -4906 -3471 -1243 -57 2531 4058 3963 1869 -1272
2021 -1272 -2619 -3551 -4181 -2901 815 3834 4035 3200 2967 866 -3064 -4160 -3616 -2211 -1020 1728
2037 1728 4066 3998 2506 138 -1775 -3518 -4342 -2866 -83 2404 3066 4222 3835 1205 -2315 -3499
2053 -3499 -3657 -3476 -1695 1716 3952 3788 2305 1261 -879 -3113 -4639 -3294 -993 987 2523 4470
2069 4470 4315 1387 -1256 -2516 -3628 -4074 -2104 560 2273 2841 3475 2162 -65 -2613 -3890 -3063
2085 -3063 -1553 108 2464 4093 3767 1934 -169 -1698 -3719 -4275 -2763 -111 1393 3022 3833 2743
2101 2743 101 -2088 -3147 -3586 -2428 -588 1498 3568 3840 2404 1278 -879 -3172 -4428 -2838
2116 -2838 -919 670 2709 3945 3293 858 -843 -2209 -3481 -3154 -1412 1250 3214 3882 3014 2019
2132 2019 -572 -3076 -3754 -3060 -1914 -298 2122 3505 3095 2094 -19 -2170 -3526 -3020 -1863 347
2148 347 2312 3386 3041 2397 198 -2232 -3406 -3221 -2712 -715 1777 3310 3056 2350 755 -1568 -3170
2165 -3170 -2970 -2516 -832 1746 3060 3246 2915 1073 -1482 -3187 -3319 -2970 -1311 1159 2740 3077 2985
2182 2985 1292 -922 -2394 -3051 -2926 -1532 1078 2692 3169 2970 1321 -1059 -2555 -3374 -3022 -1979
2198 -1979 143 1764 3036 3162 1769 34 -1840 -3046 -3126 -1688 652 2029 2951 3574 2414 -116
2214 -116 -1780 -3079 -3444 -2442 -610 1477 3279 3078 2034 661 -1230 -2643 -3339 -2118 -428 1154
2230 1154 2710 3686 2656 496 -1296 -2575 -3620 -2980 -929 1092 2169 2719 2919 1394 -598 -2687
2246 -2687 -3093 -2288 -974 454 2397 3737 2904 1198 -753 -2352 -3723 -3589 -1414 317 1863 3087
2262 3087 3339 1947 41 -1806 -2985 -2625 -2023 31 2246 3118 2502 1645 325 -1761 -3437 -3629 -1914
2279 -1914 -305 1450 2875 3607 2538 521 -1120 -2805 -3095 -2576 -525 1515 2775 2850 2282 1058
2295 1058 -1287 -3173 -3509 -2328 -1078 531 2564 3536 2782 1119 -265 -1919 -3186 -2922 -1000 1165
2311 1165 2085 3050 3008 1896 -1021 -2531 -2781 -2976 -2037 43 2481 3261 2847 1705 430 -1594 -3037
2328 -3037 -3016 -1452 38 1343 2442 3355 1579 -51 -1973 -2748 -3489 -2409 -312 1995 2796 2917 2876
2345 2876 896 -1283 -2935 -2787 -2440 -1011 648 2788 3320 2230 473 -818 -2373 -3501 -2774 -679
2361 -679 1195 2375 3081 3272 1623 -864 -2213 -2763 -2801 -1624 333 2381 3017 2346 1769 -105 -2180
2378 -2180 -3319 -3327 -1626 163 1622 3311 3682 2346 234 -1506 -2399 -3158 -2280 -177 1769 2441 2389
2395 2389 2203 673 -1813 -3132 -2997 -2013 -658 1341 3212 3495 2337 708 -740 -2455 -3744 -2517
2411 -2517 -775 1275 2154 2631 2869 1015 -1103 -2599 -3224 -2689 -1481 1045 2720 3353 2930 1762 13
2428 13 -1848 -3197 -2862 -1471 -7 1700 2903 2814 1817 -322 -1884 -2567 -2972 -2088 -54 1969 3238
2445 3238 3152 2143 709 -1801 -2928 -2815 -1854 -878 1165 2900 2863 2231 389 -1304 -2275 -3131 -2409 -535
2463 -535 1285 2305 3199 2837 1243 -1037 -2134 -2978 -2771 -1569 561 2724 2822 2454 1417 -540 -1908
2480 -1908 -3205 -2710 -1250 374 1778 3187 2845 1443 -394 -1448 -2868 -3044 -2121 18 1528 2566
2496 2566 2821 1738 340 -1454 -2895 -3025 -1466 -163 1323 2788 3204 1872 393 -1274 -2501 -3443
2512 -3443 -2266 -607 939 1974 2967 2145 670 -903 -2287 -2808 -2078 -843 873 2485 3311 2477
2528 2477 913 -550 -2175 -3148 -2695 -1517 -55 1701 2856 2377 1072 -453 -2018 -2740 -2260 -1414
2544 -1414 95 2269 2880 2730 1767 234 -1625 -2875 -2781 -1984 -409 1842 2423 2303 1761 241 -1652
2561 -1652 -2141 -2196 -1828 -208 1556 2527 2539 2371 687 -1451 -2498 -2572 -2318 -916 1207 2092 2495 2262
2579 2262 1134 -887 -1789 -2511 -2435 -1181 941 2277 2001 2404 1222 -701 -2091 -2395 -2467 -1389 126
2596 126 1907 2418 2480 1388 -338 -1594 -2286 -2619 -1294 742 1897 2303 2606 1854 -183 -1790 -2249
2613 -2249 -2608 -1956 -336 1222 2398 2403 1701 472 -873 -2207 -2595 -1321 -53 664 2173 2955 2081
2630 2081 100 -977 -2009 -2406 -2295 -748 776 1873 2316 2163 949 -89 -2106 -2405 -1448 -826 408
2647 408 1899 2868 2145 600 -590 -1563 -2551 -2720 -1057 96 1651 2313 2101 1231 -356 -1889 -2058
2664 -2058 -1733 -1415 113 1789 2816 2303 1273 106 -1126 -2895 -2718 -1490 -115 847 1956 2548
2680 2548 1550 123 -1087 -1710 -1888 -1763 -316 1510 2326 2032 1483 808 -877 -2470 -2107 -1326 -928 523
2698 523 2035 2648 1961 674 -646 -1494 -2331 -2225 -618 781 1548 1732 2150 913 -851 -1905 -2149
2715 -2149 -1711 -1169 144 1905 2625 1978 1022 -36 -1297 -2410 -2027 -1203 220 1367 2091 2530 1373
2732 1373 -451 -1414 -1677 -2375 -1777 -403 1519 2146 1886 1664 641 -1013 -2251 -2418 -1274 -190 784
2749 784 1899 2318 1648 210 -626 -1829 -2566 -2064 -404 982 1512 2147 2107 816 -770 -1657 -2166 -1756
2767 -1756 -928 490 1995 2509 1730 552 -197 -1843 -2528 -2293 -413 571 1311 2209 2523 1076 -94
2784 -94 -1445 -1885 -2211 -1422 -121 1537 2081 1640 1319 418 -1628 -2484 -1997 -1389 -79 859 2092 2567
2802 2567 1368 175 -1015 -1551 -2385 -1703 -131 918 1378 1924 1675 638 -1150 -1885 -2162 -1916 -1000
2819 -1000 766 2214 2668 1638 603 -58 -1655 -2640 -2001 -475 486 1479 2073 2186 999 -937 -1996
2836 -1996 -1906 -2237 -1386 509 1704 2096 2076 1432 196 -1429 -2144 -1947 -1338 -268 916 2121 2346 1249
2854 1249 52 -1084 -1949 -2406 -1821 -164 1284 1628 2318 1839 719 -1432 -1922 -1992 -1484 -780 938 2143
2872 2143 2428 1595 529 -792 -1813 -2580 -1724 -432 729 1602 2634 2235 934 -672 -1504 -2050 -1983
2889 -1983 -1146 153 1679 2229 2114 968 4 -1804 -2378 -2164 -911 116 1371 2228 2561 1048 -281
2906 -281 -1069 -1980 -2366 -1650 -56 1186 2220 2184 1737 298 -1069 -2071 -2141 -1627 -569 1340 2145 2422
2924 2422 1619 676 -832 -1611 -2508 -2001 -584 629 1578 2409 1847 519 -483 -1543 -2080 -1832 -919 634
2942 634 1684 2296 2087 1159 -26 -1664 -2060 -2198 -1252 112 1172 2114 2004 1315 -178 -1070 -1992 -1967
2960 -1967 -1280 72 1490 2108 2403 1659 73 -1298 -2061 -2255 -1569 -352 835 1773 2127 1662 515
2977 515 -653 -2153 -2050 -1767 -555 1102 1893 2225 1630 691 -687 -1665 -2490 -2027 -1084 598 1631 2254
2995 2254 2054 743 -548 -1524 -1893 -1955 -1025 590 1587 2153 1600 1073 -47 -1791 -1974 -2041 -1261 90
3013 90 1086 1964 1961 1112 -98 -1045 -1657 -2111 -1266 194 1070 1944 2290 1644 128 -1036 -1738 -2094 -1833 -475
3033 -475 954 1810 1890 1639 745 -498 -1842 -2299 -1512 -419 515 1401 2386 1678 573 -778 -1280 -1960
3051 -1960 -1938 -886 439 1780 1894 1643 870 -378 -1772 -1850 -1489 -828 67 1316 2259 2075 882 -81
3069 -81 -1238 -2175 -2040 -1081 176 1110 1581 1956 1032 270 -1087 -1825 -1594 -1172 -492 993 1979 1923 1128
3088 1128 333 -711 -2091 -1931 -1236 -209 545 1604 2431 1472 473 -571 -1379 -1644 -1667 -736 747 1745
3106 1745 1478 1480 876 -618 -1774 -1903 -1245 -946 91 1210 1846 1404 728 -330 -1154 -1754 -1676 -688 337
3125 337 851 1529 2026 1206 -524 -1754 -2086 -1722 -1375 -204 1276 1870 1312 1086 296 -1018 -1532 -1847
3143 -1847 -988 106 603 1339 1870 1293 -236 -1006 -1632 -1960 -1672 -277 1221 1499 1854 1505 623 -654
3161 -654 -1572 -1938 -1001 -276 505 1417 2042 1576 381 -339 -1155 -1822 -1491 -828 495 1085 1766 1809 697
3180 697 -552 -1141 -1472 -1224 -1006 -110 1242 1979 1420 996 -111 -1215 -1913 -1405 -685 -270 1031 1699
3198 1699 1906 742 49 -914 -1456 -1731 -1277 106 1044 1506 1190 1201 373 -926 -1802 -1719 -943 -410 776
3217 776 1937 2173 983 399 -248 -1383 -1684 -1252 -70 609 1231 1725 1252 647 -564 -1607 -1601 -1324 -709
3236 -709 398 1473 1775 1509 887 -32 -1062 -1750 -1348 -741 231 1043 1674 1701 980 -168 -1079 -1609 -1644
3255 -1644 -995 229 1100 1635 1789 1107 239 -1122 -1477 -1375 -1237 -246 604 1640 1787 996 61 -518 -1642
3274 -1642 -1834 -1506 -229 1122 1311 1917 1671 356 -899 -1337 -1748 -1362 -554 630 1151 1563 1448 428
3292 428 -282 -1611 -1680 -1415 -433 327 1175 1755 1714 723 -81 -893 -1750 -1578 -911 173 798 1212 1487 1082
3312 1082 32 -1335 -1667 -1616 -1092 68 1102 1908 1695 1138 377 -1070 -1443 -1601 -1065 -297 713 1520
3330 1520 1736 1148 77 -809 -1709 -1843 -958 -468 477 1388 1697 1389 651 -469 -1483 -1846 -1371 -483 409
3349 409 1093 1582 1551 528 -96 -1365 -1642 -1454 -643 283 1309 1612 1872 885 -60 -1258 -1949 -1812 -827
3368 -827 146 1034 1552 1482 1040 -41 -1169 -1343 -1576 -930 -410 911 1854 1768 1244 92 -770 -1513 -2031
3387 -2031 -1571 -360 729 1671 1917 1213 348 -979 -1327 -1571 -1155 -730 920 1426 1719 1425 978 -445
3405 -445 -1289 -1716 -1601 -577 545 1324 1444 1463 502 -490 -1001 -1488 -1709 -682 342 1048 1467 1400 1367 -200
3425 -200 -1553 -1681 -1297 -1081 -319 993 1681 1078 743 326 -850 -1735 -1804 -979 -93 723 1378 1884 1243
3444 1243 282 -1049 -1255 -1706 -1493 -804 673 1538 1376 1169 579 -504 -1393 -1609 -937 -415 114 1408
3462 1408 1892 1457 678 -68 -1048 -1516 -1689 -642 548 886 1242 1592 683 -71 -1207 -1429 -1079 -1068 134
3481 134 837 1850 1319 896 93 -704 -1730 -1627 -945 -124 520 1418 1642 1244 5 -836 -1190 -1246 -1131
3500 -1131 -448 743 1395 1325 1096 683 -646 -1531 -1575 -901 -524 10 1232 1488 1264 430 -722 -650 -1496
3519 -1496 -1637 -646 637 1273 1285 1585 960 -775 -1323 -1474 -889 -921 -50 1232 1262 1504 911 150 -918
3538 -918 -1183 -1634 -542 458 929 1308 1643 1171 -251 -1168 -838 -1396 -1176 153 854 1199 1298 1183 179
3557 179 -607 -1356 -1137 -611 -354 419 1084 1643 1002 63 -521 -1196 -1563 -1482 -184 726 893 1506 1336 429
3577 429 -545 -1112 -1163 -1080 -628 215 1273 1527 1157 412 48 -816 -1269 -1285 -79 44 656 1591 1378 754
3597 754 68 -768 -1328 -1343 -991 -6 989 1204 1248 780 116 -1061 -1537 -1327 -667 -194 495 1375 1467 817 166
3618 166 -532 -867 -1582 -707 -141 636 998 1100 884 314 -784 -1459 -1246 -1187 -617 303 1390 1127 921 457
3638 457 -2 -1228 -1516 -854 -392 476 1001 1475 1197 484 -556 -1321 -1391 -1087 -689 59 953 1528 1161 765
3658 765 -58 -1177 -1415 -1247 -411 51 685 1319 861 760 -28 -944 -1081 -1288 -1085 90 819 1335 1241 612
3678 612 121 -851 -1186 -1153 -895 -491 545 1127 1259 1088 489 -710 -1124 -1440 -993 -119 667 828 1177 1335
3698 1335 335 -393 -945 -1548 -1263 -452 358 1275 1277 963 546 -459 -892 -1306 -940 -439 340 1109 1325 1145
3718 1145 548 -203 -919 -1438 -1059 -498 252 879 1055 1288 596 -38 -582 -1357 -1397 -762 -109 696 1170 1269
3738 1269 928 228 -386 -1246 -1166 -929 -163 430 1098 977 704 341 -445 -1116 -1403 -900 -432 398 1281 1416
3758 1416 976 409 -520 -913 -1238 -1111 -547 270 781 927 1057 404 -243 -980 -1057 -1219 -375 -7 1108 1110
3778 1110 835 423 -117 -780 -1303 -1656 -665 11 701 1109 954 999 -191 -523 -1279 -1194 -810 -197 635 1254
3798 1254 1354 1024 373 -444 -1138 -1419 -927 -386 339 1244 1225 977 186 -603 -1136 -1054 -944 -484 641 1057
3818 1057 1211 1228 805 -407 -978 -1089 -1135 -451 207 834 1615 1221 358 33 -847 -1105 -958 -721 199 735
3838 735 1131 1102 680 122 -1074 -1091 -1050 -897 -282 876 1402 717 728 242 -507 -1356 -1286 -647 -69 533 975
3859 975 1412 973 48 -530 -1109 -1233 -1072 -194 654 1006 1102 1175 658 -488 -1258 -1228 -1010 -122 56 1206
3879 1206 1572 857 478 -255 -972 -1326 -1233 -477 278 703 985 1070 617 81 -642 -1232 -984 -792 335 955
3899 955 1138 1067 623 142 -790 -1391 -1122 -821 -282 615 1177 1458 814 -44 -517 -733 -1103 -917 -21 555
3919 555 819 1015 737 233 -541 -1214 -1091 -1079 -415 223 1164 1059 833 376 -42 -682 -1293 -951 -324 359
3939 359 708 910 1037 657 -467 -938 -1156 -1344 -519 112 831 1120 1053 649 117 -680 -965 -892 -560 -197
3959 -197 554 1074 1253 667 -102 -372 -944 -1270 -699 -218 627 903 810 1189 325 -429 -758 -867 -924 -365 527
3980 527 930 1078 694 77 -603 -717 -1327 -791 -249 402 981 1025 847 498 -227 -985 -933 -806 -484 -48 960
4001 960 980 913 410 -37 -594 -1138 -1296 -470 -236 574 1179 1082 478 -13 -573 -904 -968 -684 128 623 1107
4022 1107 805 709 42 -532 -1337 -845 -843 -67 476 1088 1037 642 396 -389 -910 -1139 -893 -288 285 912 891
4043 891 920 223 -528 -908 -1321 -994 -70 400 699 1044 878 519 -219 -860 -819 -824 -396 474 384 1081 879 236
4065 236 -200 -671 -722 -795 -601 314 760 1070 907 681 -267 -414 -874 -864 -775 74 537 912 815 677 126 -626
4087 -626 -753 -932 -1000 -35 772 821 1051 817 119 -478 -535 -1000 -767 -358 240 896 1022 700 -42 -334 -920
4108 -920 -1059 -1009 -414 349 804 1039 722 342 -25 -973 -1090 -922 -253 420 415 848 1043 385 13 -925 -725
4129 -725 -1082 -616 266 347 801 1088 409 15 -425 -1148 -888 -335 114 464 960 1040 223 -210 -434 -807 -798
4150 -798 -556 195 404 660 1156 723 118 -186 -1008 -844 -690 -423 518 704 932 523 108 -111 -747 -945
4170 -945 -793 -282 235 1030 1119 844 519 -215 -790 -1073 -993 -289 277 706 652 878 560 -17 -755 -1024 -992
4191 -992 -271 232 851 1270 898 572 11 -557 -1223 -1068 -675 26 466 941 964 603 275 -627 -1127 -1064 -572
4212 -572 -147 536 875 975 812 507 -223 -953 -921 -679 -214 -88 518 907 841 303 -566 -907 -837 -804 -186
4233 -186 668 990 862 1125 585 -248 -886 -788 -922 -717 192 604 913 1052 131 -59 -657 -691 -1336 -241
4253 -241 252 448 863 956 672 -65 -504 -762 -598 -691 -234 430 1019 1082 648 188 -475 -825 -1002 -402 -309
4274 -309 490 815 771 930 150 -434 -617 -977 -818 39 473 790 995 699 513 -213 -832 -921 -734 -374 107
4295 107 688 932 743 560 -114 -1080 -1071 -990 -491 270 710 880 1140 887 -244 -549 -846 -906 -332 -2 566
4316 566 1007 883 376 287 -696 -1118 -1123 -534 101 387 1079 923 492 193 -372 -560 -859 -726 -254 466 956
4337 956 777 1072 -2 -658 -773 -1064 -779 -260 96 818 1060 559 621 75 -763 -1107 -589 -169 27 584
4357 584 1045 582 348 -131 -832 -987 -684 -617 81 505 863 833 525 257 -505 -650 -799 -239 -39 601 746
4378 746 1062 384 92 -440 -573 -938 -945 11 402 563 549 911 238 -354 -848 -889 -771 -222 365 900 998 618
4400 618 412 -113 -598 -868 -662 -492 160 960 1020 879 555 -277 -657 -908 -767 -415 -58 661 903 545
4420 545 427 -198 -599 -962 -690 -632 -25 319 774 741 493 -36 -258 -707 -937 -300 -15 526 674 1043 664
4441 664 168 -579 -784 -1138 -439 -293 400 589 930 484 58 -14 -989 -781 -703 -246 442 783 849 769 143
4462 143 -338 -816 -985 -768 -174 56 660 787 924 504 -182 -952 -891 -836 -321 73 508 889 846 352 -167
4483 -167 -440 -762 -832 -586 108 712 942 835 445 -111 -645 -872 -754 -734 -129 432 648 606 630 -99 -654
4504 -654 -589 -764 -802 -142 409 836 908 637 122 -613 -742 -829 -673 -260 -64 324 753 612 395 -63 -421
4525 -421 -783 -578 -450 42 557 757 601 279 111 -688 -544 -773 -423 45 755 725 712 359 -64 -564 -996
4546 -996 -900 -206 -36 465 736 698 824 3 -291 -713 -428 -646 -23 48 842 710 676 58 -416 -824 -621
4567 -621 -342 -11 232 894 549 1007 193 -542 -536 -997 -560 -68 188 604 656 906 273 -385 -783 -845 -616
4588 -616 -438 245 532 852 715 198 122 -794 -524 -872 -267 269 768 731 611 397 27 -357 -802 -479 -303
4609 -303 3 592 834 735 431 153 -214 -763 -945 -449 47 338 932 658 656 -26 -452 -431 -529 -728 -206 350
4631 350 708 810 527 264 -209 -769 -646 -797 -530 287 534 992 507 134 -410 -537 -799 -853 -387 278
4651 278 400 645 726 506 -29 -322 -790 -785 -466 318 699 758 703 446 -138 -291 -687 -719 -273 120 538 638
4673 638 1064 119 28 -602 -569 -1041 -315 9 214 350 627 406 94 -327 -886 -771 -483 113 307 561 941
4694 941 789 210 -134 -559 -1071 -582 48 306 404 770 799 416 -397 -986 -770 -581 -471 -157 850 921 401
4715 401 224 -20 -681 -843 -798 -56 -112 356 720 503 291 213 -381 -494 -792 -503 254 449 618 488 528
4736 528 257 -551 -789 -780 -597 -56 590 822 901 357 285 -423 -595 -703 -640 -6 424 562 888 608 23 -345
4758 -345 -958 -548 -736 -413 107 700 1009 421 293 -367 -439 -744 -657 -395 84 727 724 704 570 -262 -508 -563
4780 -563 -925 -357 228 456 625 896 407 198 -302 -579 -821 -502 -7 439 641 717 444 67 -587 -703
4800 -703 -806 -560 -58 479 750 657 700 262 -95 -676 -689 -568 -304 362 546 724 627 100 -515 -427 -884 -622
4822 -622 95 289 872 955 801 314 -150 -326 -525 -557 -458 85 479 503 485 466 -199 -685 -870 -674 -645 15
4844 15 525 886 709 613 -64 -397 -799 -707 -369 -42 452 793 813 566 56 -493 -464 -811 -302 -55 261 537
4866 537 518 578 380 -12 -847 -750 -545 -234 192 583 977 661 236 -11 -334 -486 -897 -243 424 436 776
4887 776 659 563 -171 -539 -935 -490 -149 -243 461 811 854 469 -200 -299 -775 -1107 -410 -57 564 389 631
4908 631 338 214 -218 -531 -436 -720 -403 267 515 638 325 281 -354 -794 -688 -543 -262 358 393 478 416 127
4930 127 -166 -258 -489 -459 -349 217 459 417 725 480 -219 -300 -544 -794 -293 73 341 778 621 399 -52
4951 -52 -399 -619 -685 -387 -84 503 874 843 280 190 -521 -599 -723 -602 79 160 598 908 403 -73 -273 -474
4973 -474 -620 -587 -213 38 575 452 395 146 -133 -599 -590 -400 -359 214 393 852 393 269 -366 -95 -537 -588
4995 -588 -185 99 582 530 558 147 -207 -644 -596 -627 -560 30 357 711 541 493 95 -251 -638 -806 -290 69
5017 69 621 630 552 438 24 -264 -452 -375 -664 -116 382 622 492 264 167 -417 -566 -510 -404 -299 241 582
5039 582 831 338 142 -525 -114 -580 -581 -83 387 551 590 517 311 -262 -781 -709 -541 -73 15 573 911 650
5061 650 12 -117 -119 -779 -834 -182 222 396 565 641 456 -14 -545 -559 -542 -416 -131 238 675 676 281 97 -418
5084 -418 -666 -684 -284 87 398 480 603 253 6 -297 -296 -436 -479 -132 285 639 643 578 113 -234 -506 -706 -101
5107 -101 -65 1 764 784 298 194 -54 -667 -770 -465 -6 669 632 587 623 249 -20 -489 -666 -297 -359 -58
5129 -58 524 630 427 312 127 -223 -971 -448 -224 -117 141 677 488 297 -74 -57 -431 -776 -335 34 613
5150 613 618 667 397 233 -459 -423 -387 -425 -234 154 448 507 68 185 58 -698 -545 -541 -127 327 228 716 396
5173 396 222 -115 -692 -685 -451 -250 233 413 309 590 108 -3 -438 -755 -412 -372 86 615 673 682 57 103
5195 103 -118 -522 -487 -317 -37 255 605 609 328 11 -374 -680 -643 -462 -11 377 592 474 245 236 -401 -565
5217 -565 -878 -389 -207 88 630 677 577 14 -148 -608 -478 -152 -254 103 597 391 438 100 46 -430 -643
5238 -643 -524 -456 141 532 612 580 227 -137 -593 -662 -453 -388 -201 159 608 580 252 -47 -208 -652 -572 -291
5260 -291 -15 504 646 418 219 165 -300 -496 -605 -450 215 401 586 686 429 165 -302 -518 -529 -579 -173
5281 -173 331 681 537 369 115 -184 -666 -504 -382 -198 40 330 724 443 348 -3 -293 -615 -601 -100 -100
5302 -100 427 555 413 391 -153 -418 -661 -548 -417 -152 367 585 730 469 259 -254 -699 -407 -405 30 324
5323 324 231 602 233 84 7 -450 -708 -343 -171 67 563 543 484 -55 -544 -337 -544 -546 -322 253 482 599
5345 599 300 166 -179 -632 -476 -528 -276 -12 217 741 335 150 5 -311 -746 -713 -375 137 535 334 671
5366 671 405 82 -325 -345 -790 -291 117 224 459 653 331 101 -216 -575 -654 -564 38 204 330 829 479
5387 479 115 -268 -313 -563 -467 -100 175 385 242 439 107 -172 -683 -547 -266 -242 -71 493 450 137 120 82
5409 82 -423 -531 -564 -221 237 301 575 738 91 -38 -167 -556 -337 -108 -65 378 709 505 51 65 53 -236
5431 -236 -429 -419 -203 309 233 462 404 53 -359 -826 -513 -107 94 30 492 459 356 -21 -313 -542 -226 -398
5453 -398 -206 309 548 544 557 101 -149 -400 -698 -446 -135 116 209 358 298 159 -137 -355 -542 -242 -485 217
5475 217 188 308 328 313 75 -275 -595 -432 -222 60 264 408 447 97 -78 -187 -812 -489 -333 -94 310
5496 310 369 441 452 162 -218 -283 -201 -120 2 351 349 715 278 217 -321 -410 -615 -545 211 -94 299 422 397 -50
5520 -50 -148 -292 -790 -468 25 -33 547 440 66 391 34 -598 -593 -448 -258 162 248 417 509 258 -101 -112 -602
5543 -602 -635 -301 197 316 429 664 423 72 -553 -363 -394 -265 -110 146 443 375 211 -113 -178 -237 -624 -398
5565 -398 96 490 501 516 481 -111 63 -204 -141 -283 -125 213 451 349 290 223 -333 -538 -518 -245 -111 159
5587 159 554 446 397 356 -269 -154 -416 -444 -158 -22 330 210 308 114 -170 -299 -220 -269 -99 -135 362 406 464
5610 464 121 -107 -220 -515 -207 -338 -89 224 483 413 -136 234 -230 -405 -682 -491 -115 149 207 597 308
5631 308 184 -414 -384 -432 -539 -189 270 436 402 368 51 -176 -335 -520 -369 -247 151 443 760 316 202
5652 202 -122 -387 -568 -476 -267 -233 259 562 382 234 151 -109 -631 -349 -252 31 247 215 446 293 262 -260
5674 -260 -477 -702 -244 -150 407 401 363 270 -59 -118 -427 -347 -487 -337 531 669 596 181 176 22 -546 -646 -258
5697 -258 -139 -200 194 328 417 355 -268 -346 -528 -344 -208 -10 270 614 160 172 -137 -536 -545 -328 -201 41
5719 41 178 351 534 133 8 -284 -429 -244 -77 59 307 307 650 353 70 -390 -237 -390 -400 -29 218
5740 218 231 284 346 -75 -168 -250 -465 -408 -89 -226 527 585 474 50 -262 -638 -390 -196 -310 5 494 395 261
5763 261 112 115 -384 -549 -420 -7 -78 382 616 497 433 -71 -169 -685 -516 -151 137 338 363 435 118 17
5785 17 -61 -306 -115 -348 229 240 396 352 226 -211 -149 -521 -424 -188 -36 323 277 751 413 252 162 -503 -150
5808 -150 -126 -104 107 475 443 383 -16 -70 -188 -412 -340 4 130 492 400 372 34 -18 -92 -645 -199 -201 279 217
5832 217 230 489 268 40 -266 -458 -527 -377 117 339 424 186 209 144 155 -132 -207 -359 -67 218 385 588
5854 588 195 7 -50 -370 -479 -173 45 66 444 255 388 292 -360 -360 -299 -314 -89 -55 299 322 230 150 74 -229
5878 -229 -682 -157 -95 248 485 569 552 437 -166 -197 -346 -430 -199 -111 425 429 351 -1 48 -83 -357 -365 -216 -44
5902 -44 315 431 483 65 -145 -214 -408 -241 -453 -55 310 273 421 350 72 -332 -326 -354 -322 -194 240 200 401
5925 401 215 275 -236 -388 -318 -277 -182 -20 171 402 340 98 167 -316 -463 -404 -88 -193 180 372 308 276 -75
5948 -75 -279 -497 -211 -159 -225 193 504 646 95 11 -240 -287 -176 -419 27 315 358 528 191 98 -99 -602
5970 -602 -647 -214 -124 245 213 427 333 76 23 -389 -577 -179 -243 336 368 450 280 -19 -211 -370 -117 -290 -315
5993 -315 -19 171 286 437 -141 -308 -142 -239 -232 -109 117 357 303 267 158 -106 -100 -437 -512 -107 -90 24 277
6016 277 308 -36 -81 -177 -494 -196 -212 136 323 495 391 292 296 -217 -336 -459 -301 18 255 330 198 336 -32
6039 -32 -312 -361 -259 -202 -144 121 84 273 228 -12 -216 -378 -201 -300 -60 -139 495 169 43 38 -138 -327 -500
6062 -500 -374 -144 21 304 567 331 36 -56 -522 -432 -230 10 211 316 376 535 79 -5 -474 -443 -300 -85
6084 -85 66 228 445 436 265 19 133 -421 -295 -100 -113 432 228 273 282 135 -253 -412 -92 -216 -72 190
6106 190 258 348 388 -298 29 -276 -256 -92 -56 21 260 655 252 8 -12 -272 -313 -254 -210 -233 442 413 480 379
6130 379 -164 -196 -72 -214 -159 47 180 220 563 13 -31 -108 -237 -156 -84 76 150 354 269 395 -58 -149 -99 -345
6154 -345 -468 61 -307 34 628 387 301 -161 -299 -287 -87 -42 274 510 423 316 -82 -40 -246 -438 -361 -198
6176 -198 147 261 91 154 108 -82 -449 -194 -238 -15 127 308 347 102 34 -143 -325 -566 -324 -48 221 105
6198 105 231 343 174 84 -233 -147 -548 -52 -127 165 275 351 178 50 -314 -183 -299 -272 -43 182 376 344
6220 344 106 155 -190 -158 -262 -315 -29 -88 421 210 131 -168 78 27 -613 -374 -143 348 326 342 53 97 50
6243 50 -120 -382 -234 -230 150 344 567 283 202 116 -472 -32 -196 -88 -6 175 422 340 -108 -151 -148 -250 -352
6266 -352 -20 292 -248 318 478 -87 30 -265 -8 -291 -105 212 202 24 347 114 129 -55 -368 -382 -93
6287 -93 46 -136 294 216 321 42 39 -234 -290 -2 -124 -77 247 291 176 43 -310 -137 -490 -286 -35 390
6309 390 261 254 -30 255 -139 82 -16 -447 -73 214 219 427 275 91 1 -209 -308 -341 -92 -85 229 166 85 296
6333 296 13 -103 -304 -356 -387 -263 58 262 317 237 146 68 -504 -350 -109 -492 -58 352 401 269 1 -177
6355 -177 -68 -371 -171 -146 67 211 176 509 -175 -245 -275 -462 -173 2 -59 181 405 408 219 -203 -321 -263 -233
6378 -233 -301 -12 260 29 119 522 -34 -149 -120 18 -83 -178 58 223 77 -47 190 -247 -426 -430 -254 55
6400 55 103 46 254 41 28 -210 -290 -171 -190 -37 -25 341 -33 5 -13 -188 -200 -305 -271 -33 63 398 479 209
6424 209 -69 -178 -210 -280 -233 -409 -108 -159 152 206 293 80 2 -403 -214 -59 52 -258 310 222 110 162 -290
6447 -290 -301 -211 30 -135 9 80 157 61 49 -59 -302 -496 -437 -294 224 67 79 206 -149 5 -127 -29 -153
6470 -153 21 -106 354 195 -35 19 -202 -81 -351 -109 272 123 243 233 168 -98 -57 44 -380 -378 -185 -58
6492 -58 363 264 90 38 79 -213 -229 -214 -131 78 339 170 127 60 39 -290 -283 -134 -251 -206 -244 75 284 341 247
6517 247 -329 -250 -166 -307 37 211 340 175 340 224 -115 -66 -134 -330 -280 -91 -7 310 229 166 234 -213 -369
6540 -369 -134 40 95 222 161 200 157 -69 5 -185 -275 -86 -126 150 218 405 31 28 -277 -48 -157 -292 18
6563 18 126 63 178 337 -63 -159 -237 -69 -324 166 270 323 262 354 -35 -67 -283 -6 -356 188 384 272 287
6586 287 291 -325 -77 -133 -120 -142 -217 50 249 230 -9 38 -109 -184 -166 -101 -90 112 39 438 295 -17 200 -79
6610 -79 -275 -212 -155 240 148 465 511 33 89 -256 -294 -140 -138 -118 238 163 379 243 -12 -242 -195 -133 85 19 196
6635 196 4 -2 209 -133 -98 -210 -274 -93 116 -75 299 302 235 141 -144 -331 -150 42 -252 -31 128 270 132
6658 132 -15 37 -36 -90 -157 -197 11 268 147 194 -9 -212 -188 -183 -166 -437 -82 324 112 219 128 34 -77 -218
6682 -218 -315 -221 -239 50 325 262 53 -58 -127 -154 -288 -204 -182 156 479 306 452 -57 -100 -124 -288 -55 -225
6705 -225 -1 255 147 -3 144 80 -270 -239 -318 -44 -84 40 340 379 -168 -101 -279 -95 -72 25 100 60 90 96
6729 96 86 -83 -164 -109 53 3 176 129 269 275 147 142 -207 -14 -305 -435 92 365 63 47 52 20 -9 -225 -141
6754 -141 134 -120 57 103 52 115 -84 -250 -14 -391 -131 -109 -41 -41 305 38 -116 -86 -143 -154 -11 -18 176 196
6778 196 151 73 -65 -26 231 -247 -271 25 -260 82 152 -8 -92 -181 -264 -157 -72 -129 -1 190 22 -246 411
6801 411 165 -30 115 -381 -178 -89 -147 153 165 59 -57 -217 -61 -137 31 -134 -120 77 420 249 107 70
6823 70 6 -76 103 -426 -191 -22 5 66 106 -68 -78 -266 -215 -112 202 -85 -40 278 159 132 -233 -4 -256
6846 -256 -108 219 -54 216 339 170 149 13 -30 40 -173 -204 194 264 325 -21 -47 69 -383 97 -274 6
6868 6 166 123 44 -92 168 292 45 -296 -94 133 -225 6 -21 -135 7 20 -73 -92 -219 -255 -57 200 253
6891 253 162 88 -246 -31 70 -210 -101 -41 -187 362 392 -83 -300 -183 -214 -137 27 -96 53 -19 224 131 69
6914 69 -244 -179 -69 -99 36 23 74 -30 -19 -96 -108 -317 -29 -425 -13 -59 70 225 -78 148 34 -134 -281
6937 -281 1 -242 334 169 403 26 180 -100 -99 -310 -3 70 -142 -7 237 27 94 162 -215 -324 50 133
6959 133 167 -41 58 222 65 152 -65 -87 -74 -62 0 158 25 103 -106 27 -248 -153 -9 -228 67 -208 -69
6982 -69 40 26 -171 -125 -64 63 -173 -186 68 131 146 84 28 -297 -26 -152 -80 -324 36 -99 283 214 587 70
7006 70 -169 -242 44 -111 270 246 16 256 -225 -20 1 -141 87 -252 145 56 -28 -5 122 105 -154 -231 -246
7029 -246 -47 -26 230 187 -72 260 143 -204 -260 7 148 16 3 277 144 -27 89 -97 44 -118 -146 -16
7051 -16 19 27 133 59 -54 148 -58 83 -168 -251 -77 71 262 -11 288 -262 47 -103 -22 -44 46 107 199 38
7075 38 119 -264 -267 -416 -88 -79 170 9 69 105 -17 95 -275 13 -1 -181 75 73 95 165 -93 -87 -302 -522 -129
7100 -129 52 38 -79 170 263 -55 195 61 -219 -209 -128 141 -92 181 -162 208 285 -91 57 130 250 305
7122 305 197 -172 -14 -53 98 124 -145 198 26 -195 125 189 99 192 -39 211 -164 -280 -155 -2 -224 121
7144 121 47 -277 308 50 -157 -115 -310 175 137 158 207 239 73 -171 -113 0 62 -221 99 186 -138 -94 283
7167 283 -79 105 -19 -368 -380 -249 50 140 -81 165 81 141 -217 45 -7 -74 53 56 -1 18 57 88 -56 -105
7191 -105 -93 -235 -36 226 181 167 -74 -98 -292 -76 -137 -359 -9 80 87 -11 56 95 -287 59 -200 64 48 -42
7215 -42 95 51 183 -225 -171 -194 -124 53 36 117 125 37 161 187 30 -358 -136 -9 283 122 236 58 -200 283
7239 283 225 -261 -178 -142 -258 -11 137 61 127 -42 -197 -201 -103 -53 -4 119 -9 119 92 -72 -47 344 116 -280
7263 -280 -47 -146 -34 174 125 186 -119 -135 -86 -306 197 -94 48 89 -281 164 -64 67 57 -21 -96 41 56
7286 56 216 83 150 -100 -171 -4 -91 -166 -20 -6 -85 151 75 -20 -90 82 -121 -190 24 190 210 4 318 -115
7310 -115 -94 -247 -73 146 -123 82 97 -23 -42 292 -153 -54 -152 -112 -1 -239 56 208 420 -257 10 -106
7332 -106 91 320 -240 57 -113 66 242 -190 -189 125 16 -15 125 140 -26 -198 13 97 -4 123 -26 -194
7354 -194 -123 -116 -122 21 320 -51 199 96 -115 -259 109 -203 48 -187 73 83 44 -61 135 -127 -211 49 -136
7377 -136 -264 51 94 292 -9 -94 -92 -270 -111 -21 -7 257 -37 87 112 8 -144 36 -170 73 2 52 25
7400 25 -197 -299 209 -148 49 40 -61 -168 -65 28 -137 75 -143 120 -71 -7 19 72 369 144 -57 -123 -119
7423 -119 -208 -10 -44 168 -108 43 105 -118 11 -176 -375 69 69 -80 -8 172 102 -9 -89 -64 164 -22 63
7446 63 -282 -137 105 150 156 -102 -77 155 -106 16 -38 -201 -85 39 -310 27 125 87 -229 0 263 -250 -156
7469 -156 -59 -137 -179 -2 -53 2 84 -5 -27 294 183 -108 45 -175 161 22 -140 43 80 53 167 -100 -232
7492 -232 -248 -54 -428 -76 -424 246 124 63 141 -5 160 13 -199 -126 -206 -382 -64 36 75 113 -54 -81 -48
7515 -48 -305 326 -68 157 -261 156 34 -15 95 -259 -162 -29 8 -69 102 0 -69 67 -121 -156 -106 -168 -235
7538 -235 -111 131 0 -40 -77 -123 -14 -314 -269 77 199 -9 -144 -76 -342 9 64 -160 75 110 -68 -113 76
7561 76 -57 -108 62 -35 -27 -38 112 26 -139 31 -14 88 -87 -73 -57 -187 4 50 -37 383 19 -41 -190 -297
7585 -297 -217 -202 98 224 -218 -8 165 -64 171 -27 -200 -292 149 92 -86 111 13 -29 43 145 -5 -356
7607 -356 -225 -19 31 -5 -96 -138 90 100 -106 -322 261 -135 42 10 208 -5 -107 98 -104 130 -170 -69
7629 -69 105 -22 -173 -151 90 50 -193 -149 60 -94 -252 116 78 -121 126 181 51 83 -160 -174 230 -72 -21
7652 -21 66 145 -16 142 176 -170 -52 33 28 -176 -147 217 67 -169 208 66 -147 52 -114 -115 -221 -131 293 201
7676 201 -63 -86 -238 177 167 -52 217 11 -92 42 79 -232 138 -247 200 -99 236 228 -85 92 -89 53
7698 53 -89 89 116 184 -25 -93 -47 -74 -256 78 116 -66 23 24 65 -77 1 182 261 -44 74 204 59 36 -158
7723 -158 522 257 -307 -193 91 -46 14 -27 -193 75 27 92 20 82 -40 9 -432 -25 73 119 -76 -105 104
7746 104 97 -208 -41 -107 53 158 225 -289 11 163 -107 58 -56 -79 -187 9 -254 -39 -4 155 136 -103
7768 -103 -173 3 -37 -185 -143 343 -12 -31 245 -27 25 219 70 1 287 -102 80 68 -13 -81 -24 46 34 -167
7792 -167 140 -40 163 97 57 -54 -25 -326 81 -13 74 162 -74 106 115 156 -176 3 -109 -89 -35 180 49 105
7816 105 68 -59 -323 -126 -135 6 -135 85 112 24 -231 -151 -93 -121 43 -248 71 -106 -290 -155 434 164 -20
7839 -20 -20 -109 -60 -171 -79 22 -50 0 -73 -34 -112 -272 -15 -2 -83 -80 70 125 -265 108 20 -112 342 130 21 -95
7865 -95 317 -355 -3 -148 124 237 69 -64 -50 40 -317 -38 39 54 -197 164 -9 -145 -110 58 28 39 205
7888 205 -16 -46 -205 -106 21 -168 318 -69 -152 130 61 -83 -117 103 -190 185 17 94 151 -303 1 -158
7910 -158 -29 -128 -205 -110 -9 -84 106 61 -169 20 0 95 213 79 15 -95 14 -133 -241 -25 88 52 131
7933 131 -341 124 490 11 176 23 129 -30 55 88 11 250 -147 -163 -100 153 -165 54 121 -18 179 43
7955 43 57 -83 -63 -290 -8 -103 -13 -160 -42 142 44 50 108 -213 115 -63 121 -81 -286 111 -199 60 3
7978 3 -36 -36 -4 -86 48 -112 129 84 -151 134 4 -203 131 68 -103 -84 116 -58 12 -130 -75 85 -71 73
8002 73 96 129 -125 45 29 30 201 -122 -43 40 -34 -215 -176 480 -29 -140 191 26 -23 -189 34 -171 223 27
8026 27 139 359 98 -295 -101 54 -56 -59 154 164 -87 -14 48 -99 -203 176 -61 -78 108 0 40 102 -73
8049 -73 -64 42 -108 66 4 -159 -9 -154 153 -66 152 110 205 -220 -125 -32 -131 157 14 10 -105 -222 145 0
8073 0 3 108 52 114 -127 193 -6 -25 57 -219 24 -231 -17 -4 -87 146 117 -21 -201 -246 8 -48 171 -23
8097 -23 399 108 -191 -107 159 -348 -38 162 194 78 -71 230 -135 86 -249 -74 -191 -226 51 -128 -140 -117
8119 -117 240 -15 35 -127 -21 -302 -19 -44 168 -56 -327 -48 -8 -55 -190 49 88 206 92 -61 107 -232
8141 -232 54 129 -159 107 -64 60 -93 -9 37 127 60 -16 23 191 147 218 -18 205 12 2 81 -587 -127 81
8165 81 196 92 77 159 -19 -6 109 187 -51 71 57 -247 249 -93 -99 42 -162 53 -78 -225 -117 18 -42
8188 -42 -127 191 95
8191I5
##END NTUPLES=NMR FID
##END=
