##TITLE=1H_DE-27_Et2
 D2O
 8 sc, 
 1.12.2023
##JCAMPDX= 6.0         $$ Bruker NMR JCAMP-DX V2.0
##DATA TYPE= NMR FID
##DATA CLASS= NTUPLES
##ORIGIN= UXNMR, Bruker Analytische Messtechnik GmbH
##OWNER= root
$$ XWIN-NMR		Version 3.5
$$ Fri Dec  1 15:28:20 2023 Russian Standard Time (UT+4h)  she@DPX200
##.OBSERVE FREQUENCY= 200.1313
##.OBSERVE NUCLEUS= ^1H
##.DELAY= (6, 6)
##.ACQUISITION MODE= SIMULTANEOUS
##.ACQUISITION SCHEME= undefined
##.AVERAGES= 8
##.DIGITISER RES= 18
##SPECTROMETER/DATA SYSTEM= spect
##.PULSE SEQUENCE= zg30
##.SOLVENT NAME= CDCl3
##.SHIFT REFERENCE= (INTERNAL, CDCl3, 0, 15.7039)
##AUDIT TRAIL= $$ (NUMBER, WHEN, WHO, WHERE, WHAT)
$$ ##TITLE= Audit trail, XWIN-NMR		Version 3.5
$$ ##JCAMPDX= 5.01
$$ ##ORIGIN= Bruker BioSpin GmbH
$$ ##OWNER= she
$$ F:/spectra/data/she/nmr/H-F/1/audita.txt
$$ ##AUDIT TRAIL=  $$ (NUMBER, WHEN, WHO, WHERE, WHAT)
(   1,<2023-12-01 15:27:09.68 +0400>,<she>,<DPX200>,
      <created by zg, POWCHK disabled, PULCHK disabled
       configuration hash MD5:
       00 E9 B6 7A A2 85 ED C7 34 08 36 98 17 FE 4E 26
       data hash MD5: 16K
       7B 6C 7D 77 F5 AC 81 64 59 3B E4 26 D4 28 68 7B>)
$$ ##END=
$$ 
$$ hash MD5
$$ AD 74 D9 79 9B 06 06 B4 10 7C 74 AE 2C 01 98 DC
##$RELAX= 
##$RELAX= 
##$RELAX= 
##$RELAX= 
##$RELAX= 
##$RELAX= 
$$ Bruker specific parameters
$$ --------------------------
##$DU= <F:/spectra>
##$EXPNO= 1
##$NAME= <H-F>
##$PROCNO= 1
##$TYPE= <nmr>
##$USER= <she>
##$AMP= (0..31)
100 100 100 100 100 100 100 100 100 100 100 100 100 100 100 100 100 100 
100 100 100 100 100 100 100 100 100 100 100 100 100 100 
##$AQSEQ= 0
##$AQ_mod= 1
##$AUNM= <au_zg>
##$AUTOPOS= <>
##$BF1= 200.13
##$BF2= 200.13
##$BF3= 200.13
##$BF4= 200.13
##$BF5= 200.13
##$BF6= 200.13
##$BF7= 200.13
##$BF8= 200.13
##$BYTORDA= 1
##$CFDGTYP= 0
##$CFRGTYP= 5
##$CHEMSTR= <none>
##$CNST= (0..31)
1 1 145 1 1 1 1 1 1 1 1 1 1 1 1 1 1 1 1 1 1 1 1 1 1 1 1 1 1 1 1 1 
##$CPDPRG= <>
##$CPDPRG1= <>
##$CPDPRG2= <>
##$CPDPRG3= <>
##$CPDPRG4= <mlev>
##$CPDPRG5= <mlev>
##$CPDPRG6= <mlev>
##$CPDPRG7= <mlev>
##$CPDPRG8= <mlev>
##$CPDPRGB= <>
##$CPDPRGT= <>
##$D= (0..31)
0 1.2 0 0 0 0 0 0 0 0.06 0 0.03 0 0 0 0 0.0002 0 0 0 0 0 0 0 0 0 0 0 0 
0 0 0 
##$DATE= 1701430029
##$DBL= (0..7)
120 120 120 120 120 120 120 120 
##$DBP= (0..7)
150 150 150 150 150 150 150 150 
##$DBP07= 0
##$DBPNAM0= <>
##$DBPNAM1= <>
##$DBPNAM2= <>
##$DBPNAM3= <>
##$DBPNAM4= <>
##$DBPNAM5= <>
##$DBPNAM6= <>
##$DBPNAM7= <>
##$DBPOAL= (0..7)
0.5 0.5 0.5 0.5 0.5 0.5 0.5 0.5 
##$DBPOFFS= (0..7)
0 0 0 0 0 0 0 0 
##$DE= 6
##$DECBNUC= <off>
##$DECIM= 32
##$DECNUC= <off>
##$DECSTAT= 4
##$DIGMOD= 1
##$DIGTYP= 9
##$DL= (0..7)
0 120 120 120 120 120 120 120 
##$DP= (0..7)
150 150 150 150 150 150 150 150 
##$DP07= 0
##$DPNAME0= <>
##$DPNAME1= <>
##$DPNAME2= <>
##$DPNAME3= <>
##$DPNAME4= <>
##$DPNAME5= <>
##$DPNAME6= <>
##$DPNAME7= <>
##$DPOAL= (0..7)
0.5 0.5 0.5 0.5 0.5 0.5 0.5 0.5 
##$DPOFFS= (0..7)
0 0 0 0 0 0 0 0 
##$DQDMODE= 0
##$DR= 18
##$DS= 0
##$DSLIST= <SSSSSSSSSSSSSSS>
$$ [...]
##$SUBNAM2= <"">
##$SUBNAM3= <"">
##$SUBNAM4= <"">
##$SUBNAM5= <"">
##$SUBNAM6= <"">
##$SUBNAM7= <"">
##$SUBNAM8= <"">
##$SUBNAM9= <"">
##$SW= 18.0517328524113
##$SWIBOX= (0..15)
0 0 2 0 0 0 0 0 0 0 0 0 0 0 0 0 
##$SW_h= 3612.71676300578
##$TD= 16384
##$TD0= 1
##$TE= 0
##$TE2= 300
##$TE3= 300
##$TEG= 300
##$TL= (0..7)
0 120 120 120 120 120 120 120 
##$TP= (0..7)
150 150 150 150 150 150 150 150 
##$TP07= 0
##$TPNAME0= <>
##$TPNAME1= <>
##$TPNAME2= <>
##$TPNAME3= <>
##$TPNAME4= <>
##$TPNAME5= <>
##$TPNAME6= <>
##$TPNAME7= <>
##$TPOAL= (0..7)
0.5 0.5 0.5 0.5 0.5 0.5 0.5 0.5 
##$TPOFFS= (0..7)
0 0 0 0 0 0 0 0 
##$TUNHIN= 0
##$TUNHOUT= 0
##$TUNXOUT= 0
##$USERA1= <user>
##$USERA2= <user>
##$USERA3= <user>
##$USERA4= <user>
##$USERA5= <user>
##$V9= 5
##$VALIST= <valist>
##$VCLIST= <CCCCCCCCCCCCCCC>
##$VD= 0
##$VDLIST= <DDDDDDDDDDDDDDD>
##$VPLIST= <PPPPPPPPPPPPPPP>
##$VTLIST= <TTTTTTTTTTTTTTT>
##$WBST= 1024
##$WBSW= 4
##$XGAIN= (0..3)
0 0 0 0 
##$XL= 0
##$YL= 0
##$YMAX_a= 79491
##$YMIN_a= -83722
##$ZGOPTNS= <>
##$ZL1= 120
##$ZL2= 120
##$ZL3= 120
##$ZL4= 120
##$ABSF1= 10
##$ABSF2= 0
##$ABSG= 5
##$ABSL= 3
##$ALPHA= 0
##$AQORDER= 0
##$ASSFAC= 0
##$ASSFACI= 0
##$ASSFACX= 0
##$ASSWID= 0
##$AUNMP= <proc_1d>
##$AZFE= 0.1
##$AZFW= 0.1
##$BCFW= 1
##$BC_mod= 2
##$BYTORDP= 1
##$COROFFS= 0
##$CY= 11.3945322036743
##$DATMOD= 1
##$DC= 2
##$DFILT= <>
##$DTYPP= 0
##$F1P= 15.7292609196834
##$F2P= 12.9074282941183
##$FCOR= 0.5
##$FTSIZE= 0
##$FT_mod= 4
##$GAMMA= 1
##$GB= 0.15
##$INTBC= 1
##$INTSCL= 1
##$ISEN= 128
##$LB= 0.24
##$LEV0= 0
##$LPBIN= 0
##$MAXI= 10000
##$MC2= 0
##$MEAN= 0
##$ME_mod= 0
##$MI= 1.114404
##$NCOEF= 0
##$NC_proc= 0
##$NLEV= 6
##$NOISF1= 3.799351
##$NOISF2= 2.8
##$NSP= 1
##$NTH_PI= 0
##$NZP= 0
##$OFFSET= 15.70392
##$PC= 1
##$PHC0= -24594.17
##$PHC1= 13.25272
##$PH_mod= 1
##$PKNL= yes
##$PPARMOD= 0
##$PSCAL= 0
##$PSIGN= 0
##$REVERSE= no
##$SF= 200.130013532006
##$SI= 16384
##$SIGF1= 3
##$SIGF2= 2
##$SINO= 400
##$SIOLD= 16384
##$SREGLST= <1H.CDCl3>
##$SSB= 0
##$STSI= 0
##$STSR= 0
##$SW_p= 3612.71676300578
##$SYMM= 0
##$S_DEV= 0
##$TDeff= 0
##$TDoff= 0
##$TI= <>
##$TILT= no
##$TM1= 0
##$TM2= 0
##$TOPLEV= 0
##$USERP1= <user>
##$USERP2= <user>
##$USERP3= <user>
##$USERP4= <user>
##$USERP5= <user>
##$WDW= 1
##$XDIM= 8192
##$YMAX_p= 0
##$YMIN_p= 0
$$ End of Bruker specific parameters
$$ ---------------------------------
##NTUPLES= NMR FID
##VAR_NAME=  TIME,          FID/REAL,        FID/IMAG
##SYMBOL=    X,             R,               I
##VAR_TYPE=  INDEPENDENT,   DEPENDENT,       DEPENDENT
##VAR_FORM=  AFFN,          ASDF,            ASDF
##VAR_DIM=   8192,          8192,            8192
##UNITS=     SECONDS,       ARBITRARY UNITS, ARBITRARY UNITS
##FACTOR=    0.0002768,     1,               1
##FIRST=     0,             0,               0
##LAST=      2.2672688,     0,               0
##MIN=       0,             -83722,          0
##MAX=       2.2672688,     79491,           0
$$ Real data points
##PAGE= N=1
##DATA TABLE= (X++(R..R)), XYDATA
$$ [...]
2545a425K044J524J140l25j542j274j979r16m08J595J879J524Q83M6j114j871
2561b19j949r02L06P55J559K432R45M37j283j279k090j436k54R96J672J464J260
2578B414N83n72j930j991j079n94M51J858K070J562L51n08j263j764k061n59N39
2595b493J148J572J821R81n20j444j739j565q62K47J129K256J583O89K6q32k013
2612a6j868j034L07O34J687J945J427j21j244j599j633j306m50J307J842J593
2628A471J280N17o31k096j862j194l71Q88J152K040J180K53o11j135j915j571
2644b605o54Q72J543J491J510R77l02j626j929j379o97K73R04K123J376N17Jj008
2662A387j900j570n29L80N84J840J569J299k14j228j434j562j032l68R15J613
$$ plain form
2545 -1425 619 2143 3283 2958 1416 142 -1837 -2753 -3161 -1566 313 1837 2720 2766 1652 -219
2561 -219 -2168 -3070 -2764 -2009 -450 1982 2927 3364 2081 802 -1288 -2724 -2978 -1982 -310 1154 2414
2578 2414 2997 2425 495 -1496 -2575 -3169 -2718 -860 1210 2772 3123 2615 1352 -412 -2473 -3032 -2493
2595 -2493 -1345 227 2048 3029 2509 1065 -674 -2239 -3101 -2854 -1725 531 2114 2803 2829 1997 -16
2612 -16 -1884 -2918 -2611 -1977 -290 1655 3082 2961 1717 118 -1515 -2821 -3271 -1964 -122 1471
2628 1471 2751 3268 2637 541 -1321 -2515 -2886 -1998 -846 1194 2374 2627 2016 881 -1034 -2605
2644 -2605 -3259 -2387 -844 647 2157 3134 2832 1206 -723 -2102 -2799 -2526 -1622 501 1877 2394 2395 1387
2662 1387 -513 -2083 -2612 -2232 -1648 192 1761 3060 2846 1618 184 -1378 -2410 -2778 -1863 -250
2678b50J601P76L29l18j876j505j201k16Q33J380J820J491P8j006j162j730j284
2695b240m60O11J522J149J129J061m88j588j372j373n21J13J505K050J073M51
2711B622l65q09j615j932m77L26Q63J322J588R88o4j485j376j136p98J00P33K050
2729E35J115J027j4q34j792j819n30K07J93J511J670J250k91p53j068j310j322
2746b225l38Q23J493J440P75Q59m37k034j489q36l62K68J087K032J101Q2p52o88
2764G99j432j584l08O07J333J206J257Q12n06j467j463q18p80j66R89K068J243
2781A790J57K1n72j812j469n49O22P34J201J460J213l16j040j370j345r44r4R27
2799a386J249J390O69K63o41j575j292r48P8N46J321J896P38J19q34j032j441
$$ plain form
2678 -250 1351 2127 2456 2138 262 -1243 -2444 -2660 -1827 -447 1373 2864 2942 1936 774 -956 -2240
2695 -2240 -2700 -2089 -567 582 1711 2772 2284 696 -676 -2049 -2570 -2457 -952 1098 2171 2622
2711 2622 2257 1448 -167 -2099 -2576 -2250 -1387 -65 1523 2511 2447 962 -414 -1550 -2348 -2248 -1515 535
2729 535 1650 2677 2663 1829 37 -1782 -2312 -2105 -1912 -401 1269 2519 2228 1475 407 -903 -2225
2746 -2225 -2563 -1740 -247 1193 1968 2827 2390 356 -1133 -1969 -2331 -2063 -976 1056 2157 2239 1487 799
2764 799 -633 -2217 -2525 -1918 -585 621 1878 2690 2184 717 -746 -1564 -2344 -2510 -1521 547 1790
2781 1790 1947 1968 1396 -416 -1885 -2434 -1812 -1078 123 1583 2796 2480 1440 70 -1275 -2219 -2313 -1386
2799 -1386 -137 1253 1922 2185 1544 -31 -1323 -2271 -2193 -1647 -326 1570 2308 2427 1593 561 -880
2816h80j228o92J158Q70J389R24Q34o25j223r85j654j88J32J306J904J021O70
2833B733o19j175j513j810k24O70P42J234J568J048l72j293j285r94j011J02J140
2850a059J388J389P15L6r86j448j857p62M12N56J241J493R65Q8p80j460j149j132
2868b350j32J365J075J200Q48O85q16j517j530q61l34J67J283J997R90P1m32r25
2886G84j670j138n22P79J161J282J217P24m77j236j579q98r45m4J620J376J217
2903A651O57m6q84j626j399o25J96Q75J436J406J217n09j143j223j491r03m15
2920b826J468J078J153J266J68q63j161j744o74l08O97J425J504J124J23o35j214
2937E81j515j396l71O51J339J336J350N24l05j464j313j221l55K26R87J620J300
$$ plain form
2816 -880 -2108 -2800 -1642 -772 617 1541 2375 1750 527 -458 -2112 -2300 -2168 -862 1042 2063 2733
2833 2733 2114 939 -574 -2384 -2608 -1938 -1196 38 1606 2654 2282 989 -296 -1290 -2301 -2199 -1059
2850 -1059 329 1718 2433 2469 1483 35 -1822 -2584 -2172 -1616 -375 1118 2083 2171 1391 -69 -1218 -2350
2868 -2350 -2482 -1117 -42 1158 2006 2691 1875 358 -1172 -2033 -2367 -2200 -917 1080 2070 2141 1709 784
2886 784 -886 -2024 -2546 -1767 -606 676 1893 2617 2140 904 -675 -1573 -2518 -2562 -942 434 1651
2903 1651 2308 2262 1378 -248 -1647 -2272 -2076 -1201 235 1641 2858 2349 1206 -17 -1508 -2411 -2826
2920 -2826 -1358 -280 873 2139 2307 1444 283 -1461 -2135 -2443 -1746 -321 1183 2307 2430 1795 581
2937 581 -934 -2330 -2701 -2050 -711 625 1975 2499 2194 730 -583 -1804 -2159 -1933 -946 674 1974
2954A974M63l87n81j976j340o93K88J332R18J485Q58kj201j194j112j258K54Q93
2972a279J433J257R78rr29j206j636j036J7R19J136J464J130R5p45j273j147j527
2990b358L4P75J082J456J130J61m02j190j592j295j03M29J079J522J029M21l72
3007A806q05r73j607o64N25Q57J292J158P82j19j372j533p77q13K20J064J118
3024A59J398N54Q1p22j178j427r78L57N68Q90J548J099j11q90j063j373j027m38
3042b553P70J472J328Q26J63n38j006j249r52k67N23O22J615J321J47m78j089
3059F55j178j413n53O71J024J192J297M38l27r64j340p26p19O1R12J375J370L17
3077B092k47n75j477j520l75M13O26J145R88Q98J28j093j073p92q92n01J156J487
$$ plain form
2954 1974 2437 2050 1469 -507 -1847 -2540 -2252 -920 -2 1483 2341 2339 1138 -56 -1168 -2426 -2172 -1279
2972 -1279 154 1411 2389 2380 1451 245 -1391 -2427 -2410 -1491 -355 1109 2239 2334 1589 316 -831 -2358
2990 -2358 -2324 -1549 -467 989 2119 2280 1878 688 -904 -2199 -2302 -1873 -794 728 1757 2178 1806
3007 1806 1001 28 -1579 -2243 -1718 -861 431 1589 2371 2252 880 -653 -1430 -2243 -2023 -959 159
3024 159 1557 2111 2192 1470 292 -1135 -2113 -1756 -1188 -298 1250 2349 2238 1348 285 -1088 -2115 -2553
3042 -2553 -1783 -311 1017 1843 2006 1468 462 -787 -1739 -2006 -1483 -861 754 2075 2222 1744 655
3059 655 -523 -1936 -2489 -1818 -794 398 1695 2133 1806 842 -498 -1224 -1943 -1882 -970 405 1775 2092
3077 2092 1845 1270 -207 -1727 -2102 -1689 -1063 82 1070 1968 2096 1003 -70 -862 -1754 -2255 -1099 388
3095C88N82N63L64m65j534j313p82K25M53R35J398J172J29p50q25j290r04m55
3113b109N38J372P37R96P65n18j237j513p56k47M5J012J632Q62M90m64o47j302
3131c44j111l72J09J003J031J270O77n06j155j069r07p11n4J144J404J186J89
3148A784j46m09j299j308l91P6O02J167R31Q64O0q77j151j063q37j75R16R37J212
3167H93P67M87n66j112j355p72j05K70R84J530P24J77n94r79j164j010j59L81
3185a603J124N43J571M46j73j422j089p77n80J14Q86J366J169K86P5r03j457j272
3203a696l16O7R69R72J293O59j88p67j028q78j012l3P39J338J064P68j96l83j501
3222a29r30r63L71J40R98J371R90K41p98o50j214r09o28O37R41J304P77N80n77
$$ plain form
3095 388 970 1533 1897 1432 -102 -1415 -2197 -1972 -1519 -584 814 1986 2115 1365 540 -750 -1654 -2109
3113 -2109 -1571 -199 538 1534 2299 1781 544 -969 -1725 -1972 -1927 -915 717 1579 2069 1605 958 -344
3131 -344 -1455 -1827 -1718 -715 316 1586 2263 1757 602 -467 -1374 -2085 -2139 -995 409 1595 1784
3148 1784 1638 1229 -70 -1378 -1769 -1693 -1091 76 1007 1871 1931 1054 -97 -1160 -1997 -2172 -1256 -319 893
3167 893 1660 2147 1581 469 -886 -1658 -1763 -1493 -509 1021 1745 1922 1328 349 -815 -1825 -1984 -1603
3185 -1603 -479 64 1635 2081 1908 486 -603 -1380 -1960 -1846 -960 406 1575 1861 1936 1033 -424 -1696
3203 -1696 -2012 -1945 -976 -4 1289 1948 1760 993 -35 -913 -1925 -1958 -1219 119 1183 1951 1755 1372 -129
3222 -129 -1059 -2022 -1651 -1511 -513 858 1848 2089 1291 641 -573 -1482 -2110 -1473 -532 772 1549 2129 1552
3241A552j139j383o31k61N1J124J338J057J95k11q97r14j577k88K58P39J151J189
3259A353P37m65n86j273p25j030M3O23J444J254O51R0r21j139j152p91K42M33
3277a212R26J298J125L1j000j105r12j119m65J061J340R39O81M25k42j109j505
3294h43p72n9j9J121J145J022K57j60r38j519p92p13O07R04J314Q78P65j83r98
3313A017j223q28p95k20J284O96J428O47r6p63j598j019o51M59M88J106J174Q43
3331A949J91r14j237o11j319k37P92J474O45R30L60o55r27j454q64R0K70J108
3349d09J239R24Q3k70q04j365p70p84P90P62J187J000K91Kj127j495n69m73L8
3368a750O02J580J133L10l10o41j041j072p91K18Q64O37J316N57R8p62q92j183
$$ plain form
3241 1552 413 -970 -1601 -1862 -1811 -687 651 1708 1903 1692 795 -119 -1696 -1984 -1726 -987 164 1353
3259 1353 2090 1625 1039 -234 -959 -1989 -1946 -1323 121 1375 2026 2116 1195 56 -1096 -1887 -1645 -1212
3277 -1212 -286 1012 2137 2168 1168 63 -849 -1968 -2433 -1372 -32 907 1588 2013 1771 662 -843
3294 -843 -1615 -1674 -1693 -572 573 1595 1852 1692 754 -765 -1557 -2270 -1663 -759 555 1433 2198 2015 1017
3313 1017 -206 -1034 -1829 -2049 -765 -69 1359 2006 1910 1147 -451 -1470 -2121 -1662 -1174 -68 1106 1949
3331 1949 2140 1226 -11 -622 -1941 -2178 -1386 88 733 1663 2023 1368 441 -1013 -1877 -1787 -1517 -409
3349 -409 830 1754 1837 1567 763 -602 -1372 -2156 -1366 -604 583 1583 1874 1876 749 -746 -1315 -1788 -1750
3368 -1750 -1148 432 1565 1875 1565 924 -117 -1189 -1980 -1762 -898 -261 1055 1612 1710 948 56 -1127
3386a127n37kL45J547O34R01O5m99q29j497n14k71L25J248Q70J008K58p46p90
3405C89j084r23j95M00J119Q76P99N47m13q19j484o82P0k79J019J046J029L34
3423A749r2j086o38j171n87M17R31Q20R45R44n50p62j231q36m19p7O20J168Q61
3442A006L75J30m83j354q05k97k87P15O74J038J224p0q39r66r58m89m65N77J214
3461f0N08O36M33kj205j252o10j9L72Q11J233O01L77l29j062r72p94l31L07R81
3481c77M41J023O62k49j039j036m48n79K21O63Q29J299J64J8n23j067j381l29
3499a708J61P92R56P03N28L20q06j043r19l24k08O63J102P68M37J45j67j324j052
3518i76n99r1M09Q95J105P54J03n20r53n44j025k72P61N73Q64R54j2q5q26j286
$$ plain form
3386 -1127 -1664 -1666 -1321 226 860 1761 1826 1327 498 -999 -1513 -1784 -1459 -211 659 1667 1925 1179 389
3405 389 -695 -1618 -1813 -1413 -294 582 1381 1928 1515 696 -788 -1470 -1400 -1679 -660 386 1415 1749
3423 1749 1657 571 -67 -1238 -1825 -1408 -477 343 1288 2232 1682 920 -311 -1147 -1566 -1643 -1023 145 1006
3442 1006 1381 1511 1028 -326 -1131 -1428 -1715 -1000 -326 712 1936 1866 1027 61 -897 -1386 -1851 -1274 -60
3461 -60 448 1084 1517 1515 310 -942 -1552 -1571 -1199 -388 845 1446 1823 1494 432 -540 -1334 -1665 -1358 -377
3481 -377 64 1087 1749 1500 461 -575 -1023 -1602 -1381 -718 111 1410 1574 1592 1069 2 -1379 -1708
3499 -1708 -1547 -755 201 904 1432 1752 946 -97 -1016 -1340 -1548 -885 217 985 1422 1567 1400 76 -976
3518 -976 -1575 -1666 -1257 -362 743 1497 1600 1080 127 -417 -1442 -1714 -953 -380 484 1438 1426 1341 515 -771
3538g71o46m31P09M52J193Q38L1r2o85q42j123k92M18Q49N87R59N15k20q77o72
3558a00r24o54j70J038J243O76L06j5m79j045j068o80M33P41P96R40O33n1p48
3577H72p83o84r63oK12J023R31N26M45j46j100r42p56M8j26Q50J276J032R1n88
3597A212o40j018r39n88M95Q46Q70P35Q53m74n94j234m90o71J46O53J341Q25K83
3616A611j67m50j203r88m01M0P26N81J328N68k08n72q50q24m29k23L53R85J059
3635I36M68J53m52r41r31q34m8L20P48J459M88M86p38q09q46o05o97P44P89Q59
3655E49Q66M02n71o49j022r98j81j3N97J431P41L46m2p04o77j322m41M26N39R39
3675B16Q69N16j28o29r27q05o46m6O32R14J146K12L37m09j315r53l22o3N36O82
$$ plain form
3538 -771 -1417 -1848 -1139 -687 506 1344 1375 1283 598 -244 -1367 -1659 -1241 -392 195 1154 1669 1449 572 -100
3558 -100 -1024 -1678 -1848 -810 433 1109 1415 1400 921 -124 -1192 -1872 -1439 -698 98 1038 1671 1620 872
3577 872 89 -595 -1558 -1564 -1352 -329 602 1128 1573 1427 327 -615 -1371 -1323 -1449 -599 677 1709 1800 1212
3597 1212 572 -446 -1385 -1973 -1478 -632 238 973 1826 1352 758 -476 -966 -1637 -1491 -838 503 1328 1611
3616 1611 1444 994 -209 -1197 -1598 -1558 -832 -251 1077 1645 1437 865 15 -809 -1238 -1461 -1108 -123 936
3635 936 1404 1557 1105 164 -767 -1601 -1649 -1329 -581 878 1366 1852 1114 305 -541 -1146 -1843 -1099 -310 549
3655 549 1415 1817 1246 597 -425 -1423 -1604 -1617 -1020 411 1152 1498 1456 752 75 -1247 -1688 -1262 -723 216
3675 216 1085 1601 1473 844 -83 -888 -1534 -1580 -948 -34 1112 1324 1661 1252 -63 -1016 -1338 -1401 -865 -183
3695a83P39Q35J95l36r67r71o63k44L62P45J012O05L21J47j415p98o93k09M36
3714a082O14Q23Q11K89j65p09p61j058n93O73P23Q36M71P27q5p19q26q99n45J22
3734a353M50J194Q88R2M44n00r05j413l19L9J96J071R44O06N0m42p17q76o33k29
3754a413K91J038P66P30Ol62q29q63o43l28L01P67R08J107N4n46m26q59p28l82
3774a411J50O85P11O91N09j06o55r97q92kk28O92J190Q00K81l00m40o80r04l99
3794a305n0O67P18O91J088j55q22j093o78n18q8N53Q75R49N13p2k84q25j024n10
3814a370J02L59P72N29J056r5n63n04r16n91j87L90O69Q30N93K49k05o41q19q66
3834a208l63O19N93O93R04j10K2m87j037p83k63Q1Q20Q67M52N98q2n90j091n49
$$ plain form
3695 -183 556 1391 1586 1250 283 -688 -1351 -1595 -1233 -488 524 1129 1450 1597 182 -616 -1309 -1518 -1082
3714 -1082 -468 355 1166 1455 1290 581 -180 -1238 -1831 -1158 -435 401 872 1599 1514 795 -31 -930 -1475 -1353
3734 -1353 -903 291 1179 1271 1715 1215 310 -1103 -1422 -1383 -1187 -116 828 1434 1484 1042 325 -551 -1184 -1413
3754 -1413 -1122 -84 682 1412 1418 1056 227 -636 -1279 -1607 -1306 -539 369 1476 1530 984 558 -301 -1029 -1411
3774 -1411 -1261 -576 135 826 1335 1229 574 -423 -1315 -1317 -1545 -853 337 1137 1418 1118 678 -2 -906 -1305
3794 -1305 -1355 -688 30 721 1809 1654 832 -261 -939 -1457 -1545 -992 -117 832 1345 1273 989 164 -860 -1370
3814 -1370 -1268 -909 -137 392 1448 1353 790 286 -630 -1221 -1408 -1018 -349 481 1074 1323 1118 477 -342 -1208
3834 -1208 -1571 -952 -359 334 1238 1128 1150 663 -374 -1157 -1420 -1339 -519 348 800 1398 1316 726 -365 -914
3854i14m37oN16J265N87J04K57n34q59j062k93o8P51O92P66P64q5p44o91p06m20
3875a117l37M45J025N93O33J78k89j025r90n67K13PO43J423O01j75j01o70r03
3894d13o76m10N34M90Q98O94L18M2j149q13o88m71L45M37R82P94M63r2m79r03
3914i7p41q23M04N44R26Q66N20k70o98p55p62k36l46O73O25J169L20P2k02r40
3934B49j032o54r8Q50N85P13Q25j79m02p67p59q34K7L94M41J041R26K00k82o56
3954E88j000p54l55M46O31Q43P18K68l51n99q54o58m23K95P78O42P83O12l10n07
3974G93o80r48k05k52P06N28Q49M78m5m65r30n85n40r7N79Q06Q20Q21l9p82p94
3995A8p96k74l61K91P64Q91N13J50k32o27q45l81l83K56P00Q77O46n5J8o33p29
$$ plain form
3854 -914 -1351 -1357 -841 424 1011 1115 1372 838 -21 -1083 -1376 -1444 -693 -1 765 1529 1444 700 9 -697 -1117
3875 -1117 -1454 -1009 16 609 1242 1420 1131 106 -884 -1451 -1238 -1231 -588 835 1436 1261 1160 490 -413
3894 -413 -1089 -1499 -965 -475 423 1117 1435 1477 328 -485 -1173 -1644 -1299 -862 120 914 1377 1285 806 -97
3914 -97 -838 -1661 -1257 -713 213 1079 1599 1329 631 -124 -886 -1122 -1468 -795 -170 999 1319 1391 1189 249
3934 249 -783 -1437 -1535 -685 -100 613 1438 1259 857 90 -669 -1503 -1476 -1082 -641 400 1326 1526 1244 588
3954 588 -412 -1166 -1521 -1075 -444 399 1117 1385 1034 435 -419 -1077 -1500 -1205 -427 215 998 1610 1300 793
3974 793 113 -835 -1040 -1292 -586 -58 791 1269 1224 759 -171 -756 -1296 -1393 -814 -8 812 1633 1594 812 18
3995 18 -778 -1052 -1413 -1122 -358 533 1046 1196 964 337 -508 -889 -1272 -1016 -316 561 1207 1152 1170 537 -192
4016a92q11m06K78P17M99P82O14l43o28p30p66m40L59K30Q91R64L64k99k71q16
4036dj118k48O2O58M98P54N21K62p96n17q11n10l6N06Q22P83M43m1n74l93r29
4057f68m16M3r0P90R49O22m8n42l43o12p40k99K59P08O99N29O73l30q25p47o39
4078a027j42K42L29R27N24K73j28p36n48p66j87J25N98N00P02O61P8p75p22o46
4098g18k29l11K98R02P85K76J52n18p91m57l16j25M16L28J029L61Q0m62o49o92
4118f41o83J16J92N12J003M33L18l58q12n37o77j57K41O25P83P02Q3n5o02o00
4138a14o39k75Q0N08P02O14J42M4o65m35q96l55K19M15O80R46JJ05m47o65n69
4159f04o78O08l9O95O49Q1M46n63o23l99q65L41L50O19N81M27P2m4o61r84l08
$$ plain form
4016 -192 -1003 -1409 -1131 -414 85 867 1481 1138 510 -220 -986 -1426 -1067 -837 54 1018 1382 1083 812 -4
4036 -4 -1122 -1370 -1308 -650 -152 602 1123 1385 589 72 -739 -1249 -1285 -779 43 826 1269 1228 654 261 -668
4057 -668 -1084 -1041 -1131 -341 608 1230 1182 640 297 -315 -1055 -1354 -1095 -387 312 841 1514 1184 359 -388 -1027
4078 -1027 -1169 -927 -598 329 853 1126 998 262 -286 -1052 -1239 -1114 -516 -16 686 1347 1425 650 -72 -718
4098 -718 -947 -1258 -960 -58 727 1003 1155 637 -154 -611 -927 -1052 -636 -308 721 1082 1162 700 51 -641
4118 -641 -1324 -1208 -1016 -504 499 932 1250 892 80 -457 -1134 -1291 -1050 -425 358 1060 1143 1088 486 -114
4138 -114 -753 -1028 -948 -440 262 876 1018 1062 397 -38 -934 -1289 -1070 -655 25 971 972 1077 630 -35 -604
4159 -604 -1282 -674 -713 -18 631 712 1158 595 -28 -427 -1292 -951 -601 18 599 1026 1098 1054 393 -591 -899
4180h99m04M98L26Q40P42j5l40n02o56n38m33L67R70P08K46K27M5n52j071m14
4200h55l03J60L16P37O49M73m37r9p51r51P2K25K78O73O61K74km47q72o26j29
4221i54j64M44Q00N38N70j69j80j101m21j37j39L05P18M93M53J5l78n50p27n61
4241a145J07NQ88M94M96J61Q8p21p88n75j84K55P73M98N98N76o60n42p07l42l38
4262a063q3P93M03L44J058l00o66q81j01k33j46K48P59N69L68j85k95n95q38j49
4282i93J04L31P93O89M3L1l69p50l12n97j9L69O85P14P0J00R4r15o82m28m8L37
4304g53K19Q42P45J26k72o35q46k34k53L59K68Q33K68N25j78m64j063k56k22j28
4324a119N23R09P93J10k36n92o27o51m81M86L38P44J65R73q0p40n68p83l79j58
$$ plain form
4180 -899 -1303 -805 -479 361 1103 1088 748 246 -410 -948 -1381 -1014 -44 664 910 1137 1182 630 -441 -855
4200 -855 -1158 -998 -682 55 704 1177 740 641 -110 -1061 -989 -764 -486 187 848 1122 1120 673 -199 -825 -954
4221 -954 -1118 -674 126 664 1234 1065 885 -216 -637 -774 -913 -608 110 603 1056 1071 693 143 -584 -1145
4241 -1145 -1038 -1033 -145 349 845 1006 1094 373 -415 -990 -1174 -919 -146 352 950 1526 866 324 -383 -725 -1063
4262 -1063 -1146 -353 50 394 1452 1152 486 -395 -496 -729 -875 -627 132 701 1069 884 589 -6 -844 -993
4282 -993 -889 -558 235 924 967 998 629 -121 -433 -1030 -1049 -680 5 719 789 889 983 68 -614 -1042 -1090 -753
4304 -753 -534 308 1053 1179 907 272 -574 -808 -1061 -702 -434 399 667 1192 1014 550 -513 -769 -991 -1119
4324 -1119 -596 313 1106 1216 980 388 -239 -890 -1371 -885 -547 197 362 1335 1255 515 -53 -836 -1215 -1373
4344a373N88P77N37N06K8l48n14o88m66j04L22P33M78P38j84l71m94p63k22m14
4364a234M43N38M42P79J94m81k05p01p83p2K22L52Q83M82J43J2n55q93m66k32
4384a132J82O01M53M82M90j93m60m19n86P3m94N18J92R41O74m10j91p87o50k54
4404i70J44J89O14N05M37J39k75n12p44j76n48M07P07O10J04L90m2q84n23n37
4424i65N2M3N10P98M09M6K41q00p81j95l32L12K88N66N68M27l62l62p81k11l16
4445h45j50M11P57N49K93J9l60p42m21m29NN28L57Q78J11m7m55l56n94j47l11
4466i49K61Q07N61M56P3n72n81n06m52j8K76O00N74M61j42k13m28o90m12o1J45
4487h10K76J074J66L74j52p25n29m41j93M2N02N36M02N82n16j72o83m06k74oN15
$$ plain form
4344 -1373 -785 -8 529 1035 1063 715 201 -487 -953 -1057 -735 -2 476 1214 1030 659 165 -598 -820 -1234
4364 -1234 -791 -253 189 968 1162 681 476 -225 -1008 -1080 -858 -506 377 859 1002 1014 459 -434 -900 -1132
4384 -1132 -950 -349 104 586 1076 883 423 4 -582 -509 -1003 -485 -293 648 1322 912 721 -66 -716 -970
4404 -970 -826 -637 -23 482 919 1058 783 271 -473 -649 -1197 -790 -83 527 631 1021 979 95 -428 -965
4424 -965 -913 -870 -360 438 847 893 1134 334 -447 -642 -974 -662 -374 192 760 1187 825 463 -318 -529 -845
4445 -845 -995 -584 173 722 1015 1034 674 -68 -489 -918 -913 -385 -28 850 961 914 459 103 -491 -638 -949
4466 -949 -688 119 680 1136 1209 637 56 -450 -902 -920 -644 -44 530 991 849 636 208 -482 -894 -955 -810
4487 -810 -534 540 706 1080 928 203 -326 -767 -960 -918 -416 120 522 1104 588 416 -267 -673 -947 -953 -438
4508d38N37O87J41J90o10r64k51j79L2N16L85O22J13J61j34j084l16l70K6L82
4528e54N28O20L45j45k3m36r38k35m64P94L71O18L91K38l52m46p88m01k13L13
4548g77O87L40M79K02l02n27k18p36m4K71L47N44N38J39q7q63j18p37J17OK03
4569e36N54O72L26k0o27m36n40j72ML22N54N91M45r7p05n44k93p57J86N67M80
4590b6R64J06j92k77n45o07l18j08M62N34J80O28O0j75m45n28p44m4K12O26O72
4611D35N28r7K21q79m49m33k38K34K46N63M79J13N3n93m04m59m98L76N08M88N35
4632G29L18lm54m59o94m77k8P39M93M51J18K34m10n63m34l11K3J26M58O02M32
4653H90J91k75q61l78n77n9K81O54O90L34O3m42m06m96n45J67j9M84N69O50R7
$$ plain form
4508 -438 99 786 927 1117 507 -457 -708 -887 -855 -339 46 668 781 942 808 -276 -592 -962 -936 -554
4528 -554 -26 594 939 794 771 335 -603 -838 -1302 -508 -137 481 872 1110 758 312 -476 -877 -1090 -777
4548 -777 -90 250 729 931 629 102 -116 -852 -896 -625 -278 266 804 943 856 -7 -125 -862 -745 -739 -536
4569 -536 18 690 1016 996 369 -67 -607 -779 -775 -453 101 692 1137 1040 335 -209 -502 -1259 -1073 -506 -26
4590 -26 938 1044 852 575 30 -577 -895 -1003 -541 -7 173 801 861 686 241 -287 -1031 -1075 -863 -237 435
4611 435 963 866 1087 208 -241 -674 -912 -678 -432 131 610 723 776 183 -221 -680 -1178 -802 -294 194 729
4632 729 1047 1044 590 131 -563 -1040 -1068 -329 164 615 733 967 557 -6 -440 -751 -728 -602 -144 458 890
4653 890 1081 806 -55 -433 -1010 -1069 -788 -134 556 890 953 511 105 -391 -936 -769 -788 -304 265 915 1012
4674A012n86J59j075k61q2M2O60L55M57L13l7o22n03o48j45K10L69N57N57J88
4694I20k48j22m75p81j50M6L75L88N32N30k08l59n48n28j12l60O82O62O8M06L41
4715A059m46k41q83k47J83R7K32O38L99m4j77j86o15m92j46K54N12P7O77L06j83
4736G74o28k53m31l21K89J12N12P34K85m06K6p21p14L7k54O85J43M93L69J15m21
4757D25m17p17k12k32N44N39P14n5o8r1m14n31l24J02K05N43O32J45J3j41m97
4778A63n20m73j05L62L74O47J26K57m57l56k94p46J93L01N47M03J64L86n36K9
4798D65m40o88k38K25K58N89J59L75J02m95o75k54l06J19M35M95M42L7M61n63
4818E03l97n43l44J7K78L68M07O05k83m01k98l98k68l1L54M74K34M18L63m40n93
$$ plain form
4674 1012 426 585 -490 -751 -833 -791 -131 224 681 994 957 335 -168 -816 -961 -751 -382 175 732 920
4694 920 672 550 75 -706 -856 -810 -435 -47 485 1015 807 448 -100 -628 -740 -1100 -418 244 312 718 1059
4715 1059 613 372 -511 -758 -575 -478 -246 392 791 747 570 384 -231 -723 -869 -615 -103 -26 651 957 774
4736 774 146 -107 -538 -859 -570 -458 54 788 1073 667 693 -28 -742 -705 -959 -274 -131 362 731 846 425
4757 425 8 -709 -921 -1153 -609 -70 644 589 521 430 16 -515 -839 -737 -532 11 643 788 801 660 163
4778 163 -357 -830 -935 -573 -199 448 574 831 374 18 -276 -1022 -829 -528 19 422 586 972 436 465
4798 465 25 -663 -901 -676 -418 171 330 705 807 312 -363 -617 -923 -804 -369 126 568 605 1066 503
4818 503 106 -437 -781 -764 -486 -118 289 894 611 210 -88 -486 -754 -785 -431 43 277 695 1058 618 25
4839B5k39p16K12K19L07P04r2M79l36m80n76p2p7Q5J91P57L85K2j74l19m79m21
4861e95j99J56J20P30O50m19l5J99r43j51k68J5K37P01L47K60L0l45p36K3n02
4882g25l8L55M42L73K77R5k40o15l03l10j85M94J26P35L5M43n77k41l84o52O6
4903h29J96O43N74Qk9Q3n82l68j79l43L48L69L59J48L34qn19l41l86j59K0M47
4925b14K28N02K34j61n49k92n24J00J36J38M04P75k79K57j13n60n60m48L22R8
4945e06O08L99M03L0o21m30l19k58j19K89N51M03M95q5k80n12o18j77l28O46L30
4966i9L54O14j28j77o30l00l82L8J17M03L83K18O06n56j69n42n42J44Q0J53M84
4987F9M97L48p1n28m80n69k76J62L88M34N01L06J20l86o62l12o1j51M56M95J64
$$ plain form
4839 25 -214 -930 -718 -499 -192 512 420 899 563 83 -493 -565 -642 -557 -366 391 776 798 624 305 -174 -595
4861 -595 -794 -638 -518 212 862 443 408 607 -336 -487 -755 -740 -503 198 545 805 835 490 -246 -223 -725
4882 -725 -763 -408 34 407 684 779 539 -76 -379 -689 -874 -380 -254 481 516 959 382 141 -243 -895 -829
4903 -829 -633 10 584 592 563 646 64 -304 -483 -826 -478 -109 250 398 732 724 205 -136 -522 -681 -661 -214
4925 -214 14 516 750 589 40 -252 -776 -676 -540 -402 2 777 498 755 642 82 -478 -926 -604 -506
4945 -506 102 501 904 934 313 -117 -436 -694 -813 -524 27 430 925 840 560 48 -570 -747 -1075 -429 -99
4966 -99 255 869 741 564 -66 -366 -748 -710 -593 -190 193 411 1017 461 292 -250 -792 -648 -568 -415 69
4987 69 566 914 843 315 -165 -734 -1010 -848 -460 -26 475 781 901 515 -147 -459 -520 -671 -215 280 444
5008D44J29L88n35m18l38m32R0R8Q26K2L71M0j46m64k45m20l69K98N09O58K11
5029G17l4J3m94l06o81J44L92o3N66M38J14j6o80P0r14k4L18K37K76L89K00J16
5051G78k21q61j8m90J3K58M83O33J15M7l75l21l25m65P8K07L71M44K65J14j60
5072E70o53k91k71k12M23L74J94L63Q1N4k28p80j98K5KK52O55M30J12k35n65k14
5094a12n12O4M7M06L40K35K53k86k35k62k61m60L0O56L35K31L68l3o41k95k68
5115d00k20k9M84L17J60J11J65k41n74l71k22j4L92L93M31L41j17Om20n06j52
5136d66k47J15P03J63J22N33m86l03o54l09J95k47Q63K70K74Q4q6l92n05k84J62
5157d95j67M25O39K21L76n73k34k33l63l07j40N38P00J05R5j6j47n63l73l8j37
$$ plain form
5008 444 573 961 426 8 -330 -762 -672 -574 252 274 645 685 539 75 -170 -590 -959 -661 -152 506 717
5029 717 683 696 202 -104 -785 -641 -249 -312 254 692 806 790 110 180 -734 -758 -440 -203 73 462 662 778
5051 778 557 -304 -322 -812 -799 -541 -58 575 690 737 362 41 -284 -749 -671 -464 -93 351 616 730 570
5072 570 -83 -374 -645 -857 -434 -60 134 497 578 632 404 -376 -574 -549 -547 -295 360 790 902 667 102 -112
5094 -112 -624 -560 -513 -107 233 468 721 435 200 -62 -323 -783 -753 -97 238 469 837 804 163 -132 -400
5115 -400 -620 -649 -165 152 312 423 588 347 -227 -598 -820 -834 -442 -49 382 723 606 612 192 -314 -466
5136 -466 -713 -598 105 268 390 923 437 134 -520 -829 -634 -881 -18 252 526 610 524 132 -373 -657 -495
5157 -495 -662 -237 402 623 999 426 192 -41 -404 -711 -851 -313 387 492 587 571 424 -139 -512 -550 -687
5178f87K99N37M55Q9p5k56m67k95k69K61n4K32O52L31l14Lk16n28m34k96O04M97
5200F9L85J80J17m10k98l86l50J01J17L70L84N83k39k5n84k98n9k24J36K12L85
5221A66L10J71k53j41n13k50j75Q0J29P57J58N67o18n5k26l94n16M12j1P48K40
5242E86N2K19m15k44q72R9j70L48L44L78M20j60k30m78l29q1M4J63K99M47J03
5263E23R4k08l91m84J57n24N47M28K50L32j52j56l57l10j06p5J70K34M11M97j72
5284G08r4k11o25j90m63L86J82O33K67J60p3k08n45l98j08n9M32J79O39j96L58
5305G74o28j15n17j87OJ78L17O19J48J0k03m25k35m28J13J41K17M03J87J20Lk45
5327B53m74o61L04J95J84N63K09L51n39J25p22k13l53L43M95l0M80j8J03k79p74
$$ plain form
5178 -687 -388 149 604 693 618 362 -105 -400 -669 -408 -462 -230 422 753 439 442 226 -302 -736 -1032 -428 69
5200 69 454 634 751 341 43 -343 -693 -592 -475 -105 279 862 623 598 14 -284 -343 -567 -431 -219 166
5221 166 476 647 394 253 -260 -510 -685 -605 -476 281 439 1006 388 333 107 -287 -803 -391 -402 346 586
5242 586 638 857 442 198 -674 -575 -745 -397 -53 325 745 585 355 -123 -452 -533 -489 -326 -27 420 523
5263 523 617 409 18 -466 -309 -833 -286 142 392 724 572 416 59 -251 -357 -432 -262 -28 383 880 708
5284 708 614 403 -222 -412 -875 -489 -307 326 593 753 680 472 -73 -471 -579 -638 -206 -27 612 416 774
5305 774 146 31 -486 -673 -667 -489 -172 447 595 605 402 -23 -258 -686 -573 -432 -215 188 375 495 498 253
5327 253 -221 -882 -578 -383 -199 364 573 924 385 510 -212 -425 -778 -435 60 30 510 492 595 316 -458
5348d58k16kJ02K96L32L16J41M6k62m09k73l37M2M55K31M00P1L22n29k07l66n10
5370h15K51J98Q3Q08J75l0k14l29m04k89K2m4L89N76J54R4k33l19l84m40PJ49
5392e95M88L60K27J40P8n16l90q6j52K0J38L91M56K69j90m61l23m70J05M6N36
5413G1p0M56J91j89k11j79n41k73P7L80K88L43J64R8k18k82o00k96L38l34Q90
5434A03ON06J33m06n02J20l51m07K00P71J33J65L61n37k09j16m79j54K61K98M36
5455C32M91k28r1j06n71k92m59M58J04O74N4J97P5n71l29l49O7r5k0J005O1J71
5477E78l72qk08l57l31O9J78N87K52J26P4k46p79K3j71j72N51J99M28J36K59l72
5499D44k74l01k03k46n2L62L96L86m5N6j66o92k72N9P5M38K4K56O7l7p0l50k70
$$ plain form
5348 -458 -674 -676 -574 -278 54 370 511 557 295 -114 -387 -724 -682 -227 4 404 475 797 268 61 -305 -815
5370 -815 -564 -366 -283 525 700 670 456 127 -277 -566 -544 -588 -199 377 531 625 392 73 -311 -751 -744 -595
5392 -595 -107 253 480 620 698 182 -208 -294 -446 -426 -288 103 559 828 638 177 -146 -616 -511 -465 71
5413 71 1 457 648 459 248 69 -472 -745 -668 -288 0 343 507 605 387 105 -495 -791 -453 -787 103
5434 103 109 615 748 342 -160 -40 -391 -798 -598 173 306 471 832 295 86 -30 -509 -663 -402 -104 332
5455 332 823 595 504 398 -173 -465 -924 -466 -362 312 366 563 638 67 -262 -611 -544 -639 -659 346 407 578
5477 578 206 198 -10 -367 -698 -629 -451 136 388 514 588 342 -437 -414 -585 -757 -206 -7 421 557 816 444
5499 444 170 -131 -334 -580 -632 -270 126 512 467 523 357 -335 -607 -548 -473 -35 -11 245 312 275 205 -145 -415
5522d15J19k8J03K57N20k7k9j3p14j19j56j5J57M31L56J49j29o9m86l12k77R2
5544f05J32L99L72L07j18k68r4m33l85K16L27J86L82j34N23k89o57jl85q3K14
5565c94K58M97K00k65J40l84k52m81j33N80M33M24ok69K5j55m07j60j28OK49M28
5587B06J22K47k52j16m38j55k11J83J00J0Q73J02n1l95q5n29l6j31L47J70M98
5608D59j57Lo3k68l11m10K39J59M53J92L90n9l68j62l31m76K0J15J69N02N53j31
5630E18k32l4m46n70L04K9J39J92O90M2j83j30n05l09k33M12j13M75K60J71N7
5651E34k90l7p58m5n8N64r5O63qP6l8l66k80n36K28k40N64M70L18Q5n95r5k64
5674b03l96R1M0L57O76lKm94j31l26k21J53J35L0O03J70K7M5l59m74M7j16l90
$$ plain form
5522 -415 -296 -324 -221 36 556 529 500 487 -227 -346 -502 -517 -360 71 427 576 447 378 -108 -420 -697 -605
5544 -605 -473 -74 298 605 487 219 125 -308 -693 -477 -150 36 418 284 807 518 -139 -140 -525 -608 -394
5565 -394 -136 361 561 296 436 52 -200 -681 -814 -234 199 623 617 348 373 218 -189 -349 -477 -471 -222 206
5587 206 328 575 323 207 -231 -386 -597 -414 -314 -304 569 671 620 225 140 -389 -425 -556 -209 -39 459
5608 459 302 305 242 -26 -337 -747 -508 -349 104 296 686 627 259 97 -234 -710 -690 -575 -406 96 649 518
5630 518 286 252 -194 -764 -460 -431 -292 -100 590 632 449 319 -186 -495 -728 -316 -429 46 306 477 534
5651 534 244 207 -551 -596 -654 -90 -185 478 470 546 508 142 -138 -674 -446 -686 -122 348 666 751 156 61 -203
5674 -203 -599 -508 -468 -111 565 562 564 70 -61 -387 -608 -455 -320 -290 313 483 510 555 196 -278 -231 -347 -737
5697g37N64L67M73J87n34q3l42o41J55M0K53N69J09K30j52jn03k05m39K41L11
5718a38K22M41j39Nk2k03p01K36l06K31M10N27K47k65K27p87k16k47j89K90M26
5739D9K80K15j82N4l96l68j79R9j13K06L28M66K63l23k16n67j54j3K61J79M89
5760C78k0O8n3l15k74j30k4m13P37J43L73K07n3n44M6l48p7j27qM75L52J59K0
5783E72k18m47k54l23J38J97L72K22M07j95l15j03k46l14j00L24K18R8L58J67
5803E58l22l47K76o51K40j60K1N23J65mK6j73k33l75j42J20L75K05K82Q4r5k03
5825A70k29k06k34M34k73K91L36J40k62L46n43m9m54R5j24Q07K58Q8r5j94k39
5846F3l02m8l81K79K51L59K45nj29n6l32j89j36J49J23M25J60P5m59j01r7j40
$$ plain form
5697 -737 -173 194 667 854 320 237 -105 -746 -591 -551 -298 271 380 610 458 457 -46 -251 -690 -449 -138
5718 -138 84 525 386 391 369 166 -535 -299 -605 -374 36 563 810 545 772 -15 -231 -478 -667 -377 49
5739 49 329 544 362 416 20 -348 -527 -428 -541 -335 -7 459 722 399 183 -384 -538 -551 -290 -111 378
5760 378 358 426 373 58 -216 -346 -370 -783 -46 97 470 677 624 80 126 -222 -299 -426 -434 41 393 552 572
5783 572 354 -93 -347 -670 -532 -335 37 259 666 471 156 53 -193 -507 -607 -283 -65 33 391 558
5803 558 236 -111 165 -486 -246 -406 -385 138 303 299 325 152 -81 -456 -598 -478 -103 102 384 468 373 170
5825 170 -59 -265 -499 -65 -338 -47 289 429 167 513 -30 -79 -533 -438 -562 245 503 591 496 302 63
5846 63 -239 -287 -668 -389 -138 221 466 461 332 276 -56 -245 -381 -232 -109 316 476 551 92 -9 -106 -246
5868b46l79M63j73M92J57L52l83q7l02k43j48J4K51L72p8J98K01l91j53o6j96
5889c45j16J92K62K47R1o4R1o27M3k53R5L75M6L99j28K59r6m92j71k75k10M41
5911b36L16O05k44K10l26o81M17m17j03J48P5L96K83J2j66l24q2j09j81oM43J46
5933A76L90j37J02n04o9l64K8K3K09L36L90l1r7k45l51j35l04K76M7J30O08j5
5955D63Km86r3K4l52l1J07L31L35K28j39n1k71l83q2j33R9L58K38K44M7Q1n25
5978A1k79j45Q2KL11K15K28O3n5l23m58J23j63l9K07L47J97j8J17k86j15m67k06
6001f51L35K37K28J20K65j62n8l33p2j43n3K06L1M08J81m06J30m49j94l9j57M70
6023a06j1M55J18rn5l83j32l36r4J24M11K87N8J56j48j03m66p8n0J50J20j2O40
$$ plain form
5868 -246 -625 -162 -335 157 314 666 283 196 -106 -349 -497 -483 -232 140 62 260 461 70 -83 -149 -345
5889 -345 -461 -269 -7 240 331 267 358 -269 -226 -479 -384 -9 37 436 308 567 471 -21 -192 -467 -677 -236
5911 -236 80 685 441 651 325 -356 61 -356 -459 -311 -236 160 443 455 289 -35 -117 -226 -407 -413 30 176
5933 176 566 429 531 27 -42 -406 -378 -355 -146 190 580 549 452 207 -144 -279 -583 -307 -260 -130 478 463
5955 463 465 -21 -114 -90 -442 -473 -366 -35 300 528 389 338 67 -316 -398 -531 -432 -74 164 408 455 536 11
5978 11 -268 -413 -331 -329 -18 197 425 488 433 110 -348 -225 -388 -427 -220 127 324 306 423 137 22 -445 -651
6001 -651 -316 -79 149 269 534 372 314 -19 -91 -234 -287 -81 -50 358 539 133 263 -186 -380 -419 -576 -106
6023 -106 -117 338 456 447 392 9 -123 -459 -553 -429 -18 269 327 483 335 232 -234 -312 -362 -212 -92 -104 536
6046E36J9m4l28l22m45J90K63J53O3L10j3k44j11M4l38j08j90K37J89M79j59K80
6068D61j72j08l08j36j64K09L50K06J58K3k68j96o35J05n3K09N56k32M36k8j98
6089B15l17O2l71j42L68K8K19L27q8M7j73j34m54k01M8M77kL72j08L81l02m89
6111b37l43p8L39K06K76K54L3j11m7k36o14J99k56K36N11J33J21K85k11m06k06
6132a52m34J26K08L70J24K41j24q5j53m30l12r9M72J18J64K37K31j96l97j91r6
6153c78K06m05L57L93P9Q8k13j14k47k87p5K44M40J52RL05j08l24l5o47J69K23
6175a68j86L23M16K6M1J23m78k07l83Q4L26J63j69M80J66p8l21m90j48k01N12
6196a69K61o7J51J85k07j6l43k01K59o5J91J73K49J0m8m42j75k3j94J73L07j03
$$ plain form
6046 536 555 511 183 -139 -584 -394 -131 22 85 395 382 138 27 71 -267 -375 -565 -328 -139 340 181 461
6068 461 289 181 -127 -263 -427 -218 132 338 496 519 251 55 -580 -475 -528 -319 237 5 441 413 215
6089 215 -102 -40 -411 -553 -185 -157 62 389 301 348 175 41 -413 -614 -566 -89 -91 281 173 554 252 -237
6111 -237 -580 -658 -319 -113 163 417 450 339 292 56 -558 -359 -615 -379 132 265 386 671 460 54 -152
6132 -152 -586 -460 -252 118 242 483 359 274 121 -309 -621 -720 -248 -130 34 271 502 306 -91 -282 -378
6153 -378 -172 -577 -220 173 252 340 127 13 -234 -521 -596 -352 88 240 249 554 446 122 87 -560 -391 -168
6175 -168 -354 -31 385 411 452 575 97 -110 -493 -409 -83 80 -89 391 557 479 158 -332 -480 -681 -169
6196 -169 92 25 176 361 154 138 -205 -406 -147 -212 -21 152 401 411 363 -79 -254 -277 -471 -298 9 -94
6218i4N24K08j90m24l45R3j47M1K28M18P2J14l92K3n9l09j59J06K22J76J04K52
6240D62l25K2P6n93k4J46m8M17L00L50l28m00j51j16j65K28j44L72MM21l9k89
6262A76k5m58Oj11L01K34J58m6J08P9l04j58m03J10J37J99J78L5K49l22j21o8
6284d6j01k15J52R7K55o3J72K16m41j34j5j56l3L31o1L38j15K34Q1m62j46j80
6306b92j27R6L03J99J6J81k30l32p7j38M9K32K03K37Po3l7l32p5k28k1Q8K67K96
6330B22J89J57k90l15j78L17l77J50O5J00L59q1R1k30l92M6j15KL09J37O9K56
6352D91k68n0j69j67j31k00K21L74L08p1j82p9k34K4l66R4J35L57J42M7J43k81
6374A38j66j23l84K95O0K76J56J7O0l06m8J21Mm57J72p8K87J29L62k30l90K6l64
$$ plain form
6218 -94 430 638 448 24 -321 -228 -375 -334 -106 312 384 498 106 129 70 -239 -398 -292 -70 106 210 462
6240 462 137 159 235 -358 -382 -236 -284 133 433 783 455 55 -96 -212 -377 -149 -293 79 83 504 465 176
6262 176 151 -307 -301 -412 -111 123 281 235 343 422 118 -40 -443 -333 -196 3 181 216 465 143 22 -46
6284 -46 -147 -362 -210 -113 142 79 251 467 26 -108 -123 -279 -312 19 -42 296 181 415 496 34 -112 -292
6306 -292 -419 -323 -20 179 195 376 146 -186 -263 -401 -352 -120 83 320 327 264 227 -105 -180 -408 -429 -341 -74 222
6330 222 411 568 278 -37 -215 102 -275 -125 -60 40 399 318 409 179 -213 -167 -282 -280 29 166 235 491
6352 491 223 173 4 -163 -294 -494 -273 101 409 338 156 77 -157 -133 -499 -405 -270 87 229 276 419 138
6374 138 -28 -151 -535 -240 -180 96 252 269 329 23 -25 96 100 -357 -185 -263 24 153 515 285 -105 -79 -443
6397d43K65j21K8K77L17J42j94l9l03n02K12lK46Q1N00p6j10K88l90o34L64l47
6419d42K82J26K03J49J03l82J03m56k35J8M12l0K58K65J25j73m65j74j08K53k31
6440c99J15N40R7J27j03m26r2k89L52m42L94K14J92J6L5l35l09O8j91K97K02r3
6462c0K53L35l60k52N8j98l9j18J73L65M8K22k88J90m15n54K16J07J60K89m3M44
6484E63k39k26k75j98J98k52K06J62L45J35J4p9l03j08k69J27J77n2L17O2L5j84
6506A56K32k79l85j37n5M79P6J55K49j64k74m6l23j40O05j12KJ14J98J15l40j69
6528d3k67J30QN8k28M38Q3M13k73l13j13k77mJ39K85J37L63l09J2k72k07o9k10
6551e19J32N63J5J52k30K14p7o30J84J25j68J89J89K00j10R4L9l49k3j77n6M26
$$ plain form
6397 -443 -178 -299 -271 6 323 465 271 232 -71 -573 -361 -364 -118 -37 463 387 277 565 175 -459 -95 -442
6419 -442 -160 -34 169 318 421 39 142 -314 -549 -531 -119 -149 109 374 499 326 -139 -313 -421 -168 -399
6440 -399 -284 256 353 480 377 -49 -141 -430 -78 -520 -126 88 280 296 331 -4 -313 -245 -436 -139 63 -30
6462 -30 223 558 198 -54 4 -194 -233 -351 -178 187 235 457 169 359 -56 -610 -394 -287 -127 162 119 563
6484 563 324 98 -177 -375 -177 -429 -223 -61 284 419 433 354 51 -57 -326 -199 -22 -74 243 305 340 156
6506 156 388 109 -276 -413 -468 11 87 242 491 327 53 7 -316 -456 149 37 39 153 351 466 126 -43
6528 -43 -310 -180 -172 -114 -342 96 179 592 319 6 -107 -384 -388 -249 36 173 536 227 239 -33 -240 -309 -519
6551 -519 -387 176 191 343 113 327 250 -380 -196 -71 -239 -50 139 339 229 323 362 13 -10 -187 -243 183
6573A83O5L3km2j52j49j24j06J95p0M50L0J29j08j19m19m3K6j55J49J52K47J26
6596B96O8j54j65m24o4J14K12K07L2J38J58j91K32n35k73M8o5L19L17p6K63l49
6618A08m1j43k80K8J04J03K72K12O2k07r3l97L59m57RM7L28M0L56j65j82j81j43
6641b61j51K25K6J48K57LJ88j21l72j07l06J75m7M27L29Q4k72j39j57m09K37q9
6663c32N5L79J96q0J51k92j95O0n05K95q8J26K04M00j38l15K56m06L2j1Q5R8K81
6686B56M9K34j10k23l20l63O3j4K92K68l06P34k80l18J35j54l81J42J01J37K85
6707B27J98j10j10l21q0k14K23m6K66K5J97J6n5k51k43j44k05L64L01K8K45qj25
6730A78j60o1l68L18q1m0O68l12N7J59k60k81J48q9p9J18J82L8J95n0p9l03j98
$$ plain form
6573 183 248 281 279 237 85 -64 -188 -294 -99 -169 281 311 440 332 213 -206 -249 -223 -378 -229 -77 170 296
6596 296 364 210 45 -379 -443 -329 -117 90 122 260 418 227 459 -76 -349 -301 -366 -47 270 194 457 108
6618 108 67 -76 -356 -328 -224 -121 151 363 425 218 125 -272 87 -370 -361 -314 14 54 410 245 63 -118 -261
6641 -261 -412 -187 -161 -13 244 247 435 314 -58 -165 -471 -296 -343 84 413 497 225 86 -71 -480 -243 -332
6663 -332 -277 102 298 218 369 77 -118 -58 -563 -268 -356 -230 -26 374 236 -79 177 -229 -197 -208 -123 -25 256
6686 256 305 539 429 206 -114 -477 -414 -428 -136 132 -174 560 280 -38 97 -57 -438 -296 -195 -58 227
6707 227 425 315 205 -116 -196 -410 -187 -233 33 58 255 271 216 -35 -278 -422 -627 -263 38 66 311 303 178
6730 178 18 -43 -411 -93 -174 -214 454 142 199 358 98 -183 -35 -124 -203 -85 97 135 330 280 201 -102 -300
6753c00J35k10K75L39r6K35j12m2r5l08l24k3M32J32L94j80J8r4k96j4k58p6K72
6776a96N7L02L78j17l59P9n05L5j05L70K09J05o8N2J19l21j92j37J05j75k7N67
6798A76Q5J04q8n0k63j91qj38K75J75J07Q0J29k72j31q5j08k35L57K89q4J16J1
6821B51l18J63k19j23K3p0J01M47J15o6J1j29j21l95oK64L1L29r3J70j01k75J38
6844A27n76P6K77o2K91k08K79K52k15k00m96J83j20L07M49j59r4P9P5l78j12J66
6866e9l4K05K03o8%n9K1k34k02K31m86L8M17L02J43k61L10j99n62m1J03K24k4
6889c2J96jK30j01m28K1j88J69kK69O8o3L62l31j51j60j96j32N04j19l6N64k1
6912D22j84j55k37k19R8J60PK11K44p6Ml1k72l89J12R4rM05J10j97K51l36R0j93
$$ plain form
6753 -300 -165 -375 -100 239 143 378 266 224 129 -179 -503 -526 -94 38 432 252 270 176 -120 -134 -392 -468 -196
6776 -196 -139 163 541 424 65 144 -361 -326 -431 -61 148 253 185 237 356 35 -157 -294 -189 -364 -391 176
6798 176 261 365 277 227 -36 -227 -235 -373 -98 77 184 264 393 121 -10 -95 -203 -438 -81 208 124 240 251
6821 251 -67 96 -123 -246 -223 -293 -192 255 370 304 315 186 65 -330 -336 -72 -41 288 195 365 264 -11 127
6844 127 -449 -373 -96 -158 133 -75 204 456 241 41 -455 -272 -392 -85 364 205 111 190 265 -113 -225 -59
6866 -59 -93 112 315 247 247 188 209 -25 -227 4 -482 -444 -27 275 418 157 467 268 -294 -335 -232 -8 -32
6889 -32 164 163 393 292 -136 -115 -303 -134 -136 133 201 138 500 169 18 -142 -338 -470 34 -85 -121 443 422
6912 422 238 83 -154 -373 -275 -115 -108 103 347 271 275 244 -28 -417 -305 -211 -220 185 295 98 349 13 103 -90
6936i0o1J66l32N12j15L39k31k75m2r0q5N0j07J89L94P2J37m00J03l42k38Q6N4
6959c06K43O6M02k90J4M5n53L03k00K50l5J78M4J00J67n92j45j02J27RL2M64J89
6982D10O4j57k19jk35q7j18L57n8L70LK10o46j64J61K9J00j02K75J77j10J66l20
7005A05j53j27J47j03K01j34J55J39n3J52m85k41J30%j14L01J82K97Kk47p7l39
7027b62j12r6K57L66n4j46M07J3M5o07R6L4l53K97L45j32Q3J74l93M3l23j87M40
7050f5p9K65J15M8k2o3m6l08j86P4M1N58m6J4k08Np1q9p8l77N50j70J75J65o2
7075A40J58k25n6l82J91J25R2J67J30j20J46l54j62r1k40L15J27K11J4J53p2j50
7097A17j14m27L46N2l5J17J06L28l39o9k51p1L2l0j46O32J38k16K09j11k62N6
$$ plain form
6936 -90 -151 15 -317 195 80 419 188 -87 -129 -219 -304 -254 -361 -172 222 294 431 31 134 -208 -446 -360 -306
6959 -306 -63 3 405 115 129 174 -379 -76 -276 -26 -61 117 161 261 428 -164 -309 -411 -284 -275 -243 221 410
6982 410 474 317 98 97 -138 -225 -343 14 -44 326 329 539 -107 -271 -110 -81 19 -83 192 369 259 425 105
7005 105 -48 -175 -28 -131 70 -64 91 230 177 329 -156 -397 -267 -267 -381 -80 102 399 401 154 77 -262
7027 -262 -374 -470 -213 153 99 -47 360 373 418 -189 -93 -59 -412 -115 230 98 181 355 -38 5 -318 -505 -65
7050 -65 -144 121 236 284 262 199 153 -155 -341 -267 -226 332 286 300 92 97 26 -63 -141 -518 32 -138 37 202 140
7075 140 298 73 17 -365 -174 -49 43 210 340 220 366 12 -150 -241 -481 -166 -39 172 186 339 267 117
7097 117 3 -424 -78 -26 -61 56 162 490 151 82 -169 -240 -208 -238 -384 248 386 170 379 268 6 62
7119F2l12qO2K35M0J08j01J60k24n28K60q6P8j79O15r7K08k46K6q2l12j23M14
7142c0j25J47K98J50k40q1l53j40K72l65L76L08N5kjl20%n3k88K69J14O8L4J97
7166B90K6K2k23m47j35M21m1M0J77P3Q0j3j96j44o0j96J45K08k2K99j25K93n39
7189f7J05k02j48j57N06j42K98Nl3j44q6j22j55J88j04J88J98K45k79J41l63R
7211a19j93L55p9J02L62n1j98j14k60j44J64N4J49J25R4Lk20J8j2n0l76l8K96
7234a32j29P46n15K86j37Jl18j57QL46l09N66J85j93Q5k68j49J04k77J28j16K38
7256gM11l66J38r8k01l9m02M74J89n2j2J68n0j04o1j36O6j56j25M42n1K63o0J
7280B32j81k21J11j58K49J21j80M71k35j40k22J4K8k7lj27N80l28M42r9k08k25
$$ plain form
7119 62 -250 -258 -196 39 79 187 86 246 22 -506 -246 -332 -254 -433 182 85 293 47 73 -9 -321 -444 -30
7142 -30 -155 -8 290 440 200 119 -234 -374 -102 -467 -91 217 272 270 269 -51 -51 -104 -392 -123 -9 59 93 290
7166 290 316 338 115 -332 -467 -46 -87 -47 130 203 283 270 74 -70 -130 -326 -181 27 5 304 179 472 -67
7189 -67 38 -164 -312 -469 37 -105 193 198 165 21 -65 -187 -342 -154 -258 -70 128 373 94 235 -128 -119
7211 -119 -312 43 -36 66 428 377 179 65 -195 -339 -175 -121 28 153 247 250 30 48 36 -14 -390 -428 -132
7234 -132 -261 485 -30 256 119 120 -198 -355 -347 -1 -310 256 441 248 333 65 -84 20 -257 -129 -245 -7
7256 -7 404 38 176 78 -123 -162 -564 -90 99 47 35 203 153 49 -12 -148 -82 -238 -363 79 28 291 231 232
7280 232 51 -170 -59 -217 32 153 -27 444 209 69 -153 -139 -111 -138 -141 -268 312 -16 426 327 119 -106
7302a06p9O8m2K2K57m0J63P9p22K24rj45Q8L42L63m53J86J28k86l1j53k22M10
7325D2j32q3L15J31m0k09k03J72l53r4N29K97j83l5Q9P5l97k26K03j92K09j8L14
7348B11l4o3J87k07l43j32R2K35k22M82N5P5k42m14R7L0j48K01J68J72q6L31m04
7371D1J0Kk73j67K08Q6J50J0K76j6l61M0m26K7L01r4L94k46L51J30n24o1N2m83
7395e73L61N4K53l1K05l1l69J81j43j47J01K4J62J24m3K64k9l16j70j55j1M2L99
7418A52Pj60L53o6l27k11or8J58r7L72K03r0K27l08j23k37jP2J49m1L39J27j78
7442B16j45j40k31J45J17k19K27M40P4l16N2k3k85k54L51m2J76J29P4j86k00M7
7464Gk64q8j22K33M04J18j40L9k57M3m5q0j89J22L21K63j0q4M9k26m24j7RJ71
$$ plain form
7302 -106 -185 -117 -159 -137 120 80 243 322 -400 -176 -185 -330 -242 100 463 10 196 324 38 7 -146 -368 42
7325 42 -90 -173 142 273 233 24 -179 -7 -360 -454 75 372 189 154 243 318 -79 -305 -102 -294 -85 -103 211
7348 211 177 114 301 94 -249 -381 -289 -54 -276 206 261 336 94 -320 -223 -193 -341 -140 28 200 114 445 41
7371 41 51 53 -220 -387 -179 -93 57 67 343 327 -34 6 -420 -393 -92 -186 208 -38 313 443 -81 -142 -90 -573
7395 -573 -212 -158 95 64 269 238 -131 50 -93 -240 -139 -115 47 171 128 392 363 47 -123 -278 -289 -247 152
7418 152 159 -1 352 286 -41 -252 -258 -356 -198 -295 77 280 190 417 109 -14 -251 -252 -180 -31 -72 267 394 216
7442 216 71 -69 -300 -155 -38 -257 -30 410 484 168 220 197 -88 -342 9 -33 143 272 346 160 -40 7
7464 7 -257 -345 -467 -234 170 288 148 187 -70 -27 -72 -152 -341 -219 102 365 355 271 320 94 -330 -347 -338 -167
7488a67J5pJ42M1L01j67m32k20L72J92m9J74J06j48o9k00J48r4j71p0J07M54j8
7511B40j23J01m4l07Rj47MQ6K03K7L23j49P1l04j67L7o1q8L59K32P2j34J80n58
7535a38mk80J91K7K26K6O5M61m95k6k24k66R5Q6m1M53o8P0J65l33L7l72L26q0
7559i9q9P8L74J30l74J56j30J22l46J24Qk78N91r7m0l34J53j65L1j20J07L60J01
7582B63k12K35L08o69j54N7J0oO6K12K42k25J53m47K4m1MK25k28M11J81l94Q9
7605A04j86j43k61N24j0p1K21J86k49O4j39l5O2m25L62L2K7q0J93O0j10k00l13
7628c87pK60K22mO9j11J85L4l41J8q6Nl4J43J79J08j91K16j52j58j10m3l1K3M24
7653B31O2o0l79K98n2m73K09KQ5J72K71l4j49q6l64J59k37M89l48N96j53j68J73
$$ plain form
7488 -167 -152 -159 -17 24 325 158 -274 -494 -122 70 21 195 301 153 84 -116 32 -62 -233 -303 -196 258 240
7511 240 117 218 174 -133 -124 -271 -267 -181 22 49 372 223 294 -10 -177 -140 -201 -289 70 302 374 240 420 -138
7535 -138 -142 -422 -231 -204 22 48 113 574 79 53 -171 -437 -342 -256 -297 156 88 158 323 -10 27 -345 -19 -99
7559 -99 -188 -110 264 394 20 176 46 168 -178 -54 -46 -324 267 170 130 -204 -51 -216 -185 -305 -198 162 263
7582 263 51 286 594 -75 -229 -172 -162 -168 -102 110 352 127 280 -167 -143 -184 -180 45 -183 228 409 15 104
7605 104 -82 -225 -486 38 28 -43 178 364 115 179 40 5 67 -358 4 36 63 -17 176 236 126 -74 -387
7628 -387 -394 -134 88 84 153 42 227 261 -80 -62 -148 -143 -177 -34 145 253 62 278 126 -32 -142 -185 -216 -193 231
7653 231 293 233 -146 152 100 -373 -164 -162 -77 95 366 332 183 97 -267 -108 -345 144 -204 392 239 71 244
7676B44j85j83j4k08J18K28L66l90J55L29l86j42j7p4K42j24J20m6L10q1j02l64
7698b04j26P9Q1K12j77L70j89J0K1Q8n59K6K40K5K98o9K0Q2j01k30N3l1K75k82
7722h8K67O1n0l4J24n35K08j7k02pM55RJ81l9l93M54l94q0k14J8J29L49J23j57
7746A68j59P5p9l45O3O9M17j23l38L17Q5%k51k26K72j05j34K21M42k34J72l70
7768f3%J45k24j16pK55m6L40j31J60m13k9j22J44Rj86M31J68l2k47k50J36j32
7791b10J19O6k19K91k33K50j7J9k58k40L01l5k1L19O5M0p7j38j06o8k37L60j22
7814a51J5L08J82j56k45N2j77j60m8L66j05Q3K03n6J29n6m17P1L2l7J52K03K52
7837D40k22r6n2o6j65n6M6P2J48j28L87k58N0j52k08J14q5K53j09P74n59LJ42
$$ plain form
7676 244 59 -124 -138 -346 -228 0 366 -24 131 460 74 -68 -85 -159 83 -41 79 33 343 262 160 -204
7698 -204 -330 -251 -170 42 -135 235 46 56 77 165 -394 -368 -128 -103 195 126 146 228 127 -103 -50 -81 194 -88
7722 -88 179 240 190 156 280 -255 -47 -64 -266 -273 182 191 372 333 -60 394 0 -80 -294 -276 -147 202 325 168
7746 168 9 84 5 -340 -277 -208 209 86 -252 65 150 150 -101 -327 -55 -160 -294 -73 369 135 307 -63
7768 -63 -63 82 -142 -258 -265 -10 -56 284 153 313 -100 -129 -251 -107 -98 -284 147 315 283 36 -214 -78 -210
7791 -210 -91 -25 -244 47 -186 64 47 66 -192 -432 -131 -166 -187 132 197 237 160 22 -84 -152 -389 -29 -151
7814 -151 -136 172 354 198 -47 5 -172 -332 -380 -14 -119 -36 167 111 240 184 -233 -162 -130 -167 -15 188 440
7837 440 218 122 70 4 -161 -217 -171 -99 49 -79 308 50 100 -52 -260 -146 -231 22 -87 687 128 131 273
7860B73l60o0O2l4O6K00K9K35p5l67J53k18k24PK42L90j70J91J5k30q4J18l29
7883a70o0J01J25N0L25j54j44Q9p9l97K94j85J94R6K51j32Q0k61J22m29J51r9
7905b32J59L39l7J0j41j69J1k6K7j86K7J86J5L10N9Lk25j31p3j38m2J01j5K05
7929C7J65J37l47k71J7M05l88M38n1m2L04j11j85k07j0k41K20J14J62J63k17k23
7951a31K96l66j3N2N3j6KM21Q2l64l61J26Q2j3k04M66K04j73J23k02j43o6j65
7974c10J2K25R1J01J85j25j33J09n2n65K11M6K2J94K2K77p1K7k36l01K07k41R5
7997b10K02K45k58K06k90q6J13n1j72N39m10L63n8K00J6l22J57m61j11M99M9k73
8019a13K90q3J0m8Lm46J32R6O6L38j76L1P5l25p3J55J06j80J47J00J6J92j85k3
$$ plain form
7860 273 -87 -147 -85 -119 -53 147 176 411 336 -31 122 -96 -320 -313 -71 319 149 340 355 125 41 159 -170
7883 -170 -230 -129 -4 46 371 217 73 162 83 -314 -20 -205 -11 85 336 204 284 23 145 -284 -133 -232
7905 -232 -73 266 229 239 98 -71 -60 -86 -59 -245 -218 -32 -17 293 352 355 130 -1 -74 -212 -254 -153 -168 37
7929 37 202 339 -8 -279 -262 143 -245 193 142 100 404 293 108 -99 -109 -350 -130 -16 146 309 92 -131
7951 -131 165 -201 -214 -162 -109 -125 -123 298 380 16 -345 -219 -137 -150 -354 112 316 143 266 64 -79 -145 -310
7974 -310 -298 -73 18 119 304 179 46 155 103 -462 -251 -205 -183 11 33 310 239 266 30 -271 -64 -305 -210
7997 -210 -8 237 -21 185 -105 -191 -78 -129 -301 238 -172 191 133 333 349 27 184 -277 -388 111 160 -113
8019 -113 177 94 104 56 59 -387 -255 -159 -93 245 69 100 175 -150 -223 -68 38 -142 5 105 121 313 128 105
8043A05m2k06k74K22J88P0K94n4N2l43M6k17M0j68K19P3J96j41K62j00l52M3%
8066h7l39j04L85L60P7k35O2J64l69n0j72L20l22J88L67j17M6N1l80k46K06J62
8088c3j36J77L36k35o1L3l7o3k01r5N38j08K76k48J12J0l38l26J77J59R4j17L07
8111B21Q5p8k36L44l07j88l09J94M13j11K88j49p1P3j68l17J64j77L45J30K42
8132C88k60k45K70k60K0R9Kj86J88m6J56l65K07N2k28J8K07N3M5J66l92L29k79
8155f1j99P8L5k81J45L94J08L8j36Q7k51j59K64j07p3M40j36m6p0J34l79Q0P1
8178b4l15K98kj09L42K8k69Q0j28j36J37j02L80
$$ plain form
8043 105 63 -143 -417 -195 -7 63 357 303 355 12 58 -159 -119 -287 -68 5 201 60 322 222 -130 -87 -87
8066 -87 -426 -530 -145 215 292 57 119 283 -86 -136 -308 12 -310 -122 245 128 174 225 -155 -401 -195 -33
8088 -33 -169 8 344 109 48 81 44 -19 -220 -315 223 115 391 143 255 265 -73 -399 -222 -63 31 -86 221
8111 221 306 228 -8 336 29 -159 -468 -274 139 28 316 167 96 169 1 -316 -152 -329 16 146 388
8132 388 128 -117 153 -107 -87 12 14 -172 16 -30 126 -239 -32 20 -208 -190 17 70 115 281 -111 218 -61
8155 -61 -260 -182 -147 -428 -283 111 219 257 121 208 -43 -202 62 -45 -118 322 186 140 70 204 -175 -95 -24
8178 -24 -339 -41 -43 -152 190 218 -51 29 -99 -235 -98 -200 180
8191A80
$$ Imaginary data points
##PAGE= N=2
##DATA TABLE= (X++(I..I)), XYDATA
0@%%%%%%%%%%%%%%%oJ4j6J6j6J7k5L2l4M2m9N7o6P5q9J03j18J34j50J69j90K13
37A13k40K69l01L35l71M12m57N06n59O16o79P50q28R10j002J108j223J350j492
56g83J653j838K052k304K602k964L417m000M778n883P589j0603J7534o7692p842
71f4284Q1317M031K6892L1535l466p0174m6369o930K354q734K9248N8648L7922
84G1990j5656k3809j2597k9529n4615j8485L4679L7808J2543K8984L9744m053
96F7004m9782l3659q256j6739j5614K6237N0626K6344l032k362n970l5557m7619
109d8379j4734J7569J6503J4616L7009L8037k266l1210k0672j6062k9987j8375
121e7951K3189L9473K0807J0235J3432n601l8276m1161j3457L529L661J9386M2752
$$ plain form
0 0 0 0 0 0 0 0 0 0 0 0 0 0 0 0 0 -6 8 -8 8 -8 9 -16 16 -18 24 -25 32 -34 41 -48 55 -63 71 -79 90 -100 113
37 113 -127 142 -159 176 -195 217 -240 266 -293 323 -356 394 -434 476 -526 582 -641 709 -783
56 -783 870 -968 1084 -1220 1382 -1582 1835 -2165 2613 -3270 4319 -6284 11250 -56442 -64284
71 -64284 17033 21064 47956 79491 76025 5851 -40518 -47448 -45094 -53828 -24580 34068 71990
84 71990 56334 32525 19928 -9601 -64216 -82701 -48022 -10214 2329 31313 71057 67004
96 67004 17222 -16437 -24693 -41432 -57046 -30809 19817 46161 43129 40767 34797 -760 -48379
109 -48379 -63113 -45544 -29041 -14425 22584 60621 58355 27145 6473 -9589 -39576 -57951
121 -57951 -34762 4711 25518 35753 49185 43584 5308 -35853 -49310 -45781 -42120 -22734 20018
134B0018L2068l529j6894j2490k3130l4769j2526K1697K5276J5184J9105J8591
146D8601q323l3721k8508j2627q783k295K1919L7924K3900R85l752p450k6961
159I09l3002q640J4174J2269J3378K5964J9446r226k4784j7827j5320j8227m985
172d5871K1144K9947J8521Q642O194n557k7232k9375q591N077N059J3414K8722
185B0094K0191p743j7826j2490j8065k3550n473J9966K3691J4852J4557J2894
197D1098p111k5950k4085q691k954q2J5439K8258J7324m009r278r500k0898k5996
211c6435n646J6540J7180J3494J9742J6805o762k3749j8386j0144j1319k981J6655
224a5006K5662J4451J400j614q334k3185k4629n657R728J0872J5138K3086J7073
$$ plain form
134 20018 52086 48557 31663 19173 -3957 -38726 -51252 -29555 -4279 10905 30010 48601
146 48601 40278 6557 -21951 -34578 -43361 -45656 -23737 14187 38087 39072 35320 27870 909
159 909 -32093 -40733 -26559 -14290 -912 25052 44498 35272 10488 -7339 -22659 -40886 -45871
172 -45871 -24727 5220 23741 32383 38577 33020 5788 -23587 -32178 -27101 -22042 -8628 20094
185 20094 40285 32542 14716 2226 -15839 -39389 -44862 -24896 -1205 13647 28204 41098
197 41098 33987 8037 -16048 -24739 -27693 -27775 -12336 15922 33246 29237 19959 10459 -10439 -36435
211 -36435 -42081 -25541 -8361 5133 24875 41680 34918 11169 -7217 -17361 -28680 -31661 -15006
224 -15006 10656 25107 26507 24893 16559 -6626 -31255 -36912 -27184 -16312 -1174 21912 38985
237C8985n243j8023j5050j3787j5999m294J5718K2666J3357O591L945q313k3320
250b767k2674o808L027O900J5783K5151J6881k675j1904j2309j7084j9149n805
263c3433J3534J8260J2316J1937Q902p520k2402j9864q460l881K141J6987K5960
276A4477J5442M99m571r766k0242k1890n115R717J1868J3003J7688J1437p051
289B5496j9292j6290j1196j0788p05J8003K3966J4058N292K405q437k2904k1319
302b1711n755L850O186J3980K1642J3123o008j3480j2556j4752j6453k389J6200
315a8123K0099J2985J1235P877p131k2809j9776p597k090J464J4450K3510J3828
328B7922l026q086r088j8065k0242l712J3575J5292J2528J6518J2736o637k0929
$$ plain form
237 38985 33742 15719 669 -13118 -29117 -33411 -17693 4973 18330 24921 28866 20553 -2767
250 -2767 -25441 -32249 -29222 -22322 -6539 18612 35493 32818 20914 8605 -8479 -27628 -33433
263 -33433 -19899 -1639 10677 22614 31516 23996 1594 -18270 -26730 -30611 -28470 -11483 14477
276 14477 29919 30418 25847 16081 -4161 -26051 -31166 -21449 -9581 3422 21110 32547 25496
289 25496 6204 -10086 -21282 -32070 -32775 -14772 9194 23252 28544 30949 22512 -392 -21711
302 -21711 -27466 -23616 -17430 -3450 18192 31315 25307 11827 -729 -15481 -31934 -34323 -18123
315 -18123 1976 14961 26196 34073 26942 4133 -15643 -23240 -25330 -23866 -9416 14094 27922
328 27922 24896 16810 7722 -10343 -30585 -34297 -20722 -5430 7098 23616 36352 29715 8786
341H786j6975r403r273k766J5657K3741J2142J312n91p211k1184k1149l835Q157
355b2592Q941J3346K1208J4428n861j6188j2610j2477j5484m475J5261J9654J1183
368A4334O358N776o064k1919j9470m892J715L370J4134K3980J4421l572r019r873
382I279j6037j9368n168J2260J4754J0406J2311J0349n511j9682j7156o838n255
395b5656p44J4561K4221J3571k5k493o282j8935k1560n313Q061Q860J0222J6861
409A5349J3325m851j5749j2919r166j1166l777J4372K1040J1875M394M265m640
422B2352j9850k0517n905K441K974J0605K0115J3854l192j0287r013j2402j5868
435b4693m423J2689J6500J0373R981Q853m587j9018j6757p315m098m68J1252J9666
$$ plain form
341 8786 -8189 -17592 -26865 -29631 -13974 9767 21909 23221 22630 15419 -5765 -26914 -30749 -22592
355 -22592 -13651 -305 20903 35331 29470 13282 672 -11805 -27289 -31764 -16503 3151 14334
368 14334 20692 26468 20404 -1515 -20985 -25877 -24162 -20792 -6658 17322 31743 28171 19152 9279
382 9279 -6758 -26126 -31294 -19034 -4280 6126 18437 28786 23275 3593 -13563 -20401 -25656
395 -25656 -26400 -11839 12382 25953 25928 23435 17153 -1782 -23342 -28655 -20594 -11734 -1512 15349
409 15349 28674 23823 8074 -4845 -14011 -25177 -28954 -14582 6458 18333 22727 26992 22352
422 22352 2502 -18015 -23920 -21479 -18505 -7900 12215 26069 22877 12590 3577 -8825 -24693
435 -24693 -29116 -16427 73 10446 20427 29280 24693 5675 -11082 -18397 -22495 -22963 -11711 7955
449G955J2702q9l960o990j4610j6655m982R102J1197J0062J3997J1192l787j6122
463I012j3525q419r473l460J1638J8337J0245L347K136n131j5972j6225m959L670
477a8779O426J0655J5951J2203k283j1574j0124j0655j3395m583J0260J5498Q239
490G839P166O989m203j6965j3927l804j855J580J1828J7337J0372j255m989p784
504H329j3311j4694m546P679J0788Q104J0448R765l832j4911j1316n271n914j587
518b0269J2240J7204Q744J459n74n896j5428j4840m207M698O111Q326J3383J0412
532B1363k908j1348r013p329r819k800J1173J6186Q127M140L426n021j6131j5052
546a5006m130J653L009R354J4996J0244k931q301o601q791j2130k884J0931J2422
$$ plain form
449 7955 20657 20568 16608 9618 -4992 -21647 -26629 -17527 -6330 3732 17729 28921 25134 9012
463 9012 -4513 -12932 -22405 -25865 -14227 4110 14355 17702 19838 14707 -1265 -17490 -22449 -18779
477 -18779 -12353 -1698 14253 26456 24173 12599 2475 -8180 -21575 -26158 -15898 -400 7839
490 7839 15005 21994 17791 826 -13101 -16905 -18760 -17180 -5352 11985 22357 21102 16113 8329
504 8329 -4982 -19676 -24222 -16543 -5755 2349 12797 22562 18730 3819 -7497 -12768 -18682 -20269
518 -20269 -8029 9175 17919 19378 18804 12908 -2520 -17360 -21567 -16869 -10758 -2432 10951 21363
532 21363 18455 7107 -1906 -9235 -19054 -21854 -10681 5505 13632 17772 21198 16177 46 -15006
546 -15006 -19136 -17483 -14474 -5120 9876 20120 17189 8888 2287 -6504 -18634 -21518 -10587 1835
560A835P103O821O432m333j5563j2767n392k120k1R773J6081R055k02m621n043
575G038j1059j3133l284Q475R228O857J0087Q392m119j3347j0457o701o284j903
589b0210R414J4644Q945K799N6m511j2189j3153n262N331O331Q174J2332J0045
603B2746k878j1686r327q476j0094k769J0199J3541Q335N202L547m438j3038j2778
617a1914m756J078L849R049J3641R852j416q196p511r986j2439m309R219J0937
631b902P677Q665O695l937j3396j0810m999l341Q39R864J4192R072M21l394o169
646H477j2078j3431m169N397Q064Q062J1165R253k976j1262r467o986p279j433
660a8663R632J4084Q622L433Q83n367j3020j3743n704K599M767Q348J3640J0036
$$ plain form
560 1835 8938 15759 22191 17858 2295 -10472 -15864 -17984 -18005 -8232 7849 16904 16702 12081 7038
575 7038 -4021 -17154 -20438 -11963 -2735 4122 14209 22601 18482 5135 -5322 -12023 -18307 -20210
589 -20210 -10796 3848 12793 15592 15648 11137 -1052 -14205 -19467 -14136 -7805 369 12701 22746
603 22746 19868 8182 -1145 -9621 -19715 -22484 -12285 1256 9591 14793 18340 13902 864 -11914
617 -11914 -16670 -15592 -11743 -2694 10947 20799 19383 11187 3676 -6310 -18749 -23058 -13839 -2902
631 -2902 4775 13440 20135 16198 2802 -8008 -13007 -16348 -15509 -5645 8547 17619 18040 14646 8477
646 8477 -3601 -17032 -21201 -15804 -7740 322 11487 20740 17764 6502 -2965 -9951 -17230 -18663
660 -18663 -9031 5053 13675 17108 17991 12624 -396 -14139 -19843 -17244 -12477 -4129 9511 19547
674A9547j687q017p566q657j0239l183Q575J2050Q067O394M782m032j3458j3436
688a0860n644j231J294Q446J5103J0180j07m143n236j0905j2421m228O901Q810
702d041P863R546P608l275j2112j1090p290n738j335Q745J4555R721K956Om197
717A1922j1558j3295m791L617N234P783J2182R020k441q931q843q372r594k817
731b0884P721J2445Q842N723M330l356j1659j2187n407m84K400P479J3571R314
745A7848n65n876o443r793j1887m291O563R595P728R045O872j670j1346j0167
759d387o348l967r58P695J3174Q631J569j724m241j1033j2614m759M072O044P147
774a699J1060Q817j212q736q044o840p520k663P101J1542P539L582K646l386j1207
$$ plain form
674 19547 17860 9843 2277 -6380 -16619 -19802 -11227 823 8890 15284 20066 16034 2576 -10860
688 -10860 -16504 -17735 -16441 -7995 7108 17288 17181 13038 7802 -3103 -15524 -19752 -12851 -4041
702 -4041 3822 13368 20976 17701 5589 -5501 -12791 -18529 -19864 -11119 3436 13157 16113 16119 11922
717 11922 364 -12931 -17722 -14105 -8871 -1088 11094 20114 17673 8742 -101 -8473 -18067 -20884
731 -20884 -13163 -718 8124 13847 18177 14821 3162 -9025 -14432 -14916 -12516 -5037 8534 17848
745 17848 17283 11407 4964 -4829 -16716 -21007 -14444 -4849 2879 11924 18796 17126 5780 -4387
759 -4387 -10735 -14702 -15660 -7965 5209 13840 15409 13685 9444 -1589 -14203 -18962 -14890 -8846 -1699
774 -1699 9361 18178 16966 8230 186 -6654 -14174 -16837 -9736 1806 9345 12927 15573 12187 980
789I80j1871m733M87K504P091J2698Q888l09n063n510q216r786l840N895Q665
804b120O817O751M877k283j0751j0380n076k953m4P479J2405Q420J276j598m369
819H451r179j0989l620M314N984O202Q488O415k012r397q201n622n509j650P383
834h942J1509P295K402J583k796r888j0604l495K176K971N406J0177P012k072
848A2734o316o063o248q210k555O619R261O176N124M381k303r564r415l577q70
863a0826j06N812J1036O877p86l627m224p869r188l330N812O879N817P067O359
878A5703j847r092q418m028l775j415O632J0602O183O61p75l776q633j0091k582
893a4651L772M743N850Q544O951j878p442o375m914n853k407O761R526M834K182
$$ plain form
789 980 -10891 -15624 -15137 -12633 -5542 7156 16044 15735 10672 5162 -3054 -12840 -16680 -10785 -2120
804 -2120 4697 11448 16325 14042 3291 -7089 -12165 -15118 -15162 -7683 4722 13142 14418 12820 8451
819 8451 -728 -11717 -15337 -11023 -5039 1163 9651 16066 14054 4657 -3544 -9166 -14675 -16325 -8942
834 -8942 2567 9862 12264 13847 11051 1163 -9441 -12936 -10760 -7789 -2383 7794 14806 12734
848 12734 6418 355 -5893 -14103 -16658 -10039 -778 5398 10522 14903 12600 3036 -6379 -9956 -10826
863 -10826 -10932 -5120 5916 12793 12007 8380 4156 -3713 -12901 -16231 -10419 -3540 2277 9344 15703
878 15703 13856 4764 -3654 -7682 -11457 -12872 -6240 4362 10545 11206 10431 6655 -1978 -12069 -14651
893 -14651 -10879 -6136 -286 8258 15209 13331 5889 -486 -5400 -11253 -13660 -6899 2627 7461 9643
908I643J959k826r840r298k228J837J897N759J0269O830j507m750m684o590p914
923a1443k421N869P604M892M561L853k491r492q493l080j227J35O841J0756O426
938A2290j6k241l559q346q840k487M168N426N318O966M579k214q165p071m421
953h613l943n69P040R938N837J925L83l118r263r075k675K411K965N749Q746N620
969A3358k214o475n484o035o224j156O515R002N799L640L147k925r581q664k893
984a0190p09J175O262R797N634q47l929m348p690p954j183N171O890N537O600
999A0216M545k720q667p246m405l604k20O937R337N644Q07n27m243q707q449k327
1015a3629L277N300N783Q500N436j486p543o479n343o108j101O452Q704N094L005
$$ plain form
908 9643 11602 8776 -1064 -10362 -12590 -10753 -8856 -3097 7172 14002 12495 7745 3061 -3529 -11443
923 -11443 -13864 -7995 -391 4501 9062 12915 10424 932 -7561 -10641 -11868 -11733 -4892 5864 12290
938 12290 12274 10033 6474 -1872 -10712 -13199 -9031 -3605 1713 8679 13258 11044 2879 -4192 -8613
953 -8613 -12556 -13125 -6085 3853 9690 11615 11998 8880 -383 -9458 -12133 -9722 -6757 -1008 7738 13358
969 13358 11144 4669 -815 -6850 -13074 -14230 -7715 1287 7086 10726 13873 10948 1367 -7297 -10190
984 -10190 -10899 -9724 -3462 6335 11969 11122 7193 2845 -4845 -12799 -13982 -8811 -1921 3616 10216
999 10216 14761 12041 3374 -3872 -8277 -11881 -12101 -5164 4173 9817 10624 10097 5854 -2853 -11302 -13629
1015 -13629 -10352 -5052 731 9231 14667 13181 5638 -841 -6184 -12292 -13393 -6941 1763 6857 9862
1030I862J965l576q990p933l182N07K956O407Q987O175k65m443n497o640p584
1045a1251k568M966P250N572M761L950k630q824p293l382k271O60O895R284N953
1060A1072Q09j282m374q100q193k716L211M872N422O740M975j444p044o670m702
1075g424m306o66O263Q507O060K769J036l544q489q020l292Q72K879N281P754
1090E680N493l90m815n332n284o180k036N144P528N647M461K638j890q190p638
1105e164m256j190R64N174Q328N791N43k792l840o187p195k330L681N697N327
1120B551N911M443j807o576o675m685l600r22N053P998N450K255n84k768o809
1135g65p444k525J993L383N154O964N317j058n270n025n288n328j537M395O585
$$ plain form
1030 9862 11827 8251 -739 -8672 -11854 -11347 -8391 -1984 7003 13178 12913 8470 2973 -3667 -11251
1045 -11251 -13819 -8853 -1603 3969 8730 12680 10050 1226 -6067 -9449 -11720 -11060 -4165 5119 11072
1060 11072 11881 10599 6225 -1875 -10068 -12784 -9573 -4701 721 7461 12436 10992 3948 -2722 -7424
1075 -7424 -11730 -12396 -6133 2374 8434 11203 12239 8695 206 -7814 -11106 -10234 -7355 -2074 5680
1090 5680 11173 10783 5968 636 -4648 -10828 -12864 -7720 -192 5455 9916 12554 10664 2474 -5164
1105 -5164 -9420 -10610 -9646 -4472 3856 9647 10190 7398 3558 -2629 -9824 -12154 -8473 -2776 2551
1120 2551 8462 12905 11098 4522 -2153 -6838 -10438 -11360 -6307 1691 7141 9396 8812 6044 -765
1135 -765 -8209 -10734 -8741 -5358 -204 6760 12077 11019 5749 724 -4564 -9892 -11429 -7034 -449
1150d49M737L584J827j984o362o945l723NK284M795P277N573K41l509m052n687
1166b388o263k542L352M946M634M654L621j574o088n692l687j932K21M918P261
1181C441N291J252j432k745o460p230k421K466L275L984N958M542j353n343m447
1196a222m017l582j059N290O913M033K265P58k632o572o821k392J079J723L951
1211b285O571M912q02l970l567l986m969j604M440N521L972L266K368k029o444
1226A394n835k937n77J83M143O832M760m88k101k216n090n662j917L804M119L813
1242B225M563L554j567o279n088l177k511j171M592P026M174R33p8k128n870o288
1258g090j890K610K749M002N939L780j579m628m295m193m036j236M601N986L754
$$ plain form
1150 -449 4288 7872 9699 7715 1353 -5592 -9315 -9310 -7026 -2231 5046 10619 10860 7351 3299 -2388
1166 -2388 -8651 -11193 -7841 -2895 1739 6393 10014 8440 2352 -3340 -7027 -8959 -8738 -3820 3441
1181 3441 8732 9984 8552 5807 -653 -7883 -10304 -7838 -4563 -579 5379 9921 8568 3225 -1222
1196 -1222 -5239 -8821 -9880 -4590 2323 6356 8621 9379 6747 175 -6646 -9038 -7959 -6236 -2285
1211 -2285 4286 9198 8396 4426 859 -3127 -8096 -9700 -5260 261 4233 7499 9867 7838 1394
1226 1394 -4441 -7378 -7955 -7772 -3629 3203 7963 7475 5374 3158 -1932 -7594 -9511 -5707 -1588 2225
1242 2225 6788 10342 8775 2496 -2592 -5769 -8280 -9451 -4859 2167 6341 7274 7196 5068 -802 -7090
1258 -7090 -8980 -6370 -3621 381 6320 10100 8521 3893 -402 -4595 -8631 -9867 -5266 720 4474
1273D474K314J339k032o045n703j896O30J413M343O718L770r10l241l352n146
1288c324n487j162L710M676L767M249K674j978n861n090k506j702P61N078O293
1303D098M176P1j584l032n526o674j364K829L485L953N507L342j770m615m476
1318a580l280l362PM485O307L848J418J96k371o591o232j607J126K018M306O379
1334E067M062r87l737l352m515m641o92L791N496L890L042K128k278o154o264
1349e144k706n83R64M306O591M508K05j702l292n546n328q05K505M303M263M555
1365G094K590j787n587n257l947j778M1M516N920M748J354o29k761n508n154k070
1381h215J530K823M509N212L246q74l833m919m421l895m46L576N307M827K605
$$ plain form
1273 4474 6788 8127 6095 50 -5653 -7549 -6919 -5506 -1163 5555 9325 8415 5174 1822 -3324
1288 -3324 -8811 -9973 -6263 -1587 2180 6429 9103 7125 1264 -3826 -6332 -8034 -7273 -2195 4098
1303 4098 8274 8345 6761 3729 -1797 -8471 -9835 -7006 -3521 432 5939 9281 7511 2896 -1580
1318 -1580 -4860 -8222 -8215 -3730 2577 6425 7843 8039 5668 -923 -7155 -8762 -7636 -5618 -1312 5067
1334 5067 9129 8142 4405 1053 -3462 -8103 -8795 -5004 492 4382 7424 9552 7274 1120 -5144
1349 -5144 -7850 -8433 -7469 -3163 3428 7936 8141 6439 3147 -2399 -7727 -8532 -6027 -1724 2539 7094
1365 7094 9684 7897 2310 -2947 -6894 -8672 -8631 -4115 1805 6553 7907 7278 4517 -991 -6145 -8215
1381 -8215 -6685 -3862 647 5859 9105 8231 4398 -521 -4942 -8837 -9283 -5707 -400 4427 7032
1396G032J461k175n060n875k436n22J762M334N890M039j27k649l950m837n318
1411h431j054K668M583M404M013K469j603m317n149l530j595Q52L763N655M010
1426F738J449j257l281n278n398j956J522L275M868M529L110k48l686m935l674
1441d222l065m25L612M899M376K189M47k298n410n081k781j67K346L740N945L617
1457G722K14k453l831m347l592j604K347M847M112K811J615j654m519n228k985
1472f545r26M84L437O051M085R23j408k623m433m570j809J233L774L749L608K909
1488G939j103l904m703l328j928o78L388N259M276J103K90j803m372n001k049
1503f614P31K208L226M196L247K2l455l625l462l237j152K632M703M191K244J520
$$ plain form
1396 7032 8493 6318 1258 -4617 -7053 -7575 -5813 -1479 4411 8450 8323 5674 1724 -3113 -8431
1411 -8431 -9485 -6817 -2234 2170 6183 8652 7049 2732 -2417 -5947 -7542 -6690 -2927 2728 6738
1426 6738 8187 6930 3649 -1629 -7027 -8983 -7461 -4186 682 5211 8321 8073 4387 -548 -4222
1441 -4222 -7287 -7712 -4100 799 5175 7364 7811 5513 103 -4978 -7759 -7926 -5580 -1840 4105 7722
1457 7722 7936 5483 1652 -2695 -6287 -7891 -5544 -697 3415 6226 7841 6187 1668 -3560 -6545
1472 -6545 -7471 -6987 -3550 2501 6586 7509 6101 3478 -955 -5525 -7334 -6101 -2327 1422 5030 7939
1488 7939 6836 2932 -1771 -5099 -7027 -7705 -4317 942 5218 6321 6611 4808 436 -4565 -6614
1503 -6614 -5883 -3675 -449 3747 6994 7016 3561 -64 -3526 -6763 -7915 -5283 -580 3611 5855 7375
1519G375j483m041n227k175m77J296L041M692L454J74k209k976l273m396j601
1534g826K015M142L277L243K334q52l724m376k493j473p0K765M925L509N91p82
1550E205k119m348m554j438J505K944L050L975K917o25l360l521k482k729j029
1565f609L094M476L153J142O85j691m671m377j901Q70J871K767M748L399k77k937
1581C742k441l078l645j240K380M123K741K067J742j724m315m127j665n59N96
1596e403L189M749L442K82j275k456l424m188j465K031K991K751K847K564j042
1611E593m263l516k372j768l37L462N037K929J078N9j613m256m788j168J041K002
1627b880K626L998K865r02l294l173k711k980p23L342M524K956J817J058j476
$$ plain form
1519 7375 5892 1851 -3376 -5551 -6028 -4732 -1691 3001 6455 6629 4420 1444 -1829 -6225 -7826
1534 -7826 -5811 -1669 1608 4851 7185 6333 2609 -1767 -4260 -5733 -5803 -3038 1887 5396 5987 5205
1550 5205 3086 -1262 -5816 -7254 -5749 -2805 245 4220 7137 6512 3152 -369 -2851 -5580 -6609
1565 -6609 -3515 961 4114 5256 5941 4250 -421 -4798 -6699 -5829 -3958 -1191 3557 6956 6679 3742
1581 3742 1301 -1777 -5422 -6662 -4282 -159 2582 4649 6391 4667 352 -3775 -5440 -5999 -5403
1596 -5403 -2214 2535 5977 6259 4984 2528 -896 -5084 -6549 -4518 -1527 1224 4071 6635 5593
1611 5593 1330 -2186 -4558 -6326 -6663 -3201 1836 4765 5843 5902 4289 33 -4755 -5923 -4882 -2880
1627 -2880 -254 3744 6609 5707 2413 -760 -3471 -6451 -7174 -3832 692 3648 5465 6523 5047
1642E047m287m478j517K12N12L075M799K650k29k280k734l129l721j230K728L652
1658i30L187K931K037j343m019l974k407j242K7L321M619K879M55j166k019l969
1674a613l975j309J626K747L189L690K783q12l659l082l059k600r5K881M075L004
1690C791J317P86j891m487m178j804Q60J624L458M297K844o5k558k876l505l457
1706e844l88K063L428L194K454J189j484m085l549k495r06J433L078M420L208
1721E716P52j442k547l750l610j610J485K676L329L247K173j113l525l564k724
1736d507j793L73L053M361L083J828n77j672m109l820k033N11J654L199L619K717
1752E887l31k490l338l097k517o37K620L797L147K507Q73j352l815m097k142o44
$$ plain form
1642 5047 760 -3718 -5235 -5023 -4511 -1436 3363 6013 5784 3504 770 -2359 -6080 -7310 -4582 -930
1658 -930 2257 5188 7225 5882 1863 -2111 -4518 -5760 -5733 -2412 2207 5086 5541 4375 2356 -1613
1674 -1613 -5588 -6897 -5271 -2524 665 4355 7138 6326 2667 -415 -3474 -6074 -6169 -3288 787 3791
1690 3791 5108 5894 4003 -484 -4662 -6466 -5606 -3982 -524 3773 6617 6552 3994 1118 -2387 -5844
1706 -5844 -6232 -4169 -741 2453 4907 6096 4612 527 -3022 -5517 -6423 -4990 -1912 2508 5716
1721 5716 6468 5026 2479 -1271 -4881 -6491 -5006 -2330 999 4246 6419 5306 1781 -1783 -4507
1736 -4507 -6300 -5927 -2874 1487 4570 6398 5821 4149 40 -3780 -5813 -5302 -3648 -449 3170 5887
1752 5887 5556 3066 -272 -3369 -5886 -6523 -3903 -106 3041 5548 6421 5069 1254 -2843 -4985 -5629
1768e629Q96K899M066K896M51j680k394l502l336r67J592L180L414K887J550o72
1784E651l354l760k501j509J73K531L902L076O46k21j865l302l795j597R01K157
1800b867L254L343K499k12k595l316k627k534q72J984L822K856J766M11r01l905
1816A06l346k041K80J434K560L917K726N7k024k233k729l227j593J612L315K668
1832A482K192J657r09l141l540j906p35N80K160L915K960Q46r13j966l299l337
1848c954j380P31K255K482K920K096k56k914k868k509j418J9J982L809K791J044
1864D830m9j143l310l618j670K78J672K183L082K325k54j638k627k254k188p81
1880e162J825L410K657J717O46q24l274l501j789k22O16J877L662K529L14j046
$$ plain form
1768 -5629 -4733 -1834 2232 5128 5579 3899 1505 -1997 -5333 -6300 -4708 -1528 1886 4773 6323 5651
1784 5651 2297 -1463 -3964 -5473 -5300 -2769 1133 4209 4855 4634 2769 -533 -4328 -5925 -5024 -2867
1800 -2867 387 3730 6229 6017 3422 106 -2521 -5055 -5927 -3943 -121 2735 4501 4912 4011 106
1816 106 -3240 -5281 -5001 -3567 -1007 2910 5636 5693 3669 1436 -1293 -4520 -6113 -4501 -1186 1482
1832 1482 3674 5331 4422 1281 -2259 -4165 -4900 -4320 -2160 1755 4715 5561 4648 2682 -617 -3954
1848 -3954 -5334 -4603 -2348 134 3054 5150 4894 1980 -888 -3397 -4815 -4796 -2814 995 3786 4830
1864 4830 4781 3638 328 -3290 -4960 -4682 -3010 -827 2255 4580 4326 2688 61 -2193 -4381 -5162
1880 -5162 -3337 73 2730 4447 5093 4269 995 -2506 -4295 -4517 -3901 -2024 1638 4167 4481 3435
1896C435k093k804k600j008J473K482K721J993J731o89k953l042j760j389j30
1911d633K107L799K197M89l07j184l016l074j035J027J834K083L235J943q41k397
1927B227k592k169j807o83J877L262K320J169M66r89k893l163j295N75R08K135
1943f52L565K121l70j570k023k750k886n82J834K475K599J410J486j227k531l206
1959b307j235m77K40K534L542K144J32j130j496k771l093j146J215K323K155K172
1975B802J978p64k618k360j968j135k51K382L096K385Q23K00j700l107l326j216
1991d779N73J215K441L145J818l74j463k591k129k032o01K087K804K406J580O81
2007D781j055l318l085j552n55J056K419L338J942M12j139k059k515k473j131
$$ plain form
1896 3435 1342 -1462 -4062 -5070 -3597 -1115 1606 3599 5330 4641 1688 -1354 -3114 -4503 -4633
1911 -4633 -2526 1273 3470 3959 3652 2468 -548 -3622 -4657 -3630 -1796 287 3522 5465 4624 2227
1927 2227 -365 -2534 -4341 -5024 -3147 115 2435 3604 4070 3081 188 -2975 -4270 -3695 -2787 -652
1943 -652 2913 5034 4664 3094 1071 -1679 -4565 -5147 -3313 -838 1761 3171 4657 3430 899 -2307
1959 -2307 -3542 -4019 -3779 -1245 2297 4441 4573 3443 1947 -824 -3917 -5063 -3848 -1525 630 2802
1975 2802 4780 4016 1398 -962 -2930 -4065 -4316 -1934 1162 3547 4370 4570 2870 -237 -3563 -4779
1991 -4779 -4206 -2991 -550 2595 4413 4039 2576 -15 -2144 -4176 -4777 -2690 114 2520 4100 4781
2007 4781 3726 408 -2677 -4229 -4784 -3728 -1309 2029 3971 4383 3244 1185 -1330 -3803 -4934
2022d934J829K449K319K187J282j046k674k994j991j151K30K475L206K171N35
2037C893K78j820k984k761j077P72J750K589K560J906p07k367k545k222j730o72
2053e137K401L007K060J378O38j168k880k905r99m94J074K393L174K022j22j500
2069B942k417k468k534n14J525K297K543K199J210r93k711k629j789p80M24K161
2085a534L154K281P09q94j850l034k647j257R46K311K013K606J599k68k269k492
2101f26j914j590q3J887L068K394J151J82j595k966k827j271J18J203K189K719
2117B039K190l0j537k226j795k443p07J759K736J816J790P29q55k633k868j715
2133c750m65K30K231K904K234Q82q95j656k577k418j058J277J707K378J872J520
$$ plain form
2022 -4934 -3105 -656 1663 3850 5132 4086 1412 -1582 -3573 -4724 -4494 -2019 1187 3358 3893
2037 3893 4171 2351 -633 -3394 -4471 -3699 -1949 640 3200 5106 4399 2032 -513 -2735 -4465 -5137
2053 -5137 -2736 271 2331 3709 4347 3179 299 -2606 -3605 -4099 -3025 -632 2542 4564 4442 2942
2069 2942 525 -1943 -4477 -4991 -3466 -1169 1374 3573 4783 3790 1079 -1550 -3339 -4119 -3695 -1534
2085 -1534 1620 3901 4610 3716 1866 -1168 -3815 -5072 -4126 -1815 198 2804 4403 4135 1866 -626
2101 -626 -2540 -4130 -4213 -2326 742 3136 4287 4469 2874 -92 -2919 -4190 -4072 -2869 -680 2039
2117 2039 4229 4199 2662 436 -1359 -3802 -4509 -2750 -14 1802 3592 4321 3466 833 -2035 -3750
2133 -3750 -4215 -3985 -1754 1150 3384 4266 3371 1715 -862 -3280 -4338 -3061 -1354 1024 2896 4416
2149D416n75k253k749j751j114J5J507L123K113J116p0j152k375k859j257L59
2165c506J621J545K703J515J72j855k153k313j783m40J667K439K157J510M90p82
2181B987k096k767j370n4O05J693K570K178J10j240j581k203k406p21R46K532
2197h17J802J823J146p41j876k300j796q62J67J965K272K056O33n11j445k260
2213g44k344r88Q78J201K329J810J602P0j772k035j701j581j37J122K538K128
2229B376Q81q4o05k393k643j318K75J118J667K560J551L60j417j506k024j881
2245c083n47J039K145J984J367Q01p67k415k007j446m68L45J516K518K089M26
2261C497p68j098k027k305r49P45J824J671J582J504m41k070k105j680j010L78
$$ plain form
2149 4416 3841 1588 -1161 -2912 -4026 -4011 -2504 619 2732 3848 3778 2626 251 -2608 -3865 -3506
2165 -3506 -1885 -340 2363 3878 4050 2195 42 -2271 -4054 -4494 -2827 -388 1769 3279 3769 2987
2181 2987 891 -1876 -3246 -3300 -2695 -1002 1568 3746 3856 2616 1035 -1168 -3574 -4295 -3349 -817
2197 -817 985 2808 3954 3213 1337 -963 -2759 -3621 -3454 -1489 783 2839 3472 2961 1516 -744
2213 -744 -3088 -4076 -3198 -1997 332 2142 3744 3814 2042 7 -1694 -3275 -3412 -2290 248 2376
2229 2376 3257 3173 2568 175 -2468 -3786 -3511 -2393 -726 1834 3385 3745 2328 822 -1202 -3083
2245 -3083 -3630 -2591 -446 1538 2905 3706 2939 524 -1483 -2929 -3397 -3052 -1536 982 3071 3497
2261 3497 2729 1631 -396 -2701 -3650 -2905 -1081 590 2172 3676 3235 1165 -940 -2620 -3630 -3252
2277c252J396K522J983O69nj486j831k315j093N15J282J623J980J367l35j210
2293A810k023j803j182m10J321K202K142J170M54j025k043k254j356p6P20J389
2309i64K504J497J85j195j311k234j719p99J166K451J516J767Q72m02k193k093
2325i52j587o75L71J161K669J997L59q29j108k158k355n87N16J754J807K220J104
2342C707o1k002j961j610j124l36J582K024J954R57j26p18k344k422j196L35J089
2359b252J829K416J691j55j224j816j830j818m91J354J806J972J276O73p02k183
2375E46k426j315j9L36J857K393J881K96n78j528j907k370p36O98J472J853J616
2392B069J391n01j653k341j352j003q8J500K710J827N95J47j181k177k217j245
$$ plain form
2277 -3252 -1856 666 2649 3318 3313 1827 -4 -2319 -3412 -2897 -1615 8 1988 3355 3020 1810
2293 1810 -213 -2016 -3198 -3608 -2287 -85 2057 3227 3681 2656 613 -1641 -2997 -3073 -2353 -964
2309 -964 1540 3037 3222 2027 716 -1518 -3237 -4036 -2870 -419 1097 2864 3736 3334 1141 -952
2325 -952 -2539 -3214 -2843 -1682 987 2984 3343 2514 1406 -752 -3107 -3694 -3178 -1424 383 2603 3707
2342 3707 3646 1644 -317 -1927 -3051 -3387 -1805 219 2173 3130 3004 2286 -58 -2480 -3676 -3341 -2252
2359 -2252 -423 1993 3684 3529 2305 489 -1341 -3159 -3650 -2296 -490 1482 2758 3431 2729 546
2375 546 -1880 -3195 -3214 -2878 -1021 1372 3253 3549 2971 1443 -464 -2834 -3570 -2872 -1400 453 2069
2392 2069 3460 2959 1306 -1035 -2387 -3390 -3478 -1978 732 2559 3154 3301 2120 -57 -2274 -3519
2408c519O35R34J794K127J512j8j707j732j676j606n09J455K278J756J456M41
2424C621p31k215k447j148k21Q56J316K087K044J07j101j223k154j755r39J211
2440b692J720J537K068J147j63k106k602j236p62j13J316K538J924M58l09q89
2456A836k012k406r94M94J540J405K285J448l1j611j911j421j476n62J023K459
2472F6J482J069K89n80j975k226j130K75K53J758K227J736j79n03j696j989j585
2489b708q80R12J961J731J142Q58k52j640k309j177n59rJ485K124J878P61l98
2506B920j305k027j727j131N49J109J746J641J028L2j552j925j272q94m02J419
2522a791K189J696O57km87j941k159j006N5Q21J431J820J445J81j221j398j470
$$ plain form
2408 -3519 -2884 -1950 -156 1971 3483 3465 1758 26 -1650 -3256 -3765 -2310 -32 1724 3180 3621
2424 3621 2890 675 -1772 -2920 -3141 -2285 -969 1118 3162 3269 2168 945 -1209 -2964 -3903 -2692
2440 -2692 -972 565 2633 3780 3617 1511 -1091 -2327 -3089 -3202 -1886 652 2576 3034 2725 1836
2456 1836 -176 -2582 -3576 -3082 -1542 -137 2148 3596 3565 1954 43 -1378 -2854 -3416 -2393 66
2472 66 1548 2617 2906 2326 351 -1875 -3005 -2730 -2477 -719 1508 3244 3065 2562 866 -1123 -2708
2489 -2708 -3588 -2676 -715 1016 2158 3016 2764 1124 -1185 -2362 -2921 -2930 -1445 679 2557 3318 2920
2506 2920 1615 -412 -2139 -3270 -2721 -1612 134 1775 2803 2835 1283 -642 -1914 -2808 -3210 -1791
2522 -1791 398 2094 2751 2749 2262 321 -1838 -2844 -2789 -1968 -537 1283 2728 2909 1688 290 -1180
2539a180j330p93J258J900J578Q86J003n60j780k099j424k74M90J075K020J514
2555B284N95q61j121j554j660o54N82J834J343J293J010k78j386k074j158r13
2571b718J03P85K327J413M26J30q93j467k236n72K81J123J510J706Q63k67j007
2588A507j415j501j009n87P75J874J673Q60K42m10j816j632j037rP93R40K283
2605A531J135L59j008j711j060k011m97P28K009J400J030Q20j65j821j476j515
2621b252k35M12J226J774J652K23m56j223j441j730o91K61J267J457J506J066
2637B816l13j435j544j300p22O7J057J844J514N65k8p69j443k052j351N95P13
2654a786J328J719J507k39r84j352j496q64n81Q03K054J484R24J04m52j737j937
$$ plain form
2539 -1180 -2510 -3303 -2045 -145 1433 2319 3322 2762 982 -1117 -2541 -2815 -2325 -1250 770 2284
2555 2284 2879 2018 897 -657 -2317 -2971 -2389 -555 788 2081 3091 2813 1427 -647 -1805 -2718
2571 -2718 -2615 -1830 497 1910 2336 2466 1573 106 -2130 -2702 -2421 -1298 212 1918 2781 2514 1507
2588 1507 92 -1409 -2418 -3005 -2230 -356 1317 2177 2419 2009 193 -1439 -2476 -2485 -1692 -752 1531
2605 1531 2666 3025 2017 306 -754 -2765 -3262 -2534 -525 875 1905 2725 2560 739 -737 -2252
2621 -2252 -2487 -2075 -849 925 2577 2800 2344 1121 -320 -2050 -2741 -2480 -1213 244 1750 2816
2637 2816 2503 1068 -476 -1776 -2498 -2431 -1374 470 1984 2549 2521 1752 309 -1743 -3094 -2499 -1786
2654 -1786 -458 1261 2768 2529 1545 193 -1303 -2167 -2748 -1945 109 1593 2517 2621 2169 432 -1505
2671a505j091l52J055R76J560J646K89o85j378j067j581n97Q50J461J211J202
2687A994Q29k53j511j884j255o20J55J047J845J665O78m72r13j453j678p40L93
2704b173Q71J400J554J259J11j501j675j481p06n76R03J863J594J151J20o91j700
2721C23j767r83K01O99Q55J896J323N58j233j331j426j606p50R10J605J561J192
2738B027O09j73j763j799j020l41L38J071K005J658J09n11q81j781j729j043R43
2755b281J250J231J570J076k23j433j452j181q17k37P93K026J523M59L38r05j421
2772C16k212o91k78J004J255J601J560L14j087j311j291j372o50R06J758J207
2788A029J232N09j77j512k111j294n3j27J302J771J555N53n89q26j529j848o37
$$ plain form
2671 -1505 -2596 -2948 -1893 -917 643 2289 2578 1893 515 -552 -2133 -2730 -1880 -419 792 1994
2687 1994 2823 2570 1059 -825 -2080 -2700 -2545 -1498 347 2012 2690 2218 1305 -148 -1826 -2566 -2173
2704 -2173 -1302 98 1652 2911 3022 1521 -154 -1635 -2341 -2917 -2014 -151 1443 2594 2714 2023 323
2721 323 -1444 -2427 -2226 -1527 -672 1224 2547 3105 1872 541 -885 -2491 -3241 -2331 -726 835 2027
2738 2027 2636 2463 700 -1099 -2119 -2460 -2122 -1051 954 2612 2721 2210 1329 -452 -2181 -3224 -2281
2755 -2281 -1031 200 1770 2846 2623 1190 -262 -1443 -2260 -2497 -1704 322 1845 2304 2642 1737 316
2772 316 -1896 -2587 -2865 -1861 -606 995 2555 2869 1782 471 -820 -2192 -2842 -1936 -178 1029
2788 1029 2261 2770 2593 1081 -1030 -2324 -2377 -2504 -1202 569 2124 2677 2088 1262 -267 -2115 -2752
2805b752N25J364J127J663R17l44j441j523j277j006J50Q75J960J460M38K07o30
2822A713j512j634j046L32O30J453J371J135L22j247j420j193j586j09Q14J391
2838e86J740R30K30j47j377j695j195k92N51J298J275J587r7n22p91j603j254
2855a948j084N87J335J478J449Q57k78j257j677r39n25J03P91J439J630N03m33
2872B031m70j586j767q42N12P68J281J529Q69J3q43j382j274r22k28Q38J426J367
2890A320P84M2l62j494j610q73j15M48J135J723J136K72n90j097j198j297n44
2907b320M89J250J341J010M68k80j259j330j160o11L25J015J591J339M22j97j014
2924A079j222j377q67N35R83J146J212N02l6q22j514r78r98p0R30J617J385N57
$$ plain form
2805 -2752 -2227 -863 264 1927 2844 2500 1059 -464 -1741 -2747 -2597 -1722 238 1698 2136 2343 1713
2822 1713 201 -1433 -2479 -2147 -1517 -64 1307 2442 2764 1517 97 -1096 -2682 -2791 -1977 -586
2838 -586 1154 2084 2314 2167 790 -905 -2100 -2392 -1841 -543 732 2319 2222 1700 909 -694 -1948
2855 -1948 -3032 -2445 -1110 368 1817 2674 2396 1139 -538 -1477 -2002 -1899 -1108 331 1961 2464 2031
2872 2031 1561 -25 -1792 -2634 -2122 -1354 -73 1456 2325 2338 1495 113 -1161 -2083 -2311 -1473 -47 1320
2890 1320 2104 2146 1784 290 -1320 -2193 -2308 -1860 -725 998 2134 2406 1816 719 -479 -1776 -2320
2907 -2320 -1831 -581 760 1770 2238 1958 699 -631 -1791 -2402 -2077 -1062 529 1868 2290 2093 1079
2924 1079 -143 -1520 -2387 -1852 -869 277 1489 1991 1955 1133 -381 -1359 -2357 -2427 -1497 120 1505 2062
2942B062j03k68j295j634r02J58P74Q71J701Q68j42o21j218j104j337j69O52J390
2960c17J350Q71M43n50j400j604l31m69M58R43J153J539R7p15q98j118j342m60
2978b350N23R58J513J022O20o4j311j347r91o70J25R05J506J135M31k22q35j359
2996d11j095q20J40J058J256J433Q31l32r25j317p43j047n1N08J525J256O37N0
3014A953o18j245j583o89k84Q33J121J411J309K28r74r23j299j036k98K93J281
3031e20J319P74P81l22j699j338r68m04N40P74J807J051N56m28r89j066j432p42
3049b306N59P69J455J291L29k4r40j932o76m82m15Q99J643J501M39Q6p27j280
3067A89j248r58n2M44J501J111R44N03j024j379j270q87l7M13J556J235P48M30
$$ plain form
2942 2062 1959 1691 396 -1238 -2140 -1982 -1208 -337 1364 2232 2090 1469 251 -853 -2190 -2359 -1707 -317
2960 -317 1033 1904 2347 1797 397 -1207 -1538 -2007 -1549 -606 547 2086 2183 1468 570 -548 -1890 -2350
2978 -2350 -1827 -869 644 1666 2286 2222 911 -436 -1427 -2097 -1972 -1067 439 1574 2005 1783 948 -411
2996 -411 -1506 -2326 -2186 -1128 128 1561 2392 2060 1135 -182 -925 -1972 -2023 -1515 10 1266 1903 1953
3014 1953 1335 90 -1493 -2182 -2466 -1633 -512 899 2208 2436 1462 539 -760 -1796 -2094 -1801 -520
3031 -520 799 1573 2354 2032 333 -1005 -1973 -2377 -1837 -1063 744 1795 2351 1923 934 -132 -1564 -2306
3049 -2306 -1747 -978 477 1768 2097 2073 1133 -799 -1475 -1957 -2372 -1473 170 1671 2110 2196 1469 189
3067 189 -1059 -2017 -2069 -1625 -124 987 1931 2434 1410 31 -1239 -2126 -2163 -1750 -194 1041 1789 2219
3085B219m10j037j809p42O4n9Q29J648J178N36p96r59j193j164p77N14J329J122
3103D93R90J115j27j549j465q81n37l0R99J152J519M01l42n33j210j584r08L28
3121b169J053R37J456J249j6j121j214j073q48n15R16J183J286O75J42j50j451
3138C40j544o30p4N87P57J258J373M14o37j125j238r39r50M88J289J128J144N21
3156B162n54j101j097j100l66Q7Q49J466J287N00q0p16j151j604p14L92M68J195
3174g7J169R16K52j136j460j050m75k59O93J343J177R12N7n01j201j380q67nL07
3193a585J021J267J081J27o57o08j055j299m63M76J384R70R89L09l6j307j061
3210d47q49n16J46P90J291J204M30l93p24j443j118n91M72R04J042J132Q67k10
$$ plain form
3085 2219 1809 772 -1037 -1779 -1715 -1774 -945 703 1881 2417 1621 662 -531 -1695 -2472 -1958 -629 493
3103 493 1483 2598 2471 922 -543 -1424 -1961 -1991 -992 160 1679 2080 1738 1205 -5 -1589 -2497 -2169
3121 -2169 -1116 -179 1277 2526 2510 1389 175 -898 -1746 -2261 -1345 -162 1124 1799 1941 1791 340
3138 340 -1204 -1834 -1908 -1321 -564 694 2067 2481 1844 719 -519 -1458 -2408 -1920 -631 497 1641 2162
3156 2162 1608 507 -590 -1690 -2056 -1969 -1120 346 1633 2133 2053 1337 186 -1418 -2132 -1740 -1272 -77
3174 -77 1092 2008 2260 1124 -336 -1386 -1861 -2120 -1427 -84 1093 2005 2062 1561 360 -1020 -1887 -1892 -1585
3193 -1585 -564 703 1784 1911 1254 646 -409 -1708 -2171 -1695 -311 659 1648 1957 1921 614 -447
3210 -447 -1296 -1812 -1666 -876 415 1619 2049 1656 932 -511 -1629 -2220 -1748 -844 198 1330 2197 1987
3228A987j138r62r46q47L07M36R87J118Q29q5n09j299j253o84K71P54R30J281
3246A177R20j89n34j049r19j143m09R77P31J281N93M99m75j011j230j013J02M27
3264a265P62R65J138N45n62q01r66j452l45M53R09Q89J024N47k70p99j404q80
3282a512m0j02Q22R65J461J28M7p99r70j124p09K19M91J081R77Q16o5p45j006
3301f5r39o82l98Q63J406R48P00Q1n37j064j410p56L0M79R42R34J211J48o17q92
3321C82j312p57l11N72J068P50J028L30k0r04j567p54l31K90R47J074J041K7j72
3340A381p64j033p90m70RJ135J193O40O75J48j563p69j016l65j57N83J273J159
3358A269M18k51k33j202j173p21n6Q70R79J164Q37m0p68j109m88q21q71O33J417
$$ plain form
3228 1987 849 -113 -1059 -1906 -1599 -1163 -176 942 1771 1686 1177 -122 -1375 -2059 -1788 -1034 -104 1177
3246 1177 2097 1908 1374 325 -594 -1737 -2146 -1169 -438 843 1436 1935 1460 449 -781 -1794 -1692 -1265
3264 -1265 -503 462 1600 2145 1583 782 -184 -1636 -1981 -1528 -619 270 1294 1841 1571 772 -632 -1512
3282 -1512 -1552 -1654 -832 133 1594 1722 1769 970 0 -1124 -1833 -1614 -1123 -42 935 1751 1686 941 -65
3301 -65 -1004 -1686 -2084 -1221 185 1133 1833 1914 1377 313 -1097 -1853 -1823 -1344 -402 532 1743 1891 1274 382
3321 382 -930 -1687 -1998 -1426 -358 392 1420 1750 1730 826 -741 -1495 -1826 -1536 -589 485 1526 1553 1381
3340 1381 617 -416 -1206 -1676 -1667 -532 661 1301 1976 2124 561 -208 -1224 -1589 -1746 -1163 110 1269
3358 1269 1687 1436 1203 1 -1172 -1893 -1949 -1079 -100 1064 1901 1861 1093 -16 -504 -1325 -2196 -1563 -146
3377a46Q28P62L78o61m91j326j014j34N89P77J182R29L83o53r78r31r97n99N43
3396a559J284P41R44K67j13q54j346p22j21j96P90J277Q44O72l40o19r78r67r07
3415a903K46O80P93J317M09L00r62r31j131l90n2N97Q78J193K75K41j5j162j316
3434i33r04J93K69R48J156P82M16o26p96j121r02o08N56J241J048Q00J70J04j039
3453G54j437p63l03P4Q31J320Q96M57l68o32p48j238r34N13Q77Q88J022M87K14
3472A910r12j275q70m85j62M56J151J145O56L6m39j074j265n15j73O25J110J099
3490A018N44M24n91j358j020p53m46Q45Q59R54Q21K04rp52j574o47k16M85N25
3509f87J526N52M64l67p87r84j251m13K25R51J112Q68L91J39q29q54j033q11J00
$$ plain form
3377 -146 682 1444 1822 1161 670 -656 -1670 -1804 -1215 -438 744 1673 2056 1403 425 -506 -1503 -2102 -1559
3396 -1559 -275 466 1410 1677 1564 710 -636 -1358 -1479 -1675 -885 392 1236 1908 1568 949 -29 -996 -1903
3415 -1903 -1657 -977 -184 1133 1542 1842 880 -51 -1182 -1572 -1624 -1027 -149 1044 1319 1560 1545 383 -933
3434 -933 -1837 -1644 -1375 -427 729 1511 1927 1301 505 -616 -1518 -2126 -1570 -329 719 1519 1689 1793 754
3453 754 -683 -1446 -1749 -1675 -844 476 1372 1829 1461 829 81 -1157 -2091 -1578 -701 187 1209 1696 1910
3472 1910 998 -277 -1147 -1632 -1794 -1338 -187 958 1614 1650 1211 137 -1128 -1643 -1816 -1191 -81 1018
3490 1018 1562 1986 1395 37 -983 -1736 -2182 -1337 -478 476 1297 1501 1492 740 -834 -1481 -1697 -1212 -687
3509 -687 839 1391 1855 1488 701 -283 -1534 -1947 -1722 -771 341 1209 1600 1739 910 56 -977 -1788 -1688
3528a688P40J259R76K63l7m09q82j162p44k04R40N49J211O82K57o07j024o03q36
3547a319m88N62J145J081L01L78k73j154j056q09J81K72O39J085R38L33n97p01
3565E18r08q09l73R3Q09J185O84K91kq97r63o88o09m0Q77Q62J185L68j54m44r85
3586@j055n44L3P68J130O20Q67O5r98q69q45n67k52N41Q86R82N19L96p05o73j138
3607h39o12l0L60O80J149N42L17o40n76r50p82j81K02R43P45P64M47m9p38j242
3627d90q22j22K20P33Q87Q30L35m34n13q95r26l11N2J036P95N92O04J12p52r56
3647b5q88k86k77P77R67P71M24j65n50o28j283k59p6M82N87Q20J286P5q13p27
3667B12r90o06j34M08Q86Q42N35K89l04n35j315m11k43L40M70J018R30J03l94
$$ plain form
3528 -1688 -948 311 1287 1550 1513 1104 222 -940 -1684 -1888 -948 -399 812 1494 1751 1144 120 -483 -1319
3547 -1319 -1807 -1245 -100 981 1282 1660 1387 233 -823 -1632 -1451 -1179 -540 545 1483 1816 1219 518
3565 518 -390 -1199 -1572 -1479 -670 515 1199 1490 1488 591 -372 -1060 -1669 -1709 -832 30 1215 1583 1429 985 0
3586 0 -1055 -1599 -1566 -798 332 952 1819 1884 886 17 -828 -1395 -1647 -1106 -220 762 1281 1677 972 299 -839
3607 -839 -1451 -1481 -1121 -441 708 1250 1567 927 351 -599 -1381 -1562 -1360 -417 328 1092 1539 1490 752 -490
3627 -490 -1312 -1434 -1214 -481 406 1236 1571 1137 624 -271 -1197 -1508 -1456 -420 375 967 1571 1683 931 -25
3647 -25 -913 -1199 -1476 -699 268 1039 1463 1298 748 120 -1163 -1422 -1498 -1016 -429 391 1677 1752 939 212
3667 212 -778 -1384 -1518 -1110 -224 618 1153 1442 1138 603 -712 -1123 -1366 -1026 -556 462 1392 1495 1101
3686A101m65p53j028m32L76P34J022O19L00k01q03j139k91l97L9L75J162P20N95
3705A534k17n98p56q86m07j31N24J028J003L38K00j057j053L1q93k80N81J060
3723B1Q26Q07n9p49o80j103m37j19M95O52R17J051n8n08r91n72p09m58L70Q73
3743d31R58R13M2k75o03j103q71j17L88M08J206N73N00l85o62p21q20o36K48P36
3763f52Q66P96N49j2n87j073q84k14l56Q18P64Q77N94j48l75p63j159l45k82Q80
3783g06Q36L35Q65M89p28r45q20m84l42K85Q39J134N78K34m66o58j088o65j61
3802a468K77M99J058J000K75m69l41p19j229n14L00J030P91N80P21n27q44r64
3820e44o84J23k44M61R69J038M25k00l46j014p81r10J43O00R55P79P83j34n03
$$ plain form
3686 1101 636 -117 -1145 -1577 -1201 -467 555 1174 1474 1273 470 -669 -960 -1357 -1318 -943 219 939 1534
3705 1534 1317 719 -37 -923 -1330 -1461 -937 91 1094 1432 1632 575 -478 -447 -1340 -1620 -1039 21
3723 21 847 1654 1595 846 166 -937 -1374 -1493 -998 -346 571 1622 1564 1056 65 -507 -1216 -1674 -1304 -431
3743 -431 527 1440 1482 1207 604 -499 -1370 -1487 -1099 -691 515 1088 1588 1203 541 -180 -1000 -1636 -1388 -652
3763 -652 214 1010 1559 1547 960 -113 -997 -1211 -1567 -749 15 892 1486 1338 963 200 -959 -1304 -1586 -706
3783 -706 130 465 1330 1819 1091 146 -674 -1158 -1500 -1215 -376 758 1336 1570 1104 446 -642 -1307 -1468
3802 -1468 -1191 -692 366 1366 1641 1172 831 112 -1117 -1631 -1331 -301 490 1070 1791 1264 420 -544
3820 -544 -1228 -1105 -1349 -888 81 1119 1544 1344 998 -16 -797 -1707 -1564 -964 -9 770 1553 1419 916
3839I16r44p79l62n51P86R97P55O84j46j93r35q34p31P3J85O87R26J024Rl80q95
3860B92n70r71n12L26R92R88M78N57k67n73j340l42m76j87P08R63J021K09j87
3879A109o87n52q20n31j3P43R91P57N47J95o67r51q28o97j11M46Q17R61L81K50
3899A340l77q24p25p11l5N51O48O61O40L85n50q30p45n14m69L07P65J031L55J97
3919A100j29n95q93o28k1r0R16Q01P25K71k20q76j94j171l50R3Q52O28O69N23
3939A411j99p32n16r27k25J18M85O33M16J053k77l11o68j099l67R2Q3J009N39
3958E18O45K98p38p75q31l92l0N40O60P84M96J54k48o63q16n70l89M48N54P71
3978D16O33L41n25q13l31p82l69M23O98O49O92J60%n69j041m67k90L1K84J166
$$ plain form
3839 916 -28 -807 -1169 -1720 -934 63 818 1502 1356 1163 228 -606 -1337 -1264 -1079 -392 534 1558 1567 1187 292
3860 292 -278 -1249 -1761 -1435 -443 545 1023 1580 1313 740 -600 -942 -1418 -1605 -897 66 1087 1296 1109
3879 1109 422 -130 -950 -1481 -1494 -751 240 997 1544 1739 1072 121 -707 -1404 -1515 -1069 -252 709 1090 1340
3899 1340 963 139 -586 -1297 -1332 -781 -133 528 1168 1553 1003 173 -572 -1086 -1555 -1248 -483 548 903 1100
3919 1100 971 376 -517 -1145 -1166 -1256 -340 461 1186 1457 1237 361 167 -1004 -1354 -1261 -409 219 888 1411
3939 1411 1212 480 -36 -963 -1188 -1070 -585 48 464 1517 1240 929 261 -838 -1205 -1113 -1030 -21 518
3958 518 1163 1461 723 -52 -883 -1275 -1305 -765 -105 679 1175 1329 1081 418 -398 -968 -1357 -909 -355 416
3978 416 1049 1390 865 52 -279 -1061 -1430 -1007 -309 340 1032 1192 1192 623 -418 -885 -1175 -1144 -860 306
3998C06P07Q3j76l72o83p08m07J43M13R49J46R41M5m99j112n75j86m0K14P87Q01
4019G77L34n6j97o81q57n83K85L01P97M28P99n2k70q90n74q92K3K91Q26Q47L75
4040A031K49n3j114n31n73k33K96M37Q75O22M14o47m49o04n64n64L02M12P88Q19
4060I13L82j26m55q72p67l16J63N55P51O10L11J51n94n09p44q86J51M90P98M43
4080D49Q24K4o89q05n20l73k78K71J269O61N63j09j81r42l10j167KL20N58Q56
4100D23N87J25j33o52o87o24k60J77Q44M49Q14L45j32o54q51n73o19L38M50Q92
4120B59M86M40q7l67o52j017j49j41N37J008O45M25j39m65q55o46k85n1L18P01
4140c5P32L40J66n04o07n38p82J7K85O81P81N34L09n77n75p46p20j91N99O21M02
$$ plain form
3998 306 1013 1096 920 548 -135 -843 -1250 -1107 -694 255 401 1342 1387 888 -224 -799 -985 -1025 -811 -24 777
4019 777 1111 1055 858 177 -680 -1263 -978 -677 120 548 1347 1295 1025 135 -439 -1331 -1308 -1017 -191 656 1031
4040 1031 1280 1227 113 -418 -991 -1224 -928 -491 384 1006 1420 773 324 -280 -844 -1408 -1106 -694 94 913
4060 913 1295 1169 714 -158 -925 -1241 -1078 -523 228 838 1149 1300 706 197 -547 -1433 -1282 -792 6 449
4080 449 1273 1297 608 -197 -717 -1090 -1368 -1097 172 833 1396 1287 1106 164 -146 -1313 -1311 -991 -433 423
4100 423 1010 1135 1002 350 -337 -961 -1221 -1044 -200 249 1063 1408 1276 622 -229 -802 -1421 -1083 -633 259
4120 259 745 1185 1098 731 79 -938 -1087 -1228 -691 317 962 1387 1248 783 -72 -718 -1003 -1054 -736 -35
4140 -35 697 1037 1203 699 92 -446 -1228 -1211 -926 -245 536 1070 1379 802 227 -519 -1239 -1430 -831 -210 192
4161A92O65L93n41k58r14o06K8j48R74L93P90N77m71o18n42o39o38J57O28O72
4181I4O25K95O6m62o64m87n39J4K59J000N26O33p1n51p45p14n15O4L4R71N49M74
4203H56L13l33o61q46j57n20L78R66N88M14J23j33p55n92n73l55M40N88M47O02
4223G90M97n03n18m63p34l12K10O33P78N51J53O1n57q36n18n78J57L70Q33R68
4243I82j15K71p60k27q66p31K72M61P63M24M60L19n32n68p49n00O2J77O88P04
4263E35L32L30n08l14r63m14P5L66K62O98O09J84n53j73r79k58l83K24P62L97
4283B29O32M3Qm73m76q65k70M04J25P33P50k53L34o19n62m88m22j98Q95M31M81
4304D39M80K66o41o87n38k51J85J3P44M40N75o0m42j71j146l11J74N87N0P31M59
$$ plain form
4161 192 857 1250 709 451 -463 -1069 -1041 -1189 -215 178 968 1545 1074 456 -86 -725 -1363 -1206 -578 94
4181 94 719 1014 1080 618 -46 -533 -1072 -1058 -799 201 727 1360 1289 738 -7 -721 -1236 -1172 -1138 -167 382 856
4203 856 1169 836 175 -671 -828 -1348 -970 -4 584 998 1121 988 233 -359 -932 -1287 -847 -259 188 790
4223 790 1287 784 266 -197 -931 -1243 -1033 -400 378 929 1082 1143 586 -250 -768 -1346 -1189 -819 14 982
4243 982 867 1138 378 151 -715 -1446 -1174 -713 50 474 934 1253 721 153 -596 -1096 -1034 -857 -169 535
4263 535 867 1197 689 375 -588 -1002 -927 -561 -299 399 1008 1192 639 466 -513 -771 -1154 -930 -168 229
4283 229 861 904 912 439 -37 -902 -1172 -768 -643 90 840 587 921 302 -260 -748 -1170 -1368 -473 -42 439
4304 439 919 1185 544 -143 -681 -932 -747 -734 10 450 1025 965 523 352 -794 -1105 -931 -344 -294 437 896
4325H96J19j33p56n21l36k12L8O95P81J48J64M5l93j075o30m5L83L60O15O70K4
4346H37J83q58n61p7o11M11O07L99K64M06r7n47m37o98j80m7L96P52M48N29m49
4367F70K66q90q28o5J53J05P57N29K09J57m25n76p24k59j81O57L98Q01J22J54
4387A030j19r01n80l16j13L21O19M30O80J06l32m39q26o33J05K75L31O69M87K5
4407H19J62q19m78n14m11N92L63P88L52jk12n48k95p12j80K45L88M82N24N74j81
4428I38m99o01o74L08j44K63N89N35Q9J68m32n74l83o29K78p8Q88N68L03J52l37
4449G28n97n98o83N7M99N82L00M11M24k69o09n50n22k21L32J50P05P51K93j21
4469A062p29m66q68L5L57O0Q77J92L48j54l57n89l82k59k89Q29O61K66M52j98
$$ plain form
4325 896 1015 882 126 -395 -731 -943 -905 -210 571 719 883 928 535 -540 -1170 -1215 -832 -472 143 813 837
4346 837 1020 162 -399 -476 -1087 -676 -69 330 594 1000 903 356 -81 -779 -959 -1006 -610 142 590 1119 670
4367 670 936 46 -782 -847 -694 -589 168 697 906 1063 638 62 -662 -921 -1102 -445 -47 754 876 1030
4387 1030 911 10 -570 -886 -999 -678 -59 371 1051 1157 825 386 -440 -1073 -968 -693 -362 307 794 819
4407 819 981 162 -316 -830 -1241 -649 -286 502 854 853 641 93 -202 -914 -1094 -849 -461 21 545 1119 938
4428 938 439 -162 -836 -528 -672 -409 180 715 804 972 540 -34 -417 -1046 -768 -846 42 610 913 1065 728
4449 728 131 -467 -1150 -1093 -594 -12 288 699 1123 854 245 -305 -827 -1048 -716 -566 139 890 1183 1062
4469 1062 333 -133 -1001 -966 -609 -549 328 520 868 714 357 -232 -614 -873 -1162 -333 328 594 1046 848
4489H48l74m90o52j90j87M33N39Q16k17N03k91q02p41m3k75L81M74P45K51K00
4509I28k26n79o94j91m13L70N68N22N48J47j41n87o44m04j91m3Q01O35O57m1J64
4530A186m38o46p72j59k73N98O38M85L07n5m20p38l48k93k01M43N14Q51K73J56
4550A108l67q52m71n33J3M32M76Q10L62k52l41m52m12m90j43L73N45M78O73mj35
4571H18l91p93m74K27r1N29L47O36K2J75p24n40m76j88J42P19L26O13N6k56n0
4592F27p37k94m81j77O83O47N43P7r6k61m88p01l05L91j47P71R78r4r8j61o34
4613D3n31k13k42K00O59N10M25j10l44j60p29k30j57J24N30O15O48j63k72k90
4633C13o94k82k12J58O88L71O97q2l77m06m11l06n90L36N07P14L35J01j85l62
$$ plain form
4489 848 474 -16 -668 -858 -1045 -612 -73 743 526 1029 738 -64 -805 -848 -1123 -742 -268 477 728 928
4509 928 702 123 -571 -762 -1175 -805 -237 285 833 980 839 252 -392 -796 -987 -1030 -229 406 1063 1022 1186
4530 1186 748 102 -670 -829 -1102 -504 134 619 926 871 451 -287 -635 -928 -1129 -686 -172 679 952 1108
4550 1108 741 -111 -582 -1115 -1102 -670 -194 616 978 726 385 -67 -479 -969 -1112 -739 -194 284 957 953 818
4571 818 427 -366 -840 -613 -704 -175 172 808 830 1005 281 -259 -735 -923 -781 -62 264 877 933 677 627
4592 627 -110 -404 -885 -1062 -379 268 811 888 792 531 43 -658 -963 -572 -719 52 1030 936 838 677 43
4613 43 -488 -701 -943 -743 -84 426 851 741 397 237 -492 -722 -879 -755 -225 390 1038 875 603 313
4633 313 -381 -663 -875 -717 -29 342 1039 957 580 174 -237 -543 -1133 -797 -290 424 759 860 675 313
4653C13m88n07l58L81K68O14O25J45l88J25q61n03k81n1P31J11L10R16k26n05
4673C71l99o24m22K54Q6N35P13J38K51m01m02o52l90n8O15K91N50M50r8k88o48
4694a28k52l41m24L42P28L60N19J35k42k01p46n44J66NL18O58K45L15k26n67l49
4715b29m61j92M6N98L36L94J27J5k65n14n03r6m4L51N33N57K46l37N6o86m54n06
$$ plain form
4653 313 -175 -682 -1040 -659 -391 223 848 993 605 730 -131 -634 -915 -966 -235 -124 186 1102 876 371
4673 371 -28 -652 -1074 -820 -734 -199 514 652 903 502 100 -552 -942 -1000 -385 -94 456 906 808 520 -128
4694 -128 -380 -721 -1145 -803 -75 285 804 939 697 496 -250 -794 -628 -623 -305 353 598 913 687 120 -229
4715 -229 -690 -882 -836 -238 98 492 619 634 369 -145 -648 -744 -788 -437 96 653 899 562 618 -68 -522 -1028
$$ [...]
8191C04
##END NTUPLES=NMR FID
##END=
