##TITLE=1H_DE-27_EA
 D2O
 8 sc, 
 28.11.2023
##JCAMPDX= 6.0         $$ Bruker NMR JCAMP-DX V2.0
##DATA TYPE= NMR FID
##DATA CLASS= NTUPLES
##ORIGIN= UXNMR, Bruker Analytische Messtechnik GmbH
##OWNER= root
$$ XWIN-NMR		Version 3.5
$$ Tue Nov 28 16:30:13 2023 Russian Standard Time (UT+4h)  she@DPX200
##.OBSERVE FREQUENCY= 200.1313
##.OBSERVE NUCLEUS= ^1H
##.DELAY= (6, 6)
##.ACQUISITION MODE= SIMULTANEOUS
##.ACQUISITION SCHEME= undefined
##.AVERAGES= 8
##.DIGITISER RES= 18
##SPECTROMETER/DATA SYSTEM= spect
##.PULSE SEQUENCE= zg30
##.SOLVENT NAME= D2O
##.SHIFT REFERENCE= (INTERNAL, D2O, 0, 15.7039)
##AUDIT TRAIL= $$ (NUMBER, WHEN, WHO, WHERE, WHAT)
$$ ##TITLE= Audit trail, XWIN-NMR		Version 3.5
$$ ##JCAMPDX= 5.01
$$ ##ORIGIN= Bruker BioSpin GmbH
$$ ##OWNER= she
$$ F:/spectra/data/she/nmr/H-F/1/audita.txt
$$ ##AUDIT TRAIL=  $$ (NUMBER, WHEN, WHO, WHERE, WHAT)
(   1,<2023-11-28 16:29:20.84 +0400>,<she>,<DPX200>,
      <created by zg, POWCHK disabled, PULCHK disabled
       configuration hash MD5:
       00 E9 B6 7A A2 85 ED C7 34 08 36 98 17 FE 4E 26
       data hash MD5: 16K
       CE FD 70 E9 7F BE 13 34 42 27 91 0F 7A BB AB C7>)
$$ ##END=
$$ 
$$ hash MD5
$$ DA 88 C9 1D 72 E3 A8 5B 55 75 D0 3A 6F 43 FC AE
##$RELAX= 
##$RELAX= 
##$RELAX= 
##$RELAX= 
##$RELAX= 
##$RELAX= 
$$ Bruker specific parameters
$$ --------------------------
##$DU= <F:/spectra>
##$EXPNO= 1
##$NAME= <H-F>
##$PROCNO= 1
##$TYPE= <nmr>
##$USER= <she>
##$AMP= (0..31)
100 100 100 100 100 100 100 100 100 100 100 100 100 100 100 100 100 100 
100 100 100 100 100 100 100 100 100 100 100 100 100 100 
##$AQSEQ= 0
##$AQ_mod= 1
##$AUNM= <au_zg>
##$AUTOPOS= <>
##$BF1= 200.13
##$BF2= 200.13
##$BF3= 200.13
##$BF4= 200.13
##$BF5= 200.13
##$BF6= 200.13
##$BF7= 200.13
##$BF8= 200.13
##$BYTORDA= 1
##$CFDGTYP= 0
##$CFRGTYP= 5
##$CHEMSTR= <none>
##$CNST= (0..31)
1 1 145 1 1 1 1 1 1 1 1 1 1 1 1 1 1 1 1 1 1 1 1 1 1 1 1 1 1 1 1 1 
##$CPDPRG= <>
##$CPDPRG1= <>
##$CPDPRG2= <>
##$CPDPRG3= <>
##$CPDPRG4= <mlev>
##$CPDPRG5= <mlev>
##$CPDPRG6= <mlev>
##$CPDPRG7= <mlev>
##$CPDPRG8= <mlev>
##$CPDPRGB= <>
##$CPDPRGT= <>
##$D= (0..31)
0 1.2 0 0 0 0 0 0 0 0.06 0 0.03 0 0 0 0 0.0002 0 0 0 0 0 0 0 0 0 0 0 0 
0 0 0 
##$DATE= 1701174560
##$DBL= (0..7)
120 120 120 120 120 120 120 120 
##$DBP= (0..7)
150 150 150 150 150 150 150 150 
##$DBP07= 0
##$DBPNAM0= <>
##$DBPNAM1= <>
##$DBPNAM2= <>
##$DBPNAM3= <>
##$DBPNAM4= <>
##$DBPNAM5= <>
##$DBPNAM6= <>
##$DBPNAM7= <>
##$DBPOAL= (0..7)
0.5 0.5 0.5 0.5 0.5 0.5 0.5 0.5 
##$DBPOFFS= (0..7)
0 0 0 0 0 0 0 0 
##$DE= 6
##$DECBNUC= <off>
##$DECIM= 32
##$DECNUC= <off>
##$DECSTAT= 4
##$DIGMOD= 1
##$DIGTYP= 9
##$DL= (0..7)
0 120 120 120 120 120 120 120 
##$DP= (0..7)
150 150 150 150 150 150 150 150 
##$DP07= 0
##$DPNAME0= <>
##$DPNAME1= <>
##$DPNAME2= <>
##$DPNAME3= <>
##$DPNAME4= <>
##$DPNAME5= <>
##$DPNAME6= <>
##$DPNAME7= <>
##$DPOAL= (0..7)
0.5 0.5 0.5 0.5 0.5 0.5 0.5 0.5 
##$DPOFFS= (0..7)
0 0 0 0 0 0 0 0 
##$DQDMODE= 0
##$DR= 18
##$DS= 0
##$DSLIST= <SSSSSSSSSSSSSSS>
##$DSPFIRM= 0
$$ [...]
##$SUBNAM2= <"">
##$SUBNAM3= <"">
##$SUBNAM4= <"">
##$SUBNAM5= <"">
##$SUBNAM6= <"">
##$SUBNAM7= <"">
##$SUBNAM8= <"">
##$SUBNAM9= <"">
##$SW= 18.0517328524113
##$SWIBOX= (0..15)
0 0 2 0 0 0 0 0 0 0 0 0 0 0 0 0 
##$SW_h= 3612.71676300578
##$TD= 16384
##$TD0= 1
##$TE= 0
##$TE2= 300
##$TE3= 300
##$TEG= 300
##$TL= (0..7)
0 120 120 120 120 120 120 120 
##$TP= (0..7)
150 150 150 150 150 150 150 150 
##$TP07= 0
##$TPNAME0= <>
##$TPNAME1= <>
##$TPNAME2= <>
##$TPNAME3= <>
##$TPNAME4= <>
##$TPNAME5= <>
##$TPNAME6= <>
##$TPNAME7= <>
##$TPOAL= (0..7)
0.5 0.5 0.5 0.5 0.5 0.5 0.5 0.5 
##$TPOFFS= (0..7)
0 0 0 0 0 0 0 0 
##$TUNHIN= 0
##$TUNHOUT= 0
##$TUNXOUT= 0
##$USERA1= <user>
##$USERA2= <user>
##$USERA3= <user>
##$USERA4= <user>
##$USERA5= <user>
##$V9= 5
##$VALIST= <valist>
##$VCLIST= <CCCCCCCCCCCCCCC>
##$VD= 0
##$VDLIST= <DDDDDDDDDDDDDDD>
##$VPLIST= <PPPPPPPPPPPPPPP>
##$VTLIST= <TTTTTTTTTTTTTTT>
##$WBST= 1024
##$WBSW= 4
##$XGAIN= (0..3)
0 0 0 0 
##$XL= 0
##$YL= 0
##$YMAX_a= 193504
##$YMIN_a= -222945
##$ZGOPTNS= <>
##$ZL1= 120
##$ZL2= 120
##$ZL3= 120
##$ZL4= 120
##$ABSF1= 10
##$ABSF2= 0
##$ABSG= 5
##$ABSL= 3
##$ALPHA= 0
##$AQORDER= 0
##$ASSFAC= 0
##$ASSFACI= 0
##$ASSFACX= 0
##$ASSWID= 0
##$AUNMP= <proc_1d>
##$AZFE= 0.1
##$AZFW= 0.1
##$BCFW= 1
##$BC_mod= 2
##$BYTORDP= 1
##$COROFFS= 0
##$CY= 11.3945322036743
##$DATMOD= 1
##$DC= 2
##$DFILT= <>
##$DTYPP= 0
##$F1P= 15.7292609196834
##$F2P= 12.9074282941183
##$FCOR= 0.5
##$FTSIZE= 0
##$FT_mod= 4
##$GAMMA= 1
##$GB= 0.15
##$INTBC= 1
##$INTSCL= 1
##$ISEN= 128
##$LB= 0.24
##$LEV0= 0
##$LPBIN= 0
##$MAXI= 10000
##$MC2= 0
##$MEAN= 0
##$ME_mod= 0
##$MI= 1.114404
##$NCOEF= 0
##$NC_proc= 0
##$NLEV= 6
##$NOISF1= 3.799351
##$NOISF2= 2.8
##$NSP= 1
##$NTH_PI= 0
##$NZP= 0
##$OFFSET= 15.70392
##$PC= 1
##$PHC0= -24593.27
##$PHC1= 12.4527
##$PH_mod= 1
##$PKNL= yes
##$PPARMOD= 0
##$PSCAL= 0
##$PSIGN= 0
##$REVERSE= no
##$SF= 200.130013532006
##$SI= 16384
##$SIGF1= 3
##$SIGF2= 2
##$SINO= 400
##$SIOLD= 16384
##$SREGLST= <1H.CDCl3>
##$SSB= 0
##$STSI= 0
##$STSR= 0
##$SW_p= 3612.71676300578
##$SYMM= 0
##$S_DEV= 0
##$TDeff= 0
##$TDoff= 0
##$TI= <>
##$TILT= no
##$TM1= 0
##$TM2= 0
##$TOPLEV= 0
##$USERP1= <user>
##$USERP2= <user>
##$USERP3= <user>
##$USERP4= <user>
##$USERP5= <user>
##$WDW= 1
##$XDIM= 8192
##$YMAX_p= 0
##$YMIN_p= 0
$$ End of Bruker specific parameters
$$ ---------------------------------
##NTUPLES= NMR FID
##VAR_NAME=  TIME,          FID/REAL,        FID/IMAG
##SYMBOL=    X,             R,               I
##VAR_TYPE=  INDEPENDENT,   DEPENDENT,       DEPENDENT
##VAR_FORM=  AFFN,          ASDF,            ASDF
##VAR_DIM=   8192,          8192,            8192
##UNITS=     SECONDS,       ARBITRARY UNITS, ARBITRARY UNITS
##FACTOR=    0.0002768,     1,               1
##FIRST=     0,             0,               0
##LAST=      2.2672688,     0,               0
##MIN=       0,             -222945,         0
##MAX=       2.2672688,     193504,          0
$$ Real data points
##PAGE= N=1
##DATA TABLE= (X++(R..R)), XYDATA
0@%%%%%%%%%%%%%%%%%lJ1j6J6j6J6k1K9l2L2l9M7n3O1o9P7q7J00j13J27j41J58
39H4j77J94k13K36k61K89l19L51l89M28m68N18n72O28o93P68q53R48j057J188
59F30j344J531j766K067k468L029l867N261p966J5010o5487j67575J34514Q5687
73b744j02318L2956K17217M0016j49756m6307N4369o7770j28584J9084J34982
84A145N3977l3022L1929R3997l4787j63143n9259P2996k2494r2441Q8037J88825
96A25760l062j06515M2136N0653j47144j34986Q3567R9561m2537P543J39662M9200
108A63838j17796q2799K4506k1226r2955q92J21662P7462k9193j412O4187j9836
120H5546j33963o1788O6363K0014n7997M9875J47042J4910j09692j3534M7341
$$ y = [0, 0, 0, 0, 0, 0, 0, 0, 0, 0, 0, 0, 0, 0, 0, 0, 0, 0, -3, 8, -8, 8, -8, 8, -13, 16, -16, 16, -23, 24, -29, 32, -37, 40, -47, 53, -60, 67, -74, 84, -93, 101, -112, 124, -137, 152, -167, 184, -205, 223, -245, 273, -299, 329, -364, 404, -449, 499, -558, 630, -714, 817, -949, 1118, -1350, 1679, -2188, 3073, -4893, 10117, -55370, -222945, -88431, -2744, -105062, -72106, 145111, 185127, 35371, -10936, 43433, -24337, -152921, -133837, 1145, 55122, 22100, 54029, 148026, 113239, -49904, -109163, -36167, -58661, -151102, -63065, 125760, 122698, 16183, 58319, 108972, -38172, -173158, -89591, 9970, -32567, -25024, 114638, 163838, 46042, -36757, -12251, -33477, -126432, -127324, -5662, 71800, 42607, 41195, 105382, 85546, -48417, -110205, -43842, -23828, -81825, -31950, 115092, 130002, 20310, 6776, 54117]
131E4117q7857j24868N3197J21284p299k2620R8985O1428j01805r8850K1400Q714
143b4174o7654l961J10835P6753l1619k8443L4021j5108j11819o3019O5433N1253
155g502l6499K5413J22573K2126j09694l5835M8486n5242j04395M8378J19546
166C7355k27l4414O7688M4406r4128r4209J6957K1984l9474L452R4987P1227k6999
179F8605m1090J3974r821q8942n3175O2729N9440k2680J2498Q9772J1201j00915
191A596m5039L5554k9852o9982M3020J05952J5411l1403L2745K7811p1622q3818
203f9627N293L3714j1561J391P0279O1340k5866n4040m393m833o2475m1250N7653
216d4375O8614n010L37N9934J0345q7384n6812K6776k068m8822K7836R6011K5766
$$ y = [54117, -33740, -158608, -105411, 15873, 8574, -14046, 84939, 146367, 44562, -54288, -32888, -24174, -91828, -95789, 15046, 91799, 60180, 31737, 65758, 50650, -61169, -124188, -58755, -7502, -44001, -18588, 103985, 126111, 16417, -19418, 29068, -26174, -130569, -82191, 37355, 37128, 2714, 70402, 114808, 20680, -73529, -56572, -34588, -74062, -70610, 24377, 95604, 68605, 27515, 41489, 31668, -57274, -110449, -47720, 11720, -10960, 1538, 91310, 102511, 1596, -43443, -7889, -37741, -107723, -64703, 41249, 56660, 25257, 58002, 85813, 14191, -69627, -64334, -30620, -42181, -40790, 29489, 90829, 64963, 10923, 6530, 1697, -60778, -102028, -44375, 24239, 19229, 19566, 79500, 89845, 2461, -54351, -27575, -29643, -78465, -50629, 45382, 71148]
229G1148m3216K072K4029n3770q0914N180N3583O357l983N7341N7543l0663o5365
242f58r895M323m9456l5260N7625P0820n733j3238M2426P141q2365n6142L1216
255c9196J5625l2213K5771Q7776K4181m8758j3628J5761m5001p0069P905N6991
267a4855J4924m950M2926M3752l3315o4932j2266R046l1605j9568N5127O5701
279D9985k688j8343K1779k564o9574m9812K4713K4721j3471K0343O7798K1664
291G4551m4588k7474N731k7955n1083P545N8782K7400n081K3020L0336l0408o4650
304b3874j9508J3428j3272j1943M6519N9444Q06k5522L652l683n2862m3119K3198
317d6736L6781J864J2531M9420J9574m4606m1546Lj2992l8307M666N9895L4619
$$ y = [71148, 27932, 30004, 54033, 263, -80651, -75471, -21888, -15531, -19514, 37827, 95370, 64707, -658, -10553, -6230, -55686, -90946, -33321, 37499, 31766, 18528, 60954, 68095, -14270, -70412, -39196, -23571, -55784, -30013, 57763, 81944, 33186, 19558, 35319, -9682, -79751, -71846, -14855, 69, -4881, 38045, 81797, 48482, -16450, -28716, -19670, -51275, -70843, -15716, 49985, 47297, 28954, 50733, 48169, -21405, -71217, -46504, -21783, -35254, -14911, 52887, 74551, 29963, 2489, 8220, -19735, -70818, -63273, -4491, 22909, 17828, 40848, 71184, 40776, -23874, -43382, -29954, -43226, -55169, -8650, 50794, 51600, 26078, 29730, 26047, -26815, -69934, -46736, -9955, -8091, 4440, 53860, 73434, 28828, -12718, -12715, -25707, -64014, -59348, 547, 35166]
330C5166j0276P637K3873k7575o3242j7105K4239j541p558M4250N3896p337l4267
343B0160l959o141m7651l3890K8386M0452N616R643L8922J1911m5359m1548J235
356b2223l670k6723J0269N8468L0874j5212j933J3555l1265n8441j0167K8082
368b8386M325N83M2354M2296j3114l3824p559j0321l6739j8957K9360L7421J0415
381A7854P611K2203P22m1819l9932k225L801j1772J3480N1615L0339j6047j1639
394B4191M823k6524m9906o708L2468J3237K270L3020L3090j7932l9338j3207o919
407a7435k6655j1089L1908M0238J1656R90J2339k704l8994l9062k56J4163l178
420b8079J0328M6046K8818k3329k4145K894k0182m6997l626M3939K0164k835K7558
$$ y = [35166, 24890, 32527, 56400, 28825, -34417, -51522, -27283, -28824, -36382, 7868, 61764, 54427, 20160, 16201, 10060, -37591, -71481, -43095, -2643, 2973, 12616, 51538, 63449, 18090, -23458, -22223, -25893, -52616, -42347, 16121, 46995, 31783, 29850, 43405, 12140, -46301, -56468, -28386, -24061, -23478, 18876, 61172, 48058, 14234, 6675, -3646, -40385, -59342, -29982, 7439, 17854, 25465, 47668, 48390, 6571, -33361, -35586, -31785, -43557, -30077, 21538, 51877, 35830, 24191, 29014, 2490, -47416, -54124, -21656, -8419, -6149, 26871, 59961, 42029, 2691, -10516, -17435, -44090, -55179, -23271, 16967, 28623, 29613, 41952, 39248, 254, -38808, -39064, -24901, -28079, -17751, 28295, 57113, 33784, 9639, 12533, -7649, -54646, -58272, -14333, 5831, 2996, 30554]
433C0554L1367k4244m6282j0509P31k1722o700L6536L9029M282o521N667o939
446B5249l9312l4765P646K1797J391J0687M3870K5026l0717l0207M154j6038m3560
459e4779J749M9830K0561q163K1310K4978l0164m8383p191O829j4279M90L9496
472B284L6269J12j1457j379j0375l5642k8408R802K5893P647P418L3124J9196
485E4484l0790l5077K4o317l1270K778M9462K6977r110Q995J8150k7487m9233
498b8414j0001J3410l688K113L4777L4180k373k0694r292q585k6515k4017J2740
511c6359L4408J3262J86K2948J8646l1667m3204j41N434k5734m63N1100L1183
524C9599j6725k590J7258k4437n0663p747K4436M501O48L1911L3173p524k8523
$$ y = [30554, 61921, 37677, -8605, -19114, -18383, -40105, -46805, -10269, 28760, 33042, 26521, 32188, 25249, -14063, -48828, -41182, -19385, -17994, -7307, 36563, 61589, 30872, 665, 4819, -11219, -54779, -53030, -3200, 17361, 9198, 30508, 55486, 25322, -23061, -30252, -23423, -37702, -37212, 2284, 38553, 38665, 27208, 25829, 15454, -20188, -48596, -38794, -12901, -5254, 2164, 35288, 54484, 23694, -11383, -11359, -17676, -48946, -46168, 3294, 30271, 21161, 30156, 48306, 20819, -28414, -38415, -25005, -28693, -26580, 8197, 42377, 40004, 19310, 10018, 1433, -25082, -49099, -36359, -1951, 11311, 11497, 34445, 53091, 21424, -21780, -21921, -16487, -42221, -42684, 8416, 39599, 22874, 20284, 37542, 13105, -37558, -45305, -20869, -16368, -15720, 16191, 49364, 41840, 13317]
537A3317j3452o002k2266k0525J6728L8174J2944m933J6088J4692l3383m2825
549c1443L673J3172j7990J676M9384K9289k1626j0956J1941k1986m7173n832K9112
562a8759J0122L54K7333K9118j1264l1727j5415k803j5887j3513K0470L8339J2910
575B9278q718O105P502l0688m0769J968J9917o761O62M0981K9066k1257k0690
588F596O845j3060m0104o781L2990J8875r63J7504K3612j1455l6603j9272O04
601b1212o838q662J8429L9172J5616j4493m409O698k3916m0941J783L0368J386
614g019n651L5114L0232k5526l2309N492m613l6668o722L8975K4385m977R422
627B0135K1071j1378l9316j9743P474J895p472J6181L9878J3367k2852j1571P642
$$ y = [13317, -135, -6137, -28403, -48928, -32200, 5974, 18918, 13985, 30073, 44765, 11382, -31443, -27770, -14598, -32588, -30912, 18472, 47761, 26135, 15179, 27120, 5134, -42039, -47871, -18759, -8637, -8283, 19050, 48168, 36904, 5177, -10238, -13041, -28928, -42441, -21971, 16368, 29278, 20560, 26665, 34167, 3479, -37290, -35322, -15405, -22166, -21504, 19477, 48543, 27286, 6596, 13441, 381, -39723, -46504, -13514, 5361, 4398, 21902, 45514, 34059, -2544, -21816, -21212, -28050, -36712, -18283, 20889, 36505, 22012, 17603, 24301, 385, -40556, -38773, -8405, -7019, -12670, 22444, 52676, 27150, -5159, 333, -4280, -40948, -47670, -8695, 15690, 10713, 20135, 41206, 29828, -9488, -29231, -21757, -19862, -27334, -11153, 28725, 42092, 19240, 7669, 15311]
640A5311k1557l9777M949L6866N827p142K9773K6832k7064l5711L126Q91k7100
653c4776n397L7801K7587o572q19J3975j0101l7693k1315J1884J0396m000J4176
666d854L6124J2125k4645j7013M049j5255l2379M622L7036J3392q409J6480K1614
679D2887k2940l9684k829J0179j4897o687L4107L3228o601j2537P739n100l4543
692a7678k2628J4887J9238r29P315K9854J2281k7163k4942L062n270k5374J286
705c6061L9778K1161j2206M781K0054j8416m3425o312J8555n454q644K9234L4283
718C7328p673k1698J605j313k8945k1889J8164K6156J808J923K4409J1401k9578
731A1698k9016M125J968k0939J480L9530K1776j5188l144J5093j5564m0325p025
$$ y = [15311, -6246, -46023, -41074, -4208, 1619, -5523, 24250, 51082, 24018, -11693, -8567, -7676, -34776, -40173, -2372, 25215, 18643, 17824, 31799, 21698, -15995, -37310, -25426, -15030, -19030, -4854, 31270, 43395, 18750, 1737, 5786, -9469, -41848, -37226, -190, 13202, 4793, 21273, 42887, 19947, -19737, -22566, -12387, -27284, -33971, 136, 33364, 26763, 14226, 21965, 16865, -17678, -40306, -25419, -6181, -7110, 205, 30059, 42340, 15177, -9765, -6703, -11973, -37347, -36061, 3717, 24878, 12672, 17453, 37507, 19091, -24334, -30646, -12091, -17545, -26189, 3045, 37328, 29655, 7957, 9562, 8249, -20696, -42585, -24421, 1735, 3543, 5466, 29875, 41276, 11698, -17318, -13193, -11225, -32164, -30684, 8846, 30622, 15434, 12290, 27383, 11819, -28506, -35531]
744c5531K3006L335o570K3829L1161p062k6577n478J283k1832j9590J7595K9906
757G475M401l338J6526Q542k7290k9864K803Q445j1340K313L3768K2933j3721
770B1653j2628P105r892l3957j0000K3614J3899n098J3335K7067l480l1017j2438
783a1837O021j1645j7509J5963L4129P283j0224P675Q359k5056l2354K350J6445
796a0400m668j066K9709K3843j5427k0233L762l674k8482j1121K7020K0876n488
809D651N230K3192l095l3716j7164R396l610j5384J4512L5266Q057j5485J094
822A2944P787k2194l0231M388K0289J227j087K3750K0614j5863k4562j012m34
835d384k0995r469K5018K4927l284j637J6234j358l1702j9402J0892M676j0901
$$ y = [-35531, -12525, -9190, -15760, 8069, 39230, 32168, 5591, 113, 1396, -20436, -40026, -22431, 7475, 11876, 8538, 25064, 33606, 6316, -23548, -20745, -12300, -23640, -21327, 12441, 35374, 21653, 9025, 16130, 6238, -27719, -37719, -14105, -206, -5304, 8031, 35098, 31618, 601, -11837, -5816, -17461, -34970, -19007, 15122, 22405, 12181, 19856, 28215, 3159, -29195, -26845, -10400, -15068, -16134, 13575, 37418, 21991, 1758, 5520, 1846, -26636, -37757, -10737, 10139, 4651, 9881, 33073, 29978, -3738, -20902, -11506, -15116, -30500, -15988, 19278, 27335, 11850, 12944, 20731, -1463, -31694, -27306, -7017, -5790, -6877, 16873, 37487, 21624, -2938, -3950, -4384, -25379, -34848, -9830, 15097, 11813, 10176, 26410, 25052, -6650, -26052, -15160, -10484, -21385]
848b1385J1459L2809Q489j8409o569M863j6828k6688L055K4123O908j935J6537
861A6429J6788j3245k6808n310M005j1303q706K1464K7310k19j0520P500J473
874A8858k7506k2632J0723J4260n757N375K8867J1391k0853j3709M414r947k3062
887b9578K349K6148J1750m214Q542J3192j1558k8169r126Q513k706p268J7380
900d745K8726J031j6228R00L762k2810k2989J2241J9856l320J470K4913R634k3169
914I272j7102M072n629j8497M251K6194J3260m352L118Q545j1128k5378r944R771
928a3547L790l719J3450K4240J488j8542n265K746j6499j9468J1487K2269J770
941D200n42J7422P759k1083j9243J488o85j1184L619K3003J4625m049l664K543
$$ y = [-21385, -9926, 22883, 31372, 12963, 6394, 11257, -5571, -32259, -29204, -5081, 1827, -108, 16429, 33217, 19972, -6836, -12146, -8141, -19444, -28150, -6686, 20624, 20405, 9885, 17385, 18858, -8648, -31280, -20557, -6297, -12054, -6679, 22188, 33579, 12726, -983, 3431, -6516, -29578, -27229, -1081, 10669, 6455, 14997, 28189, 16631, -11538, -20664, -12151, -14857, -22125, -4745, 23981, 25012, 8784, 9684, 13446, -9364, -32353, -20112, -256, -3576, -2106, 22807, 32441, 9272, -7830, -3758, -9387, -27884, -23633, 2561, 15821, 11469, 14587, 23132, 12004, -13374, -23318, -13547, -9757, -13476, -26, 24214, 25702, 7160, 1895, 4641, -11858, -31326, -19839, 2430, 4200, 3658, 21080, 28839, 7756, -11487, -9999, -10684, -21868, -18249, 4754, 19379, 15330, 11666, 14209]
955A4209q289k1806j0075J0880J0392j61Q810J9971K304j9906j1046L115r340
968a0942j6786R712K4520M939n535J0845P488j9966k1525J730N701o533K669K2421
982H738J4697o386p793p1p895j8215q746J1853J3466J696M936J5227K609k1229
996B887j4158M362l804j3231R103K6057N936q742N635N671j9151k0784L151P998
1010i070k983M247J9261J1280p220r800l204o460j3216n866J1858J5293L370J866
1024I356J0718N80k0298j5509L933N77q623Q667K4019O175j0151L95K435j5803
1038c529j7381K968J0663J786M220J4251R372p437j2180n638m680r063m368J1830
1052i186J6821L945j241N260j28j7931j5935M160N993l863O571K0712P045j1867
$$ y = [14209, 5920, -15886, -25961, -15081, -4689, -4850, 3960, 23931, 26235, 6329, -4717, -1602, -10942, -27728, -18016, 6504, 11443, 5908, 16753, 24241, 4275, -17250, -15520, -9819, -16352, -13683, 8738, 23435, 17049, 9256, 9185, 1290, -16925, -25671, -13818, -352, 1344, 6280, 21507, 24116, 2887, -11271, -6909, -10713, -23944, -14841, 11216, 17152, 8410, 14045, 19716, 565, -20219, -17068, -9070, -12053, -7806, 11455, 22735, 15515, 5715, 2511, -3949, -17165, -23031, -11173, 4120, 7490, 9356, 20074, 20654, 356, -15153, -11220, -10643, -19266, -10599, 13420, 19595, 9444, 9839, 12274, -3529, -20910, -17942, -7279, -5493, -1273, 12978, 22350, 14913, 2733, -2905, -7585, -16648, -21016, -9186, 7635, 11580, 10339, 15599, 15471, -2460, -18395, -14235, -8242, -12105, -5534, 15178, 22223, 10356]
1066A0356n763J645j1818j6304L241J4189M412J762J1531Q009r177j4461n088
1079g466j386o064j770J2202J6120L517m611J444j251j6486j5066N109R764j608
1093g552N146J8557O275j4264p786J522r326j3876N193J5996N030N41Q796M232
1107A8484j0424j3981n034l64k062R10J1519J4215K475n648j953k468j3817j1921
1121b0069N938J0854R91M370J4574L516j3597r891oo493r555N189J6111O606o3
1136H475M675J895j0346j3235m454K308Q19K116J0612J2424M10p822m178k900
1150G99j0875r714O665J2418L590K374J0391K833j3859j1709L11k202p555N798
1164a0735J6189O885k911R54J022j0202j4053k133N350K922K556J0333J0719j718
$$ y = [10356, 4593, 6238, -5580, -21884, -18643, -4454, -42, 1720, 13251, 21260, 12083, -2378, -7466, -8852, -14916, -16686, -4484, 11636, 15153, 10542, 11986, 10735, -5751, -20817, -15708, -5944, -7552, -2406, 16151, 22426, 8162, 376, 1898, -7428, -21304, -16111, -115, 4915, 5456, 14252, 18484, 8060, -5921, -10955, -11319, -13381, -12471, -952, 13263, 15738, 10090, 8137, 5669, -8148, -20069, -14131, -3277, -2286, 2084, 16658, 20174, 6577, -3314, -3320, -9813, -19368, -14179, 1932, 8538, 8475, 13150, 15045, 4699, -8536, -12990, -10682, -9863, -7747, 2865, 15289, 15699, 7877, 3699, 799, -10076, -19790, -13125, -707, 2883, 5257, 15648, 18481, 4622, -7087, -6776, -8978, -16533, -10735, 5454, 12339, 9428, 10382, 11404, 1202, -12851, -14984, -9634, -6712, -4156, 6177, 16896, 15178]
1178A5178j0176m987k063r230p076Q264J3583K184L35Q383J107j5103j1515K076
1192i040M30n996O722J6992N780n516r14M95j0618j2938m80P957L807K278R243
1207H202Q714m438j1461m652j258p092m592R930J3346K017j167N472n86j4657
1221b222j0698K859K739l152N832J4993N590p119m469m45p845j1428R6J0705N867
1236A303J041O796P572n263j3559n282J122m653l560J0177J3859J709m376K179
1250I065j11j3340j1400M450O994j212L677J3548N783r422q109P86m751j1345
1264a5387K79J3139P426r57L537O802n790j4844n259M306j765l204J0418J3970
1278A2671N29p599L10J50j2323j0754N637R466M16J415J1765N436j1168r812Q02
$$ y = [15178, 5002, 15, -2048, -11278, -18354, -10090, 3493, 5677, 6012, 14395, 15502, 399, -11116, -9040, -8610, -14606, -7884, 9108, 14888, 9372, 8458, 8953, -1665, -14603, -15083, -7126, -3319, -1041, 8202, 16916, 12478, 1017, -3635, -4893, -11985, -16577, -6647, 6699, 8716, 7549, 13021, 12435, -2222, -12920, -10061, -7322, -10474, -4642, 10351, 15941, 8822, 4353, 3908, -3937, -15365, -15269, -4564, 1303, 2344, 9140, 16712, 11449, -2110, -7392, -6270, -10923, -14483, -4306, 9553, 11262, 6886, 9065, 8954, -4386, -15786, -11336, -4342, -5554, -1877, 11671, 17454, 8032, -77, 709, -4042, -15387, -15108, -1969, 5457, 4500, 8037, 14839, 9049, -5795, -11054, -6748, -8513, -11717, -1299, 12671, 13200, 5601, 5911, 6061, -6262, -17016, -11379, -1913, -1497, -82, 11683, 17119, 5951, -3861, -3059]
1293c059j854r326J031J4221Q014k821J044N663o131j5236m579O240O60k432R483
1308I18J2954m67r086j890M30j0110r121O046J1183J905o3Q467M058j0567j1459
1323f802j54J376o150P74J3440R451l926k516L742m324j4652m787Q222L460j696
1338d542P096J1858o27j1071m547P86o498q102O005J2705L105k105N108M242j0234
1353C179j2904N34M893m016m01J3317J0072o015o143K850k688j3906m425J0289
1367e364O023k377N156J1022j489j2696m954K241m451o410N537J3681L167m189
1381D897K410L388r423j3101P94P444j741j060J1868J0278o923q615K174j600
1395G90j2232l649J1451P676k638K764Q893k026j3053n910L115j779m564N581
$$ y = [-3059, -4913, -14239, -13208, 1013, 9027, 6206, 7250, 12913, 6782, -8454, -13033, -6793, -6133, -8565, 918, 13872, 13405, 4319, 2429, 2859, -7251, -16372, -10326, 857, 2762, 2699, 11166, 15224, 4657, -6802, -6956, -5580, -11730, -10956, 2484, 11935, 8009, 5493, 9235, 4911, -9741, -14528, -6306, -2846, -4542, 2554, 14412, 13785, 2714, -1833, -1047, -7545, -15647, -9642, 3063, 6168, 4063, 9171, 13413, 3179, -9725, -9191, -4298, -8314, -8715, 4602, 14674, 8659, 2516, 5366, 2678, -11228, -15653, -5364, 659, -1718, 3438, 14460, 12971, 275, -4679, -2438, -6889, -13299, -7762, 5919, 9086, 4897, 7307, 10695, 1272, -11829, -11035, -3591, -5332, -6392, 5476, 15754, 8831, 216, 2390, 790, -11442, -15091, -3640, 4036, 1398, 4162, 13055, 11029, -2024, -7934, -4819, -6598, -11162, -5581]
1409e581J3287L624o015p53L043p641j2619O04R627J158j999R374R455p016j1228
1424b680P05J148r410m049J1468R904k614l09O570q21j3109p324M626J425l704
1439h174M312J2537M183p808l682K411n122j1757R6J1707M160l619O193R510o513
1454H434j3581m09M146o900m822J1545J1745l591l728N175o73j2502p249N806
1468f604M238k730L209J1448M012q846n923K036k654j0295l05J2793N443m347
1482A475K885Q964o012j4444j253O286m116m126J0373J1656l335n846K808j74
1496E141j0697o926N232O653q91J181Q814M082q357q302J266L03p654o36J2333
1511A542P034m472n17O904m453j3980k833P537m68l704Q003J1450k251q308k68
$$ y = [-5581, 7706, 11330, 5315, 4562, 7605, -36, -12655, -12051, -2424, -1266, -3265, 6109, 15564, 8548, -2680, -1975, -827, -10237, -14286, -2818, 7086, 4472, 4163, 10733, 9912, -3197, -10521, -5895, -4470, -8174, -3862, 8675, 12858, 5050, 1368, 3779, -1343, -13100, -13004, -1297, 2863, -756, 5437, 14947, 8434, -5147, -5556, -1410, -8310, -13132, -1587, 10158, 6567, 2839, 8014, 7341, -5161, -12410, -6604, -2366, -5096, -1887, 9561, 13573, 4727, -1196, 840, -1814, -12109, -12414, 379, 5822, 1475, 4360, 13324, 7312, -7132, -8385, -2099, -6215, -10341, 32, 11688, 8353, 2507, 5315, 5141, -5556, -12482, -7250, -597, -1488, -307, 8507, 12589, 4232, -4070, -2804, -2501, -10155, -10791, 1542, 8576, 4104, 3587, 10491, 6038, -7942, -10775, -3238, -3706, -7410, 593, 12043, 9792, 1484, 1216]
1526A216J500q240o937N215Q903M22q53O474M088q394r580P89K786n258j331J1307
1542B107Q356n002l469N023k484j2803l797Q669K836l869N901J0878k123r925
1556B98k091K079o006o465N710R959R90j967L963L263p975r516R42M472l188j069
1572f601R729Q388m997n941L530j465j1163m097R383M572l378M154R347k198j0089
1587h26k831J845l696m565N201R701J667k770J118K302o456r137J19N523r3j345
1603d243P544Q127m813o949J061M83q793l861Q525O711k405J343P101j273j0278
1618a720m713L162j178l496M088R492K466m235o93J745n070q807K05P044J196
1633e14j770O332O882m501q528K91J489o845l690Q570P964k023j142N603j061
$$ y = [1216, 2716, -5524, -12461, -7246, 1657, 2079, 1226, 7700, 11788, 3394, -6186, -5397, -2611, -7869, -9200, 2107, 10463, 5461, 1992, 7015, 4531, -8272, -12069, -3400, -564, -4433, 1468, 12346, 10223, 298, -1793, 286, -5720, -12185, -6475, 3484, 4474, 2507, 6470, 9733, 1758, -7758, -6816, -2344, -5532, -6601, 3128, 11516, 6519, 578, 4108, 2643, -8520, -12617, -3234, 1338, -2040, 2114, 11461, 9263, -826, -3657, -1812, -5508, -10073, -4872, 4829, 6496, 3726, 4844, 7146, 690, -8447, -8328, -2805, -2898, -4243, 3301, 11428, 6615, -334, 727, 1210, -7583, -11444, -2919, 3792, 1387, 2730, 9831, 8558, -1720, -6433, -3271, -4449, -7945, -3857, 5635, 8101, 3866, 3173, 4918, -152, -8959, -8754, -1710, -514, -2284, 4048, 10930, 6429, -2099, -1808, -319, -7164, -10854, -2284, 5680, 3657, 2515, 8118, 7057]
1648G057r785n225M063J005l334M023R034J866n263k380J612m092p648N14P659
1663h94K724j979M101O519m483r307o74K322m070l161P614Q213k082k871M118
1678F090o22r151n218L870L009j556K156Q384K146n680m030J335k828o406K26
1693h275Q433L704k347K085M737l509r202j646L455j911k289O499Q156j474m338
1708B078J437K92p872n191L999M908o40J440O149K071n917n478Q10m87n004K74
1724g131Q052M677k368rL541l119q734k158M213K00j768N246P444j262n406m25
1740I93P69o070n038M409O001K67j23N223J397o413n405J098l32l200Q91P604
1756B071M162k389j160K018k610p928j448M404J534j115M228O244j149o091j643
$$ y = [7057, -2728, -7953, -3890, -2885, -6219, -2196, 6838, 8704, 3441, 1061, 2673, -1419, -9067, -8553, -894, 1830, -149, 3952, 10471, 5988, -3319, -3993, -1671, -5741, -8902, -1288, 6925, 4843, 1972, 6090, 5468, -3683, -8901, -5031, -2022, -3578, -1422, 6962, 9108, 3428, -602, 733, -2095, -8501, -8275, 158, 3862, 1515, 3600, 8337, 4828, -4374, -6020, -2565, -4476, -6765, -266, 7890, 6416, 2078, 3515, 3807, -4065, -9256, -5257, -349, -989, 451, 6600, 8671, 2754, -2724, -1914, -2401, -7405, -7131, 921, 5598, 3230, 3221, 6762, 3643, -5091, -7249, -3036, -2836, -4604, 642, 8086, 6824, 1418, 993, 1762, -4308, -9346, -4937, 1064, 1331, 1208, 6431, 7828, 1415, -3990, -2892, -3224, -6424, -5533, 2071, 6233, 3844, 2684, 4702, 2092, -5836, -7284, -2880, -1346, -2461, 1767, 8011, 6862, 771, -872]
1771h72O76m475l470M099O317M12n28L334J008n813n453K32J801k044J407O401
1787C032M017k981k050O81k337o155j401M480K591n4K756M426r88o089k441R31
1803a582k662k673L581O759J111j849J939O10n662n534J041K585r90J017O040
1818C731L663l793k726M62j916n518r16M996L438k33J703L794j750n944k987J383
1834b613j232k110L679O650Q68k681Q67J61n198n149J792L771n72O68N469K912
1850G282l956l952O53k037l998o2N255L437n72J034K857k026n829k909J733O2
1866c028j314L327O245N33l392n00M79m467n035K140M292M49N50M372K401m414
1882B638m485L17q13l025J66N215L930r00k01J422j522n498k814K105J546o34
$$ y = [-872, -196, -4671, -8141, -4042, 2275, 2687, 2159, 5493, 6501, 688, -4765, -4533, -2732, -4776, -3369, 3032, 7049, 4068, 2018, 2699, 362, -5793, -7194, -2714, -123, -177, 2579, 7005, 6017, -72, -2513, -1582, -4244, -6917, -3336, 3423, 4534, 2685, 4624, 5234, -428, -5962, -4921, -2336, -3326, -2309, 3731, 7394, 3601, 875, 1337, -579, -6097, -7013, -2017, 1421, 1188, 2891, 6685, 4935, -1009, -3996, -2613, -3845, -5955, -2276, 4374, 5242, 2561, 3428, 3589, -1609, -6758, -4966, -1195, -1767, -1099, 4370, 7282, 3326, -626, 27, -2010, -6008, -6070, -815, 2622, 2050, 3084, 5941, 3915, -1914, -4823, -3090, -3028, -4342, -1015, 5230, 5763, 2371, 1871, 2350, -2117, -7152, -5012, -720, -271, 279, 4651, 7052, 2638, -1847, -1530, -2343, -5368, -5202, 13, 3943, 3043, 2842, 4264, 2742, -2756, -5570, -3465, -1919, -2553]
1898b553K531N552M34m083j617N43l202m492K108N506R17q63L695J721m371m973
1914c147M39L43k317P29N206L537j203j401R95j836m962k143K884K058m56J624
1930C50N034O10n161k261J117k165m091K685N828P34j375K652J711n202m361L48
1946c547J063j281O97N077L343j841j913L8j055m513k105L502K981l27J188L849
1962E156M52n435k518J409j783k960K429N852J058j638J247Q99m038m857P90K110
1978a827m22N63M056L184j966k887l11p00l453k019L591L770l61O52K812m2n025
1995c85l269J600k14k253K293N496J433k863K40J071l528m823Q74L099R5N9L901
2012B826L012k555l770l04k05k790j496L809L945j22n02K154J18n482l084J755
$$ y = [-2553, -22, 5530, 5964, 1881, 264, 807, -2395, -6887, -4779, 727, 1644, 781, 4476, 6197, 1826, -3147, -2708, -2365, -4682, -3953, 1253, 4790, 3587, 2186, 3181, 1345, -3617, -5760, -2876, -818, -1274, 350, 5384, 5994, 833, -1428, -311, -2476, -6567, -3882, 1946, 2680, 1305, 3957, 5668, 466, -3895, -3547, -2484, -3765, -3068, 2009, 5352, 3511, 1598, 1636, 581, -3932, -6037, -2535, 446, 119, 1307, 5156, 5608, 173, -2345, -936, -2719, -5679, -3250, 2602, 3660, 2022, 3269, 4168, 130, -4727, -3937, -1827, -2249, -1686, 2370, 5554, 3588, 701, 390, -310, -3763, -5782, -2191, 1579, 1218, 1870, 4682, 4640, -385, -3654, -2054, -2268, -4521, -2228, 3268, 4701, 1838, 2078, 3149, -379, -5202, -4328, -1229, -1134, -1075, 2826, 5838, 3283, -487, -791, -996, -3786, -5282, -1473, 2472, 2350, 1848, 4002, 4120, -1362, -4446, -2691]
2028b691J294k045J651O087R63l555j013J479l304m787J553M040N34k51L364K134
2044E453k828m005l99K33j858j015L478M238j11j616J350J29m617l766K728J977
2060f29j649J447N258Q68l986j324Q05k031m068J140M714Q09o36K190J784k237
2076B455m442j186J451r87r54L510M399m08k600R01l8m336l340K426L403j093
2092h39M69M642J344m287k770J094j083l486Q43N127J676j469Q75K087k452m808
2108c037p30K023n2j193L292M434o31l449l10R52l421l491K520L973k12m20L219
2125C467J660m224l625J140K34k564K65N180K361j723l49J551k015m713q02K638
2141a519R03o44J986M029n48l844r86J031k488k936K302M682k13j255K810J212
$$ y = [-2691, -1397, -3442, -1791, 4296, 5259, 1704, 691, 2170, -1134, -5921, -4368, -328, 206, -45, 3319, 5453, 2625, -1380, -1779, -1546, -3404, -4419, -941, 3297, 3186, 1570, 2920, 3049, -1568, -5334, -2606, -629, -2278, -831, 4427, 5295, 1309, -15, 790, -1241, -5309, -4169, 545, 1354, 718, 2908, 4692, 2455, -1987, -3173, -1722, -2709, -3663, -153, 4246, 3838, 1238, 2139, 2101, -2235, -5575, -3149, 254, -839, -370, 4272, 5616, 1329, -1441, -347, -1430, -4916, -4073, 1054, 2730, 1261, 2136, 4223, 1771, -3037, -3767, -1744, -1796, -2989, 303, 4737, 4106, 657, 347, 1299, -2122, -5613, -3093, 880, 668, 248, 3467, 5127, 903, -2722, -1582, -1348, -3912, -3647, 1533, 3894, 2171, 1822, 3373, 1358, -3355, -4157, -1519, -616, -1260, 726, 4755, 4207, 363, -623, 408, -2080, -5016, -2714, 1968, 1755, 500, 3310, 4522]
2157D522m000m013J409J214k199K65M502K582j981j575J177j377l969j222L187
2172a478J808o58J430L364m55m060j676J142j373k516K079M666K93j789J593J136
2188C506l461m209J134K124p91j61L832L067k855k235Q26m11l741j011L205K691
2204A510r14M29L239r13m271j728J542n40k088K021M768O06k422J17J156l055
2220e43l796R72K849K2p94L500K666k477k887j02M67k868j186L518K826o46r5
2237A426K100l38m316k332J540O70j307J217M338Q31k551n04Q04k571l075N71
2253c497L130R19j051K298K762k216l656l14Q35j821j169L507L114p37j127J267
2269B244L20m083k512J823J650j006Q14L742J397k829k145J167j215l270K98L795
$$ y = [4522, 522, -3491, -2082, -868, -3067, -2802, 1700, 4282, 2301, 726, 1903, 526, -3443, -4665, -1478, 330, -328, 1102, 4466, 4011, -49, -1725, -583, -1956, -4472, -2393, 2273, 2566, 777, 2370, 3506, 45, -4164, -3030, -906, -1697, -1858, 1974, 5041, 2186, -49, 777, 366, -3375, -4386, -1181, 1510, 596, 1025, 4264, 3351, -920, -2648, -1106, -1646, -3734, -1713, 3055, 3661, 1239, 1356, 2512, -543, -4339, -3367, -518, -496, -1290, 2210, 4876, 2399, -488, -590, -123, -2991, -4177, -659, 2167, 1521, 1426, 3526, 3188, -1128, -3460, -1920, -1250, -2557, -1340, 2998, 3829, 1278, 774, 1578, -993, -4068, -3497, -367, 552, -499, 1799, 4561, 2345, -1311, -1625, -790, -2611, -3780, -273, 2841, 2104, 977, 2244, 2564, -1519, -4031, -2208, -558, -1564, -750, 2992, 4389, 1560, -585, 582, -633, -3903, -3605, 190]
2285A90J462j408J479J922j740l769n65J390r23j045K909L538p56j950O48J03
2301A485k948k381J531K289n24L21K834J407l070k053P64o09k255K72L638J667
2317B368j064J4J551j397l904p39K059o1q52K005L499m05k615N4N13k876k088
2334c938J873K368J96p8K232Q59k587k639M88M0j229K5L288K046j189n56R15j102
2352A012l571q79K196O59o33J871K697k49k568r72M82j796j810J415L138P8l09
2369G61J754L25k288k658J10Q12q25j20L029K293r76j505K74o22k955j044K434
2386a201J394l45O60K895m35l073j127Q26j176j802K080K664N15n93N69N24k206
2403A69k529J10J088k49L59K328K048j346j582m8k85k385r15K096K093n53M65
$$ y = [190, 1652, 244, 1723, 3645, 1905, -1864, -2429, -1039, -1962, -3007, -98, 3440, 2684, 734, 1382, 1485, -1463, -3844, -2313, -24, -548, -227, 2607, 4014, 944, -1109, -345, -954, -3209, -2937, 701, 2368, 1304, 1318, 2869, 1472, -2432, -3171, -1112, -1173, -2025, -20, 3479, 3074, 459, 513, 1026, -1850, -3938, -2065, 303, 499, 421, 2653, 3512, 925, -1714, -1226, -1186, -2415, -2390, 898, 2944, 1755, 1199, 2114, 1012, -2559, -3438, -1242, -583, -1216, 655, 3352, 3103, 535, -437, 45, -1751, -3561, -2146, 992, 1070, 761, 2515, 2840, 552, -2106, -1996, -1184, -2009, -2129, 900, 3193, 2217, 712, 986, 364, -2591, -3635, -1201, 193, -152, 508, 3403, 2968, -105, -1232, -406, -1582, -3384, -1304, 1360, 1875, 1282, 1851, 2375, 169, -2360, -2250, -1162, -1411, -1052, 1276, 3324, 1978, 396, 348, 63, -2322, -3237, -1141, 952, 399, 864]
2420H64J904Jl094j337L81k16j339J755K965M21r12o4J87j867k320k0J710N21
2438d60K52J336J906j195k290j58k3j538r81K588K259o95P3J509m35l157j387
2455b396J095K17q98J563K466N18j373o37N39j574k465L18J954J011J62J006J291
2472B797j023k396o57N28j330m47K187K207l37p90J087k82k704j264Q16R07p70
2489a471J293K603J58j635p90O0j076j852O76J710R74j40R01J250j281k597o00
2506a817Q66o50j70J799K448m59j301M84j37k497j423J338J308l36R56K053J83
2523B645j576j480l7q63r31N25K018J155mr5R58j201k573o28R10J15l17J636K040
2542B297k64j265j80k12j983j372J558J460K23L92J371K90j823j453K23n16r84
$$ y = [864, 2768, 2769, -325, -1662, -1281, -1497, -2836, -1081, 1884, 2305, 1393, 1329, 1516, -351, -2671, -2691, -981, -460, -208, 1128, 3034, 1839, -451, -609, -632, -2170, -3151, -563, 1696, 1001, 1074, 2583, 2148, -1009, -2396, -1301, -1084, -1982, -419, 2047, 2565, 1192, 555, 1094, -480, -2945, -2627, -673, 338, 500, 1506, 2797, 1774, -622, -1279, -751, -2081, -2528, -341, 1866, 1529, 739, 1826, 1544, -1160, -2424, -1608, -701, -1471, -178, 2425, 2583, 948, 158, 218, -858, -2710, -2034, -324, 650, 510, 1411, 2661, 1380, -1217, -1817, -951, -1601, -1771, 28, 2476, 2017, 716, 1200, 1063, -1434, -2857, -1519, -211, -547, 409, 2462, 2645, 1069, -411, -448, -1311, -2242, -1717, 301, 1456, 1452, 1357, 2315, 1114, -1459, -2087, -1177, -1062, -1379, 257, 2297, 2033, 768, 588, 376, -1607, -2979, -1421, 39, 262, 654, 2025, 2315, 492, -961, -738, -1254, -2238]
2559b238P35J980J446m41k10K20q82k278p84J242N22l85K027J837o59j981r7N
2577E9j752j398J911J972l90L24J471m22j800j465K18M2n19R72J875R33o72m88
2595H71L12j191k000n28J572P75k60J405J762o93k188l11n7j027j029J998J745
2612A156J86p1O65j20k103j516L68K52j36O26K192J095j122j219J72o95j675n65
2630b510J808J063j35Q09J351l20k313q09K95p29n36J550J873K88q96P94k91j961
2648f69j511N18P49L2N13J738J252j508j156j15m31j384l35J722J612j86K04J239
2666B284o96k353q40M48R0p92J508K070O3r73K49r0k003j138J93J805k6K91J544
2685A634P04j311j538r1m4j231m22K205J670m90l30J048p08k374n77P02L39m35
$$ y = [-2238, -1503, 477, 1923, 1482, 1272, 1492, 610, -1668, -2452, -1210, -688, -1073, 954, 2791, 2132, 151, 54, 59, -1693, -3091, -1180, 792, 402, 726, 2197, 1775, -25, -1490, -1272, -1230, -1749, -777, 1098, 2031, 1359, 871, 1183, -8, -2008, -2536, -964, -189, -449, 956, 2718, 2025, -163, -474, -531, -1558, -2587, -589, 1156, 1342, 1271, 1936, 1816, -287, -1803, -1435, -1183, -1319, -693, 1499, 2594, 1472, 253, 425, -270, -1945, -2510, -702, 361, 226, 1035, 2386, 2066, -247, -1056, -761, -1490, -2026, -476, 1397, 1685, 789, 1583, 1292, -669, -2180, -1662, -913, -881, -368, 1370, 2622, 1114, -42, -157, -588, -1972, -2307, -585, 1027, 841, 1045, 2284, 1588, -765, -1605, -1157, -1067, -1859, -351, 1719, 1782, 809, 1058, 968, -1035, -2173, -1980, -175, -201, 90, 1634, 2338, 1027, -511, -602, -646, -1877, -2299, -94, 1576, 1086, 756, 1804, 1096, -1278, -1855, -1153, -814, -1249]
2703a249J254K070k91j193m97M32j473j522P72J996k6L31J020O03j343j967N6
2720a027L60r66l34K247J416l41q08Q39p49k120q31J269P17m93J486J406J05j871
2738C05o89J6o82j150P42J957O15m84Q16N19j562j838m6P22k92l33J578K004o60
2757A538j323K66j32k082n24J304J165p9L26J832j35j924j043M79n96j420Q97
2774a451K516K43o01K91N79j376k006R8J153j67l96J858J673q39j417J18k33j483
2792a440q95J372J540j8J51J106J23j922j473M12J65q18O52K072R63j249J9L07
2810A067j175j993K80J311L57K1J152J187p51j545l71K66j357o04J646J484R7
2827A072k78Q36O6j976j430N24N56q72P49K176O64j319m70K17p75j760j44J965
$$ y = [-1249, 5, 2075, 1784, 591, 94, 526, -947, -2469, -1697, 299, 273, 604, 1624, 2227, 884, -1083, -1027, -667, -1633, -1967, 280, 1696, 1355, 547, 1386, 637, -1483, -2314, -1045, -328, -821, 665, 2071, 2176, 305, -384, -368, -1050, -2200, -1458, 499, 1114, 630, 1446, 1965, 403, -1435, -1481, -759, -1051, -1384, 194, 2198, 1538, 215, 481, 349, -1733, -2257, -953, 212, 133, 459, 2291, 2156, 232, -811, -332, -928, -2348, -1451, 1065, 1308, 707, 998, 1577, 201, -1805, -1707, -554, -721, -1117, 741, 2414, 1575, 158, 276, 43, -1440, -2335, -963, 577, 559, 710, 1816, 1939, 17, -1456, -1044, -879, -1697, -1045, 1027, 1990, 741, 760, 1067, -108, -2101, -1821, -510, -153, -132, 1020, 2207, 1456, -89, -460, -194, -1551, -2155, -509, 975, 1072, 794, 1630, 1696, -280, -1710, -1186, -630, -1502, -753, 1423, 2087, 768, 298, 515, -260, -2020, -2164, -199]
2845a99O26n00R43J497r91j941m63N87p45p41J340K015r2o90M22Lj567j970J110
2864a356J070m20L74J710P70j205j167M08n35j773J85K102Q08n08L38J279j173
2881I07j825m82P12j86p01J313J928J8j165L32q8j627j173N74J619j99j68J389
2899A178J367k007j451O25l6j526P3K046R82n00Q3Q07q03j715r05J075Kl26J125
2918I4J815m0j445m73N12j102j505P45J721M59o80J251P99j737j428n0L68p82
2936a478k30K243J126q55j99M07m00k053n61J027P86l17O76J835j06j244j179
2953e22P18j177j332R92J793K69k42M84J139j364k246J17P32j39n76K309R11q12
2971A054q12L03j61k003m35J141J021l65P04J161K05j863r61N55q5j391R47J814
$$ y = [-199, 427, -73, 870, 2367, 1376, -565, -1028, -441, -1186, -1927, -587, 1428, 1336, 646, 1068, 1071, -496, -2466, -1356, -286, -706, -332, 1378, 2148, 943, -224, 184, -351, -2124, -1939, 163, 971, 463, 801, 2080, 907, -918, -1400, -688, -874, -1575, -262, 1666, 1684, 519, 851, 763, -864, -2037, -1463, 156, -43, -211, 1178, 2545, 538, -913, -288, -324, -1850, -1777, 269, 1251, 751, 834, 1641, 838, -877, -1782, -707, -705, -1031, 94, 1909, 1869, 424, -49, 463, -639, -2144, -1399, 322, 781, 101, 1352, 2151, 414, -1014, -1064, -696, -1478, -1708, 535, 1661, 806, 607, 1014, 614, -1439, -2000, -973, -187, -504, 172, 2007, 1901, 657, -522, 196, -981, -2313, -1321, 472, 741, 499, 983, 2122, 758, -1488, -1371, -639, -778, -1354, 955, 1866, 1054, 242, 545, 384, -1619, -2054, -913, 108, -257, 447, 1608, 1813, -50, -1011, -456, -541, -1932, -985, 829]
2989H29N34o41K37L32q82k079J90R83j03k06J388J662r97j095L7j37j295n04J025
3008g22J337J00j78J160j05j741j115M62L74q09N41J914N58r53l89Q74j146j924
3026a762J57J392J34o43J459J267p63j670j88M83j308n60J455J326J77m22Q53
3043A387J28j769j190M96M02n93N50K084O89j351p49M64p98j723L40J566L10l84
3061a41J010J463j448j557j54L61p07m79J220J851k06o58O81j13j556j490O58
3078a265J086l96M09J440Q11j289j091O52m95j699K60J812P10n16K99R22o01k082
3096a033k52N04P0p16J368J630j48q47j5K11j286j450R40R83k49J44J311P35j565
3115C35r36J51P1j291K8J860J065q24L79O13n27k188j82Q45o9N4N57J586J6j146
$$ y = [829, 1363, 722, 959, 1291, 409, -1670, -1480, -497, -600, -806, 582, 2244, 1247, 152, 189, 52, -1243, -1747, -722, 615, 715, 537, 1697, 1592, -149, -1264, -802, -428, -1237, -696, 1218, 1776, 823, 434, 1308, 162, -1762, -1605, -213, -79, -722, 737, 2004, 1241, -429, -617, -134, -1442, -2002, -547, 779, 956, 534, 1387, 1515, -254, -1444, -948, -546, -1139, -589, 1495, 2184, 833, 84, 548, -250, -1973, -1633, -67, 243, -141, 869, 2332, 884, -673, -827, -466, -1173, -1652, -432, 1419, 1213, 555, 1236, 1123, -433, -1923, -1265, -179, -575, -166, 1274, 2085, 796, -295, 357, -138, -1837, -1577, 235, 945, 429, 728, 1650, 1049, -1033, -1285, -781, -711, -1427, -59, 1571, 1423, 576, 561, 772, -514, -1964, -1024, -41, -290, -146, 1165, 1900, 335, -601, -450, -379, -1670, -1642, 218, 1283, 459, 838, 1451, 924, -1264, -1446, -601, -670, -616, -59, 1527, 1543, 397]
3135C97j29mr77j278Q10J666j00k0O46R58j584j499L75J73p40M0J450J082n35
3154G31p9O31q89j863k08Q74M42j12P74J439p8j161n91oq02p75K13K008N35o68
3174D15P75K07j055j611K14P44p41K49J639Q88q64n68M39n85j407m83J045R66
3192B67k98O05J402n39j425n40J16p66m64P97J605M22o11K35M18j441r99k55R65
3211e06k06k6J694R77r32j041J4m3j578m7J173J002k85L99R12l27j453m47R8k45
3231h67n18J007J505K73p66J13J90r90j815P45Q23K54j8Q14J371j464p92j1j66
3250c12j039L5J176J193k93k12Q69k47j855p27O08O2k1L76J521N68j249k5R4j032
3270e10j304M82J160L05o9P99J076j268j134k57L19n07m58J163J128n0l11N79
$$ y = [397, 268, 264, -713, -1991, -1181, 485, 385, 365, 1011, 1969, 385, -1114, -739, -566, -1306, -1266, 184, 1266, 731, 652, 1283, 394, -1469, -1677, -803, -361, -473, 301, 1740, 1662, 501, -90, -96, -898, -1673, -1460, 548, 1083, 415, 1190, 1397, 342, -1269, -1055, -311, -1052, -803, 836, 1724, 860, 292, 731, 146, -1261, -1744, -699, 267, -31, 574, 1976, 1437, 12, -528, -412, -1178, -1642, -845, 760, 1182, 571, 806, 1224, -217, -1216, -1471, -506, -712, -738, 956, 1933, 1001, -40, -26, -69, -1647, -1694, -521, 481, 196, 595, 1507, 1180, -273, -720, -622, -867, -1385, -378, 1127, 1400, 634, 747, 937, -53, -1868, -1123, -300, -46, -64, 750, 2121, 657, -135, -146, -312, -1351, -1316, -140, 1053, 760, 548, 1417, 1170, -685, -1412, -804, -742, -763, -387, 1134, 1702, 453, 428, 522, -510, -1814, -1332, -172, 133, 64, 863, 1939, 671, -463, -720, -401, -908, -1366, -203, 925, 875, 564, 1143]
3288A143n2j973q09J074K55k46N68J180M56j171p76Q73j122j253Q05J074M59q3
3306D02P68L12r02j366J38n7k97j48J348J438m77p39L98l60j574o26O52Q88j13
3325c15O00J175K25j274p08J92n67r41L39J533P68o29O18K19j056j391M3O15n2
3344f06RJ006J126q1j543M15N6j448q23J212J110l46L05J095K52j898p40K65j16
3363g50o68M66J646P95j114Q0Q02r01j479m33J163j94J04P91J409m66j053n94
3381c96M40j197o04J126J270j56n2R15J56j581j148O01J40m31M78J532M21p58
3399G56l74M63j230j158J48O89Q07k97Q03J031m86j397p3O9p35o37J358J086p9
3418G44m0M76k14j463p80K58M08k51M70J437M96q49m74L72m44j726L50R59P16
$$ y = [1143, 1091, -882, -1691, -617, -362, -608, -40, 1140, 1596, 425, -351, 522, -600, -1853, -1048, 26, 485, 402, 1170, 1482, 580, -786, -648, -705, -1002, -1150, 198, 1636, 1159, 420, 818, 458, -1116, -1742, -1090, -202, -315, 285, 1460, 1685, 411, -297, -105, -672, -1613, -1274, 259, 1027, 398, 1016, 1235, 179, -1212, -1169, -554, -606, -597, 409, 1535, 1454, -89, 326, 382, -1066, -1889, -677, 433, 87, 392, 1487, 1739, -159, -899, -634, -750, -1418, -952, 694, 1489, 375, 455, 1257, 356, -1123, -1556, -393, -587, -483, 308, 1717, 1251, 198, -396, 44, -1153, -1757, -631, 639, 483, 431, 1346, 1502, -79, -1227, -626, -486, -917, -439, 1093, 1514, 756, 382, 845, -385, -1543, -1395, -706, 101, -196, 607, 1638, 1152, -245, -318, -249, -984, -1621, -263, 823, 744, 704, 1180, 966, -497, -1277, -1019, -611, -862, -392, 1045, 1541, 692, 218, 590, 146, -1580, -1230, -271, 445]
3437D45n66J054R10n64j790m97O19o46m85J432J635q14m96O65m4j439r32M44P32
3456c37j9J81J412M16j039p08Mj97j104j69J588O77j17J61P36p85j411n71Q42
3475d40l32m33J207J440k21j014K37J23j303r80N68J369k72P4J418K82j025j304
3493f06J77Jj096L29J441P39m31l9N78o17j632l12J025J21p06J002J815l30j323
3512A36j45M75j156j085J017R54O8jR74K90r28j653M60K06p84K25J415Q43n28
3531G83m99O23j48j961n74J031O60m46O73J619j40j551m84O56j060q34Q27J491
3549F66l7l18R18L83j336j491M21O22p61K08J310R12o02n09j5J65j828o07J259
3568f40P63k33M21R87J51j729m12M82m37q59P52J695K40p65L28M49j003j603L04
$$ y = [445, -121, 933, 1843, 1279, -511, -1008, -389, -1035, -1520, -88, 1547, 733, 237, 902, 858, -581, -1513, -1069, -337, -356, -175, 1237, 1653, 614, -94, -90, -287, -1391, -1560, 28, 705, 588, 749, 1485, 700, -711, -1282, -440, -772, -1205, 2, 1442, 1221, 207, 444, 567, -736, -1716, -1148, 221, -51, 23, 1441, 1723, 698, -606, -429, -428, -1524, -1195, 246, 985, 554, 515, 1093, 476, -1156, -1468, -443, -322, -1028, -26, 1789, 1459, 136, -9, 466, -690, -1775, -758, 196, 264, 263, 1237, 1527, 599, -1054, -594, -388, -1172, -947, 468, 1311, 783, 284, 907, 759, -1202, -1776, -745, -85, -531, 142, 1761, 1621, 70, -414, 242, -818, -1652, -825, 666, 629, 311, 1229, 1612, 276, -1215, -794, -172, -933, -725, 585, 1497, 895, 386, 371, 536, -1292, -1899, -640, 123, -110, 311, 1298, 1449, -280, -692, -210, -647, -1506, -754, 941, 1181, 416, 744, 1193, 190, -1413, -1109]
3587a109O65j31l10J549J040q09j004R5J24j203q32J792Q98l40q5J216p7j749
3605b70m65K03J31j013R52J534L56j168L08L21q80j405J31R90J79j63R28J147
3623A816r76j445K17K11o72q15J387J271l28k69O57o3j575r31R91mn50Q50J405
3642A177J7r97K08J38o26j540J97J281K99n7N33R86o56j460j63L18m58o78J231
3661b50J574k28q15M77k2j408r69Q25P07m04K8J602L45j102n48J90m83j132R4
3680a519J670N11j63J17O58l79j803r7O35k38m83R53J710m19r47L98J12j534p93
3699a611Q62O26P2rJ498J63j133j180L10Mj218M75J474P94o87r5O33k04j854J35
3719i45M97q6j13R70J208n73q69J92J93j609n67J125J293o39O9R66M61j222j440
$$ y = [-1109, -444, -575, -885, 664, 1704, 895, -109, -14, 110, -1093, -1925, -133, 765, 425, 340, 1556, 1479, -270, -735, -532, -401, -1414, -462, 1072, 1428, 260, 568, 889, 9, -1396, -1265, -275, -96, -259, 669, 1816, 840, -605, -388, -177, -849, -1664, -277, 994, 666, 397, 1054, 991, -584, -1515, -524, -528, -1078, -228, 1177, 1194, 197, 405, 543, -83, -1623, -1426, -145, 154, 97, 630, 1616, 960, -500, -663, -345, -803, -1481, -250, 1324, 1096, 281, 758, 736, -672, -1641, -816, -109, -513, -485, 1117, 1462, 360, -188, 2, -481, -1613, -1519, 151, 662, 499, 616, 1274, 895, -908, -1005, -370, -608, -1091, -138, 1572, 1153, 206, 604, 716, -818, -1611, -749, -123, -51, -60, 1438, 1601, 468, -712, -402, -398, -1616, -1141, 333, 1127, 440, 345, 978, 774, -1080, -945, -448, -534, -647, 323, 1531, 958, 89, 281, 474, -1135, -1702, -577, 716, 77, 146, 1112, 1573, 351, -1089]
3738a089L39L87p42J09J596R94r67l54N28p35j245m8P60J40R7N05J218m69j040
3757a6l85L73r46o40Q01J468mj97N18L77j225j413M01M93l44J13J552P07j076
3776E57l84M70p11j180k4P85J028o85P14Q75k66j269n89O83j119k52Q89J423J64
3795A109q18M34L26j323r01L52O50k88j17J437O74p57j148N47j84j358k50J206
3813d09P28N9O5P54l82j167m51K03J34p64R00J509j2p19r0J41q08j314N68J053
3833bj57P1P93R17q42j277L02o2q53j75J059J123k35K25K27k07j575m67N97J7
3853e21k40M01J288K31p17o92O00p23j047J92J132N48k63M80P83j022j185J87
3871e68R4q12j89J670R34l17l68N51m63j162n10L08P44k00L60J041L79j176n40
$$ y = [-1089, -750, -363, -1105, -996, 600, 1594, 627, 273, 801, 66, -1179, -1227, -467, -327, -230, 275, 1493, 1024, -16, -401, -28, -974, -1614, -813, 655, 651, 454, 972, 1349, 124, -1289, -888, -395, -739, -626, 926, 1633, 557, 173, 643, -68, -1248, -1272, -487, 541, -144, 570, 1445, 1179, -90, -679, 4, -1115, -1367, -478, 945, 1109, 291, 725, 1051, -272, -1173, -821, -171, -459, -576, 861, 1535, 778, -370, 177, -7, -1365, -1615, -409, 319, 378, 443, 1197, 815, -352, -803, -600, -466, -1230, -330, 1179, 1167, 448, 358, 499, -309, -1623, -1055, -2, -159, -88, 705, 1622, 780, -497, -195, -257, -1110, -1285, -226, 897, 662, 887, 1114, 907, -668, -1135, -538, -521, -761, -360, 928, 1159, 442, -250, 350, -373, -1420, -1228, -96, 452, 189, 669, 1452, 430, -755, -568, -474, -1286, -1475, 195, 1129, 812, 444, 995, 532, -630, -1140, -832, -88, -288, 72, 1113, 1492, 316, -224]
3890b24L42n03r68K99J369J29k27N93N17q00j342O8M12o37J09J363P88l46n98
3909C44K29l36j224l65R63L76j19O8Q16M41j112n37L88m74m92J37R91P75l60J10
3929F19N59r64j315O6N52j2n1J023Q52o54n45r8J18j010k45O75O97J39j13Q67
3949A160J46j294o17J23l3n03K69J199Q12n43m82K55m91j115j45J128j5R1N74
3968E19Q83m07j021K03l53q23j54Q44P92K1o2M79N6r75j150J79O66m09J64J162
3988F14R42j117l69N94o89j348J89J106J05p7N51Q54p51p81j98R6o52j27R26O26
4008D94N89o04N75j02r91j077J91P34m48M42J050O66p87j085M22m00j015L72R45
4027b9N50m00O92K57o56r48j03K73m42n07J288J051j69n43K08L00j266r99N36
$$ y = [-224, 118, -385, -1353, -1054, 315, 444, 217, 810, 1327, 527, -815, -747, -335, -972, -863, 500, 1288, 942, 344, 573, 237, -987, -1352, -389, -13, -132, -64, 752, 1193, 81, -456, -68, -542, -1034, -897, 94, 869, 509, 619, 1178, 214, -1101, -1035, -483, -495, -546, 477, 1329, 675, 130, 32, 150, -860, -1105, -430, 267, 406, 293, 1160, 1306, 12, -605, -482, -515, -1018, -749, 450, 1262, 719, 237, 492, 1, -1114, -1259, -131, -146, -55, 519, 1402, 995, -26, 177, -176, -999, -1153, -309, 483, 504, 442, 921, 977, 2, -1148, -969, -303, -712, -548, 614, 1556, 439, 70, 664, -25, -1373, -1184, -78, 27, -50, 501, 1355, 604, -177, -375, -279, -931, -1058, -132, 494, 1083, 479, 1054, 952, -39, -1116, -925, -191, -639, -197, 853, 1519, 732, -353, 69, -331, -1346, -974, -29, 521, 121, 813, 1070, 414, -534, -637, -364, -806, -1313, -25, 1026, 857, 314, 522, 822, -444, -1443, -907]
4046i07P36O4L33N40O07q77o14J7l53o82J81J129N21l56L58K02k34r93l14K10
4066d32k95k3R40R02j35o87L7J33j050n74M53O79J70Q1N11N41r38p89j00L2m03
4087i47R6J220N01n33L03L52q56p47m49O20jQ6N84R95l80m69k34K6m78r74O88
4108e97J143l11k2R31P8r70j107L67J50n12L66Q85P95q59M8K57l55j109j65M96
4128d91M87l43P52Q89n63p52m52K71k77o00M74R78L74n41M26K33q75p28k01P36
4148b03n65O9J352N48q58m01M05l11j268J62O50O11j32K97N95j17j184l46M75
4167b21j79m12L49J105Jl78J46J97o65r59J74M27J09p0O08Q21m63o59K28m74p26
4188a041K1Q62O41k32Q5N35k10p37q31P58l49j09K79J199K06n24j89K65n75j139
$$ y = [-907, -171, -107, 226, 766, 1373, 496, -118, -101, -454, -1136, -955, 174, 695, 339, 697, 899, 665, -328, -642, -432, -727, -750, 190, 1092, 957, 270, 307, 440, -610, -1184, -731, -52, 118, 199, 710, 1251, 313, -476, -576, -544, -947, -851, 369, 870, 337, 640, 992, 136, -611, -1060, -440, -441, -355, 229, 1224, 844, 375, 141, 167, -311, -1285, -597, 546, 235, 213, 1144, 1222, 252, -855, -488, -338, -850, -484, 401, 1196, 337, 385, 642, 287, -822, -987, -491, -4, -347, 405, 1294, 731, -21, -473, -202, -479, -1079, -605, 373, 747, 206, 632, 865, -10, -738, -939, -203, -768, -699, 653, 1201, 343, -58, 347, 36, -1232, -1070, -420, 191, 59, 356, 951, 834, -350, -696, -221, -400, -812, -463, 642, 643, 265, 411, 608, -57, -1016, -842, -415, -306, -376, 232, 1053, 590, -69, 159, -315, -1041, -1020, -158, 483, 251, 336, 871, 661, -76, -907, -149, -498, -607, -328, 871, 1077, 553, 364, 629, 54, -1085]
4208a085L17P64o8Q4O00N17n43q33j52L48p53j48P88Q37j0m50M25K08j286n43
4228i83N75L1k70M02J226k22j61l23J66q30p31NJ058L28j02N36L27n47r42J38
4248c19o2n03O0O74R05M7n30K24P6q04o34J79N27k92N13R65J4o97p91M91n28m72
4270i57J84J082J66p1L80K55n12r24k47K63j41k04Q47P63J6o34M9J54o82q22K25
4291h10R74j41K8Q37J60j028m69J43N6p80K65J360j60N8p1K93m12j080l3P07k69
4312c72p6N38R68j90q49m8J95p08o92R01P73k86R4M31M92j001r56L44K26n20k
4333g38J051O17m55k70Q0k00r07k12Q49L38n60R12L96J4o98l39R3n84m91Q70P28
4354D94P4m74K57N92j019p73L51M58p13J94R08P84o92n50M33l77p02k69P53M98
$$ y = [-1085, -768, -4, -72, 12, 612, 1129, 586, -247, -399, -51, -804, -952, -164, 673, 663, 213, 638, 846, -440, -983, -408, -377, -647, -245, 981, 759, 598, 275, 441, -389, -1120, -1115, -57, 271, 169, 705, 1032, 485, -457, -319, -381, -884, -824, -150, 755, 802, 272, 496, 572, -232, -866, -687, -160, -452, 61, 1026, 1040, 343, -448, 43, -485, -957, -773, 309, 475, 404, 784, 1039, 527, -397, -644, -381, -522, -726, 121, 884, 900, 266, 315, 469, -213, -1035, -810, 164, 23, 51, 888, 1048, 20, -449, -306, -250, -1030, -765, 595, 435, 493, 422, 715, 303, -777, -810, -103, -372, -448, 90, 1058, 868, 19, -29, 166, -542, -1234, -333, 440, 154, 248, 679, 1171, 170, -786, -442, -216, -736, -738, 313, 930, 475, 205, 285, 85, -822, -1034, -185, 153, -407, 505, 901, 915, 217, -122, -29, -613, -1104, -234, 494, 568, 94, 351, 943, -76, -849, -498, -40, -753, -559, 349, 1133, 441, -109, 324, -53, -755, -1024, -271, 227]
4374B27k71L32N92K68j400j13K9j02m45K40J197K36n11K41J17q70q09O16O1K76
4394h9j46N94O90m06r99L65l30l18j37P91O77p01M65N05j33r94n47L38K5m36N09
4415b77J097J9q50J08K37m73p58L58L45L06j22R24M0p27k75k74J81n92K6O57P06
4436F56l58j49L29n9r47l69M20K53k27M07P62J93q10N1N2m50o81M16O50J26j94
4457G1N61N04o41p61k67M72m98j42J007L31Ll88K67j89r95j97M90L74P0j2O74
4478G34J45r33j19K34k57n61j6R15N82o11L83k1j57q50j43L48r6r7O68P70j73
4499G45n50j25J6n99m65P39K62k1j03P70J86r35l01K76m74m37O60M92O44l59j22
4520B99K26j97r90l23Q70O3l78Q34P40r88k74K39Jn21l06M13O79p9m30P75P0q52
$$ y = [227, -44, 288, 880, 1148, -252, -365, -336, -438, -883, -643, 554, 790, 279, 520, 637, -233, -1042, -426, -365, -89, -235, 359, 1049, 643, -356, 9, -321, -639, -776, 15, 692, -9, 456, 961, 828, -166, -713, -375, -350, -786, -277, 820, 839, -11, 97, 334, -139, -897, -539, -194, 112, -10, 914, 954, 227, -48, -322, -141, -733, -707, -50, 656, 298, 149, 478, 419, -528, -897, -477, -224, -451, -44, 718, 911, 101, 152, 204, -246, -927, -511, 139, 265, 71, 632, 1136, 495, -266, -533, -61, -559, -701, 306, 637, 640, 252, 519, 330, -665, -862, -372, 2, 72, 60, 734, 879, -54, -173, 61, -196, -757, -773, 142, 724, 113, 496, 475, 318, -532, -675, -327, -423, -520, 148, 918, 745, 195, 70, 86, -513, -978, -239, 23, 2, -101, 669, 855, -80, -381, -105, -579, -1016, -356, 136, 780, 421, 299, 525, 328, -662, -985, -115, -52, -430, 404, 1144, 156, -118, 121, 122, -399, -705, -292, 387, 308, -122, 653, 723, -129]
4542a29o05L92j03k05L50P60L77m53k46L37m42m14m11N12J27K6M03O98j41p74
4562E9j81k9l29k63N78N51Q4j93M07m0p02o83L39K85l53L58O25K29l93l08q9l5
4584h3q68J01M72O16j11N40k78L18q68l12M64k94m32M46R57J6l99L0J46p24o38
4605i01M79L81j09j43O64N74l09p86p8K74p42J41M12M71k55L74J48j86o17k26
4625d34K81j85l26M76R39l71J33k66o6j16p21J32N98l24P2M70N78n31n31q0J14
4646a58m25L5N98N18l29k01N69m03o86n5K72J25q8M16M71O4m28q2j72k89l82J29
4668e01M63K95p8J63M37p44o21K68M8m82M39M28M20j28q2J69l65n90l42N53K08
4689d2j63N77K92lp01o3K01n29l74N77K78L31O1k4L06n30m60k22M03l18j96R13
$$ y = [-129, -734, -342, -445, -650, -300, 460, 837, 384, 138, 475, 33, -381, -792, -280, -153, -127, 276, 974, 833, 59, -122, -151, -480, -743, -165, 386, 470, 277, 684, 644, -58, -741, -402, -117, -470, -112, 513, 742, 349, 41, -48, -83, -951, -850, -378, 238, 127, 667, 389, 707, -161, -473, -9, -303, -735, -289, 668, 684, 285, 315, 461, -263, -901, -422, -41, -150, -293, 371, 945, 636, -150, -228, 46, -696, -555, -143, 328, 73, 447, 595, 409, -208, -434, -153, -338, -664, -188, 751, 380, 513, 247, 181, 65, -656, -524, 74, -250, -178, 292, 870, 339, -192, -272, -158, -583, -548, 50, 568, 239, 38, 607, 204, -482, -537, -265, -140, -228, 188, 659, 723, 295, 213, 41, -248, -630, -501, -38, 257, 179, 342, 779, 35, -586, -318, -270, -752, -313, 115, 535, 407, 325, 494, 129, -461, -803, -250, -42, -205, 372, 664, 661, -40, -103, 98, -431, -805, -228, 50, 381, 442, 418, 724, 194, -266, -488, -85, -403, -599, 314]
4711C14N32l47m32J71L2n39k53L70N3K85j88O89L68j243j60L08m01j20K94N20
4731B53K91m92K37M12p96l99m1O27j91l07Q86K91k77n08j28K98r18P4J82P88l8
4752B44%N15o4p83l34Q8j43K2P8R04K04l77j58N4m64m96J61O22j74N9K67O60l77
4775E08p70M9J44m89O5N72J87n6J6R9J64o54k03K55om29M48L68L53o36J06N6j81
4798c4o63q2M63M03j5K32O12n55n50J8P5l66j55O34O26j70j66J20j74m22l24K15
4820b78No4L10M40J00l71l00k2K04o58P3N79M5K71j67J75o5q80L87J59l59K10
4842b06K42L87J16n16K71j24o15j38M20J73j91j8O79J79n90q1l9n9o12R9N98L55
4864C30O3j95L89m58m21m06O33k41J51K30L20Q0l16j80M20q28k66N46L51j18p1
$$ y = [314, 846, 499, 67, 238, 270, -269, -522, -152, -99, 186, -2, 687, 1055, -188, -348, -40, -441, -561, -267, 253, 544, 52, 289, 701, -95, -494, -535, 92, -99, -406, 480, 771, 494, -14, -142, 156, -762, -688, -506, 282, 244, 244, 759, 695, -88, -422, -334, -477, -455, -377, 527, 731, 354, 196, 250, -214, -710, -549, 73, -101, -42, 225, 885, 508, -262, -213, -69, -558, -493, 79, 266, 210, 226, 325, 489, -165, -368, -113, -119, -548, -100, 268, 621, -15, 91, 147, -34, -697, -779, -316, 87, 72, 304, 916, 361, -189, -171, -96, -462, -617, 17, 643, 473, 307, 427, 253, -169, -493, -278, -273, -337, -27, 413, 513, 142, -158, -180, 24, -634, -561, 18, 63, 334, 167, 342, 277, -603, -216, -57, -416, -206, 36, 423, 539, 23, 294, 170, -445, -583, -163, 10, -181, -199, 480, 659, 69, -12, -51, -110, -722, -623, -25, 330, 393, 198, 587, 129, -292, -698, -65, -306, -155, 75, 395, 475, 159, -21, 399, -429, -695, -149, 202, 84, 13]
4885A3K57M45n70m12N9L60p08J36Q50K41l02j12Q2m16n49O2N82l22K39J69N41
4906F45r9o49P2K08m51k59J73N22Q6o4K26L06p03o19N62j05j80l4N36M59m10l5
4928A87K83l45m69j69K96L34j64J54N33k53k39m52L6j59n1M03L67o5l9J14K95
4949E97q54k77J46L89l24R3M64M25n70mQ9l39n86J8Q54Q8r1N2M70o4n94m62L35
4972a45k32j83M73N85j52p3q3J30m23p48N28K67Q7k02N16K86j90o40J44Rk43l93
4994f82O35L92l42K70L74l22m51k11J44N6l27M72K39P0l0j32J18l6j027L09M50
5015c1J79o09Q26o5J22o61J23L12n73j18P64K32r4p9j23K25l68m98K40J1o9K78
5037B4M37j77l90O5L13n53j91L67J86L67o29N34J09m14m17L63m2l08j15O05L54
$$ y = [13, 270, 715, 145, -267, -208, 152, -556, -420, 430, 671, 369, 257, 339, -77, -626, -564, 18, -304, -65, 104, 645, 546, -103, -31, 177, -274, -533, -360, 162, 248, 184, 410, 716, 13, -606, -44, -149, -329, -363, 173, 632, 222, 187, 470, 125, -344, -513, -217, 117, -47, 107, 640, 387, 148, -304, -268, -427, -478, -75, 292, 227, 188, 302, 597, -257, -534, -388, 1, -323, -230, 234, 659, 89, 85, 174, -165, -751, -733, 121, 209, 118, 170, 640, 576, -18, -480, -145, -377, -560, -87, 498, 346, 273, 190, 320, -103, -851, -323, -56, 31, -171, 345, 631, 441, -199, -55, -46, -289, -682, -47, 345, 3, 273, 647, 325, -126, -337, -193, -137, -464, 8, 247, 317, 287, 155, 273, 237, -790, -481, -31, 148, -461, 365, 300, 422, -239, -116, 196, -377, -495, 269, 501, 407, 328, 205, 430, 62, -436, -196, -185, -254, 24, 461, 284, -106, -41, 272, -281, -472, -105, 81, 448, -181, 353, 462, 48, -369, -6, -48, -356, -471, 134, 488]
5058D88k72j72K72J5q66N1L06Q5k4J75L78J31m57m32J33P9m71M05L48K05k66J66
5080B77K65m01p88L11K37k36Q3M26L80l07P3k53n2l21l59L34L52j07J39K20K53
5101E26m63j94n5J76k63j67P30K15m60L51j05j94o03J28M30j14n2M6M01K0o16
5122b63J43J01k96l65M01L51j10n3N67j21n69l47M79o0j10j66O21K58n77M04K51
5143E39n75p19J77P46k01k18L19M94n87j55N7MJ6l59K85L85K0q8K36j99j11n63
5165d97M61L9n70L20O43K68m36j88J42l80r2l42P71Jl08J90k8N55m40m50L55k31
5187b17m49N94J08L74p4oQ4n25l60J33K60L0K2K19K52m43J05l76J95m4l52O61
5209A91n7j2l4L65r2q06J59P2J00m63O93O6N7r5j70K43k19m74r0O03K13j37K79
$$ y = [488, 216, 44, 316, 331, -535, -484, -178, -93, -117, 58, 436, 567, 110, -322, -189, -110, -581, -176, 172, 377, 111, 277, 542, 141, -647, -336, -99, -335, -252, 174, 554, 247, 320, 67, 15, -306, -665, -331, 21, -86, 53, 273, 526, 63, -131, -186, -10, -273, -440, 290, 505, 45, 396, 291, 97, -506, -378, 52, -62, -114, -68, 333, 353, -263, -120, -19, -315, -680, -279, 72, -38, -91, 476, 355, -214, -561, -82, -142, -252, -418, 203, 461, -116, 288, 539, -36, -755, -578, 168, -33, -251, 68, 562, -25, -180, -123, -119, -103, -462, -177, 208, 228, 140, 376, 177, 66, -497, -36, 3, -567, -247, 396, 664, 228, 40, 182, -198, -290, -632, 139, 140, -168, 22, -6, 549, 109, -341, 14, -217, -666, -72, 36, 410, 336, 330, 414, -111, -471, -338, -78, -48, -26, 193, 445, 2, 107, -269, -74, -118, -470, 191, 134, 122, 88, 453, 361, -445, -286, -214, -114, -577, 116, 182, 239, 144, -26, 217, -2, -476, -566, 37, 250, 113, 392]
5232C92K38k31n94j0K65n96K21L95K02j50q2K45j29k65m61N92j07Qo2N68J86l24
5254C01k25O9l38m75K98M86K0j17M65n9m60m02K78o9ML2L11J11j30K31l16q1l02
5277c68j57M31M8r3K03L65J9m43j24L13k70n43J50M49L78k27K4J29k38n00L42
5298a12J63m84J98L79K45j87K8K2j36p99K44L07K85k46J37L56k07k25k36L79r
5319A02l41j23L13N41j41l97L34k78n87M71P3k39K97r3M28j51k14J25k2m11l11
5340f24N40O0Ok3M04l2o14r7m1K7J47K15K40L96n86J06J24l62l58K20L81k44l6
5363a51J31M53m52k61L28R1j80m38K67M93j27J3R4R2m98n8N8K11m44N23N1K94
5385D90m43J8J65m03k16r1O70l73K39j23L60J46o07j0n1j00j27K75P63k16j48
$$ y = [392, 630, 399, -195, -205, 60, -536, -315, 80, 282, 132, 50, 295, 166, -99, -560, 32, -75, -67, -129, 439, 625, 301, 76, 145, -193, -668, -370, 116, 136, 19, 484, 425, -35, -437, -159, -228, -224, -192, 119, 230, 100, 331, 15, -66, -368, -525, -94, -46, -139, 64, 429, 448, 5, -119, 194, -76, -619, -469, -20, 358, 131, 155, 284, 46, -454, -112, 51, -433, -235, 144, 389, 202, 230, 252, 116, -683, -439, -132, 153, -93, 44, 400, 193, -32, -268, 111, 102, -239, -362, -49, 492, 351, -46, 288, 10, -577, -106, -33, -272, 25, -68, 360, 209, -5, 120, 98, -313, -624, -84, -24, -18, -41, 363, 331, -283, -380, -421, -394, -247, -32, 208, 604, 18, 124, 248, -114, -472, -252, 129, -115, -151, -20, 433, -19, -280, 48, 139, -41, -479, -212, 281, 154, 167, 261, 353, -145, -203, -145, 66, -378, 145, 196, 490, 47, 65, 230, -173, -389, -480, 190, -183, 56, -67, 293, 439, -168, -178, -229, -329, -456, -181, 582, 366, 218]
5406B18J29k47k33k03M2K35l24L71M00k8k91P7n1k15j40R3K84NJ9J21O1j59l82
5429b18j95M66k35nL69L34j11l90J99l3m51N0m6L27j41k43N85K39n96j32J34j9
5451a12j37O8K89K29m7K02j96r6l94Q4K46k77j4K72J96j20k08K06J0k19l77L10
5473h5K21m5J17J77j21j43k43J4J58k88j63N15J98j52k96M58j2l25k79J7L56r9
5495b0J87L34j69k31k69L67l05l20J18M81P5l1j07J89J4m68LK6j09K31L48p9r4
5518A71l49L99j15n13Q5L11j10O7K35J03j22l91L10l7k15N5l3L36k57l8J77Q0
5540A49j03l45q1N17l06o6J27M68l7p3o1k18j8m01M69J23j54J06J97J4j89k11
5562i3M5M3l89r6O40K1M6k71K22l32p3l6K45R7n5O5M73l10o11J15L02j73k09M07
$$ y = [218, 347, 100, -133, -336, -294, -59, -383, -12, 388, 360, 69, 146, 95, -120, -260, -167, 117, 122, 141, 262, 323, 164, -218, -413, 53, -182, -187, 182, 516, 405, 15, 214, 181, -270, -220, -266, 61, -80, -323, 262, 501, -95, -227, -93, -112, -249, -181, 108, 337, 290, 492, 296, 200, -194, -110, 136, -141, -155, 117, 313, 193, -15, 191, 201, -18, -395, -85, 136, 91, 208, 385, 264, 121, -122, -108, 50, -238, -401, 114, 312, 160, -136, 322, 310, -15, -294, -277, 79, -20, 167, 501, 332, 101, -168, 199, -106, -426, -308, 173, 248, 217, 110, 299, 313, -155, -152, -126, -235, -4, 344, 265, 171, -178, 221, 106, -407, -322, -11, -121, -54, 181, 284, 162, -229, 81, 44, -171, -116, -149, 187, -70, -108, 69, 149, 46, -299, -380, 137, -169, -235, -108, 360, 323, 250, 189, -29, -47, -448, 21, 144, -10, 96, 293, 307, 118, -93, -48, -5, -394, -490, 150, 171, 217, -54, 168, -164, -237, -273, -28, 69, 14, 79, 552, 242, -369, -254, 48, -125, -334, 73]
5586G3K36j96q8L90j71l23k77M85k14k56M00K42J50m09j56K45k87j36J97J86m08
5607c17R3K62M58m12m24K66N6j61N4L87oM0r3j0J54n34k5J00J23P7k2N8L45l38
5631A31j51M0j87j75J90j09K55Rl7N33o08Lj36j65K86k49M29J05j6j92K28k82
5653i8K20n30K23K20o2j32M66L06p17k09K71J6p9k37M11L05l76J15L21j44n35
5674b45L1R5j25NL54m6R7j35p8J90m94j4J64L28p5K51l16L34l67K50j69O7k46
5697a44R2J53K31m26JK21k0l40N6K72l12L21k09N45m43m8J12Q5l50O6j43L91N1
5720A62j6N0Q9j35l42K19j40n0Q3J40K53j98l38K75j55l52M92j75J81j69L48N4
5742B76l23m1k37K22k6J85j06L27O6j43J10Nk35m64J65r0R2o6L19K43o4m2k8j88
$$ y = [73, 309, 113, 25, 415, 244, -79, -356, 129, -85, -341, 59, 301, 451, 42, -114, 131, -156, -292, -95, 91, -317, -224, 38, 496, 84, -340, -74, -18, -179, -125, 262, 256, 296, 203, 193, 347, -187, -212, -112, 11, 88, 66, 124, 469, 131, -20, 20, -167, -342, -152, -261, -6, 3, -34, 499, -109, -106, -242, -407, -121, -370, 59, 164, 148, -44, 184, -98, 122, -408, -185, 35, -27, -159, 307, 613, -104, -313, -42, -26, -105, -342, 69, 374, -2, 113, 434, 290, -245, -214, -119, -244, -239, 115, 69, 166, 31, -47, 143, -351, -365, -201, 127, 52, 303, -13, 321, -46, 204, 35, 102, -144, -52, 101, 332, -94, -93, 128, 108, -232, -176, 96, -216, 105, -104, 441, -2, -50, 62, 147, -203, -137, -280, 111, 162, 146, 196, 285, 150, -192, 27, -113, -163, -80, 60, 313, 115, -223, 52, -103, -455, 37, -138, 43, -126, 222, 276, -47, -88, -325, -103, -129, 56, -50, 277, 343, 200, 310, 315, 80, -384, -219, -309, -217, -283, 36, 279, 215, 173, 145, -43]
5766d3k31J47J66K96j89l37L82ol21K58l40P5K13q5J72j22J7NK55k95n4l37N03
5789A29r1j98M41j75P6l08Q0J97m90P1K34K01r4l0J27M8k17j96J3R0J08K1J43
5812A80k2k64Q9j46K78m61J46J48o1K49QL67l56l74K28P9l23q7J57K72J46j3j35
5835A05m1k68k49O09k34j48m9M51Kl25j3K07l10M0m4M67j04M9rK2j8m42M27l04
5859a79q3j31M04L37j95J22j52R2n08Q4k1K07p6L29Q3k3k97r8J41l60j58K86M28
5882B32k28r0N6K63j77m39K94J73k01q4J10L52n2l75M77k93l46R7L33k20j10K46
5904A8L68k05r6j79l8N5j57k08N67m9j28J27L66j85n25L8K69j53j68K72K8J03
5926A20j50O8r0n0l13M12J58n5nK31j50j30k59J01J37m04L29J50J70o9l72L60
$$ y = [-43, -274, -127, 39, 335, 146, -191, 191, 185, -136, 122, -218, -143, 70, -15, 157, 35, 52, 57, 312, 17, -37, -374, 129, 38, -160, 281, 106, 182, -126, -46, 151, -339, -268, -34, 167, 73, 43, 170, 218, 1, -195, -182, -92, 16, 37, 180, 158, -106, -17, -163, 115, -346, -200, -52, -113, 136, 144, 511, 155, -219, 9, 88, -235, -322, -165, 107, 253, 240, 105, 64, -204, -453, 156, -78, -226, -275, 176, 178, -147, -160, 47, -263, -223, -267, 200, 96, 145, 136, 158, 140, -302, 125, -179, -262, -393, 11, 348, 153, 275, 123, 215, -293, -209, -230, -23, -99, 230, 313, 290, -7, -105, 36, -324, -482, -196, 232, 4, -86, -30, 233, 56, -383, -89, 84, -117, -201, -91, 261, 209, -166, 311, 18, -328, -231, 102, -118, -228, 18, 386, 181, 85, -94, -132, -77, -234, -442, 125, 76, -52, 75, 441, 256, -269, -231, 38, -115, -283, -11, 17, 120, -30, 38, -52, -102, -415, -3, 155, 100, 95, 326, 176, 46, -213, -112, 25, -379, -50, 100, 270, 201, -171, 189]
5948A89j35l57R3K86k67J29L49J30j93k81j21NQ0j68L75j83J69K6l4J61k52l6
5970c5k14M6K35k40M92K15m75OL08j80k90O5jK35K3m7Q5k59j50J69o1k09p7K55
5994a04L85j49k34R6J25k86p4K8L00R5l15M12K3j17k56j1K57j82k46J91J5J27
6016H0l8J41j5m33K05P1j40M6J2J72K12j79L3l60J16k12K84K81j55M4r4Q0j88
6039c7j14J34K47k49l61O55l4p1j13P3p8k54LOJ9QJ33M72k99M7l54m4R7k47j07
6064d68L55J07k7nM76l91j50m7L5N3NJ83k10L33j98J75l19J97k85K1p8R8K9J87
6088G6J07j64m0j46K87k69R0R2K56l96K43l1k8l29K01J92l19K37K35m43M96m64
6110a17j7N8j51K2K08j01q9J97N9M25n69J7k32J22j8O2N44k71l2j78mj16K05k31
$$ y = [189, 54, -303, -210, 76, -191, -62, 287, 417, 224, -57, -178, -173, -93, -261, 114, -69, 100, 126, 92, 253, 1, -35, -249, -203, 32, -208, 284, 499, 24, 30, 338, 158, -132, -67, -68, 167, 190, 143, 228, -31, -181, -12, -73, -282, -359, -104, 281, 132, -102, -6, 119, -167, -241, -213, 87, 182, -133, 279, 302, 185, -71, -82, 175, -7, -253, -62, -47, 80, 42, 183, 168, -265, -60, 11, -129, -83, -71, 101, 313, 134, 167, -193, -77, -289, -5, 276, 121, 165, 71, 151, -37, -151, -17, 230, -19, -380, 275, 241, 170, 57, 130, 52, -202, -199, -193, -174, -166, -33, 439, 140, 187, -167, -211, -114, -361, -468, -113, -6, -33, -38, 438, 47, -103, -150, -115, -62, -57, 126, -84, 249, 51, 226, -93, 104, -181, -160, -238, -140, -111, 76, 183, 19, -21, -167, 120, -149, -59, 33, 289, -107, 136, 105, 77, -252, -51, 141, -178, 59, 294, -149, 347, -117, -134, -76, -227, -205, 3, -98, -187, 10, 69, 494, -75, -58, -290, -168, -186, -124, 420, 149, 117, -61, -65, -181, 24, -207]
6134b07K2L12k37J06L48l25l4J5J42l76J06L8P5R3m3j17K78Rk92J32j50j80K89
6157DN2K87j44l5Ll02K26q2j5j21L33k00L21j26m10J87K81n24j12L85%K46j23
6180A31J94j15k13o4J6Qq5q1K74J04k11O9j23K5j63K82k04L83k18r8M76J05o53
6203a61M1J68j82J06k79M27J32j86k95jJ37k22N70k16q9l5J83N3p8k63J02J90
6225A02l28J80L7j11K15J6R9n3l41J54k19Q2j41M28j97L24j83L5n5k49M2j49K72
6248d0O0N3R5K52m24j44K21k35J14jQ5L26j72JR1j77l99o6J98K11K2k17M50l05
6272aJ46j50k9J02m55L70j47O4R3J14J80j75k52k75N00n51L21K54P3l72K03L37
6294C50j43k55j06r5K42k11K21m5L93l53r5J32k08k77K91K86L9j75l0lo3j06n4
$$ y = [-207, -185, 127, -110, -4, 344, 19, -15, 0, 142, -234, -128, -90, -15, 78, 35, -82, 196, 205, -87, 45, -105, -285, 4, 56, 343, 199, 164, 167, -135, 91, 9, -6, -127, 206, 6, 327, 201, -209, -22, 259, -265, -377, 8, 8, 254, 131, 325, 210, -3, -67, -51, -43, -128, -209, 65, 169, -42, 27, -96, -71, -234, 48, -156, 227, 9, -89, 387, 492, -161, -120, 48, -134, -28, -307, 120, 252, 66, -229, -230, -93, -315, 255, 39, -50, -85, 98, 151, 73, -190, -88, 102, -226, -46, -9, -120, 95, 111, 210, 157, -184, -30, -249, -167, -308, 120, -77, 247, 64, 99, 44, -205, -163, -312, -40, 20, 73, 168, 420, -4, -148, 73, -162, -48, -49, 36, 362, 190, 191, 282, 105, -294, -360, -162, 49, 71, -146, 304, -1, 145, -5, -34, 68, -387, -17, -164, -100, -7, 107, 287, 112, -140, -415, 85, -466, -145, 109, 182, -190, 13, 350, 207, -48, -154, -249, -7, -218, 3, -42, 351, -2, -97, 35, -173, -450, -159, 127, 166, -9, -39, -42, -105, -211, -265]
6317b65K15j82K16j83J30P5J33J90l05j44N2J72mj09J6o7J62p7j22J9N4m7l54
6340d25N19j99J05J77j19j80J70k70J64k11L97J03j02M9j70j6J1Nk70L23Ko5K36
6363B34k95K27l75L31m90K29k22L30J88n3M7j32R7j22k60J68j44R5K27J09N0Q3
6385C22l47p7j2k08L16K23k70o3K02J89j27k86r5m2J90j86J82K24l8k59K23J63
6407B24k10j4P4j11K92l98K14L27j13k39Rp6j12m0P7K12J2k6k35L09l00r2j31
6430c47M66n2l69K92L08k34j57n5j34Q4O6O7J29M8k02K60l99K83j68J13j83k1
6452b05K41J53Q8j77j73O0j97K95k56K74l00K83M12j02k75j51j31j5o1N4J14J79
6474A10lj00K57q5j53l28J61M9J66M0J44j12l0J24j71k20k73M30j67K42K06l56
$$ y = [-265, -50, -232, -16, -199, -69, 6, 139, 329, 24, -120, -68, 104, 100, -9, 7, -60, 102, 25, -97, -78, -24, -71, -425, 94, -105, 0, 177, 58, -122, 48, -222, -58, -269, 128, 231, 129, 178, 8, -8, 3, 8, -262, 61, 63, -2, 234, -61, 166, -209, 122, -368, -139, -361, -31, 157, 104, 151, 19, 116, -6, -266, -98, -242, -147, 80, 189, 239, 322, -25, -102, -114, -322, -6, 217, -53, -116, 86, 275, 148, -138, -233, -275, -85, -271, -89, 135, 97, -162, 61, 224, 14, 0, 74, -37, 255, -143, 71, 398, 285, 46, 55, -21, -133, -173, -96, 116, 128, 102, -133, 176, -124, -216, -347, 119, 67, -302, -10, 298, 64, -93, -148, -282, -198, -132, -65, 64, 112, -90, 170, -229, 54, -114, -1, -184, -205, 36, 189, 277, 100, -73, -13, -210, 85, -171, 103, -197, 86, 498, 396, 121, -30, -161, -176, -237, -183, -69, 110, 107, 7, 264, 179, 26, -302, -141, -92, 74, 114, 258, 146, 116, 240, 69, -151, -424, 6, -161, 81, 287, -69]
6496f9Op7q2J34m2r9PN41j2l56k0J73j39Kj82M1K15j88L18On2k45N5J77j50O4
6522B6j75J52J81k6L7M2j63j22M2j32J13J08r1L52j56j83k44K29k01q8L21j6K70
6545B76l05N02k03k86J35n9k07J66j94K20QJ42Oj74N0m38J83o9J66K23K9k26j74
6568b29L39j19j51k65L62q7L06k66K33Oo8K1k46J97j46j89J84J77M6n4k75L12
6590H8p4m19L07J63o5R7K86k05j89l7J20P7j97J59jJ33l17N0J33m31J07K97r6
6613a4o9J95m18K51J96K4l61M33l64j22l5L60Q1j82K30j19k34j72N35k79p0J08
6635b6K99J12j28j82J86j30j70j10j29K16k17K77M60j76l46j63L93j74j62K38
6655F8j34J52n9j36K22j15l34K36R8k09K73j0L74j97Ok34o1K51m43J27K35J9k7
$$ y = [-69, -63, -140, -222, -88, -130, -229, -222, 319, 307, -49, -69, 104, -35, -33, -215, -174, 41, -147, 171, 177, 125, -120, -65, 112, -38, 26, -149, 3, 184, 158, 195, 237, 74, -48, -6, -138, -25, 83, -8, 344, 188, 5, -239, -10, -211, -299, 22, 6, 276, -29, 473, 270, -16, 119, 60, -147, 19, -175, 45, 53, 195, 201, 27, 77, -361, -178, -247, -81, 142, 171, -55, -229, 110, -9, -160, -425, -63, -150, 156, -110, 123, 129, 61, 82, -164, 33, -113, -302, -118, 59, 105, 51, -224, 88, 14, -405, -98, 65, 0, 97, 383, 178, -11, -48, 72, 149, -48, 111, 110, 243, -74, -24, 109, -322, -215, 82, -14, -83, 112, -306, -55, 141, 165, -196, 237, -127, -249, -284, 76, 157, -25, 205, 86, -148, -320, 215, -64, -134, -26, 273, 385, 257, 75, 261, 131, -39, -149, -278, -62, -279, -2, 458, 282, -64, -227, 166, -8, -170, 68, -66, 86, 27, -109, 113, -2, -336, -100, -2, -211, 62, 52, 426, 229, 235, 1, -60, 191, -252, -125, 110, 129, 102]
6678A02P8Rq8j36j96K01l16K15Q6J17j20O2K46j8k84m40L35l11K47L64mj58j1
6701b0N8k12n6K34j06J60J35k9J07o4J19n39J58%k43K34K34j44J8mJ97k14l01
6724b78J54p7J73j62K29K38k63j9L8J16l98j48L64l2J86P8K7j29M4l12j3K05n6
6747c5j0K79j28K6j53K70l75l8o8J34N7J07j06N97l17j99j65P2N5k38K24J22j48
6770c7M8J4J52m75j8K64q1L05K6j40N5l62j3J80L8l07O1L44m3n4K08J26k81j42
6794a32j64K59j4J4J05L43j25j03oM1k72J1n5K53k62O0J97l3k12j7k16M79l09
6817a58J00k3M03j92K0J31k80j21j60L32k63j4M43k22p3R1J76J17n42Kj11K25
6839a19K37J08K20k38j08k99K2N43l25o1K35l9j11l57O19l44j14m8K59l8j38K25
$$ y = [102, 180, 189, 101, -35, -231, -30, -346, -131, -45, 72, -48, 14, 260, 242, -42, -482, -147, -458, -211, 153, 149, -9, -20, 38, -174, -230, 4, -102, 58, 193, 164, 271, 207, 326, -213, -55, -55, -298, -64, 170, 26, 44, 40, 237, 23, -278, -124, -201, -28, -190, 39, 277, 14, -5, 33, 149, -249, -397, -33, -65, 121, 199, 226, 97, 141, -171, -184, 21, -35, -45, 234, 106, 132, -21, 249, -126, -164, -232, -98, -41, 66, -40, 557, 240, 41, -124, -52, 3, -235, -11, 111, -37, 11, 25, 177, -298, -316, -52, -133, 172, 198, 58, 113, -249, -262, -82, -44, -351, -290, 54, 11, -43, 165, 291, 10, -132, -296, -37, -51, -37, 68, 411, 286, 183, 177, 218, -54, -43, -98, 155, -107, -47, 150, 117, -95, -112, -328, 151, -158, -58, -81, 322, 130, 150, 281, 1, -120, -280, 52, -211, -225, 218, -4, -77, 14, 190, 307, -235, -233, -344, -119, 118, 226, 446, 208, 100, -199, -177, 366, 41, -20, 215, 176, 65, -292, 327, -17, -131, -179, 80, 42, -96, 129]
6861A29L9j75j53J33K37o52K01L17q6J45k89K66l30K75l84J14L49k01J70J22j38
6882H9Q6N3j97J58o95L57L6J31p0J86J81l67J30j53j18J7r7L34M53m64k13M7K65
6905A49M8m39L04m6n0k87N64j96j20mL30l28j06j49M15O7o1L5J20l06j86K25N0
6928B9l15J08J35N1M4j64L30j88j0j58O3m1k9N5J24K86j76j42J63o2m78%O00j53
6952G2N5k98N14j45l43OL07k88J10o2L48N5l53l5J05k03k54J04K18j7NK61r5J53
6976B20L6j46j24K00k27j4L45p6k29K24j07%l22K47j88K02J21j20M64m86m8k0
6998d8j15q0k34M73m4J15J88J87m57l24K8L94l26J24L14P6M6n65K18Q4k87k55
7020d88N73l16L4K56N6K39k59k63R5N9m07J17J06J48K46l26L19j50l93M14r2j27
$$ y = [129, 168, -7, -160, -27, 210, -442, -241, 76, -10, 135, -154, 112, -218, 57, -327, -213, 136, -65, 105, 227, 89, 175, 228, 31, 189, -506, -149, -113, 18, -52, 134, 315, -52, 78, -75, -193, -176, -273, 61, 514, 50, -163, -116, 149, 197, -242, 62, 16, -34, -321, 243, 47, -73, -77, 253, -75, -181, -330, 85, 152, 91, 126, 246, -60, -246, -21, 29, -286, -178, -43, 8, 52, -112, 218, 30, 20, -138, -75, -116, -145, -90, 34, 320, 144, 2, 165, 103, -375, -375, 225, 72, 127, -171, 343, 198, -145, -139, 168, -120, -10, -72, 276, 331, -22, -57, 48, -155, -409, -305, -87, -104, -99, 162, 67, 220, 256, 110, -14, 186, -41, -55, 290, 214, -15, 209, 102, 102, -220, 27, -161, 41, 162, 42, 506, 20, -28, -48, -163, -243, -477, -4, -48, 67, 255, 442, -15, -339, -311, 83, -243, -119, 195, 271, 317, -248, -30, 54, -233, -488, 85, -231, -197, 59, 115, 354, 95, -168, -73, -14, -421, -304, -198, -50, 196, -130, 189, 39, -354, 60, -32, -159]
7042a59N5r9N58r5p0l38J49k18J25J72K14m26J84J21j62n2j48K0J31Q8j73J74
7064E1j57L44pk3j31m29L30m5N8k58N69J05M7m04k66K71J4m18L28m7r7K10N39
7087E84o10k84L10M5l08j7J12K56j5K16k36Lk58J31K20k61P3J36J37K63m36n34
7109d73N61j01k7j95K27p9J05o4RO5o6j15P2K03j28j5K43J18k53O5j22k01Q7M7
7133c7J46k8kJ59J44k79J75j89m1k15j0K72M52m18J53j54J66l06j55lj01K55j40
7156a56K86K25m39M9K17j89j37K11O1R6l2j36k5o8j97kP3j13M5O9L81j40J93n3
7180B19k34k90J99J42r9j12M47L0j5l80J1j8J74k09RL36j31q3Q4K22k50l67K49
7203f6j44J63j1K7m0N0O9J8J07n32R9P8K0N2L53k4L18n78j00N1N0k1q1K31K32
$$ y = [-159, -104, -203, 355, 260, 190, -148, 1, -217, -92, 80, 294, -132, 52, 173, 11, -41, -189, -169, -38, 50, -123, 51, -106, 238, 231, 208, 77, -352, -22, -67, -9, -267, 302, 407, 454, 50, -216, 55, 69, -349, -21, -68, -165, 45, 584, -26, -310, 0, 45, -263, -280, -168, 88, 73, 289, 53, 56, -202, -71, 149, -112, -39, 97, 234, 497, 61, -473, 88, -13, -40, -235, -8, -87, 18, -46, -37, 28, -38, -153, -81, 122, -6, -21, 222, 340, 87, 152, 30, -171, -84, -37, 109, 81, 79, 238, 382, 103, 278, 89, 48, -167, -177, 95, 547, 129, 282, 128, 294, -12, -167, -170, -271, -16, -156, 130, 355, -84, -35, 182, -7, -144, 67, 128, 224, 192, 56, 31, -37, -234, -236, -163, -276, -231, -162, 219, 79, 272, 219, -15, -305, -106, 36, -63, -175, 272, 302, 287, -93, -82, -100, 74, -135, -126, 210, 79, -4, 80, 302, 52, -315, -66, -210, -47, -58, -31, -71, -21, 48, 66, 173, -359, -260, -182, -162, -110, 243, 219, 537, -41, -141, -90, -40, -61, -142, 89, 321]
7228C21m08J46m3k00j02m9M67on3l2R7J28l11p9K61l63M0R2J50k74J10JK22m22
7252c07N30n71K53K1j44K00K15P4k85J34j82m16K08J25K51R1m3M6k77J67k28J75
7274C7l02k8L13p2J89k00L07j97j3j24Q3K48l45N3L87M0j78k76R3p8j94O4L02
7297A09r6k6k3J37J6k93J52k9L4Nq5P5L20j84n30O43m50j88K22J13J05j9K69m8
7321B29j40j20J41n0n43K20K43P1RP4p3J38l72k24K62J06j13J77J40mj69J19l8
7344H3j41n3j25L04n9K10J89j22k68M9l16J91j23n0M67K22k63q8j47L71m85j50
7366c04K03K39n94M69K4J64j63j46J5J45k54%L96j30q0l03O88j30j35l60K94k55
7388b17K6N73k63J15k8N4l51k06j4J31K75l05M14L67m17j46k18L09j65k09J78
$$ y = [321, -87, 59, 16, -184, -286, -335, 132, 126, 73, 41, 138, 266, -45, -124, 137, -226, -186, -94, 56, -218, -108, -107, 115, -307, 223, -348, -95, -74, -218, -18, 197, 271, -14, 120, -62, -478, -270, -145, 106, 197, 154, 200, -77, 90, -138, 37, -265, -293, 20, -52, 137, -63, 244, 47, 34, -90, -7, 241, -104, -51, 336, 376, 198, -78, 15, -63, -257, -193, 109, 13, -13, -36, 101, 117, -176, -24, -53, -19, -14, -99, -24, 296, 112, -418, 225, -225, -413, -191, -78, 27, 8, 277, 229, 89, -31, 110, 60, -483, -263, -20, 51, 60, 134, 61, 199, -173, -397, -135, -29, -142, 35, 175, 171, 2, 121, 83, -58, -111, -236, 68, 9, 219, 408, 286, 18, 67, -249, -58, -181, -231, 236, 458, 195, 107, -40, 331, -154, -304, -101, 138, -456, 13, 37, 201, 38, -108, -93, 52, -202, -202, 194, 64, -16, -319, 369, 239, 104, -256, 38, -217, -191, 382, 119, 234, 206, 260, -91, -297, -311, -180, 95, -210, 204, 571, 154, 8, -210, 99, -66, -275, -97]
7409i7l9M3J71k1O8k1k24M4j12K52l14K18J66l0o2J76l10j96J22J99N8j78N9L79
7433C51k84j00r0K3J60j15J57j4k0Q0P8j58j72k15J29M55m90M96k69K62r9m34
7455b69M32j87p3k45M3M21j69Q1L80m82Q2k26J58j14J67p6J75R0k37m1J60O9o66
7478e27M50L0M21n25K68J39R7m84j52L13l94o3K18M41j74P1j39L3j58J18J77j08
7500E2k90K60M8R5n8P5l6j98j09l90O12k3o2J87K4j46j73J11R0l40rL67k04L22
7524B05j25J2J53l40j14l68L88K43L1j78K33l06n8L05k37kN0R4j17J15j47K49
7546H6J4M2n10K94J09q6J71j5j86M8J38q7Qk90j34M60l67K45J66j86J87l04J38
7569e9j9k17ML91R5k27M8J55O4l70J99m0J27n07J53O50j13k99k10J48j92L37l12
$$ y = [-97, -136, -93, 78, 57, 125, 104, -120, -76, -188, 64, -250, -32, 134, 104, 42, 218, -92, -288, -166, 33, 91, -87, -28, 351, 67, -33, -123, -100, 60, -55, 102, 88, 68, 148, 226, 68, -104, -319, -190, 265, -225, 271, 2, 264, 165, -269, 163, -24, -97, -342, -299, 122, -47, 34, 414, -68, 14, -212, -54, -168, -1, -77, 98, 188, -49, -90, 70, 139, -527, -77, -47, 374, -151, 117, 256, 353, -131, -283, 30, -364, -427, -209, 232, 58, 129, -10, 23, -135, -17, 160, 52, -238, 22, 70, 165, 107, 182, 146, -52, -161, -551, 61, 38, -24, 163, 187, 41, -132, -21, 69, -271, -280, 87, -117, 205, 80, 92, 245, -95, -209, -577, -189, 54, 85, -93, 140, -166, -224, 81, -156, -158, -108, -14, -131, -16, -163, 86, 100, 142, -368, -74, 35, -51, 120, 105, -81, -33, 105, 18, 26, -264, -398, 62, -305, -60, 106, -80, 107, -197, -59, -78, -295, -291, 100, 195, -32, 16, 171, 235, -135, 64, 24, 151, -356, -203, 447, 334, 35, -175, -27, -219, 118, -194]
7592a94M21k29p7L41r0k30j71L3K43j17o9K34j14Q0l96P53l33l9j40j0K1K53j2
7615A58K19k75k4j38oK45m28J72R6o8j36L98j96J04k62jj2L78q3j77J49n2R6j95
7639c8P8k97J81L8J32k06K12R3J1k89k04K56k57k23N27L0j84L10k41K36m15j32
7661c82J66K45M2l20L40Q3r7Q2k96J11j37L7q6L54j09m0K06j67j50j25K67j84
7683a60j42J17M70M9n3j5l18J68n83K02J04J36J12l0lj63J84k83K06l12R1K13
7705a0K35l03NO6j7j55p0L17l9k88N8L21J08j4k48L2j09J9l66O96J15l57L22m52
7729a34K95j33l87L08K11l70K85M4k60L5N3P3j69RK67k32p0M84l21L01k78j88
7751a77o7K1p8K39K97j10M3k86K75j64m3l06K29n7K02J76q9J5Kn6j36q9m3J50
$$ y = [-194, 227, -2, -79, 262, 172, -58, -229, -196, 47, -70, -139, 95, -19, 61, -335, 418, 85, 46, -94, -104, -83, 170, 158, 377, 102, 78, -60, -66, 179, -249, -77, 19, -49, -185, 213, 17, 121, -141, -142, -154, 224, 141, -36, 113, 61, 157, -38, 40, -257, -76, -38, 94, -112, 100, 193, 204, -85, -289, -33, -290, -513, 14, 44, -140, 170, -71, 165, -250, -382, -216, 29, 71, -249, 91, 174, 77, 159, -137, -26, -163, -126, -212, 142, 33, -7, 199, 32, -118, -243, 24, -160, -302, -185, 285, 334, 281, 266, -52, 116, -467, -265, -161, -25, 87, 57, 54, -109, 75, -208, -2, -314, -223, -10, 225, -78, -73, -7, -24, -179, -249, 68, 29, -259, -201, 120, 228, 214, -34, -2, -111, -92, -458, 238, 353, -4, 318, -134, 161, 28, -359, -51, 160, -210, 75, 119, -141, -106, -53, 20, -149, -140, 127, -105, -175, 309, -12, 289, 11, -177, -244, -223, -301, -62, 235, 125, 168, -118, 157, -7, -50, -356, -127, -184, 18, 194, 105, 120, 122, 66, -70, -159, -202, -52]
7775e2J74k7j82K61j72q2r0K83l58k4J05K05J19j11o5O7j5j42qj38J25j2J7L58
7799B36J89l92L58n94J94j65K09J56j02NK01k68k14J01M73k89k42J18L12l13j33
7820a60K33j0K3l78P5K90j02O2Nl0J02j21j51L50m2k21K07k28P3J97j15K33l15
7843b3j79j20Q9K20j79M47k49O5k17L33J17n84L16l3nNk15K15J01l45K35n6j08
7866a70J00J41j68P1J40l7J64p9l64K74j34J58j85J48J2j19J01r2J50m13K07J2
7888h3K99l50K06j04j04J68j95K55l28K13J30j9k58M05j47k9k55K4M64l72RJ27
7910E6J02l3k65M4Q3o4j28K3K68J09l16K93j06Qm29J38Q4M50m74J58P6P2q4k19
7934a54L48q5j45QM3m7J14Q8j82L4J7j38J77k18K45J0j17K1R8j70N2k52L67l02
$$ y = [-52, 122, 95, -87, 174, 2, -80, -170, 113, -245, -269, -164, 41, 160, 49, -16, 51, 36, -106, -114, -252, -127, -139, -122, 236, 425, 33, 391, -203, -9, -174, 35, 191, 89, 94, 295, 27, -187, -86, 387, 98, -144, -26, 286, -27, -160, 73, 63, 86, -292, -217, 73, -29, 33, 38, 8, 110, -11, -162, 188, 146, -75, 132, -96, -23, 174, 59, 292, -23, -202, -322, -233, -13, -192, 255, 6, 71, -146, 187, 304, -280, 36, 3, -2, 3, -212, 3, 104, -241, -6, -62, -170, -70, 71, -97, -26, 114, 77, 241, 162, -202, 72, -62, 96, -89, 59, 71, -48, 53, -39, 111, -302, -95, -83, 216, -134, 72, -32, -136, 32, -163, 92, -236, -23, 107, 88, -170, 235, 88, 59, -196, -172, 292, -80, -71, 56, 158, 125, -140, -96, -13, -77, -205, -182, 86, 195, -121, 172, 66, 74, -355, -217, -133, 317, -157, 1, 77, 149, 65, -154, 194, 109, -36, -28, 15, -32, 82, 170, -12, 22, 39, -99, 78, -140, 105, 115, -2, 19, 117, -53, -1, -253, 114, -188]
7958a88LJ59R2N8j9j62K78k23J66m81Q9K97J22K6l41L34k42J5j0L13k64q7K68
7981B03K3k16O7j12J30j23k17L34K16m33R3P1j32J82J73k75O2j40mK30K64m88
8003i2K77l07J27R7K4l18P4L4n8K74k33J2K47q8m16O0R3J07j71L76K87l16k48
8026a58J93n7l3j60K54J13l8M7pk69L31n54J54k07L57J56k75L29l17L4Q7K24m35
8049b31O0J87M6klm8J53j78k82L82n0k87L03j70J80k25O4k68M51j66j15N44m18
8072g3k12K85K72j84j01R3K4l53Q5J89j90n5K01JL4o4p0n4K44k6l39N18j99J88
8096B14k93n0R9j16j01K86j0j13K8j12J11L34n29J87Q4k6J02K96n21K83j90J71
8118A34k83K3Q2n1m0N20k36k48L5o1k9K44k58n5L51k90J92m6M25j52m59K7L26
$$ y = [-188, -185, -26, 66, 124, 105, -57, 221, -2, 164, -317, -228, 69, 191, 217, -124, 210, -32, -17, -27, 286, 22, -65, 203, 226, 10, 77, -35, 95, -28, -245, 89, 305, -128, -35, 36, -96, 86, 259, -16, 46, -94, -98, 132, 396, -92, 185, -122, 5, 102, 126, -192, -118, -84, -142, 132, -101, -89, 158, 70, -346, -286, -193, -86, -257, 119, 406, 90, -158, 35, -22, -55, -215, 39, 152, 114, 161, 154, -115, 216, -338, -184, -391, -34, 122, -153, 176, -141, -107, -20, 204, -231, -171, 16, 62, 60, 57, 9, 162, -16, -298, 84, 34, -253, 50, -120, 60, -165, -101, -369, 82, -84, -199, 345, -73, -285, 0, 272, 88, -13, 80, 104, -249, -164, 25, -165, -220, -19, -18, 16, -48, -118, -172, 72, 46, -293, 225, 26, 214, -79, -129, -30, -146, -247, 39, 29, -84, -56, -168, -57, 277, -252, -65, 19, -7, 95, 391, -130, 153, -37, 134, -149, -126, -44, -95, -135, 385, 149, -99, -64, -125, -154, 90, -168, -223, 128, -162, 30, -16, 409, 257, -202, -175, 151]
8141A51l14K29k19J75J37l97L05J67k0l25j47L96j75j12K72M6l67m16M91Q9J41
8162A07l7r2J18K89l58M0O3k18j08R0P0l5J57j80J39k70p8M40l53J01J25J0j93
8185a73J62m8j13J33k6R9
$$ y = [151, -163, 66, -153, 22, 159, -238, 67, 234, 214, -111, -258, 138, -37, -149, 123, 169, -198, -614, -123, -34, 107, 70, -22, 96, 385, 27, 67, 130, -88, -196, -106, -36, -71, 86, -94, 45, -225, -303, 137, -216, -115, 10, 20, -173, -11, -59, -172, -39, -65, 34]
8191C4
$$ Imaginary data points
##PAGE= N=2
##DATA TABLE= (X++(I..I)), XYDATA
0@%%%%%%%%%%%qJ6j6J6j6K4l2L3m1N3o2P3q8J05j22J39j63J91k17K46k83L23l66
34a95M14m67N27n91O60p36Q22r15J015j126J245j375J519j675J848k037K242k471
52a296K725l004L315l667M067m521N047n664O396p288Q398r821J1726j4420J8562
67A0555k5808M2142j49684K2371K10010j06581K3549J56286N19k25054o9363O7262
79d3796j5231q4882P7168J59498M8288p6137j7981L3036o3809j60278k5359J21609
91d7874M5399n0851Q8287J58543m6200j70499q249M6975j12877r2898J36832J47231
103I3819l3285k9413R0578N50j58995r6086N3056K9733m0445L9019J37347N9389
115A45267p1069n3007K0761l7015j19868k7421J10956O4327l5277L5192J09595
$$ y = [0, 0, 0, 0, 0, 0, 0, 0, 0, 0, 0, 0, -8, 8, -8, 8, -8, 16, -16, 17, -24, 29, -33, 40, -48, 57, -65, 74, -89, 102, -115, 131, -152, 171, -195, 219, -248, 279, -312, 348, -388, 434, -481, 534, -592, 653, -722, 797, -878, 970, -1067, 1175, -1296, 1429, -1575, 1740, -1927, 2140, -2381, 2666, -2998, 3398, -3890, 4508, -5313, 6413, -8007, 10555, -15253, 26889, -122795, -100424, 109586, 3005, 26554, 182840, 183359, -41695, -111058, -43796, -59027, -143909, -66741, 92757, 141045, 64908, 46927, 79963, 16154, -144124, -169483, -47874, -2475, -53326, 34961, 193504, 147304, -23195, -31444, 15531, -97346, -190244, -53412, 93819, 60534, 31121, 121699, 122249, -36746, -132832, -79776, -50043, -90488, -51469, 85878, 145267, 74198, 21191, 41952, 4937, -114931, -142352, -31396, 32931, -2346, 32846, 142441]
126A42441k7738j51829m2262N6626m5049p7800R4301J52125p340o1472M7743K1733
138A01479j28633j03601N0345N8089k6254J9508J10947N0436p4862p0208Q125
149d629j5496q4607k0871J04908Q2108k7219N27P9581j5365j39226n2417O3837
161b8869j1712o5015P2731J35048r851p4830K3242J8641j03877q4749N3188O8886
173g167p278J4400Q3608L8299o9638p5608k133k006n7227j5356R2662P7485k5833
186D4208j7107N0888j6976j15583m4860O0939J2896l6877N7559J06439n303p2031
198B4192n585Q385p1856o5793M0081P1206J0575K800N1613K8742o0099p5994p404
211d9137J4272k8128o535P8840P3407j9481l3324K1700j2659r2872m7116N4781
$$ y = [142441, 114703, -37126, -79388, -22762, -67811, -145611, -51310, 100815, 93475, 32003, 79746, 101479, -27154, -130755, -80410, -22321, -48575, -29067, 81880, 132316, 57454, -12754, -4629, -20125, -104732, -125603, -20695, 61413, 34194, 34721, 114302, 98937, -40289, -92706, -28869, -40581, -105596, -32865, 102183, 92332, 17502, 40744, 59385, -44492, -129241, -76053, -7167, -14445, -45, 83563, 121862, 52224, -23384, -25517, -27523, -84750, -100106, -7444, 70041, 44208, 27101, 77989, 61013, -54570, -99430, -38491, -25595, -62472, -4913, 101526, 96223, 24192, 18607, 26992, -44864, -110657, -70576, 630, 11205, 14005, 65618, 94360, 34261, -41733, -49137, -34865, -62993, -69528, 9312, 82719, 63238, 29914, 51614, 38955, -53917, -101033, -46252]
223d6252L6184k1932L2931Q5979K565p6932k7160J5954m1337n6190L6687Q2832
235B3329J8407j4382L0523K4469n8937q0035n199K8704j5693n724P0488O8259
247H4209k4424m5058J1692o469p7069l8832O0110M7849j5361K0238O8715l001
259H2599q0202l5521J6053k5479m2708L6383P9795J9565k1258J5406J5493n3094
271G032o9388L98L5617j255M28N8963N3577k7104n0113k818p982n7522k7199N3913
285c3453N0903l078J0141M5056m713o8384l9768J2885m520k3996L0004O9933K2478
298F3488k6826o827N901m2146o1143r52M1985J4422K654M3650M3248k4704n2513
311B37j2666k093l5994j8465M7091N3787K372m239K3067n219o1413m4400J3386
$$ y = [-46252, -10068, -32000, 931, 86910, 89475, 12543, -14617, 1337, -40000, -96190, -59503, 23329, 41736, 27354, 57877, 82346, 23409, -56626, -61825, -33121, -48814, -54538, 15950, 84209, 59785, 14727, 26419, 19950, -57119, -95951, -35841, 12008, -3353, 16885, 85600, 82599, 2397, -33124, -17071, -42550, -85258, -48875, 30920, 50485, 29227, 44633, 60126, 7032, -62356, -61958, -26341, -27596, -27168, 31795, 85372, 58268, 8155, 5337, -2645, -60167, -87366, -33453, 17450, 14372, 24513, 69569, 64856, -3528, -43296, -30411, -34931, -58927, -28923, 41010, 63488, 36662, 29835, 35736, -6410, -67553, -68505, -26520, -12098, -9444, 34206, 77454, 52750, 237, -12429, -14522, -50516, -68981, -21890, 31897, 34269, 30030, 53097, 47878, -13535, -57935, -44549]
324d4549J4351j1488K2407O3412K4854l3109k0625M521l1095n3437K964M9852
336a1942J9724k253L2151L3340l1455n6271j2190L759k5333r060M9626N1228J99
349D1523j0742J2664r260n5529l7683J8011K1771m096J9654N3644J5673l9701
361B5929k6136J736k6459m2091J2758N2316J9826j155K6313K0191l5981n0286
373b3039r467M238j4371K542M4814M0029k409j4442q80j5297m3684k8558J8940
386d1584K8233P180J7405M0212J0648l9265l1810j714j6608l0561J4105N1563
398G804K1679o201J3182J1437l5767m7946o480J2386l015P617M1476L5905o147
411D5930k1957q199j4065l6030k3485K0646L4607R895Q472K9978P995m2375l7686
$$ y = [-44549, -30198, -41686, -19279, 44133, 68987, 35878, 15253, 19774, -11321, -64758, -61794, -11942, 7782, 5529, 37680, 71020, 39565, -16706, -28896, -25137, -50470, -59530, -9904, 41324, 41523, 30781, 43445, 34185, -21344, -59027, -41016, -19245, -23341, -3687, 49957, 65630, 25929, -207, 1529, -24930, -67021, -54263, -1947, 17879, 16724, 43037, 63228, 27247, -23039, -32506, -28268, -42639, -40097, 4717, 44746, 42337, 27895, 27015, 11718, -31966, -60524, -41584, -13351, -6171, 11234, 51446, 62094, 22829, -8981, -10695, -27303, -57864, -43759, 7804, 29483, 23282, 36464, 47901, 12134, -35812, -42292, -29906, -32921, -25304, 16172, 52077, 45930, 23973, 15774, 1709, -34321, -57806, -37160, -2553, 7342, 15814, 45792, 53787, 11412, -26274]
424b6274K695l273k4429J5869N6905K3038j6770L408J0395l7102m9827m1K2518
437b2888J00O298M0125K9514j5050k7438q954j0773l0010j5174K8030L7705Q365
450A9850K535K3759L125m6738l9163Q729L575k0494J7027N8125J8127k5532j779
463B1146Q160l6352m5435P800L0133M289P585L6165K2733k2227l1417j0848r568
476a7836k2129q167K8753L7469Q036l093J2725o8m1209l6702R466J4161j0159
489b8753J4147N0399J9017k8498j4788L603k8669m0761P480L6151J2118M250K6994
502C2690J7655k2572l5829j2654j541j0471m201K7510L9058P876j4776J963J483
515B6191l6968l9662J2272K6295n855O476M7589K0571l5614k3396P749j9638l8801
$$ y = [-26274, -23579, -26852, -51281, -35412, 21493, 44531, 27761, 31169, 41564, 4462, -45365, -45406, -22888, -22788, -16490, 23635, 53149, 38099, 10661, 1707, -9066, -39076, -54250, -26220, 11485, 19850, 22385, 46144, 49269, 2531, -36632, -27903, -24328, -44822, -27795, 30330, 48457, 22925, 21146, 29306, -7046, -52481, -44681, -14548, -10259, -2674, 33491, 56224, 33997, 2580, -8268, -17836, -39965, -48132, -19379, 18090, 26126, 23033, 35758, 35690, -5519, -42221, -32755, -18594, -28753, -14606, 35793, 54810, 26312, 11524, 15127, -13542, -54303, -46823, -10672, 1446, 5696, 32690, 50345, 27773, -8056, -20710, -22251, -32722, -36923, -9413, 29645, 37521, 22745, 24708, 26191, -10777, -50439, -38167, -11872, -17727, -11251, 36338, 56909, 21295, -2101, 5648, -13990, -52791]
528e2791R841M4209J5487l248J8785J4880k6303m0275j2285O147l876j411K8224
541b616L8046M225k0803l615J588l3159l4505J6966L2525k640K598M0238J5193
554E4041l9377k8283P504j2644l1747J1641M5710J7064n942J1335J1179k6633
566A3848l9459r010J1666K262J330K6648L3506o35k6161j0088r95k5725k7442
579e0255J7470L6736M262j807K8431J4226l6780l3308N839p58k3609Q278M4608
592A3333K0849j1924n55P178k3234l8161r400J8036J1069L985K1315K9140m38
605D1193l0431j7496K184j5249k5379J6033M2582P654j2670J8590J5563l6923
617E651l9701R297J1551j8900N999M6096K2728j9230r264O932j8636l7278p826
$$ y = [-52791, -42950, 1259, 16746, 13498, 32283, 47163, 20860, -19415, -31700, -25553, -29429, -30840, -2616, 35430, 39655, 18852, 15237, 16825, -16334, -50839, -33873, -1348, -3988, -1390, 38848, 54041, 14664, -13619, -6115, -18759, -50506, -38865, 6845, 23909, 17967, 29302, 40481, 13848, -25611, -34621, -22955, -20693, -19363, 7285, 40791, 40156, 13995, 3907, 2912, -22813, -50255, -32785, 3951, 8213, 6406, 34837, 49063, 12283, -21025, -15186, -15944, -39553, -31275, 13333, 34182, 22258, 21703, 28881, 5647, -32514, -41914, -23878, -12809, -8824, 12491, 41631, 41193, 10762, -6734, -4550, -19799, -45178, -29145, 13437, 21091, 8421, 27011, 42574, 5651, -34050, -24753, -13202, -32102, -26103, 19993, 42721, 23491, 14227, 21159, 2523, -34755, -42581]
630d2581K4877J6478N45J4037K7085k934l6682k0194Q132q859k2758J8738M6082
643B1966P698j7813J2172J2277l5744l9125J0614J7915j1494M047L9905K1266
655D3684k1417j8000L274j1953l0935o606K8592K2524l2P744K1407l987l7095
668b800k2346Q232j115j5492J5724M2337J0030k0422p58R544k6823l7404P676
681c3617K7538n10j310L0858K2907k1476k7947j32l353k4421q150K9649K7601
694A7637j560j828J5037k283l5195k5298J1053J0583r930R930L9673J3950k5822
707A5947j2303R712j8341l6389N076L4273O451p127K2822K2570k1734l3480k211
720a4734N410j6836p436K9256L0945k505j0521Q870j025l3923k5674J4364J7383
$$ y = [-42581, -17704, -1226, -681, 13356, 40441, 37507, 825, -19369, -11237, -20096, -42854, -24116, 21966, 29664, 11851, 24023, 36300, 556, -38569, -27955, -10040, -21534, -17487, 22418, 43684, 22267, 4267, 7541, -4412, -35347, -41953, -13361, 9163, 9131, 16875, 38282, 34295, -2800, -25146, -16914, -18029, -33521, -17797, 24540, 34570, 14148, 13390, 22934, -3889, -41293, -33617, -6079, -6589, -7899, 22959, 45866, 24390, -3557, -3689, -7042, -31463, -39613, -9964, 17637, 16077, 14249, 29286, 27003, -8192, -33490, -22437, -11854, -21784, -11854, 27819, 41769, 15947, 3644, 13356, -4985, -41374, -36298, -2025, 4426, -2701, 20121, 42691, 20957, -12523, -14734, -9324, -26160, -33596, -4340, 26605, 24100, 13579, 22449, 21424, -12499, -38173, -23809, -6426]
733f426p333O431L5744J2999k9225j7114R068j1914l0983O026L6431J1452r110
746F046J3616J7656j9732l5417n160J0274q058o266K5912L1116l382j6054K113
759A2664M86k8002k3132J4788K2807j520K785K7052J0834k6908k3606M160l227
772a0819k1820K640L4257J8178r424J507J3439j3603l5162r176J6718K719o361
785a6907J9727L0770k343k4795m466K897k1046k2702J4788K9179K155l139J9789
798B3907J1633k6529k7825M321N599j5999N84L3481K1292j3158q546J0544r979
811I325l3785j0381K1732J0100p065J4682K9153k651k8486r002O563j5430j9785
824c5030J5867L0968L488p332J2553Q152k4973k8014L266J0660p568j23K9131
$$ y = [-6426, -13759, -7328, 28416, 41415, 12190, -4924, 4144, -7770, -38753, -32727, 3704, 15156, 6046, 19662, 37318, 17586, -17831, -22991, -12717, -20775, -27041, -1129, 29987, 26605, 10551, 12664, 13150, -14852, -37984, -23196, -389, -1909, 876, 27928, 38762, 11854, -11752, -7592, -10819, -32639, -29999, 4258, 22436, 13012, 14519, 27958, 14355, -20807, -29983, -13265, -10546, -16907, 2820, 33590, 31247, 6452, 1986, 4883, -16163, -38865, -24077, 5102, 7257, 4118, 23907, 35540, 9011, -18814, -14493, -8894, -24893, -24309, 9172, 30464, 17306, 8760, 19304, 9325, -24460, -34841, -13109, -3009, -10074, 4608, 33761, 31110, 2624, -6378, 185, -15245, -35030, -19163, 11805, 15293, 7961, 20514, 28666, 3693, -24321, -21055, -10395, -17963, -18086, 11045]
837A1045K1612j2312j5356N169m975k8559j1144K2780J5984m960P838K3672k850
850B7944k9782j2604P070p771j5349J4636L0530O858j0159M085O197k0059k6667
863b5071N56J5798J47j319K1197K0882j0655k1965j168P97k0476j2406K1945K3531
877A1793k979j125J8306L25k9644j7762R260P73j1852J0780K9380Q745j4164l597
891H239M568j5088k4982M63J9600P399k478J4258J9613r605k6217n041N708j4008
905a7571j2513K1018K6446l539p343J3677O38k8855j7728J1384O260q153J0118
918f161K7079P105j5754q113J527j1576j9690K21K0284J1234j842P461J4431q340
932A7866k5966p971P841o314q558J8250K5474j715j0458N804J57k4025j7150J0197
$$ y = [11045, 32657, 20345, 4989, 10158, 5183, -23376, -34520, -11740, 4244, -716, 7122, 30794, 27944, -1838, -14442, -7372, -15143, -30492, -15856, 14674, 21532, 11373, 15458, 21655, 1596, -25071, -24515, -8717, -8570, -9889, 11308, 32190, 21535, -430, -1598, -801, -21277, -33683, -11738, 11793, 8814, 7689, 25995, 26320, -3324, -21086, -11826, -11053, -22905, -12125, 17255, 26000, 11836, 8239, 12807, -2281, -27263, -26800, -7200, 199, -2279, 11979, 31592, 21987, -4230, -9271, -3563, -17571, -30084, -9066, 17380, 13841, 6498, 20175, 20813, -8042, -25770, -14386, -8126, -16279, -6161, 20918, 28023, 12269, 4156, 5683, -5893, -25583, -25362, -5078, 6156, 4314, 11775, 26206, 17866, -8100, -16071, -8230, -14544, -23102, -4852, 20622, 18907, 8449, 14253, 14410, -9615, -26765, -16568]
946a6568J0957k708O982K0647P173j4970j3247q99o363j3741O49J9852J4910j485
960A1189P83R144o732k4782j0549J0005J137p124J4061K4915j69j5752l8K614
974H702j9296j7072J1062J6497k7K685J7417N713j6708j5784j396k634r318J784
988a8375J9030J5414j951m127M929n370k1947j1287J1830P072m729J0614K2653
1001B3756n97j9183l739K992j5969j4652J2837J7896P28J758J2841K203j6118
1014D753j4678j368O6m443L393J6846J4371k484p549K78m527j9678j0007J2619
1028a2408J1008k313P921J8763j816j9434o684K877j0690r822J1338J8288K643
1041I671p44O396Q15j4469j4927j665L469J49L194J4313J3404k221j0924l098
$$ y = [-16568, -5611, -8319, -1337, 19310, 26483, 11513, -1734, -2633, -8996, -22737, -22088, -2236, 12674, 11189, 11972, 21116, 14384, -10398, -20947, -10942, -9805, -16929, -2868, 22047, 21878, 6126, 6088, 8702, -10594, -27666, -16604, -107, -134, 2551, 19968, 25681, 8973, -6811, -8207, -10841, -20159, -18375, 655, 16069, 14118, 9991, 14920, 9550, -12397, -23684, -11854, -4782, -9511, 1103, 23756, 23159, 3976, 237, 3229, -12740, -27392, -14555, 3341, 4069, 5827, 18668, 20871, 4753, -9925, -11293, -11227, -15670, -12277, 4569, 18940, 16456, 8907, 9185, 4658, -15020, -25027, -12408, -1400, -3713, 4208, 22971, 21155, 1721, -4963, -2086, -12776, -22598, -11260, 7028, 9671, 8927, 15323, 16138, 1669, -13258, -14923, -11454, -11305, -8111, 6202, 19606, 17385, 6461, 3363]
1055C363l063j4796r082J2599J4689j84L259J3591j206k0048j0264M156m324q245
1069a9555J0539J9158L794m904K909Q03j4107j4470K24O852K030L527J2598J0776
1083B0174m878j2568m718k060j0868o848J3225J5955j7L35J0348j952j9725j0597
1097a4194N765r60o080J0828J8319J828p099J04j294j3106j1659K172Q152M619
1111b605M277R677P407n445j2695o084j303p242l771J2518J5112N12j828N923
1125A4453l115j7962r791N415K503k119R839J5631J753q346k996k637j0407r302
1139a7081K930R938N609L717O502M776o795j3165n700K75l253j530J1781J4510
1153A2514N76m756K132k782j6143r147O438O103j095P546J3952J659j0864n891
$$ y = [3363, 300, -14496, -23578, -10979, 3710, 3526, 6785, 20376, 19170, -878, -11142, -6986, -11310, -19555, -9016, 10142, 13936, 9032, 11941, 12744, -1363, -15833, -15609, -8757, -6727, -3200, 9398, 20174, 15296, 2728, -1990, -4050, -14918, -21766, -8541, 7414, 7397, 7732, 18080, 16128, -3597, -14194, -8429, -9389, -15469, -4641, 13678, 15506, 8407, 8511, 7217, -5889, -17548, -15376, -7224, -2605, 1672, 11349, 18756, 13311, 616, -5468, -6771, -14013, -17784, -5266, 9846, 10358, 8530, 14453, 11338, -6624, -16415, -11000, -8497, -10616, -777, 14854, 16607, 8261, 5265, 2628, -7779, -17081, -14151, -4213, 1396, 5113, 11615, 16391, 9596, -3569, -9269, -8994, -12247, -13777, -1996, 12514, 13090, 8334, 10466, 7684, -8459, -17606, -11168, -5065, -6160, 1386, 15338, 16997, 6133, 242]
1167B42j147q282q542N306J2376O107J053M964K917q740j3314m455K832j532j96
1182a0411J1933J3136j989o855O39k495j4646q099R364Q231j007O324J2717l01
1196A6541j3391o611L47o669p102O655J4334M540r87K796J722r874j2799k396
1210a2894M920M73R73J1627J1153l677q324j015k678j2489o105J0040R486r2M078
1225E476R795j102j3241q194J291k870m830O418J3758N486l367l59J044q930j3112
1240a2737j544P594K539Q00R519J0608m588j0903k589p40r268n652J1007J1816
1254E862M8k28P651n11j4746r405L161J360m568N411J4938N515o795l453J812
1269F052p474j2806m18J0842M251o69P774R328n873j3392k820J540p056m599J1268
$$ y = [242, -905, -9187, -17729, -12423, -47, 6060, 7113, 12077, 14994, 6254, -7060, -11515, -8683, -10215, -10411, 1522, 14658, 12669, 5814, 6453, 3958, -10688, -18787, -9423, -1192, -2199, 4125, 16842, 16541, 3150, -3461, -3114, -9783, -16885, -10230, 4104, 8644, 7657, 10453, 12175, 2301, -10498, -12894, -7974, -7501, -6528, 5099, 16252, 12575, 4251, 3236, 558, -11931, -18036, -7996, 1490, 1398, 5476, 15271, 14169, 928, -7266, -5975, -8845, -13675, -7257, 6501, 11987, 8620, 8261, 9305, 375, -12737, -14281, -6687, -4148, -3348, 6171, 16779, 12191, 1288, -1301, -2041, -11309, -16961, -5954, 5862, 5910, 5682, 13333, 12822, -1924, -11329, -8168, -6808, -11376, -5965, 8973, 14488, 7693, 4240, 6052, -1422, -14228, -14646, -3804, 447, -222, 7552, 16880, 11007, -2385, -5205, -3665, -10721, -15320, -4052]
1284d052J2946n88k697N050n68j3952j0085M940M744l226M474J3948M759q855
1298F838n730J665o144j1751Q50J2606N335j753N962P858o709j3905l112L190
1312d800m042l119R898J2984k10n501J748m57j1728r814N032P566q32K310J1847
1327A0882M697r449q546J353k581j0041Q82J3311O701k736K244O213n787j4385
1341g242l742M714j43k418Q611J2772J1q261p59M17r708r707N708J0359L24m84
1357D52R962N092j1317j0495J984L47q756Q67J4824P829m956o87N482n451j4338
1372i161l174P021J680k408P502J2033j071r999l103J454p310q707N746J2420
1386B923J500k393P360N200j1651j2030K584K913o392N24J4141P988o363k874
$$ y = [-4052, 8894, 8306, 5609, 10659, 10091, -3861, -13946, -9006, -4262, -7488, -3014, 10934, 15693, 6838, 1108, 2773, -3371, -15122, -14272, -1666, 3669, 1916, 7878, 15736, 9027, -4878, -7990, -4800, -8842, -11961, -2063, 10921, 10711, 5210, 6958, 6501, -5227, -15041, -10009, -2443, -3275, -965, 10882, 15579, 6130, -2416, -1063, -3644, -13685, -12803, 508, 7209, 4473, 6717, 12930, 7143, -7242, -10984, -6270, -6413, -8831, -220, 12552, 12563, 4302, 3543, 3960, -5748, -15455, -9747, 612, 936, 452, 10414, 15506, 4189, -6306, -4322, -3975, -12731, -11864, 2960, 10789, 5833, 5146, 10628, 5177, -9161, -12335, -5314, -3634, -6042, 1460, 13493, 12422, 2423, -680, 774, -6536, -15243, -9497, 2923, 4423, 2030, 9390, 14590, 2939, -9091, -6507, -3594, -9986, -9462, 4679, 12667, 6304, 3430]
1400C430M135m977j3094k501Q257L583j527N750J0275j334j0893m587K146m913
1414f250p639N864J3322J968m357M334M405j0290j2642K263O346l821k68J2454
1428E689Q496o787o270K538k301j1662l417R313O322j198K485Q795q34j1602o777
1443g210L330r64o475M420J3847L903o814L89M608p951j4091K440R389j662k273
1458e114J1132R142q240q937K199k5j0092l522J0872Q013k169L42O881j055j1751
1473b324p183M023J870n386L657J3422M313q300k577M598o523j3059K242J1199
1487b8P45l034Q311Q370p389j0829N64J404o762k777R522R004j354k147M157j59
1503G598j0496p969M110M767k934J477J1643N165q877n346L430l821j1409J101
$$ y = [3430, 7565, 2588, -10506, -13007, -4750, -1167, -2694, 3056, 13331, 11997, 1104, -3483, -1337, -6250, -13889, -8025, 5297, 7265, 2908, 7242, 11647, 1357, -11285, -9022, -2676, -6497, -6765, 5689, 14185, 7398, 1128, 3666, 1365, -10297, -13714, -4401, 1921, 723, 3208, 12003, 11169, -433, -7210, -3880, -4844, -11319, -6899, 6948, 10851, 4037, 4426, 9034, 1083, -13008, -10568, -1179, -2841, -5114, 6018, 15160, 6920, -2017, 182, 157, -9935, -13457, -2585, 5428, 3259, 3601, 10482, 9427, -2324, -9507, -5484, -3614, -9000, -5343, 8079, 12392, 4092, 1515, 6113, -410, -13469, -11227, -28, 717, -2317, 5994, 14364, 6975, -3854, -3290, -1886, -8648, -11425, -1903, 7101, 5747, 3600, 7757, 7598, -2898, -10867, -6757, -1990, -4924, -3447, 8196, 13361, 4484, -862, 2568, -1253, -12662, -11561]
1517a1561J2351L103l789N139P674o650j1689o63L477m086k826Q919R797j414
1531G782m543J491M26r266p893M518O907j311P3R858N285r372p694L075q26r413
1547a0903J82J2348N287m639J794O741n461j2591j454N367j192k892P977R484
1561A0048j362o220k33O59p375o929M423Q315l08j178P264M839q614r039K478
1576c232J224p296k18J2317O009n088l31N139m582j1892j423O098M55j545O257
1591A892Q270j719p150k216J269n417n783M047R169J686k336M443M378p869r685
1606g021J643L231m733l06J0700O467n250k595L287l330j0436j995O861L157j617
1621a937M343P460j030q328l083J113l017n141L888R384K248l521K131M155p214
$$ y = [-11561, 790, 3893, 104, 5243, 12917, 6267, -5422, -6085, -2608, -6694, -9520, -601, 9196, 7782, 3239, 4730, 5156, -4110, -12003, -7485, -578, -1889, -1816, 8042, 13327, 3955, -3739, -664, -1490, -10903, -10721, 1627, 6914, 2275, 4069, 10810, 5349, -7242, -8696, -3329, -4521, -7413, 564, 10048, 8686, 2466, 2233, 2892, -4483, -11412, -6989, 1326, 1018, -160, 7104, 11943, 3329, -5710, -3232, -2008, -9304, -9522, 2795, 8804, 3716, 3385, 8524, 3942, -7950, -9373, -3275, -2820, -4365, 1892, 10162, 8443, 1293, -923, 346, -5071, -10854, -6807, 2362, 4048, 1712, 6155, 10533, 2664, -7021, -5378, -2147, -6880, -7186, 3514, 9981, 4731, 2136, 5423, 2093, -8343, -10338, -3477, -320, -1937, 2406, 9866, 8836, 508, -2575, -1462, -4479, -9620, -5732, 3652, 5900, 2379, 4510, 8665, 1451]
1636A451r979J527N440k752j203R641O805n241n336K559j684r131k685Q136M602
1651B150j999K545O375j216q945l699K003j071m257L829R594K364m569N57K661
1666F322n967r331J072O461j49j595P661O042n177o470J197n51o985k042P828
1681a684N449j451R90M594j158q630m496K423M47k534L096Q431K723m842j457
1696A901J781m758p701J002O798J592j590N301N826m787p701K26M80m781k135
1711h546P266O628j098j367K923p13p592n076K807K635j701K350P664K633n312
1726C501l636J754l174o815L19P824L085k130L294M593m346p690r36K168k817
$$ y = [1451, -8528, -7001, -1561, -4313, -5516, 4125, 10930, 5689, 353, 2912, 1228, -7903, -10588, -2452, 2150, 151, 2696, 9071, 7855, -1090, -4789, -2786, -3857, -8114, -4285, 5309, 7673, 3104, 3661, 6322, 355, -8976, -7904, -1443, -1592, -3187, 4474, 10516, 5339, -1131, 66, -485, -7470, -9512, -1684, 3765, 2314, 3304, 7898, 6740, -1890, -6386, -3963, -3516, -6050, -2954, 5477, 8200, 3358, 1901, 3682, -1076, -8777, -7775, -977, 615, -975, 4326, 10152, 5365, -2336, -2110, -1630, -6411, -8546, -1280, 5348, 4250, 2883, 5806, 5093, -2499, -7575, -4768, -2133, -3834, -1484, 6180, 8813, 3501, -135, 1619, -1555, -8370, -8051, -227, 2858, 728, 4022, 8615, 4269, -3421, -4357, -2189, -5006]
$$ [...]
8191d3
##END NTUPLES=NMR FID
##END=
