##TITLE=1H_DE-27_AA
 DMSO-d6
 8 sc, 
 30.11.2023
##JCAMPDX= 6.0         $$ Bruker NMR JCAMP-DX V2.0
##DATA TYPE= NMR FID
##DATA CLASS= NTUPLES
##ORIGIN= UXNMR, Bruker Analytische Messtechnik GmbH
##OWNER= root
$$ XWIN-NMR		Version 3.5
$$ Thu Nov 30 13:45:37 2023 Russian Standard Time (UT+4h)  she@DPX200
##.OBSERVE FREQUENCY= 200.1313
##.OBSERVE NUCLEUS= ^1H
##.DELAY= (6, 6)
##.ACQUISITION MODE= SIMULTANEOUS
##.ACQUISITION SCHEME= undefined
##.AVERAGES= 8
##.DIGITISER RES= 18
##SPECTROMETER/DATA SYSTEM= spect
##.PULSE SEQUENCE= zg30
##.SOLVENT NAME= DMSO
##.SHIFT REFERENCE= (INTERNAL, DMSO, 0, 15.7039)
##AUDIT TRAIL= $$ (NUMBER, WHEN, WHO, WHERE, WHAT)
$$ ##TITLE= Audit trail, XWIN-NMR		Version 3.5
$$ ##JCAMPDX= 5.01
$$ ##ORIGIN= Bruker BioSpin GmbH
$$ ##OWNER= she
$$ F:/spectra/data/she/nmr/H-F/1/audita.txt
$$ ##AUDIT TRAIL=  $$ (NUMBER, WHEN, WHO, WHERE, WHAT)
(   1,<2023-11-30 13:44:29.93 +0400>,<she>,<DPX200>,
      <created by zg, POWCHK disabled, PULCHK disabled
       configuration hash MD5:
       00 E9 B6 7A A2 85 ED C7 34 08 36 98 17 FE 4E 26
       data hash MD5: 16K
       D6 17 46 94 A8 43 73 BF F7 EE 60 0F 88 0B 91 57>)
$$ ##END=
$$ 
$$ hash MD5
$$ BC ED 4F 7B AE 89 B2 F2 6E 83 37 0C 35 F0 BE F6
##$RELAX= 
##$RELAX= 
##$RELAX= 
##$RELAX= 
##$RELAX= 
##$RELAX= 
$$ Bruker specific parameters
$$ --------------------------
##$DU= <F:/spectra>
##$EXPNO= 1
##$NAME= <H-F>
##$PROCNO= 1
##$TYPE= <nmr>
##$USER= <she>
##$AMP= (0..31)
100 100 100 100 100 100 100 100 100 100 100 100 100 100 100 100 100 100 
100 100 100 100 100 100 100 100 100 100 100 100 100 100 
##$AQSEQ= 0
##$AQ_mod= 1
##$AUNM= <au_zg>
##$AUTOPOS= <>
##$BF1= 200.13
##$BF2= 200.13
##$BF3= 200.13
##$BF4= 200.13
##$BF5= 200.13
##$BF6= 200.13
##$BF7= 200.13
##$BF8= 200.13
##$BYTORDA= 1
##$CFDGTYP= 0
##$CFRGTYP= 5
##$CHEMSTR= <none>
##$CNST= (0..31)
1 1 145 1 1 1 1 1 1 1 1 1 1 1 1 1 1 1 1 1 1 1 1 1 1 1 1 1 1 1 1 1 
##$CPDPRG= <>
##$CPDPRG1= <>
##$CPDPRG2= <>
##$CPDPRG3= <>
##$CPDPRG4= <mlev>
##$CPDPRG5= <mlev>
##$CPDPRG6= <mlev>
##$CPDPRG7= <mlev>
##$CPDPRG8= <mlev>
##$CPDPRGB= <>
##$CPDPRGT= <>
##$D= (0..31)
0 1.2 0 0 0 0 0 0 0 0.06 0 0.03 0 0 0 0 0.0002 0 0 0 0 0 0 0 0 0 0 0 0 
0 0 0 
##$DATE= 1701337469
##$DBL= (0..7)
120 120 120 120 120 120 120 120 
##$DBP= (0..7)
150 150 150 150 150 150 150 150 
##$DBP07= 0
##$DBPNAM0= <>
##$DBPNAM1= <>
##$DBPNAM2= <>
##$DBPNAM3= <>
##$DBPNAM4= <>
##$DBPNAM5= <>
##$DBPNAM6= <>
##$DBPNAM7= <>
##$DBPOAL= (0..7)
0.5 0.5 0.5 0.5 0.5 0.5 0.5 0.5 
##$DBPOFFS= (0..7)
0 0 0 0 0 0 0 0 
##$DE= 6
##$DECBNUC= <off>
##$DECIM= 32
##$DECNUC= <off>
##$DECSTAT= 4
##$DIGMOD= 1
##$DIGTYP= 9
##$DL= (0..7)
0 120 120 120 120 120 120 120 
##$DP= (0..7)
150 150 150 150 150 150 150 150 
##$DP07= 0
##$DPNAME0= <>
##$DPNAME1= <>
##$DPNAME2= <>
##$DPNAME3= <>
##$DPNAME4= <>
##$DPNAME5= <>
##$DPNAME6= <>
##$DPNAME7= <>
##$DPOAL= (0..7)
0.5 0.5 0.5 0.5 0.5 0.5 0.5 0.5 
##$DPOFFS= (0..7)
0 0 0 0 0 0 0 0 
##$DQDMODE= 0
##$DR= 18
##$DS= 0
##$DSLIST= <SSSSSSSSSSSSSSS>
$$ [...]
##$SUBNAM2= <"">
##$SUBNAM3= <"">
##$SUBNAM4= <"">
##$SUBNAM5= <"">
##$SUBNAM6= <"">
##$SUBNAM7= <"">
##$SUBNAM8= <"">
##$SUBNAM9= <"">
##$SW= 18.0517328524113
##$SWIBOX= (0..15)
0 0 2 0 0 0 0 0 0 0 0 0 0 0 0 0 
##$SW_h= 3612.71676300578
##$TD= 16384
##$TD0= 1
##$TE= 0
##$TE2= 300
##$TE3= 300
##$TEG= 300
##$TL= (0..7)
0 120 120 120 120 120 120 120 
##$TP= (0..7)
150 150 150 150 150 150 150 150 
##$TP07= 0
##$TPNAME0= <>
##$TPNAME1= <>
##$TPNAME2= <>
##$TPNAME3= <>
##$TPNAME4= <>
##$TPNAME5= <>
##$TPNAME6= <>
##$TPNAME7= <>
##$TPOAL= (0..7)
0.5 0.5 0.5 0.5 0.5 0.5 0.5 0.5 
##$TPOFFS= (0..7)
0 0 0 0 0 0 0 0 
##$TUNHIN= 0
##$TUNHOUT= 0
##$TUNXOUT= 0
##$USERA1= <user>
##$USERA2= <user>
##$USERA3= <user>
##$USERA4= <user>
##$USERA5= <user>
##$V9= 5
##$VALIST= <valist>
##$VCLIST= <CCCCCCCCCCCCCCC>
##$VD= 0
##$VDLIST= <DDDDDDDDDDDDDDD>
##$VPLIST= <PPPPPPPPPPPPPPP>
##$VTLIST= <TTTTTTTTTTTTTTT>
##$WBST= 1024
##$WBSW= 4
##$XGAIN= (0..3)
0 0 0 0 
##$XL= 0
##$YL= 0
##$YMAX_a= 87403
##$YMIN_a= -115640
##$ZGOPTNS= <>
##$ZL1= 120
##$ZL2= 120
##$ZL3= 120
##$ZL4= 120
##$ABSF1= 10
##$ABSF2= 0
##$ABSG= 5
##$ABSL= 3
##$ALPHA= 0
##$AQORDER= 0
##$ASSFAC= 0
##$ASSFACI= 0
##$ASSFACX= 0
##$ASSWID= 0
##$AUNMP= <proc_1d>
##$AZFE= 0.1
##$AZFW= 0.1
##$BCFW= 1
##$BC_mod= 2
##$BYTORDP= 1
##$COROFFS= 0
##$CY= 11.3945322036743
##$DATMOD= 1
##$DC= 2
##$DFILT= <>
##$DTYPP= 0
##$F1P= 15.7292609196834
##$F2P= 12.9074282941183
##$FCOR= 0.5
##$FTSIZE= 0
##$FT_mod= 4
##$GAMMA= 1
##$GB= 0.15
##$INTBC= 1
##$INTSCL= 1
##$ISEN= 128
##$LB= 0.24
##$LEV0= 0
##$LPBIN= 0
##$MAXI= 10000
##$MC2= 0
##$MEAN= 0
##$ME_mod= 0
##$MI= 1.114404
##$NCOEF= 0
##$NC_proc= 0
##$NLEV= 6
##$NOISF1= 3.799351
##$NOISF2= 2.8
##$NSP= 1
##$NTH_PI= 0
##$NZP= 0
##$OFFSET= 15.70392
##$PC= 1
##$PHC0= -24596.91
##$PHC1= 16.65271
##$PH_mod= 1
##$PKNL= yes
##$PPARMOD= 0
##$PSCAL= 0
##$PSIGN= 0
##$REVERSE= no
##$SF= 200.130013532006
##$SI= 16384
##$SIGF1= 3
##$SIGF2= 2
##$SINO= 400
##$SIOLD= 16384
##$SREGLST= <1H.CDCl3>
##$SSB= 0
##$STSI= 0
##$STSR= 0
##$SW_p= 3612.71676300578
##$SYMM= 0
##$S_DEV= 0
##$TDeff= 0
##$TDoff= 0
##$TI= <>
##$TILT= no
##$TM1= 0
##$TM2= 0
##$TOPLEV= 0
##$USERP1= <user>
##$USERP2= <user>
##$USERP3= <user>
##$USERP4= <user>
##$USERP5= <user>
##$WDW= 1
##$XDIM= 8192
##$YMAX_p= 0
##$YMIN_p= 0
$$ End of Bruker specific parameters
$$ ---------------------------------
##NTUPLES= NMR FID
##VAR_NAME=  TIME,          FID/REAL,        FID/IMAG
##SYMBOL=    X,             R,               I
##VAR_TYPE=  INDEPENDENT,   DEPENDENT,       DEPENDENT
##VAR_FORM=  AFFN,          ASDF,            ASDF
##VAR_DIM=   8192,          8192,            8192
##UNITS=     SECONDS,       ARBITRARY UNITS, ARBITRARY UNITS
##FACTOR=    0.0002768,     1,               1
##FIRST=     0,             0,               0
##LAST=      2.2672688,     0,               0
##MIN=       0,             -115640,         0
##MAX=       2.2672688,     87403,           0
$$ Real data points
##PAGE= N=1
##DATA TABLE= (X++(R..R)), XYDATA
$$ plain form
0 0 0 0 0 0 0 0 0 0 0 0 0 0 0 0 0 0 0 0 1 -8 8 -8 8 -8 8 -11 16 -16 17 -24 24 -27 32 -35 41 -47 50 -57 65 -72 80
41 80 -88 97 -108 120 -132 146 -161 177 -196 215 -238 262 -289 319 -354 393 -437 493 -554 629
61 629 -721 842 -998 1215 -1541 2078 -3137 6021 -30076 -96442 -11354 83645 -4767 -115640
75 -115640 -24882 30368 -15865 -39379 -14338 30792 -2911 -59796 -1619 43213 13337 -11506
87 -11506 -17151 -4545 -17950 -32730 23421 30217 -44555 -62418 -12028 16479 -19261 -51433 1011
100 1011 32745 -20407 -47058 -3004 48372 37715 -21605 -18281 37087 36648 -11909 -23369 27213
113 27213 53781 -5107 -46273 -5417 28075 6389 -17807 -636 20660 -1607 -17174 13470
125 13470 35275 19892 5914 17547 25118 4269 3725 42159 41388 -13470 -31213 17092 38252
$$ packed form
0@%%%%%%%%%%%%%%%%%%JrJ6j6J6j6J6j9K7l2L3m1M8n1N9o7P6q8R7j07J22j37J52
41H0j68J85k05K28k52K78l07L38l73M11m53N00n51O08o73P47q30R30j047J183
61F29j350J563j840K213k756L619n215R158l6097o6366Q5088R4999q8412j10873
75a15640R0758N5250m6233k3514K5041M5130l3703n6885N8177M4832k9876k4843
87a1506n645J2606j3405j4780N6151O796p4772j7863N0390K8507l5740l2172N2444
100A011L1734n3152k6651M4054N1376j0657n9320L324N5368m39m8557j1460N0582
113B7213K6568n8888m1166M0856L3492k1686k4196J7171K1296k2267j5567L0644
125A3470K1805j5383j3978J1633P571k0849n44L8434p71n4858j7743M8305K1160
$$ plain form
138 38252 -13675 -39946 13149 35758 -25007 -57884 38 48992 8005 -41106 -8653 37081
150 37081 13209 -27427 -6720 36633 20281 -27776 -26511 7338 5070 -19315 -15404 -2006 -18959
163 -18959 -38447 -19587 1917 -12373 -24632 -3662 9293 -13564 -26707 5190 33518 7569
175 7569 -29317 -13270 26825 17145 -25365 -21124 22391 16909 -35348 -41621 9588 28612 -11662
188 -11662 -31631 2027 25328 1837 -15328 11309 36000 17099 -7970 5401 27643 18218
200 18218 2526 13568 20107 -5070 -17507 9000 21085 -8054 -18346 12883 21458 -15407
212 -15407 -24201 22091 42380 -153 -26721 11030 43162 11269 -22580 5503 38753 8591
224 8591 -36349 -17683 24494 10904 -29853 -23901 7077 -1369 -28159 -16955 10573 3409 -17388
$$ packed form
138C8252n1927k6271N3095K2609o0765l2877N7922M8954m0987m9111L2453M5734
150C7081k3872m0636K0707M3353j6352m8057J265L3849k268k4385L911J3398j6953
163a8959j9488J8860K1504j4290j2259K0970J2955k2857j3143L1897K8328k5949
175G569l6886J6047M0095r680m2510M241M3515n482n2257o273N1209J9024m0274
188a1662j9969L3658K3301k3491j7165K6637K4691j8901k5069J3371K2242r425
200A8218j5692J1042O539k5177j2437K6507J2085k9139j0292L1229Q575l6865
212a5407q794M6292K0289m2533k6568L7751L2132l1893l3849K8083L3250l0162
224H591m4940J8666M2177j3590m0757N952L0978q446k6790J1204K7528p164k0797
$$ plain form
237 -17388 -9326 8691 942 -11125 3463 17118 -2561 -24913 -9007 15629 -301 -29980
249 -29980 -17228 12042 -3206 -40260 -26564 18651 14987 -28625 -28047 16445 24284 -12298 -17577
262 -17577 20611 30599 -5425 -18983 11517 26803 1802 -13535 4167 11209 -9011 -13943 6892
275 6892 12466 -6868 -8615 11600 12696 -6475 -790 26546 24657 -4590 -6061 24435 29820 -139
289 -139 -10175 15176 22985 -6345 -23230 971 21523 1559 -23484 -11379 12651 6140 -14595
302 -14595 -8169 15071 13527 -8355 -9714 10994 15525 -2150 -7690 4305 3282 -13056 -12815 2764
316 2764 -579 -19771 -17706 141 -4947 -24437 -14985 11907 5808 -22658 -17331 16971 17640 -14908
330 -14908 -16489 16593 19858 -16176 -23733 11038 21102 -12934 -27703 -478 13148 -11192 -21752
$$ packed form
237a7388Q062J8017p749j2067J4588J3655j9679k2352J5906K4636j5930k9679
249b9980J2752K9270j5248l7054J3696M5215l664m3612N78M4492P839l6582n279
262a7577L8188R988l6024j3558L0500J5286k5001j5337J7702P042k0220m932K0835
275F892N574j9334j747K0215J096j9171N685K7336j889k9247j471L0496N385k9959
289a39j0036K5351P809k9330j6885K4201K0552j9964k5043J2105K4030o511k0735
302a4595O426K3240j544k1882j359K0708M531j7675n540J1995j023j6338K41J5579
316B764l343j9192K065J7847n088j9490R452K6892o099k8466N327L4302O69l2548
330a4908j581L3082L265l6034p557L4771J0064l4036j4769K7225J3626k4340j0560
$$ plain form
343 -21752 2598 15527 -4372 -14083 6098 17555 3451 -2180 14434 18404 391 -3765 15786
356 15786 20328 -1446 -9568 9007 14640 -7296 -16250 6720 19662 -2407 -18929 1373 22447
369 22447 7500 -12255 2236 25104 13869 -10880 -2727 22636 16066 -10419 -10571 9619 7009
382 7009 -14368 -13514 5552 2936 -16892 -15809 3041 2256 -13834 -9358 10547 5810 -15276 -8580
396 -8580 16506 11555 -16000 -13305 13966 8320 -22834 -19797 11364 9253 -24488 -26219 5195
409 5195 10213 -17858 -21543 7112 14638 -10142 -16196 9386 19794 -861 -10003 8939 15830
422 15830 -3306 -9146 9133 12991 -7238 -12462 5353 8584 -9163 -9978 9472 12556 -5910
435 -5910 -8463 11238 19316 3640 -4656 10283 21386 7563 -7266 4915 20482 8114 -12741
$$ packed form
343b1752K4350J2929j9899r711K0181J1457j4104n631J6614L970j8013m156J9551
356A5786M542k1774q122J8575N633k1936q954K2970J2942k2069j6522K0302K1074
369B2447j4947j9755J4491K2868j1235k4749Q153K5363o570k6485j52K0190k610
382G009k1377Q54J9066k616j9828J083J8850p85j6090M476J9905m737k1086O696
396h580K5086m951k7555K695K7271n646l1154L037L1161k111l3741j731L1414
409E195N018k8071l685K8655P526k4780o054K5582J0408k0655r142J8942O891
422A5830j9136n840J8279L858k0229n224J7815L231j7747q15J9450L084j8466
435e910k553J9701Q078j5676q296J4939J1103j3823j4829J2181J5567j2368k0855
$$ plain form
448 -12741 -5234 13028 5767 -13546 -8136 9402 4746 -12356 -8707 9481 9185 -5754 -5178 10138
462 10138 9896 -5658 -5147 11845 9513 -11619 -12142 6661 4260 -17646 -15175 6350 2663 -21802
476 -21802 -19220 5980 6155 -15668 -14881 8500 10729 -9962 -12327 8265 13880 -5489 -13396 2890
490 2890 10808 -5522 -14608 -231 7250 -7220 -15666 -1778 6998 -3890 -10370 1973 10390 1056
504 1056 -5277 6416 15651 6188 -5043 4154 17016 7436 -7415 901 16666 5385 -14542
517 -14542 -6004 15079 7237 -13627 -6016 15714 9636 -11544 -4527 18730 15143 -6719 -4320
530 -4320 16885 14788 -7130 -6273 14689 11291 -12734 -12125 9586 6492 -16358 -13543 8752 4454
544 4454 -17446 -12043 10780 6884 -13504 -9454 11710 9341 -10295 -9868 9545 9198 -11302 -14773
$$ packed form
448a2741P507J8262p261j9313N410J7538m656j7102L649J8188k96j4939N76J5316
462A0138k42j5554N11J6992k332k1132n23J8803k401k1906K471K1525l687k4465
476b1802K582K5200J75k1823P87K3381K229k0691k365K0592N615j9369p907J6286
490B890P918j6330r086J4377P481j4470q446J3888Q776j0888o480J2343Q417r334
504A056o333J1693R235r463j1231R197J2862r580j4851Q316J5765j1281j9927
517a4542Q538K1083p842k0864P611K1730o078k1180P017K3257l587k1862K399
530d320K1205k097k1918Q57K0962l398k4025O09K1711l094k2850K815K2295m298
544D454k1900N403K2823l896k0388M050K1164k369j9636M27J9413l47k0500l471
$$ plain form
558 -14773 4255 7897 -12170 -17917 454 4999 -13144 -17047 1883 7708 -7422 -11867 3166
571 3166 9412 -2194 -6477 5203 11724 679 -7702 1702 11145 1255 -10232 -813 10099 -751
585 -751 -14018 -2335 12382 2649 -10873 -10 15088 6288 -7081 1861 17187 10508 -4777
598 -4777 412 15764 11193 -6167 -4142 11658 8108 -10238 -8402 9968 7364 -11273 -8430 9798
612 9798 7326 -9508 -5584 12218 9045 -7750 -4952 11488 9364 -6599 -6837 7250 6011 -10664
626 -10664 -12475 2937 5073 -11295 -14550 619 4109 -10412 -13503 2260 6960 -5994 -9924
639 -9924 2780 8432 -2429 -8133 1392 7694 -1708 -10153 -2309 6051 -1604 -12001 -5380 5356
653 5356 -1122 -12033 -4212 8613 2943 -9096 -1776 12466 7328 -6001 -518 13696 8722 -6561
$$ packed form
558a4773J9028L642k0067n747J8371M545j8143l903J8930N825j5130m445J5033
571C166O246j1606m283J1680O521j1045q381R404R443r890j1487R419J0912j0850
585g51j3267J1683J4717r733j3522J0863J5098q800j3369Q942J5326o679j5285
598d777N189J5352m571j7360K025J5800l550j8346J836J8370k604j8637K843J8228
612I798k472j6834L924J7802l173j6795K798J6440k124j5963k38J4087j239j6675
626a0664j811J5412K136j6368l255J5169L490j4521l091J5763M700j2954l930
639i924J2704N652j0861n704R525O302r402q445P844Q360p655j0397O621J0736
653E356o478j0911P821J2825n670j2039P320J4242n138j3329N483J4214m974j5283
$$ plain form
667 -6561 -2704 13035 8782 -8555 -6288 10237 7657 -10037 -7289 11472 9180 -8992 -6545 12764
681 12764 11060 -6470 -3569 14052 12113 -5300 -4486 12062 10768 -6510 -7878 7186 7529 -9046
695 -9046 -11159 5040 7061 -9380 -12350 4206 7646 -7523 -10463 5204 9678 -4919 -9318 4352
709 4352 9849 -3895 -10724 763 7345 -5225 -13831 -2197 6485 -5219 -15633 -4045 7253
722 7253 -3860 -13936 -1414 10588 -571 -11302 711 12629 1762 -10037 597 11902
734 11902 1730 -10442 -1262 10902 1380 -11674 -3209 9603 1741 -10599 -2109 11495 4586
747 4586 -8032 -392 13447 7244 -4951 869 12823 7204 -4582 -190 10094 6015 -5615
760 -5615 -3503 6350 4548 -6033 -5278 5059 5540 -4579 -5643 5071 7530 -2269 -5017 5238
$$ packed form
667f561L857J5739m253j7337K267J6525k580j7694K748J8761k292j8172K447J9309
681A2764j704j7530K901J7621j939j7413Q14J6548j294j7278j368J5064L43j6575
695i046k113J6199K021j6441k970J6556L440j5169k940J5667M474j4597m399J3670
709D352N497j3744o829J1487O582j2570q606J1634Q682j1704j0414J1588J1298
722G253j1113j0076J2522J2002j1159j0731J2013J1918j0867j1799J0634J1305
734A1902j0172j2172R180J2164r522j3054Q465J2812p862j2340Q490J3604o909
747D586j2618P640J3839o203j2195N820J1954n619j1786M392J0284m079j1630
760e615K112R853j802j0581P55J0337M81j0119j064J0714K459r799k748J0255
$$ plain form
774 5238 8508 -1491 -6257 3231 7977 -2901 -9563 -502 5720 -4089 -11764 -2533 5468 -3969 -12401
789 -12401 -2800 6968 -1543 -11060 -1832 9337 403 -10323 -1247 9873 1077 -11075 -2987 8733
803 8733 -111 -12603 -4427 7720 -244 -12590 -4921 7923 1748 -10381 -2870 10298 4173 -7366
817 -7366 -1116 11495 6270 -6017 -1514 10397 6189 -6174 -2921 8624 5017 -6919 -4747 7192
831 7192 5222 -5565 -4137 7328 7046 -3297 -3173 7389 8828 -1244 -2953 6380 8834 -1237
845 -1237 -5181 3759 7936 -2629 -8516 780 6929 -2904 -10053 -438 7941 -2273 -10493 -354
859 -354 9383 -143 -10016 -403 10165 652 -10435 -1092 9831 -228 -12736 -3658 8649 -1342
873 -1342 -13865 -4478 8399 -1671 -13878 -3703 9393 226 -11809 -1697 10944 2100 -9943
$$ packed form
774E238L270r999m766R488M746j0878o662R061O222r809p675R231Q001r437q432
789a2401R601R768q511r517R228J1169q934j0726R076J1120q796j2152Q088J1720
803H733q844j2492Q176J2147p964j2346P669J2844o175j2129P511J3168o125j1539
817g366O250J2611n225j2287M503J1911m208j2363L253J1545l607j1936K172J1939
831G192j970j0787J428J1465k82j0343J24J0562J439j0072j709R333K454j0071
845a237l944Q940M177j0565n887R296O149r833p149R615Q379j0214q220J0139
859c54R737r526r873R613J0568r513j1087R343J0923j0059j2508R078J2307r991
873a342j2523R387J2877j0070j2207J0175J3096r167j2035J0112J2641q844j2043
$$ plain form
886 -9943 -759 10996 2197 -9744 -1849 9687 1898 -9834 -2984 8414 1777 -9506 -2910 8150
900 8150 2992 -6658 -1229 8761 4938 -4014 -212 8302 6122 -2501 -1033 6687 6170 -2206 -2914 4748
916 4748 5507 -3051 -5218 2903 5526 -2623 -5795 2851 6739 -1122 -5027 2671 7792 421 -5570
931 -5570 1560 7755 700 -7496 -920 6778 -542 -9679 -3050 6153 -922 -10341 -3327 5810 -736
946 -736 -9834 -2423 6824 472 -7947 -1867 6670 1281 -7625 -2772 6422 1566 -8258 -4425 5554
961 5554 1504 -8930 -5390 5723 2285 -8362 -4730 6684 4101 -6326 -3565 7260 5889 -4155
975 -4155 -3260 6670 6461 -3194 -4287 5339 6987 -3104 -5836 3559 6796 -3366 -6221 4371 7864
990 7864 -2150 -5625 4955 8777 -1275 -4785 5072 8685 -939 -5596 3362 8350 -825 -7170
$$ packed form
886i943R184J1755q799j1941P895J1536p789j1732O850J1398o637j1283O596J1060
900H150n158r650N429R990l823q952L802Q514k180q623J468P720n17q376p08P662
916D748P59q558k167Q121K623q149l172Q646L888p861l905P698N121p371n991
931e570P130O195p055q196O576P698p320r137O629R203p075r419P014R137o546
946g36r098P411R247o352q419O080Q537n389q906M853R194m856r824L833R979
961E554m050j0434L540J1113l438j0647L632J1414k583j0427K761J0825j371j0044
975d155Q95R930k09r655j093R626J648j0091k732R395L237j0162k855J0592L493
990G864j0014l475J0580L822j0052l510R857L613r624m657Q958M988r175o345
$$ plain form
1004 -7170 1150 7517 -1591 -8983 -536 7601 -1076 -9164 -493 7732 -399 -8319 -173 8278 427
1019 427 -7590 -633 7510 358 -8202 -2511 5805 41 -8764 -3813 4832 36 -9410 -4094 5349
1034 5349 1490 -8442 -3470 6553 2736 -6937 -3135 6898 3821 -5823 -3617 5795 4167 -5630
1048 -5630 -5034 4494 4787 -5001 -6104 3996 5400 -4268 -5576 5157 6910 -3248 -4421 5851
1062 5851 7814 -2208 -4042 5735 7306 -2128 -4652 4522 6725 -2514 -5985 3028 6759 -2678 -7006
1077 -7006 2861 7368 -2276 -6577 3353 8182 -1610 -6071 3011 7044 -973 -5570 1906 5633 -1144
1092 -1144 -6371 -659 4175 -1073 -6283 -2037 3509 -335 -5905 -2248 3488 528 -5316 -2155 4048
1107 4048 1450 -4439 -2609 3420 1880 -3917 -3831 2363 2460 -4077 -5300 1608 3586 -3582 -6587 1803
$$ packed form
1004g170Q320O367r108p392Q447Q137q677q088Q671Q225q131p920Q146Q451p851
1019D27q017O957Q143p152q560N691Q316n764q805M951Q645m796r446N316R443
1034E349l859r932M972J0023l817r673L802J0033l077r644K206R412j628r797
1048e630N96R528K93r788j103J0100J404r668j308J0733J753j0158j173J0272
1062E851J963j0022j834R777J571r434k524R174K203r239l471R013L731r437m328
1077g006R867M507r644m301R930M829r792m461R082M033q017m597P476L727o777
1092a144n227N712M834n248n210M246N546l844n570L657N736k960n844L161O203
1107D048k598n889J830O029j540n797Q6O194R7o537j223O908J978p168l005Q390
$$ plain form
1123 1803 5100 -3088 -6109 2936 7097 -1959 -5943 3688 7687 -2030 -6217 3200 7527 -1833 -6325
1138 -6325 2629 7308 -2410 -6953 2570 7666 -1488 -6570 2790 8668 -840 -6590 3261 9189 -707
1153 -707 -6201 2947 8226 -704 -6296 1671 6940 -748 -6662 158 5580 -483 -6247 -688 5709
1168 5709 438 -6020 -1322 5515 1338 -5450 -1154 5455 1640 -5734 -2319 4382 1256 -5764 -3481
1183 -3481 3403 1497 -5864 -4448 3117 2586 -5237 -5023 3551 3958 -4685 -4939 4380 4805 -4366 -4999
1199 -4999 3915 5058 -3836 -5582 3199 5363 -3898 -5998 3040 5347 -3116 -5959 2931 6271 -2369
1214 -2369 -5524 3538 7167 -1735 -4829 3783 7175 -1382 -4976 3216 6696 -1301 -5127 2231 6033
1229 6033 -1126 -5107 1381 5870 -621 -5063 1078 5708 310 -4638 769 5522 862 -4308 270
$$ packed form
1123A803L297q188l021R045M161r056l984R631L999r717m187R417M327r360m492
1138f325Q954M679r718m543R523N096r154n082R360N878r508n750R851N928r896
1153g07n494R148N279q930n592P967N269p688n914O820N422o063n764N559O397
1168E709n271o458M698O837m177o788M296O609l815p374L415O701l126p020K283
1183c481O884j906p361J416P565n31p823K14Q574M07q643k54R319M25r171o33
1199d999Q914J143q894j746Q781K164r261k100R038K307q463k843Q890L340q640
1214b369l155R062L629q902l094Q612L392q557l594Q192L480p997l826P358L802
1229F033p159l981O488M489o491m442O141M630n398m948N407M753m660n170M578
$$ plain form
1244 270 5087 708 -4290 -1116 3785 635 -4808 -2317 2954 845 -4295 -2880 3012 1929 -3854
1259 -3854 -3386 2972 3045 -3413 -4058 2997 3311 -3330 -4620 2099 3558 -3650 -5169 1834 3662 -3374
1275 -3374 -5511 1640 4203 -2622 -5268 1835 5209 -1647 -5050 2397 5423 -1404 -4611 2054 5745
1290 5745 -1095 -4974 1783 5889 -869 -5125 1382 5569 -643 -4695 980 5310 401 -4488 1100
1305 1100 5708 1155 -4148 137 5640 1630 -3990 -602 5363 1960 -4463 -1737 4656 1912 -4898
1320 -4898 -2535 4349 2652 -4594 -3076 4303 3172 -4600 -3289 4358 3425 -4572 -3863 3937 3651 -4726
1336 -4726 -4666 3298 3544 -5015 -4922 3114 3848 -4864 -5639 3280 4142 -4498 -5239 3511 4516 -3679 -4805
1353 -4805 3549 4569 -3310 -4642 2694 4096 -2994 -4814 2621 4419 -2577 -4604 2099 4543 -1931
$$ packed form
1244B70M817m379m998L174M901l150n443K491N271k109n140J415N892j083n783
1259c854M68O358P3o458o45P055L14o641j290O719J459p208j519P003J828p036
1275c374k137P151K563o825k646P103L374o856l403P447L026o827l207O665L691
1290E745o840l879O757M106o758m256O507M187o212m052N675M330m909m889N588
1305A100M608m553n303M285N503m010n620L388N965l403o423K726O393k744o810
1320d898K363O884j697p246J518P379j131p772J311P647r33p997P09P800k86q377
1336d726O0P964K46q559R3Q036P34q712p75Q919Q62q640p41Q750J005q195j126
1353d805Q354J020p879j332P336J402p090j820P435J798o996k027O703K444o474
$$ plain form
1368 -1931 -4228 2065 4711 -950 -3758 1864 4831 -24 -3439 1331 4751 582 -3603 571 4213
1383 4213 570 -3563 -184 4078 1328 -3493 -923 4251 1848 -3413 -1222 4245 2036 -3068 -1680
1398 -1680 4188 2349 -3496 -2181 3516 2390 -3430 -3127 2978 2328 -3304 -3339 2695 2946 -3585 -3934
1414 -3934 2640 2821 -3668 -4125 2486 3088 -3140 -4044 2106 3201 -2683 -4227 1621 3400 -2199 -4624
1430 -4624 890 3517 -1919 -4326 825 4294 -1357 -4229 849 4308 -582 -3816 906 3995 -314
1445 -314 -3236 441 3944 251 -3618 -413 3750 890 -3691 -756 4192 1831 -3839 -1189 4813
1460 4813 1985 -3589 -1418 4582 2513 -3365 -1544 4077 2546 -3409 -2104 3752 3055 -3338 -2782
1475 -2782 3276 2954 -3383 -3526 3476 3462 -3436 -3503 3621 3371 -3562 -3637 3189 3534 -3421 -3898 2631 3289
$$ packed form
1368a931k297O293K646n661k808N622K967m855l415M770L420m169m185M174L642
1383D213l643m133L379M262k750m821K570N174k403n261K191N467k209n104J388
1398a680N868j839n845J315N697j126n820L03O105o50n632l5O034K51o531l49
1414c934O574J81o489m57O611O02o228r04O150J095n884j544N848J779n599k425
1430d624N514K627n436k407N151L469n651k872N078L459m890l234M722L089m309
1445c14k922L677L503l693l869L205M163k860m581K935M948k361n670K650O002
1460D813k828n574K171O000k069n878J821N621j531n955J305N856o97o393N56
1475b782O058l22o337j43P002j4o898o7P124k50o933p5O826L45o955m77O529O58
$$ plain form
1493 3289 -3028 -4196 2011 3397 -2807 -4675 1548 3516 -2237 -4431 1288 3825 -1987 -4426 1329
1508 1329 4032 -1463 -4095 1254 3738 -1104 -3788 863 3429 -602 -3662 135 4056 -150 -3828
1523 -3828 -153 4012 785 -3760 -182 4617 1115 -4178 -341 4749 1390 -3835 -612 4189 1344
1538 1344 -3627 -986 3935 1557 -3192 -1374 3709 2024 -3357 -1370 3728 2033 -2916 -1430 3584
1553 3584 2006 -3207 -1557 3561 1896 -2829 -1662 2718 1593 -2982 -2309 2201 1942 -2019 -2778 1555
1569 1555 2387 -1670 -2901 1121 2599 -1054 -3148 455 2499 -578 -2912 -44 2649 -393 -2868
1584 -2868 -487 2522 204 -2873 -844 2771 539 -3310 -1124 3392 1015 -3538 -971 3830 972
1599 972 -3881 -1096 4128 1281 -4012 -1323 4374 1743 -3802 -1823 3929 2589 -3525 -2207 3965
$$ packed form
1493C289o317j168O207J386o204j868O223J968n753k194N719K537n812k439N755
1508A329K703n495k632N349K484m842k684M651K566m031l060L797L921m206l678
1523c828L675M165l227m545L578M799l502n293L837N090l359n225L223M801k845
1538A344m971K641M921k378m749J818N083j685n381J987N098j695m949J486N014
1553C584j578n213J650N118j665m725J167M380j125m575O73M510k59l961p59M333
1569A555Q32m057j231M022J478l653k094L603K044l077k334K868K693l042k475
1584b868K381L009k318l077K029L615k232l849K186M516k377m553K567M801k858
1599I72m853K785N224k847n293K689N697k631n545J979N752j340o114J318O172
$$ plain form
1614 3965 3016 -3566 -2369 3595 2975 -3123 -2157 3589 2589 -3203 -2095 3092 2429 -2768 -1799 3068
1630 3068 2195 -2826 -1806 2771 2159 -2507 -2397 2331 2434 -2097 -2847 2248 2976 -2036 -3628 1484
1646 1484 3107 -1811 -3551 1198 2966 -1228 -3427 170 2995 -484 -3278 -444 2763 115 -3094
1661 -3094 -524 2866 526 -3257 -538 2933 188 -3468 -834 3527 293 -3984 -552 4016 740
1676 740 -4142 -942 3821 943 -3835 -1312 4247 1849 -3803 -1740 3997 2323 -3841 -1701 3663
1691 3663 2279 -3091 -1812 3356 1992 -2940 -1359 3264 2032 -2660 -1413 2962 1480 -2551 -1139
1706 -1139 2645 1449 -2378 -1361 2694 1498 -2452 -1974 2633 1935 -2092 -2210 1621 2515 -1622 -2566
1722 -2566 918 2240 -608 -2647 116 2432 -85 -2744 -565 1944 491 -2322 -698 1604 718
$$ packed form
1614C965r49o582J197N964o20o098R66N746j000n792J108N187o63n197R69M867
1630C068q73n021J020M577o12m666J10M728J03m531p50N095P28n012j592N112
1646A484J623m918j740M749J768m194k199L597K825l479k794K834L207k648l209
1661c094K570L390k340l783K719L471k745l656K634M361l234m277L432M568l276
1676G40m882L200M763k878m778K523N559k398n652K063N737j674o164K140N364
1691C663j384n370J279N168j364m932J581M623j232m692J247M375j482m031J412
1706a139L784j196l827J017M055j196l950M78M607o98m027j18L831Q94m137r44
1722b566L484J322k848k039K763K316k517k659K179K509j453k813J624K302q86
$$ plain form
1737 718 -2444 -910 1862 166 -2336 -413 2246 298 -2581 -664 2340 786 -2778 -1175 2998
1752 2998 1005 -3572 -1411 3268 1831 -3073 -1957 3224 2235 -2773 -2344 2948 2707 -2161 -2490 2468
1768 2468 2613 -1627 -2278 1471 2656 -1567 -1918 1738 2088 -1415 -1743 1803 2137 -1417 -1843 1969 2598
1785 2598 -1755 -2487 2113 3049 -1635 -3070 1690 3523 -1341 -3397 1005 3496 -1018 -3924 -15
1800 -15 3381 -25 -3491 -260 2950 296 -3239 -690 2959 101 -2841 -375 2430 -162 -2697
1815 -2697 -96 2479 -214 -3064 48 2854 -216 -3158 21 3083 77 -3528 -848 3208 993
1830 993 -3453 -1250 3307 1445 -2966 -1947 3006 1878 -2345 -1857 2338 2191 -1668 -1857 1699 1789
1846 1789 -1395 -1622 1372 1863 -1309 -1641 1627 1533 -1272 -1363 1505 1626 -1801 -1764 2094 2277 -1779 -2478
$$ packed form
1737G18l162J534K772j696k502J923K659j948k879J917L004j554l564J603M173
1752B998j993m577K161M679j437m904J116N181r89n008M29N292k41m868l29M958
1768B468J45m240o51L749J185m223l51L656L50l503l28L546L34l554m26L812O29
1785B598m353p32M600R36m684j435M760J833m864k056M402K491m514k906L909
1800a5L396l406l466L231L210k654l535K549L649k858k942K466K805k592k535
1815b697K601K575k693k850L112K806l070k942L179L062l006l605K680M056k215
1830I93m446K203M557j862m411J019M953j128m223M88M195j47l859j89L556R0
1846A789l184k27K994M91l172l32L268r4k805r1K868J21l427L7L858J83m056o99
$$ plain form
1864 -2478 1836 2648 -1463 -2978 1692 3093 -1022 -3031 1063 3245 -628 -3050 -59 2824 70
1879 70 -2913 -519 2581 80 -2455 -352 1990 264 -2059 -248 1845 -389 -2145 62 1955
1894 1955 -406 -1855 230 2278 126 -2549 -48 2533 175 -2665 -867 2322 1129 -2360 -1773
1909 -1773 2163 1654 -1887 -2021 1532 2111 -1259 -1946 734 2128 -357 -1716 349 1776 -119 -1645
1925 -1645 222 1596 -376 -1646 930 1731 -664 -2039 983 2301 -977 -2363 1252 2917 -792
1940 -792 -2748 1151 3479 -651 -3434 154 3766 56 -3593 -384 3708 404 -3432 -686 2996
1955 2996 527 -3036 -827 2777 601 -2624 -386 2237 335 -2007 -272 1909 66 -2163 55
1970 55 2131 -129 -2744 -297 2694 166 -2927 -290 2931 767 -2740 -1248 2712 1523 -2300
$$ packed form
1864b478M314Q12m111j515M670J401m115k009M094K182l873k422K991K883k754
1879G0k983K394L100k501k535K103K342j726k323J811K093k234j756K207J893
1894A955k361j449K085K048k152k675K501K581k358k840J798L189j193l489N87
1909a773L936n09l541j34L553N79l370o87K680J394k485j359K065J427j895j526
1925a645J867J374j972j270K576Q01k395j375L022J318l278j386L615J665l709
1940g92j956L899K328m130k783L588L612l710l649L209M092l304l836K746L682
1955B996k469l563K209L604k176l225K238K623j902k342J735K181j843k229K218
1970E5K076k260k615K447K991k528l093K637L221k164l507J492L960j189l823
$$ plain form
1985 -2300 -1389 2238 1894 -2021 -1849 1361 1602 -1021 -1859 800 1784 -806 -1911 926 1370 -1034 -1351
2002 -1351 1120 1376 -1345 -1415 1574 1186 -1345 -1383 1846 2063 -1336 -2066 1318 2617 -984 -2621 751
2019 751 2583 -544 -2907 29 3038 -266 -2736 -130 2812 92 -2265 -237 1875 510 -1778
2034 -1778 -329 1519 221 -1722 -646 1386 335 -1656 -210 1598 -71 -2099 -144 1895 165
2049 165 -2254 -308 2240 496 -2271 -988 1809 984 -1911 -1501 1410 1599 -1582 -1970 1240 2161
2065 2161 -1141 -2100 488 1883 -504 -2056 583 1889 -284 -1341 575 1323 -561 -1304 420 1497
2081 1497 -669 -1364 700 1713 -1002 -2157 646 2163 -601 -2542 447 2676 -440 -2853 162
2096 162 2941 -34 -2668 -306 2610 546 -2115 -577 2200 957 -1731 -797 1559 786 -1624 -863
$$ packed form
1985b300R11L627l44l915J72L210K41k623q38K659R84k590j105K837M44k404l17
2002a351K471K56k721p0K989l88k531l8L229K17l399p30L384J299l601j637L372
2019G51J832l127k363K936L009l304k470K606K942k720k357K028K112j365k288
2034a778J449J848j298j943J076K032j051j991J446J808j669k028J955K039j730
2049A65k419J946K548j744k767J283K797q25k895M10K911J89l181l88L210R21
2065B161l302r59K588J395k387j552K639J306k173j057J916P48j884p43J724J077
2081A497k166o95K064J013k715j155K803J517k764j941K989K229l116k413L015
2096A62K779k975k634K362K916k064k661J538K777j243k688R34K356p73k410P61
$$ plain form
2112 -863 1573 688 -1740 -611 1694 703 -1589 -664 2065 459 -1920 -524 1837 762 -2042 -1236
2128 -1236 2102 1359 -2088 -1792 1978 1959 -1573 -1843 1650 1961 -1723 -2303 1420 2169 -1085 -2076 1141
2145 1141 2197 -789 -1650 880 1599 -985 -1542 1056 1534 -1087 -1376 1044 1849 -1414 -1831 1471 1982
2162 1982 -1490 -2037 1140 2173 -1052 -2196 897 2455 -558 -2107 201 2098 -137 -1876 109
2177 109 1543 367 -1585 -389 1654 510 -1339 -512 949 345 -829 -67 1253 423 -1116 -418
2193 -418 1165 622 -1128 -187 1476 930 -1284 -794 1564 806 -1732 -1066 1458 1382 -1289 -1442 1289
2210 1289 1500 -1151 -1739 1018 1589 -836 -1803 649 1730 -467 -1721 383 1491 -248 -1405 349
2226 349 1347 -519 -1486 594 1131 -639 -1599 630 1652 -441 -1664 385 1834 -562 -1789 172
$$ packed form
2112h63K436q85k428J129K305r91k292R25K729j606k379J396K361j075k804Q06
2128a236L338p43l447K96L770j9l532k70L493L11l684n80L723P49l254r91L217
2145A141J056k986q61K530P19k584n57K598M78k621k89K420Q05l263m17L302N11
2162A982l472n47L177J033l225j144L093J558l013j549K308J897k235j739J985
2177A09J434j176j952J196K043j144j849Q27J461o04j174P62J320q30j539O98
2193d18J583n43j750R41J663n46k214M90K358p58k538O66K524p6k671j53K731
2210A289K11k651n88K757N71k425r67K452J081k197j254K104J108j739j157J754
2226C49R98j866r67K080N37j770r60K229J022k093j223K049J449k396j227J961
$$ plain form
2242 172 1864 98 -1978 -317 2184 423 -1873 -678 1828 651 -1790 -807 1675 820 -1511 -1117
2258 -1117 1381 893 -1632 -694 1146 774 -1404 -586 1476 788 -1651 -750 1595 1077 -1526 -998 1815
2275 1815 942 -1588 -1217 1705 1435 -1564 -1480 1614 1976 -1231 -1698 1063 1981 -1036 -2016 1102 1892
2292 1892 -588 -1794 739 1604 -827 -1556 453 1384 -496 -1692 661 1426 -755 -1518 818 1503
2308 1503 -500 -1596 921 1682 -668 -1934 395 1964 -393 -1727 73 1794 -55 -1945 -5
2323 -5 1842 169 -1776 -283 1743 424 -1395 -519 1359 359 -1456 -470 1484 396 -1120 -520
2339 -520 1238 720 -1305 -714 1117 287 -1346 -639 1572 719 -1356 -362 1229 984 -1331 -1060 1054
2356 1054 1327 -1037 -1173 1070 1217 -1275 -1282 698 1208 -787 -1331 613 1038 -371 -1041 525 1057 -204
$$ packed form
2242A72J692j766k076J661K501j761k296J195K506j177k441R83K482q55k331L94
2258a117K498m88k525R38J840l72k178Q18K062o88k439R01K345n18k603N28K813
2275A815q73k530L71K922k70k999Q4L094L62l207m67K761R18l017r80L118P90
2292A892k480j206K533Q65k431p29K009R31j880j196K353P65k181p63K336O85
2308A503k003j096K517P61k350j266K329J569k357j334J800J721j849j890J940
2323eJ847j673j945J493K026j319j819Q76J878j000j815R86J954j088j516O00
2339e20J758n18k025N91J831q30j633P07K211q53k075R94J591k45k315K71K114
2356A054K73k364j36K243J47k492pJ980N10j995n44J944M25j409o70J566N32j261
$$ plain form
2374 -204 -1152 346 1136 -241 -806 185 1062 -237 -1222 289 1198 -30 -1325 111 1318 197 -1391
2391 -1391 -272 1465 374 -1322 -399 1491 863 -1445 -936 1425 1062 -1311 -1152 1479 1115 -1287
2407 -1287 -1204 1258 899 -1621 -915 1247 1005 -1253 -1015 1065 1191 -1364 -1015 1371 976 -1322 -1176
2424 -1176 1344 1125 -1218 -1504 1451 1372 -1271 -1382 1061 1086 -1476 -1297 1215 1406 -994 -1227 833
2441 833 1655 -666 -1338 590 1182 -768 -1413 609 1599 -365 -1199 417 1078 -377 -1419 298 1295
2458 1295 -31 -1316 169 1238 -191 -1167 -27 1287 51 -1502 -252 1514 373 -1629 -360
2473 -360 1150 406 -1398 -290 1386 397 -1289 -592 919 789 -1047 -607 1066 651 -1088 -429 1051
2490 1051 789 -951 -926 1275 619 -1330 -1300 1183 669 -1221 -893 1102 806 -913 -1028 860 1072 -734
$$ packed form
2374b04r48J498P90j377n65R91Q77j299r85J511R09j228j295J436J207j121j588
2391a391J119J737j091j696R23J890o28k308N09K361l63k373J59K631l64k402
2407a287Q3K462l59k520P06K162k42k258K38K080J26k555L49K386l95k298J46
2424a176K520k19k343k86K955p9k643j11K443K5k562J79K512J91k400k33K060
2441H33Q22k321o72J928N92j950o45K022R90j964q34J616O61j455j042J717R97
2458A295j326j285J485J069j429r76J140J314j236j553J250J766j141k002J269
2473c60J510p44j804J108J676r89j686O97J511j30j836M40J673m15j739O59J480
2490A051k62j740K5K201o56j949L0K483n14j890L28J995k96j719j15J888K12j806
$$ plain form
2508 -734 -912 919 1186 -708 -1118 683 1277 -491 -1169 651 1320 -497 -967 521 1291 -208 -1115
2525 -1115 389 1073 -47 -1070 202 1153 122 -1005 -83 1228 93 -899 -270 1082 314 -918
2541 -918 -503 1046 243 -1125 -511 1166 188 -909 -431 990 554 -1002 -662 872 629 -907 -764
2558 -764 762 914 -799 -899 802 989 -1195 -893 656 812 -1098 -794 812 1094 -886 -1195 691
2575 691 1225 -495 -1066 560 1287 -489 -1271 590 1425 -443 -1322 622 1490 -495 -1444 127 1465
2592 1465 -268 -1469 437 1590 -119 -1432 199 1475 -304 -1348 319 1327 -75 -1269 -77
2607 -77 1431 157 -1330 126 1310 276 -1298 44 1492 18 -1316 -141 1477 331 -1326
2622 -1326 -201 1179 255 -1043 -268 1150 256 -1367 -590 896 398 -1073 -494 851 632 -1124 -415
$$ packed form
2508g34j78J831K67j894m10J801N94j768o78J820O69j817m70J488P70j499r07
2525a115J504O84j120j023J272R51j031j127R22J311j135r92O29J352p68j232
2541i18M15J549q03j368O14J677r78j097M78J421m36j556L40J534k43j536J43
2558g64J526J52j713j00J701J87k184L02J549J56j910L04J606K82j980l09J886
2575F91N34j720n71J626P27j776p82J861Q35j868q79J944Q68j985r49J571J338
2592A465j733j201J906J153j709j313J631J276j779j044J667J008j402j194J192
2607g7J508j274j487J456J184j034j574J342J448j474j334J175J618j146j657
2622a326J125J380r24j298P75J418q94j623P77J486m98j471N79J345k19j756P09
$$ plain form
2639 -415 854 617 -839 -576 852 511 -831 -749 402 675 -779 -736 519 724 -600 -1184 568 896
2657 896 -448 -882 392 826 -350 -974 193 1046 -74 -854 242 710 -190 -1277 200 1088 104
2674 104 -1327 -40 1018 43 -1027 115 1076 90 -982 132 1000 -27 -881 114 1018 300 -773
2691 -773 -287 904 328 -1035 -204 854 437 -1007 -559 867 190 -774 -490 811 430 -955 -443 809
2709 809 658 -767 -455 722 863 -729 -930 353 671 -594 -906 241 701 -474 -1058 423 981
2726 981 -556 -1112 262 735 12 -1118 267 769 -145 -934 38 1049 -75 -995 -290 940 125 -1077
2744 -1077 -182 1038 174 -1142 -131 1438 398 -1337 64 1495 167 -1287 -180 1260 198
2759 198 -1345 -251 1305 100 -1156 -214 710 287 -893 -60 1040 470 -1250 -501 1350 489 -1302
$$ packed form
2639d15J269k37j456K63J428l41j342Q2J151K73j454M3J255K05j324n84J752L28
2657H96j344m34J274M34j176o24J167Q53j120p80J096M68r00j087J477Q88r84
2674A04j431J287J058r75j070J142R61r86j072J114Q68j027q54R95R04p18j073
2691g73M86J191n76j363Q31J058m17j444M48J426o77r64K84J301l81j385N12J252
2709H09j51j425L12J177J41j592k01J283L18j265l12J147M60j175n84J481N58
2726I81j537n56J374M73p23j130J385N02r14p89R72J011j124r20P05J230q15j202
2744a077Q95J220q64j316J011J569j040j735J401J431j328j454J107J440j062
2759A98j543J094J556j205j256R42R24m23j180Q33J100n70j720P49J851q61j791
$$ plain form
2776 -1302 -352 1175 536 -1073 -768 911 547 -935 -898 909 287 -956 -507 487 615 -669 -888 632
2794 632 689 -798 -547 617 729 -498 -863 698 874 -331 -599 256 527 -314 -761 306 732 -663
2812 -663 -881 169 610 105 -735 -37 919 239 -570 252 1028 162 -1089 -199 847 268 -768 40 892
2831 892 197 -672 -78 612 392 -672 -271 906 180 -829 -270 931 307 -665 -393 808 590 -722
2849 -722 -596 614 397 -629 -543 417 402 -737 -782 259 684 -432 -472 528 784 -320 -594 327 851
2868 851 -273 -927 272 924 -393 -952 196 719 -599 -989 400 777 -553 -752 60 790 67 -777
2886 -777 376 1109 -16 -766 -95 786 71 -657 -69 825 -6 -958 -113 744 33 -844 -127 964 358
2905 358 -721 -192 969 605 -704 -434 899 558 -795 -295 836 615 -899 -575 832 476 -1005
$$ packed form
2776a302R50J527o39j609L05J679l64j482L7J807o22j243M49R94J28j284k19J520
2794F32N7j487K51J164J12j227l65J561J76j205k68Q55K71q41m47J067M26j395
2812f63k18J050M41n05q40O98R56o80q09Q22P76q66j251Q90J046n79j036Q08Q52
2831H92o95q69N94O90k20j064M01J177p26j009N59J201o24r72K72J201k18j312
2849g22J26J210k17j026Q6R60j5j139m5J041M25j116m0J000K56j104k74R21N24
2868H51j124o54J199O52j317n59J148N23j318l90J389L77j330j99Q12P30p23q44
2886g77J153P33j125p50O71Q81p15p28N88Q94q31r52Q45Q57p11q77P17J091o06
2905C58j079N29J161l64j309K70J333l41j353N00J131k21j514L24J407l56j481
$$ plain form
2922 -1005 -773 886 469 -562 -611 675 770 -491 -517 1050 450 -665 -784 581 746 -728 -977 456
2940 456 624 -651 -805 337 705 -422 -836 218 676 -461 -788 216 867 -359 -804 404 854
2957 854 -211 -786 136 533 -316 -766 -36 685 -221 -905 -194 1025 13 -831 -26 979 168 -886
2975 -886 267 765 -72 -726 57 687 64 -615 -438 509 12 -375 -147 449 196 -326 -258 579 424 -552
2995 -552 -208 653 597 -415 -579 404 524 -245 -340 598 543 -373 -658 313 712 -127 -475 223 453 -325 -635
3016 -635 264 529 -188 -405 319 551 -54 -795 81 817 -314 -930 -414 511 -236 -793 -2 627 19 -531
3036 -531 -250 660 -67 -792 94 1028 219 -490 -344 593 234 -786 -483 762 370 -761 -192 706 340
3055 340 -910 -501 635 514 -743 -241 672 473 -692 -371 852 357 -703 -568 434 618 -615
$$ packed form
2922a005K32J659m17j031m9J286R5j261k6J567o00j115j19J365J65j474k49J433
2940D56J68j275j54J142L68j127m14J054M58j137l27J004O51j226m45J208M50
2957H54j065n75R22L97q49m50P30P21r06o84P11J219j012q44Q05J005q11j054
2975h86J153M98q37o54P83O30o23o79J77R47m97l87K28N96k53n22O8Q37j55r76
2995e52L44Q61n6j012j64R83J20p69r5R38n5r16k85R71L99q39l48O98K30p78l10
3016f35Q99K65p17k17P24K32o05p41Q76P36j131o16N16R25p47n57P91O29o08n50
3036e31K81R10p27p25Q86R34q09p09J46R37l59j020L03J245l92j131N69Q98l66
3055C40j250M09J136j21j257N02R13j99j165L21J223m95j060J35J002J84j233
$$ plain form
3072 -615 -647 600 608 -648 -603 454 570 -414 -632 231 745 -450 -618 414 927 -278 -834 395 942
3091 942 -78 -649 186 602 -307 -815 177 454 -114 -827 101 949 -235 -518 -119 609 -282 -772 438
3110 438 520 -299 -854 66 799 -41 -459 -34 708 227 -735 -348 860 278 -576 -116 707 231 -639 -64
3130 -64 682 465 -318 -198 696 129 -574 -336 458 271 -507 -278 739 230 -621 -673 113 444 -452 -448 412
3151 412 488 -115 -239 305 460 -377 -334 606 276 -239 -399 -82 444 -177 -787 4 734 -226 -629 -145 612
3172 612 -139 -604 262 501 40 -297 7 467 -98 -516 -156 248 209 -662 -245 565 335 -507 -404 478
3192 478 398 -455 -368 501 824 -176 -362 374 366 -506 -216 258 241 -453 -662 420 455 -393 -562 467 527
3213 527 -164 -763 244 540 -457 -527 700 820 -116 -657 653 506 -487 -446 222 652 -254 -660 87 719
$$ packed form
3072f15l2J247Qj256M5J057J16r84k18Q63N14j195j68J032N13j205n56J229N47
3091I42j020n71Q35M16r09n08R92K77n68p13R28Q48j184k83L99P28q91m90J210
3110D38Q2q19n55R20P33q40m18M25P42m81r62L87J208n82q54M60Q23m76q70N75
3130f4P46k17p83J20Q94n67p03K38P94j87p78K29J017n09q51n2P86L31q96MQ60
3151D12P6o03j24N44J55q37M3R40l30n15j60L17N26o21o10P91P30r60m03M84P57
3172F12p51m65Q66K39m61l37L04M60n65m18L60M04l9q71M17Q10k30q42J03Q82
3192D78q0q53Q7Q69L23j000j86P36qq72K90M74j7o94k09J082L5q48j69J029O0
3213E27o91n99J007K96r97p0J227J20r36n41J310j47r93M1O68M30r06m06P47O32
$$ plain form
3233 719 -227 -691 168 545 -451 -554 240 584 -78 -467 234 773 -196 -578 240 504 -104 -702 226 510
3253 510 70 -741 52 399 178 -895 6 496 113 -702 -162 813 86 -383 -412 729 137 -486 -108 629
3273 629 161 -600 -378 555 251 -715 -245 520 137 -332 -292 464 182 -448 -163 247 387 -306 -339 495 579
3294 579 -158 -535 439 353 -224 -477 -32 352 -150 -197 262 437 -6 -528 340 543 -166 -507 524 582 -141
3315 -141 -745 -51 537 -6 -596 -1 472 73 -585 30 641 -183 -436 316 465 98 -401 -29 579 83
3335 83 -429 -322 579 56 -236 -153 549 137 -507 -354 353 -276 -250 -354 253 377 -298 -162 346 132 -447
3356 -447 -291 545 227 -256 -224 459 390 -150 -425 127 648 -390 -436 457 582 -127 -634 55 579 204 -421
3377 -421 119 597 -4 -648 -88 514 49 -523 -258 477 -96 -494 83 567 -49 -321 440 620 169 -531
$$ packed form
3233G19r46m64Q59L77r96j03P94L44o62l89P01N39r69l82Q18K64o08n98R28K84
3253E10m40q11P93L47k21j073R01M90l83q15N40R75p27m69k9J141n92o23L78P37
3273F29m68p61K22R33l04r66M70P65l83m69M0P56k82o30K85M10J40o93l3Q34Q4
3294E79p37l77R74q6n77k53M45L84n02m7M59J75m43n22Q68K03p09l41J031N8p23
3315a41o04O94N88n43n90N95M73l99o58O15O11q24k53P52J49l67m99L72O08m96
3335H3n12J07R01n23k92Q3P02m12o44J53P07o29K6j04O07J24o75J36N08k14n79
3356d47J56Q36l18m83L2O83o9n40k75N52N21j038m6Q93J25p09n07O89N24l75o25
3377d21N40M78o01o44N60O02m65n72K65P35n73l98N77M84o16k72P61J80m51p00
$$ plain form
3397 -531 352 662 18 -693 40 845 10 -801 -294 272 279 -445 -78 595 66 -604 -170 457 185 -630 -289
3418 -289 622 228 -251 157 564 152 -602 -250 408 270 -664 -492 185 287 -568 -184 115 411 -458 -225
3438 -225 329 142 -219 -207 161 385 -9 -50 209 708 -144 -497 156 352 77 -723 415 478 -75 -411 -57
3459 -57 430 279 -359 400 519 124 -189 171 705 -19 -307 -282 450 -132 66 -66 257 119 -609 134 653
3480 653 8 -330 -227 330 121 -368 17 606 447 -156 -60 290 89 -225 -399 333 481 -171 -175 318 65
3501 65 -159 -398 20 288 -116 -306 262 258 -158 -551 194 379 -53 -436 132 414 -22 -300 40 564 45
3522 45 -620 252 409 -126 -515 4 612 3 -439 99 421 -111 -253 -102 622 176 -513 37 529 287
3542 287 -303 -145 306 93 -342 -81 517 169 -406 -102 604 328 -462 153 376 151 -202 -30 454 295
$$ packed form
3397e31Q83L10o44p11P33Q05q35q11N07N66Pp24L67O73n29o70M34O27k72q15L41
3418b89R11l94m79M08M07m12p54L52O58j38r34J72O77J02q55L84K99K96q69K33
3438b25N54j87l61J2L68K24l94m1K59M99q52l53O53J96k75q00J138O3n53l36L54
3459e7M87j51o38P59J19l95l13L60N34p24k88K5P32n82J98j32L23j38p28P43N19
3480F53o45l38J03N57k09m89L85N89j59o03R6L50k01l14j74P32J48o52mM93k53
3501F5k24k39M18K68m04j90N68mm16l93P45J85m32l83N68K82m36k78L40N24n19
3522D5o65Q72J57n35l89N19O08o09m42N38L22n32j42J51P24m46o89N50M92k42
3542B87n90J58M51k13m35K61N98l48n75L04P06k76p90O15K23k25l53J72M84j59
$$ plain form
3562 295 -397 -332 272 164 -530 -89 553 69 -128 -96 232 339 -143 -261 220 306 -172 -540 313 317 -148 -285
3584 -285 455 13 -333 -660 207 399 -368 -462 240 372 -86 -711 140 431 -91 -153 23 396 6 -492 195
3605 195 420 -116 -481 -46 336 -389 -68 187 524 -247 -246 122 400 173 -247 102 512 -20 -206 -109 236
3626 236 189 -330 -230 307 57 -277 -243 400 -26 -528 -154 270 145 -109 -380 418 113 -413 -276 161 251
3647 251 -97 -382 69 252 102 -270 -49 265 -32 -149 135 94 -115 -272 296 520 -86 -141 -8 347 43
3668 43 -391 85 72 -28 -722 88 448 88 -383 -102 424 -39 -306 85 268 12 -488 -9 627 46 -292
3689 -292 -4 525 175 -439 -144 612 141 -224 -296 290 162 -62 26 441 -24 -432 -179 440 469 -147 -141 315
3711 315 250 -488 46 241 174 -246 -490 229 201 -378 -309 208 254 -299 -417 75 267 -284 -226 281 164 -240
$$ packed form
3562B95o92O5O04j08o94M41O42m84j97L2L28J07m82j18M81Q6m78l68Q53Mm65j37
3584b85P40m42l46l27Q67J92p67r4P02J32m58o25Q51K91n22o2J76L73l90m98O87
3605A95K25n36l65M35L82p25L21K55L37p71JL68K78k27m20L49M10n32j86R7L45
3626B36m7n19J00N37k50l34L4O43m26n02L74M24j25k54k71P98l05n26J37M37R0
3647B51l48k85M51J83j50l72K21L14k97j17K84m1k09j57N68K24o06n5J33L55l04
3668D3m34M76j3j00o94Q10L60l60m71K81N26m63k67L91J83k56n00M79O36n81l38
3689b92K88N29l50o14K95P56m71l65p2N86j28k24Q8M15m65m08K53O19K9o16OM56
3711C15o5p38N34J95o7m20k44P19k8n79O9N17M6n53j18M92J92n51N8N07j17m04
$$ plain form
3733 -240 -98 176 304 -268 -342 150 286 -284 -259 -99 206 -149 -235 135 401 -108 -367 -69 369 17 -255
3754 -255 256 475 57 -312 -334 448 27 -576 -375 164 -171 -20 -82 60 280 -172 -181 360 -185 -222 67 168
3776 168 -70 -304 45 413 149 -181 -109 129 289 -375 -199 276 250 -467 -283 242 320 -34 -321 119 260
3797 260 -146 69 -65 632 66 -202 206 251 -72 -243 125 190 -268 -189 43 179 61 -426 241 232 84 -179
3819 -179 275 -8 -31 -133 -31 348 125 -239 -276 410 284 -485 -374 311 163 -378 -99 329 39 -189 -321
3840 -321 259 36 -262 -53 337 342 -131 -143 267 318 -36 -180 332 393 -262 -566 199 275 -354 -60 493 301
3862 301 9 -320 197 545 -287 -483 511 299 -392 -285 77 394 -285 -383 148 363 -183 -138 138 38 -285
3883 -285 -344 134 339 -152 -104 92 308 -86 -497 71 373 19 -211 -129 84 11 -627 59 218 118 -29
$$ packed form
3733b40J42K74J28n72p4M92J36n70K5J60L05l55q6L70K66n09k59K98M38l52k72
3754b55N11K19m18l69k2P82m21o03K01N39l35J51o2J42K20m52rN41n45l7K89J01
3776A68k38k34L49L68k64l30P2K38J60o64J76M75k6p17J84N25P8l54k87M40J41
3797B60m06K15j34O97n66k68M08M5l23j71L68O5m58P9K32J36j18m87O67rj48k63
3819a79M54k83k3j02J02L79k23l64l7O86j26p69J11O85j48n41K79M28k90k28j32
3840c21N80k23k98K09L90Nm73j2M10N1l54j44N12O1o55l04P65P6o29K94N53j92
3862C01k92l29N17L48q32j96R94k12o91J07L62L17o79r8N31K15n46M5K76j00l23
3883b85n9M78K05m91M8J96K16l94m11N68L02l54k30Q2K13p3o38O86J59j00j47
$$ plain form
3904 -29 -55 213 192 -437 -82 435 -36 33 36 342 151 -127 -36 238 2 -231 -169 221 -81 -408 -256 197 437
3927 437 -120 -240 313 162 -145 -96 405 359 -275 -159 153 166 -52 -261 311 234 -297 -162 166 504 1
3948 1 -280 242 170 -298 -318 -34 325 -53 -144 232 248 68 -291 -198 206 -136 -305 -161 376 -35 -342 35
3970 35 243 -57 -69 -319 410 224 -183 -150 376 -64 -43 -405 271 409 -132 -535 249 328 -486 -367 -145 -66
3992 -66 -90 -157 346 237 -178 -191 217 80 -129 -233 255 122 -291 -387 265 340 -212 -376 144 126 -106 -226
4014 -226 -18 426 25 -438 133 533 -134 -317 363 456 -211 -263 92 261 -96 -251 50 263 33 -236 189
4035 189 330 40 -301 14 181 61 -360 -62 335 153 -583 198 405 25 -84 -219 325 60 -462 -241
4055 -241 363 60 -295 -41 280 -103 -128 -111 100 -173 -207 128 184 -30 -192 -98 176 -116 -199 75 247 99
$$ packed form
3904b9k6K68k1o29L55N17m71O9LL06j91k78R1K74k36k33O2L90l02l27J52M53K40
3927D37n57j20N53j51l07M9N01m6o34J16L12J3k18k09N72p7n31J35L28L38n03
3948Ak81N22p2m68k0K84L59l78r1L76J6j80l59R3M04l42j69J44N37m11l07L77
3970C5K08l00j2k50P29j86m07L3N26m40K1l62O76J38n41m03P84P9q14J19K22P9
3992f6k4o7N03j09m15j3M08j37k09j04M88j33m13r6O52P5n52j64N20j8k32j20
4014b26K08M44m01m63N71M00o67j83O80R3o67n2L55J69l57j55L01K13k30k69M25
4035A89J41k90l41L15J67j20m21K98L97j82p36P81K07l80j09j35N44k65n22K21
4055b41O04l03l55K54L21l83k5J7K11k73l4L35N6k14j62R4K74k92q3K74J72j48
$$ plain form
4077 99 -177 88 248 -21 -14 -316 488 118 -220 -106 147 54 140 -66 249 210 -48 -98 76 397 -37 -168
4099 -168 244 198 -53 -449 -202 -68 102 -240 60 266 -1 89 -233 87 -21 -445 80 271 -31 -406 66
4120 66 392 145 -347 -37 289 -6 -116 171 273 352 -101 -43 30 134 -310 -70 155 317 -149 -81 98 430
4142 430 -147 -158 353 98 -29 -218 386 165 -240 -70 422 -6 -28 -252 261 288 -291 -426 87 173 69
4163 69 -302 64 118 -38 -382 79 70 -422 -427 56 272 -5 -108 108 273 20 -110 216 199 183 -274 -28 109
4186 109 -173 -273 -29 252 237 -464 58 514 104 -323 -209 269 91 -371 192 342 -26 -340 3 461
4206 461 175 -433 -77 180 176 -280 61 -12 42 -220 -245 61 26 -480 -361 450 108 -80 -255 109 150 -297
4228 -297 -113 107 -27 -158 -240 85 99 -164 25 219 188 -196 40 246 -200 -62 35 -47 217 247 -25 208
$$ packed form
4077I9k76K65J60k69Pl02Q04l70l38J14K53r3Q6k06L15l9k58n0J74L21m34j31
4099a68M12m6k51l96K47J34J70l42L00K06k67R0l22L20j08m24N25J91l02l75M72
4120F6L26k47m92L10L26k95j10K87J02P9m53N8P3J04m44K40K25J62m66O8J79L32
4142D30n77j1N11k55j27j89O04k21m05J70M92m28k2k24N13K7n79j35N13Q6j04
4163F9l71L66N4j56l44M61rm92nM83K16k77j03K16J65k53j30L26j7j6m57K46J37
4186A09k82j00K44K81j5p01N22M56m10m27J14M78j78m62N63J50l68l14L43M58
4206D61k86o08L56K57mm56L41p3N4k62k5L06l5n06J19Q11l42j88j75L64M1m47
4228b97J84K20j34j31q2L25J4k63J89J94l1l84K36K06m46J38R7q2K64L0k72K33
$$ plain form
4250 208 302 -195 -110 97 215 170 -272 23 -100 -42 -214 75 382 98 -267 42 104 94 -274 -60 119 293
4272 293 -58 32 249 316 -48 -327 161 192 -199 -298 -12 106 -276 -168 19 379 -112 83 126 -6 -148 -173
4294 -173 258 52 -345 -357 -71 25 44 42 -58 96 -88 -271 100 176 -323 5 135 437 107 -231 -10 87
4316 87 -91 -173 382 367 -52 -259 -51 363 109 -281 -193 104 -29 -44 88 174 155 -328 -126 213 81 -268
4338 -268 -260 336 155 -410 -201 130 89 -200 -62 178 130 -361 -310 298 199 -105 -74 47 330 -209 -456 -51
4360 -51 25 -336 -227 261 143 -204 6 155 -113 270 -35 20 248 -233 -141 -105 160 89 -295 266 -82 -51
4382 -51 -139 224 180 -11 -216 -52 354 -185 -182 -75 143 40 -111 -49 478 -111 -281 61 172 33 -163 76
4404 76 5 223 -172 322 195 184 15 -28 27 142 -155 -89 308 -46 -106 -143 138 88 -185 -125 -263 53 -33 -291
$$ packed form
4250B08R4m97Q5K07J18m5m42K95j23N8j72K89L07k84l65L09O2j0l68K14J79J74
4272B93l51R0K17O7l64k79M88L1l91r9K86J18l82J08J87L60m91J95M3j32j42k5
4294a73M31k06l97j2K86R6J9kj00J54j84j83L71P6m99L28J30L02l30l38K21R7
4316H7j78q2N55j5m19k07K08M14k54l90Q8K97j33j5J32Q6j9m83K02L39j32l49
4338b68QN96j81n65K09L31m1k89J38K40m8m91N1O08r9l04L1J21K83n39k47M05
4360e1P6l61J09M88j18l47K10J49k68L83l05N5K28m81R2L6K65p1l84N61l48L1
4382e1q8L63m4j91k05J64M06n39LJ07K18j03j51O2N27n89j70L42J11j39j96K39
4404G6p1K18l95M94j27j1j69m3N5J15k97O6L97l54o0l7K81n0k73O0j38L16q6k58
$$ plain form
4428 -291 -59 34 7 -127 93 189 95 -245 200 -57 -66 -41 195 242 -41 -211 12 399 176 -54 88 212 271
4451 271 -73 -242 299 -38 -85 -62 76 -88 -177 3 47 -30 -205 -19 134 58 -185 -60 420 66 -141 12
4473 12 -146 203 -20 -281 292 214 -92 -46 272 31 -101 25 113 111 -394 -351 68 437 -344 -275 144 -43 69
4496 69 -272 264 -1 -356 -158 401 296 -188 42 -17 188 -134 -385 101 311 -212 -79 7 401 -62 5
4517 5 12 114 -252 -254 -175 -52 -185 -356 180 -11 -105 -138 141 192 6 -74 -91 342 -39 -121 -101 271 278 -318 121
4542 121 190 -122 -360 -73 382 183 -250 116 349 78 -22 -260 181 -11 14 -41 212 402 -133 -257 163
4563 163 241 -34 -190 294 58 -132 15 186 -178 -186 -277 -40 226 43 25 225 284 -65 -65 -7 231 -51 -154
4586 -154 -267 225 97 92 350 71 -124 14 55 -6 -32 77 -81 9 90 -231 84 112 255 5 -198 281 129
$$ packed form
4428b91K32R3k7j34K20R6r4l40M45k57rK5K36M7k83j70K23L87k23k30J42J24N9
4451B71l44j69N41l37m7K3J38j64q9J80M4p7j75J86J53p6k43J25M80l54k07J53
4473A2j58L49k23k61N73p8l06M6L18k41j32J26Q8kn05M3M19L69p81O9M19j87J12
4496F9l41N36k65l55J98N59j05m84K30n9K05l22k51M86K10n23J33Q6L94m63O7
4517EPJ02l66kP9J23j33j71N36j91r4l3K79N1j86q0j7M33l81q2K0L72Pn96M39
4542A21O9l12k38K87M55j99m33L66K33k71j00k38M41j92K5n5K53J90n35j24M20
4563A63P8k75j56M84k36j90J47J71l64qr1K37K66j83j8K00N9l49%N8K38k82j03
4586a54j13M92j28nK58k79j95J38M1o1k6J09j58R0Q1l21L15K8J43k50k03M79j52
$$ plain form
4609 129 -240 41 9 235 -144 -56 -29 48 -146 -95 37 -91 -147 -56 320 96 72 -7 178 -80 69 -48 19
4632 19 -168 -113 -247 74 31 -90 -95 -70 -60 -219 -165 2 129 -472 -254 184 69 -205 -121 60 192 27 -215
4655 -215 -4 211 -63 -591 -48 127 -239 -360 118 -66 -322 -259 106 136 -116 -89 78 -14 -44 -254 138 269
4677 269 27 -115 -29 115 -49 -196 402 110 -165 -160 105 287 84 -141 86 295 -159 -331 23 179 -94
4698 -94 -60 -202 11 19 -192 42 319 93 -135 11 440 -99 -322 -262 116 -126 54 -16 196 155 170 -29 -55
4721 -55 318 56 -16 137 70 35 -51 193 329 101 -80 114 125 -181 104 88 -14 -380 -186 -151 64 -202 -77
4744 -77 -29 280 108 -290 -125 -88 118 -364 99 313 -85 -49 -133 69 -3 -317 198 232 -86 -202 18 312
4766 312 25 -147 82 220 125 -53 -175 221 75 -180 -256 355 -74 -201 -40 -48 174 -246 -104 287 399
$$ packed form
4609A29l69K81l2K26l79Q8K7P7j94N1J32j28n6R1L76k24k4p9J85k58J49j17O7
4632A9j87N5j34L21m3j21nK5J0j59N4J67J27o01K18M38j15k74Q4J81J32j65k42
4655b15K11K15k74n28N43J75l66j21M78j84k56O3L65L0k52K7J67r2l0k10L92J31
4677B69k42j42Q6J44j64j47N98k92k75NK65J82k03k25K27K09m54j72L54J56k73
4698i4L4j42K13Qk11K34K77k26k28J46M29n39k23O0L78k42J80p0K12m1J5j99k6
4721e5L73k62p2J53o7l5q6K44J36k28j81J94J1l06K85j6j02l66J94L5K15k66J25
4744g7M8L09j72l98J65L7K06m82M63K14l98L6q4K02p2l14N15L4l18j16K20K94
4766C12k87j72K29J38r5j78j22L96j46k55p6O11m29j27J61qK22m20J42L91J12
$$ plain form
4787 399 -189 -148 12 -79 -419 -331 -48 111 -230 -336 142 219 -173 -284 115 101 -77 -231 70 165 -47 12
4809 12 51 196 -16 -244 120 118 -25 97 91 177 -107 -363 308 356 -62 -180 185 130 -34 -344 -126 -53 -114 -153
4833 -153 -268 332 -1 -384 -244 179 -154 -35 -256 -54 155 -249 -69 -105 -7 -68 -169 339 151 -186 -154
4854 -154 30 152 -184 -96 144 86 -178 53 -83 31 258 -21 154 28 -300 -119 298 25 33 -213 195
4875 195 191 -66 117 -59 106 -131 -69 -10 320 -151 16 86 75 -13 -165 114 146 -180 -189 19 308 89 -158
4898 -158 16 164 -80 -184 170 -120 -8 63 -91 -50 -122 119 176 184 72 -228 -12 66 194 0 68 121 378
4921 378 -412 -190 -48 271 -192 151 208 56 -222 -38 -15 58 -162 -338 241 120 127 18 -23 120 -160 -195
4943 -195 89 166 14 -299 221 63 -169 101 -40 52 -10 -256 150 -98 -27 -141 -47 285 -69 -282 287 328
$$ packed form
4787C99n88M1J60r1l40Q8K83J59l41j06M78P7l92j11L99j4j78j54L01R5k12N9
4809A2L9J45k12k28L64kj43J22oQ6k84k56O71M8m18j18L65n5j64l10K18P3o1l9
4833a53j15O00l33l83J40M23l33J19k21K02K09m04J80l6R8o1j01N08j88l37L2
4854a54J84J22l36Q8K40n8k64K31j36J14K27k79J75j26l28J81M17k73Qk46M08
4875A95mk57J83j76J65k37O2N9L30m71J67P0j1q8j52K79L2l26rK08K89k19k47
4898a58J74J48k44j04L54k90J12P1j54M1p2K41N7Qj12l00K16P8J28j94O8N3K57
4921C78p90K22J42L19m63L43N7j52k78J84K3P3k20j76N79j21Pj09m1J43k80l5
4943a95K84P7j52l13N20j58k32K70j41R2o2k46M06k48P1j14R4L32l54k13N69M1
$$ plain form
4965 328 -69 -38 220 247 -22 -107 -57 319 -178 -121 -23 49 90 -159 140 281 -76 -85 114 33 203 -9 -104 91
4989 91 291 -143 61 413 -84 -119 -173 -3 156 -79 -195 196 64 -274 -43 -26 317 -60 -54 94 -2 -120
5011 -120 -11 194 98 -99 153 122 84 -65 -302 235 -184 -56 -140 40 129 -11 -6 1 60 76 -373 -10 -71 -181
5035 -181 -181 187 -3 -73 76 147 271 -42 -271 162 -2 -56 13 -46 -325 84 212 80 139 -49 -26 -247 150
5058 150 125 -171 -114 31 172 -133 -40 150 83 115 68 -191 -90 -132 -234 83 110 -25 -75 12 -28 -135 -23 -69
5082 -69 221 -55 -219 143 63 -80 -259 -15 0 75 -116 -145 100 53 -307 127 -70 -64 -219 147 -30 131 -122
5105 -122 -3 320 59 -88 248 348 -36 -235 -156 219 305 -258 -95 143 201 -236 74 9 70 -153 -57 123
5127 123 120 -23 -192 155 9 -127 -139 225 86 -18 -53 363 18 -139 81 83 124 -196 -64 45 47 -119 -109
$$ packed form
4965C28l97L1K58K7k69q5N0L76m97N7R8P2M1k49K99J41l57rJ99q1J70k12r5J95
4989I1K00m34K04L52m97l5n4J70J59k35j16L91j32l38K31J7L43l77OJ48r6j18
5011a20J09K05r6j97K52l1l8j49k37N37m19J28q4J80Q9j40NPN9J6m49L63o1j10
5035a81%L68j90p0J49P1J24l13k29M33j64n4O9n9k79M09J28j32N9j88K3k21L97
5058A50k5k96N7J45J41l05R3J90o7L2m7k59J01m2j02L17K7j35n0Q7m0j07J12m6
5082f9K90k76j64L62q0j43j79K44J5P5j91k9K45m7l60M34j97Oj55L66j77J61k53
5105a22J19L23k61j47L36J00l84j99P9L75Q6n63J63K38N8m37L10o5O1k23R6J80
5127A23lj43j69L47j46j36j2L64j39j04l5M16l45j57K20KM1l20J32J09Kj66J0
$$ plain form
5150 -109 21 -185 -45 86 263 317 49 -192 120 305 -107 105 163 78 -37 233 -37 -38 -342 -325 -5 -26
5172 -26 -27 -116 109 190 -192 -226 -35 206 133 61 109 7 -17 -289 165 113 -162 -48 4 16 254 88 -18 127
5196 127 -17 -83 15 78 134 -125 216 -92 40 -226 -136 185 110 -185 -160 -60 -97 -192 -142 143 87 -32 62 31
5220 31 54 -370 -231 159 34 49 132 17 -78 116 -140 259 97 21 5 263 173 -79 -251 145 95 -88 73
5243 73 59 -309 74 161 -120 8 -75 -9 -97 112 50 -10 -81 113 243 -150 30 -68 432 -129 -152 98 28 32 -229
5268 -229 99 36 225 -9 220 115 18 -311 114 274 -118 288 368 -107 -40 -50 187 19 -123 26 351 106
5290 106 -106 -152 270 -177 -83 -141 -53 129 -38 -139 130 216 -45 34 221 22 -305 -17 312 233 -114 -160 -72
5313 -72 110 18 -21 -44 66 -172 -90 186 -23 -34 -169 0 237 112 -128 -114 63 151 -65 -182 199 207 31
$$ packed form
5150a09J30k06J40J31J77N4k68k41L12J85m12K12N8q5j15K70k70jl04J7L20k1
5172b6jq9K25Q1l82l4J91K41p3p2M8j02k4k72M54n2k75J14N2J2K38j66j06J45
5196A27j44o6R8O3N6k59L41l08J32k66R0L21p5k95K5J00l7r5N0K85n6j19R4l1
5220C1K3m24J39L90j25J5Q3j15r5J94k56L99j62p6j6K58r0k52j72L96n0j83J61
5243G3j4l68L83Q7k81J28q3O6q8K09o2o0p1J94J30l93J80r8N00n61k3K50p0Mk61
5268b29L28o3J89k34K29j05r7l29M25J60l92M06Q0m75O7j0K37j68j42J49L25k45
5290A06k12m6M22m47R4n8Q8J82j67j01K69Q6k61P9J87j99l27K88L29p9l47m6Q8
5313g2J82r2l9k3J10k38Q2K76k09j1j35J69K37j25k40J4J77Q8k16j17L81Qj76
$$ plain form
5336 31 -234 -9 75 -34 14 132 -72 -293 26 388 -173 -173 193 29 23 -13 -122 97 -113 -146 -125 -48 201 -107
5360 -107 -1 162 134 -101 106 267 79 -16 20 25 9 -156 -23 116 -134 -164 89 116 224 42 216 -143 -60
5383 -60 79 -2 -166 121 -43 -237 66 -29 -139 -75 -12 3 -226 -130 18 278 -76 -219 -69 22 -28 7 -23 309
5407 309 168 -179 53 92 -292 -49 38 269 53 -101 119 216 36 -64 -97 -24 -32 116 28 150 24 162 24
5430 24 149 58 26 -216 19 -68 -198 -210 -106 51 -223 -135 30 20 -105 -216 474 191 -91 -2 19 84 57 95
5454 95 30 99 95 24 0 287 -40 -71 -114 45 -153 -103 -172 43 59 -242 -152 48 160 -91 131 139 124 -237 -208 44
5480 44 -224 -340 218 -11 -81 -380 -242 -22 -19 -353 43 269 -7 -513 13 236 -39 -174 -161 206 216 -120
5502 -120 -224 37 198 -191 46 72 91 3 157 408 201 109 -274 6 -174 41 374 116 -83 22 152
$$ packed form
5336C1k65K25Q4j09M8J18k04k21L19L62n61%L66j64ol6j09K19k10l3K1P7K49l08
5360a07J06J63k8k35K07J61j88r5L6Nj6j65J33J39k50l0K53K7J08j82J74l59Q3
5383f0J39q1j64K87j64j94L03r5j10O4O3J5k29R6J48K60l54j43J50R1n0L5l0L32
5407C09j41l47K32L9l84K43Q7K31k16j54K20R7j80j00l3P3qJ48q8J22j26J38j38
5430B4J25r1l2k42K35q7j30j2J04J57k74Q8J65j0j25j11O90k83k82Q9K1O5k7L8
5454I5o5O9mp1k4K87l27l1m3J59j98N0o9K15J6l01R0K00J12k51K22Qj5l61K9K52
5480D4k68j16N58k29p0k99J38K20Ll34L96K26k76n06N26K23k75j35J3L67J0l36
5502a20j04K61J61l89K37K6J9q8J54K51k07r2l83K80j80K15L33k58j99J05J30
$$ plain form
5523 152 22 20 38 -108 128 -21 -139 -163 222 -147 47 -175 -166 117 -139 -58 -97 259 114 -52 -148 179 103
5546 103 11 -75 117 275 110 59 43 32 180 -92 -57 54 -324 -99 -168 294 -173 -109 -75 102 -75 -245 178
5569 178 -198 -2 57 274 168 -375 155 251 125 -161 -103 6 -9 -74 -127 -12 152 -142 163 -70 33 -16
5591 -16 -309 181 150 -115 -174 279 -41 -46 -228 336 31 -299 -328 79 37 148 -41 5 242 5 98 -32 203
5614 203 45 -307 -116 402 -157 78 -117 156 96 -163 32 41 29 -102 154 216 -150 40 -53 269 -207 -59
5636 -59 128 -49 193 -56 -26 57 43 -104 -136 59 57 -308 186 172 164 -15 -364 149 91 -131 -193 -159 0 -283
5660 -283 86 228 40 39 -159 57 31 -121 -172 -134 113 -139 8 241 371 -96 -408 167 110 6 -125 -112
5682 -112 45 11 -141 52 112 -249 -103 -60 68 -77 -29 53 113 -352 -80 400 97 144 -406 -40 -27 -17 -133
$$ packed form
5523A52j30kJ8j46K36j49j18k4L85l69J94k22RK83k56Q1l9L56j45j66r6L27p6
5546A03r2q6J92J58j65n1j6j1J48k72L5J11l78K25o9M62m67O4L4J77j77j70M23
5569A78l76J96N9K17j06n43N30R6j26k86N8J09j5o5n3J15J64k94L05k33J03m9
5591a6k93M90l1k65n9M53l20nj82N64l05l30k9M07m2J11j89M6K37k37R3j30K35
5614B03j58l52J91N18n59K35j95K73o0k59J95Rj2j31K56O2l66J90r3L22m76J48
5636e9J87j77K42k49L0Q3j4j47l2J95kl65M94j4qj79l49N13n8k22o2L4J59k83
5660b83L69J42j88jj98K16k6j52n1L8K47k52J47K33J30m67l12N75n7j04j31J3
5682a12J57l4j52J93O0l61J46M3J28j45M8Q2O0m65K72M80l03M7n50L66J3J0j16
$$ plain form
5705 -133 -316 67 73 202 22 34 33 246 57 166 -70 -338 -135 192 234 -7 -41 486 59 -72 -301 221
5727 221 423 205 -92 88 -54 -15 -9 236 -104 -119 -154 30 83 -61 198 280 293 204 -182 189 -66 -301 248
5750 248 74 275 69 -206 -151 383 -202 -76 -174 24 -12 -250 -181 -180 167 -220 -67 58 79 -297 -31 -77 -97
5773 -97 4 163 163 -30 27 129 139 -39 -264 311 -29 -89 183 18 30 -302 -165 -135 259 33 11 3 -279 -79
5797 -79 -29 11 122 -171 -90 -90 131 132 -416 -74 118 49 -140 -198 -27 74 -224 14 145 2 -105 -98 97 -52
5821 -52 159 -86 -25 102 -196 84 -154 9 -94 113 -112 -69 219 -39 130 216 93 75 185 -17 -146 -266
5843 -266 70 -17 120 -4 -189 9 102 -255 -105 33 -16 -205 -79 155 102 -139 -114 -65 68 -25 217 163 -82
5866 -82 -24 39 224 43 -174 -86 184 25 -228 136 -291 50 -58 69 1 355 -68 -92 -256 -163 -142 75 138
$$ packed form
5705a33j83L83OJ29j80J2jK13j89J09k36k68K03L27M2k41l4N27m27j31k29N22
5727B21K02k18k97J80j42L9OK45l40j5l5J84N3j44K59Q2J3q9l86L71k55k35N49
5750B48j74K01k06k75N5N34n85J26r8J98l6k38O9JL47l87J53J25K1l76K66m6k0
5773i7J01J59%j93N7J02J0j78k25N75l40o0K72j65J2l32J37L0L94k26k2qk82K00
5797g9N0M0J11k93Q1%K21Jn48L42J92o9j89n8J71J01k98K38J31j43j07PJ95j49
5821e2K11k45O1J27k98K80k38J63j03K07k25M3K88k58J69Q6j23j8J10k02j29j20
5843b66L36q7J37j24j85J98R3l57J50J38m9j89J26K34n3k41K5M9J33r3K42n4k45
5866h2N8O3J85j81k17Q8K70j59k53L64m27L41j08J27o8L54m23k4j64R3K1K17O3
$$ plain form
5889 138 155 -86 -46 -157 154 -70 -261 -210 -113 33 33 -120 54 -219 -235 28 -39 22 88 291 155 -25 -248
5912 -248 2 189 227 -256 179 -94 77 119 -99 -211 -163 -62 51 -58 202 -290 -171 334 179 -343 -178
5933 -178 67 84 -188 -52 30 116 121 -218 3 -185 -195 -173 145 91 64 -216 178 -86 -119 -106 43 97 -256 0
5957 0 180 186 15 96 -238 165 21 -156 151 42 55 4 58 83 94 -240 -33 37 -198 -10 200 172 284 -204
5981 -204 97 -63 -127 -186 26 590 51 61 67 195 -41 -250 205 338 -44 -173 -257 160 -68 -221 -188 -28
6003 -28 -7 -225 51 -3 2 67 -201 -90 144 230 2 -65 -52 142 -106 95 52 -274 21 68 30 -142 -142 108 -87
6028 -87 -24 -118 77 17 -113 132 -129 104 131 127 158 -189 -60 174 131 154 330 201 -42 134 -81 -213 -56
6051 -56 3 -9 -233 -124 -5 -18 65 65 61 -1 -178 74 36 -84 -139 -177 64 97 -232 -151 -7 45 -132 -84 317 -1
$$ packed form
5889A38J7k41M0j11L11k24j91N1R7J46%j53J74k73j6K63o7O1O6K03j36j80k23
5912b48K50J87L8m83M35k73J71M2k18j12M8J01J13j09K60m92J19N05j55n22J65
5933a78K45J7k72J36Q2Q6Nl39K21j88j0K2L18n4k7k80L94k64l3J3J49N4l53K56
5957@J80Oj71Q1l34M03j44j77L07j09J3n1N4K5J1l34K07P0k35J88K10k8J12m88
5981b04L01j60o4n9K12N64n39J0OJ28k36k09M55J33l82j29q4M17k28j53L3J60
6003b8K1k18K76n4NO5k68J11K34Q6k28o7J3J94k48K01m3l26K95M7l8j72%K50j95
6028h7O3r4J95o0j30K45k61K33K7mL1l47J29K34m3K3J76j29k43J76k15j32J57
6051e6N9j2k24J09J19j3Q3%mo2j77K52l8j20n5l8K41L3l29Q1J44N2j77M8M01l18
$$ plain form
6077 -1 143 -293 -148 64 -164 -110 226 135 -140 -73 75 -18 -282 -165 -90 130 120 74 225 -186 -88 -240 71
6100 71 -79 -73 62 -143 73 129 215 385 121 -75 31 320 198 36 -52 122 123 -119 52 -210 -14 197 110
6123 110 -89 127 82 35 -87 -3 -296 24 209 260 -162 133 -1 98 -108 -137 340 313 -70 230 108 -77
6145 -77 77 14 -19 79 24 -91 7 184 -10 -36 122 -38 51 2 32 74 185 -163 114 15 -103 0 -72 207
6169 207 141 51 -167 -282 -49 20 -268 14 -183 -387 0 126 -33 180 -370 34 43 -19 -15 143 90 100 -57
6192 -57 131 188 -241 26 69 353 55 -17 -196 13 146 -179 138 71 107 -66 7 192 -28 -71 26 -42 -70 48
6216 48 -57 298 4 126 51 -84 -16 -218 1 169 27 12 111 -119 -63 -116 -243 55 52 63 -13 270 -19 -141
6240 -141 -96 115 -6 -356 101 20 188 253 52 -115 -82 -202 -90 214 221 47 -12 180 37 -229 -57 86
$$ packed form
6077aJ44m36J45K12k28N4L36r1k75O7J48r3k64J17P5K20j0m6J51m11R8j52L11
6100G1j50OJ35k05K16N6Q6J70k64j96J06K89j22j62q8J74Jk42J71k62J96K11q7
6123A10j99K16m5m7j22Q4k93L20J85N1m22K95j34R9k06k9M77k7l83L00j22j85
6145g7J54o3l3R8n5j15R8J77j94k6J58j60Q9m9L0M2J11l48K77r9j18J03p2K79
6169B07o6r0k18j15K33O9k88K82j97k04L87J26j59K13n50M04Ro2MJ58n3J0j57
6192e7J88N7m29K67M3K84k98p2j79K09J33l25L17o7L6j73P3J85k20m3R7o8k8J18
6216D8j05L55k94J22p5j35O8k02K19J68j42j5R9k30N6n3j27K98lJ1p6K83k89j22
6240a41M5K11j21l50M57q1J68O5k01j67L3j20J12L04Pj74n9J92j43k66J72J43
$$ plain form
6262 86 298 42 -163 -16 112 93 -96 12 155 -212 -100 38 -63 19 -443 -190 125 72 -202 -138 -177 113
6284 113 -25 112 170 -207 45 189 83 1 142 -21 -165 232 184 212 142 -90 25 99 162 57 -119 62
6306 62 -13 -81 105 72 255 113 -180 154 -172 204 144 17 -142 258 -109 -20 -158 -196 102 55 -200 2 -147
6329 -147 -195 -282 70 -194 -56 49 211 84 140 -193 397 32 -392 97 365 84 -112 154 19 -18 231
6350 231 -41 21 6 2 6 -56 23 56 -117 -159 240 186 21 -77 15 -1 -31 108 106 -24 -281 137 -77 -261 67 -62
6376 -62 -197 -49 -65 -50 176 16 6 -65 285 -418 -152 246 27 -36 172 122 -118 209 -70 215 -11 -272
6398 -272 -146 22 424 -168 16 187 218 -131 -69 26 13 114 -23 -48 82 -25 -44 -30 -152 -25 -117 -75 -20
6421 -20 171 -223 -62 152 85 127 -69 109 -12 -326 35 166 -125 -43 269 402 101 -172 -2 -39 -225 -9
$$ packed form
6262H6K12k56k05J47J28j9j89J08J43l67J12J38j01Q2m62K53L15n3k74O4l9K90
6284A13j38J37N8l77K52J44j06q2J41j63j44L97m8K8p0k32J15P4O3j05j76J81
6306F2p5o8J86l3J83j42k93L34l26L76o0j27j59M00l67Q9j38l8K98m7k55K02j49
6329a47m8q7L52k64J38J05J62j27N6l33N90l65m24M89K68k81j96K66j35l7K49
6350B31k72O2j5mMo2P9L3j73m2L99n4j65r8R2j6l0J39kj30k57M18k14j84L28j29
6376f2j35J48j6J5K26j60j0p1L50p03K66L98k19o3K08n0k40L27k79K85k26k61
6398b72J26J68M02n92J84J71L1l49O2R5j3J01j37k5J30j07j9J4j22J27r2M2N5
6421b0J91l94J61K14o7M2j96J78j21l14L61J31k91Q2L12J33l01k73J70l7j86K16
$$ plain form
6443 -9 -228 -31 108 128 -67 113 126 -55 166 40 -150 95 -35 -123 67 -9 -111 -131 34 61 82 -26 49
6466 49 -40 89 -73 212 -60 -251 74 15 133 -105 45 -129 87 -41 -175 -184 -264 -15 -10 -51 -198 -237 -31
6489 -31 16 59 -26 -128 123 -9 -62 -162 37 -328 152 -24 340 58 -191 -157 298 -364 143 26 74 193
6511 193 1 -21 -87 26 123 -52 57 268 217 -3 323 266 -60 284 44 125 -140 99 12 -73 -66 -26 -38 171
6535 171 23 51 84 44 145 15 143 -7 -56 38 -19 200 -340 -3 -78 139 20 -149 -27 195 104 -29 81
6558 81 -104 66 -31 149 -211 80 -13 -277 7 419 179 -68 -36 120 -87 118 50 243 105 -28 -126 253
6580 253 -98 43 301 110 -124 8 -80 -181 -86 -36 -98 187 -210 -288 154 185 -155 -189 -165 98 -33 -143 61
6603 61 -16 -88 -21 -83 181 -18 68 16 7 -83 280 334 29 82 -187 105 -75 122 9 -10 -119 13 74 -4 -22
$$ packed form
6443ik19J97J39K0j95J80J3j81K21j26j90K45j30q8J90p6j02k0J65K7K1j08P5
6466D9q9J29j62K85k72j91L25n9J18k38J50j74K16j28j34rq0K49Nm1j47l9K06
6489c1M7M3q5j02K51j32n3j00J99l65M80j76L64k82k49L4M55o62N07j17M8J19
6511A93j92k2o6J13R7j75J09K11n1k20L26n7l26L44k40Q1k65K39q7q5PM0j2K09
6535A71j48K8L3m0J01j30J28j50m9R4n7K19n40L37p5K17j19j69J22K22r1j33J10
6558H1j85J70r7J80l60K91r3k64K84M12k40k47L2J56k07K05o8J93j38j33r8L79
6580B53l51J41K58j91k34J32q8j01R5N0o2K85l97p8M42L1l40l4K4K63j31j10K04
6603F1p7p2O7o2K64j99Q6n2rr0L63N4l05N3k69K92j80J97j13j9j09J32O1p8j8
$$ plain form
6628 -22 -66 -162 60 -279 83 -202 -46 69 21 206 -189 112 189 -15 -136 220 107 163 24 34 -52 -332 131
6651 131 59 177 99 -145 84 38 -12 -15 -273 66 48 -154 99 -131 10 -132 -49 -235 -104 103 -35 -21 -92
6674 -92 293 -135 162 -124 -91 -5 -109 159 -227 220 55 -154 -59 -1 -10 56 -4 -117 13 3 -98 -75 19 100
6698 100 -134 126 -4 -177 -186 -60 85 123 -81 3 -118 72 -70 43 219 -162 3 220 96 50 -111 137
6720 137 -92 46 104 0 95 5 151 239 236 35 -216 -26 162 -6 -114 -65 -10 -109 -113 45 -146 151 82 -143
6744 -143 88 8 -183 -167 -49 225 -27 -93 -9 82 -205 -49 146 16 -53 112 34 -4 -86 -159 -1 318 -196
6767 -196 181 43 57 246 -192 -97 141 212 283 417 120 275 -198 316 46 -193 -89 15 200 30 -44 131
6789 131 68 -240 37 -163 26 53 -205 -101 -231 18 -184 228 -117 50 102 78 -13 189 -8 376 -88 100
$$ packed form
6628b2m4r6K22l39L62k85J56J15m8J85l95L01P7k04j21L56j13N6j39J0q6k80M63
6651A31p2J18p8k44K29m6n0lk58L39j8k02K53k30J41j42Q3j86J31K07j38J4p1
6674i2L85m28K97k86L3Q6j04K68l86M47j65k09R5N8rO6o0j13J30j0j01K3R4Q1
6698A00k34K60j30j73rJ26J45L8k04Q4j21J90j42J13J76l81J65K17j24m6j61K48
6720A37k29J38N8j04R5r0J46Q8lk01k51J90J88j68j08M9N5r9mJ58j91K97o9k25
6744a43K31q0j91J6J18K74k52o6Q4R1k87J56J95j30o9J65p8l8q2p3J58L19n14
6767a96L77j38J4J89m38R5K38P1P1J34k97J55m73N14k70k39J04J04J85j70p4J75
6789A31o3l08K77k00J89K7k58J04j30K49k02M12l45J67N2k4r1K02j97L84m64J88
$$ plain form
6811 100 -30 30 189 -70 116 -106 57 156 34 64 382 63 -52 -110 -4 119 59 67 -29 61 225 -152 284
6834 284 -204 1 -22 90 98 -41 -160 -233 77 -100 -132 42 -104 -64 141 214 -125 82 -193 -148 20 -139 -219
6857 -219 -56 63 117 -23 20 -83 -60 -99 -271 54 120 216 120 138 216 -95 -27 172 107 126 -40 294 61 9
6881 9 -113 256 -41 -188 -140 -90 76 -18 -148 -11 85 -196 79 151 -155 -284 -28 28 17 -123 112 -82 169
6904 169 -217 -165 286 50 -48 147 313 -134 -72 120 51 72 -136 215 234 -269 -267 172 172 227 -234 -132 -134 165
6928 165 308 -85 153 80 28 -100 -44 292 69 134 231 -11 -26 -11 180 -23 171 -83 74 290 -21 59 -72
6951 -72 -54 77 -229 63 -31 138 40 -179 -46 72 -226 42 -61 -211 -208 -137 231 22 -94 24 -75 55 69
6974 69 -166 327 96 -92 237 -73 378 -73 45 38 254 178 -41 120 27 -12 -321 -47 180 -95 -99 234 102
$$ packed form
6811A00j30O0J59k59J86k22J63R9j22L0L18l19j15n8J06J23o0Qr6R0J64l77M36
6834B84m88K05k3J12Qj39j19p3L10j77l2J74j46M0K05P3l39K07k75M5J68j59q0
6857b19J63J19N4j40M3j03K3l9j72L25O6R6r6J8P8l11O8J99o5J9j66L34k33n2
6881Ij22L69k97j47M8N0J66r4j30J37R6k81K75P2l06j29K56N6j1j40K35j94K51
6904A69l86N2M51k36r8J95J66m47O2J92o9K1k08L51J9n03KM39%N5m61J02kK99
6928A65J43l93K38p3n2j28N6L36k23O5R7k42j5J5J91k03J94k54J57K16l11Q0j31
6951g2J8J31l06K92r4J69r8k19J33J18k98K68j03j50LP1L68k09j16J18r9J30J4
6974F9k35M93k31j88L29l10M51m51J18pK16p6k19J61r3l9l09K74K27k75mL33j32
$$ plain form
6997 102 -87 -2 -133 183 10 -152 345 41 128 -144 -122 -16 255 95 -84 222 76 -164 59 -48 -208
7018 -208 -326 31 149 153 -136 30 243 170 184 -86 1 6 165 -107 28 205 -5 124 207 -230 -197 -49 137
7041 137 44 139 180 -130 260 -15 204 -36 126 -268 -50 65 51 -73 78 181 56 -56 -50 123 -136 -89
7063 -89 -37 -99 19 94 -49 -56 233 -158 -54 70 -233 -69 -27 -9 -161 -185 35 228 -12 179 -128 373 44
7086 44 202 107 -27 -58 -90 -110 88 -151 38 215 -53 112 -328 -285 -107 120 83 162 115 -55 170 -138 124
7109 124 323 113 25 -355 -2 -83 85 -31 -174 -50 -24 -251 120 129 -10 100 -52 183 119 -25 -166 270
7131 270 208 -177 -183 -183 -7 74 -214 -15 -61 -92 -230 -5 -107 169 -39 122 -116 -14 43 102 137 -44 -187 -61
7155 -61 -177 83 -57 228 -43 76 40 6 61 -136 -89 281 190 -16 80 82 -197 -83 -227 -102 -164 -197 55 137
$$ packed form
6997A02j89Q5j31L16j73j62M97l04Q7k72K2J06K71j60j79L06j46k40K23j07j60
7018b08j18L57J18Mk89J66K13p3J4k70Q7NJ59k72J35J77k10J29Q3m37L3J48J86
7041A37r3R5M1l10L90k75K19k40J62l94K18J15j4j24J51J03j25j12OJ73k59M7
7063h9N2o2J18P5j43pK89l91J04J24l03J64M2J8j52k4K20J93k40J91l07N01l29
7086D4J58r5j34l1l2k0J98k39J89J77k68J65m40M3J78K27l7P9m7j70K25l08K62
7109A24J99k10q8l80L53q1J68j16j43J24K6k27L71Rj39J10j52K35o4j44j41M36
7131B70o2l85o%J76Q1k88J99m6l1j38K25j02K76k08J61k38J02N7N9L5j81j43J26
7155f1j16K60j40K85k71J19l6l4N5j97M7L70r1k06R6Kk79J14j44J25o2l3K52Q2
$$ plain form
7179 137 11 -3 -99 146 -234 -12 109 217 -79 -267 -100 103 50 217 -27 -9 90 -241 19 -28 37 -202
7201 -202 -85 47 -55 -171 6 135 166 -38 18 -87 127 -266 -260 55 43 7 -251 27 -2 123 42 -32 -117
7224 -117 85 -292 77 80 171 -144 -68 109 -33 30 279 116 52 -84 86 -95 -230 -11 128 -78 -356 -289
7246 -289 -12 278 50 -96 92 84 -24 225 -29 82 90 95 38 79 90 100 -142 51 10 -68 -102 -4 -143 116 280
7271 280 -124 -128 -194 -61 71 281 -73 -117 70 31 -79 -74 -177 189 23 -50 339 240 0 -126 112 107 46 -41
7295 -41 95 15 29 -4 -36 -157 105 -117 -69 224 -181 -127 42 -99 -18 -12 -71 -119 56 -33 -24 50 -75 -200 -132 77
7321 77 10 164 -169 -27 249 37 137 -80 -77 -207 64 82 82 -66 198 -157 -13 -85 5 72 156 -60 60 -60
7345 -60 -21 -29 -242 -258 -121 -45 -35 115 271 47 -58 178 -176 98 -180 11 167 134 124 -323 242 -48 57
$$ packed form
7179A37j26j4r6K45l80K22J21J08k96j88J67K03n3J67k44J8R9l31K60m7O5k39
7201b02J17J32j02j16J77J29L1k04N6j05K14l93OL15j2l6k58K78k9J25q1p4q5
7224a17K02l77L69LR1l15P6J77j42O3K49j63o4j36J70j81j35K19J39k06k78O7
7246b89K77K90k28j46J88qj08K49k54J11QNn7M1J1J0k42J93m1p8l4R8j39K59J64
7271B80m04mo6J33J32K10l54m4J87l9j10Nj03L66j66p3L89r9k40j26K38no1q7
7295d1J36q0J4l3l2j21K62k22M8K93m05N4J69j41Q1On9m8J75q9RP4j25j25O8K09
7321G7o7J54l33J42K76k12J00k17Lj30K71J8%j48K64l55J44p2R0O7Q4k16J20j20
7345f0L9qk13j6J37P6J0J50J56k24j05K36l54K74k78J91J56l3j0m47N65k90J05
$$ plain form
7368 57 -226 -80 -69 -49 -49 15 -25 -157 -222 21 -121 -3 93 -40 32 83 83 3 -104 -214 42 -35 76 69 48 -109
7394 -109 -215 38 185 40 8 -5 -225 219 70 73 -31 -14 -117 -3 -232 -339 12 -121 -399 153 -58 -44
7416 -44 97 275 -147 25 110 2 64 -129 104 128 78 -13 41 151 40 6 63 -121 -22 -3 -69 -178 45 206
7440 206 84 194 34 -88 31 201 184 44 145 53 200 -95 33 -66 151 17 128 261 -42 32 -160
7461 -160 63 -2 68 162 -128 146 7 102 407 66 -143 5 4 220 279 -181 -293 171 -59 118 199 101 -33
7484 -33 -73 -75 33 145 -76 -16 -59 -40 -326 13 -212 57 -80 -135 -216 45 63 -243 161 147 -8 19 -78 247
7508 247 248 -100 -64 -167 -397 -17 97 116 22 -202 9 179 -155 -1 -199 46 153 196 -196 -54 209 -81
7530 -81 -9 39 -2 -134 425 191 79 -119 -253 -25 -153 -74 114 4 -61 2 64 146 243 -33 76 70 -89 29
$$ packed form
7368E7k83J46J1K0%O4m0j32o5K43j42J18R6j33P2N1%q0j07j10K56p7J11pk1j57
7394a09j06K53J47j45l2j3k20M44j49Lj04J7j03J14k29j07L51j33k78N52k11J4
7416d4J41J78m22J72Q5j08O2j93K33K4n0r1N4J10j11l4N7j84R9J9o6j09K23J61
7440B06j22J10j60j22J19J70j7j40J01r2J47k95J28r9K17j34J11J33l03P4j92
7461a60K23o5P0R4k90K74j39R5L05l41k09J48jK16N9m60j12M64k30J77Q1r8j34
7484c3m0kJ08J12k21O0m3J9k86L39k25K69j37n5q1K61J8l06M04j4j55K7r7L25
7508B47Jl48L6j03k30L80J14J9r4k24K11J70l34J54j98K45J07M3l92J42K63k90
7530h1P2M8m1j32N59k34j12j98j34K28j28P9J88j10o5O3O2Q2R7k76J09oj59J18
$$ plain form
7554 29 142 -57 -87 23 -36 73 -98 15 106 -22 113 191 133 89 -30 -35 -29 497 177 -50 -20 71 76 274 26
7579 26 -42 77 89 15 41 15 -47 -49 123 26 -97 9 99 -72 34 -167 -321 69 268 -130 -79 -49 -107 -99 -54 -60
7605 -60 -5 122 245 -89 308 -156 -91 -13 69 -119 -157 112 289 -56 147 66 -141 -160 107 14 -141 -113 -269
7628 -269 -46 32 -3 -167 10 42 -104 -146 238 64 -146 75 -33 84 56 115 3 -40 -41 108 60 138 -136 -77
7652 -77 -100 39 -85 -27 68 77 263 89 120 45 239 119 -118 22 48 90 -94 44 -86 1 103 92 -20 -92
7676 -92 149 212 -143 86 -32 25 -229 104 34 -68 21 -195 195 217 -8 109 -13 186 31 -110 -10 -38
7698 -38 221 140 130 -3 -61 8 -79 129 -25 77 -10 70 -108 -122 59 224 48 -81 -69 133 93 142 146 -156 148
7723 148 -65 -181 175 177 -140 -83 5 173 20 164 83 -2 70 20 -64 -248 225 3 -25 69 245 14 85 316
$$ packed form
7554B9J13j99l0J10n9J09j71J13R1j28J35P8n8m4j19nON26l20k27L0R1NJ98k48
7579B6o8J19J2p4K6k6o2kJ72r7j23J06R0j71J06k01j54L90J99l98N1L0n8QM5o
7605f0N5J27J23l34L97m64O5P8Q2j88l8K69J77l45K03q1k07j9K67r3j55K8j56
7628b69K23P8l5j64J77L2j46m2L84j74k10K21j08J17k8N9j12m3jJ49m8P8k74N9
7652g7k3J39j24N8R5RJ86j74L1p5J94j20k37J40K6M2j84J38j30Q7J02j1j12p2
7676i2K41O3l55K29j18N7k54L33p0j02Q9k16L90K2k25J17j22J99j55j41J00k8
7698c8K59q1j0j33n8O9q7K08j54J02q7Q0j78j4J81J65j76j29J2K02m0M9Ml02L04
7723A48k13j16L56Kl17N7Q8J68j53J44q1q5P2n0q4j84M73k22k8R4J76k31P1K31
$$ plain form
7747 316 88 -194 205 84 -57 -34 -92 170 -84 -154 115 223 38 -205 18 -15 -156 75 -116 -7 -102 -38
7769 -38 -166 -69 81 158 -63 -74 251 -153 -53 54 -53 -156 -87 -28 -65 145 -105 146 72 189 118 166 -16
7792 -16 61 71 -102 -1 -50 -85 214 -47 79 153 -134 -53 -174 249 -119 -79 -129 -156 191 44 -116 164 7
7815 7 307 -77 -38 208 267 170 -301 101 -54 63 -242 -35 458 -186 167 -180 151 -50 18 -228 96 162
7837 162 19 126 -207 -146 124 -175 -9 38 -223 -204 90 142 -23 33 357 -109 -29 -3 -148 -9 183 53
7859 53 152 -236 -24 137 17 -77 129 48 12 -138 224 24 84 264 169 -148 -147 102 -165 -24 248 -50 69
7882 69 -29 3 -90 96 -240 167 -70 -272 -183 -209 -171 33 -30 1 -179 -8 -102 85 191 18 -130 64 23 78
7906 78 81 -117 94 -111 103 -15 -71 12 56 272 104 -79 121 -96 44 276 -66 -8 15 62 21 -364 27
$$ packed form
7747C16k28k82L99j21j41K3n8K62k54p0K69J08j85k43K23l3j41K31j91J09r5O4
7769c8j28R7J50P7k21j1L25m04J00J07j07j03O9N9l7K10k50K51p4J17p1M8j82
7792a6P7J0j73J01m9l5K99k61J26P4k87Q1j21M23l68M0n0k7L47j47j60K80j57
7815GL00l84L9K46N9r7m71M02j55J17l05K07M93o44L53l47L31k01O8k46L24O6
7837A62j43J07l33O1K70k99J66M7k61J9K94N2j65N6L24m66Q0K6j45J39J92j30
7859E3R9l88K12J61j20r4K06q1l6j50L62k00O0J80r5l17JK49k67J41K72k98J19
7882F9r8L2r3J86l36M07k37k02Q9k6L8K04o3L1j80J71r4J87J06j73j48J94m1N5
7906G8Lj98K11k05K14j18n6Q3M4K16j68j83K00k17J40K32l42N8K3M7m1l85L91
$$ plain form
7929 27 460 4 -97 78 239 -202 -132 102 55 -102 -155 88 36 274 -185 -74 -196 -16 69 -50 126 -49
7951 -49 -37 -60 57 -19 -104 70 129 -17 -62 180 54 74 -124 -56 63 -146 74 -37 -19 64 -167 -89 -27 82
7975 82 -148 -51 2 73 -58 -166 -26 101 -32 83 188 -103 -91 38 40 -23 6 -29 236 -239 -295 72 0 -172
7999 -172 42 -118 430 121 -51 42 73 93 -89 -73 -40 240 110 288 46 182 116 150 -191 27 132 -190
8021 -190 -68 -57 92 140 65 203 4 -193 149 -57 122 30 -62 83 -183 226 93 74 165 -30 -55 102 65
8044 65 -62 -198 -52 212 -228 177 -181 104 1 119 167 -13 -82 28 -104 81 -53 -11 -85 -183 111 -164
8066 -164 -101 -31 80 -161 -258 -92 -38 71 -51 203 77 -269 149 47 -34 70 -116 -13 2 -184 -149 69
8088 69 -84 -77 117 -92 98 109 -35 -67 41 -192 82 -107 149 -185 -76 43 -39 47 97 50 -56 28 127 -27
$$ packed form
7929B7M33m56j01J75J61m41P0K34m7j57n3K43n2K38m59J11j22J80Q5j19J76j75
7951d9J2k3J17p6q5J74N9j46m5K42j26K0j98O8J19k09K20j11J8Q3k31P8O2J09
7975H2k30R7N3P1j31j08J40J27j33J15J05k91J2J29Ko3K9l5K65m75n6L67p2j72
7999a72K14j60N48l09j72R3L1K0j82J6L3K80j30J78k42J36o6L4l41K18J05l22
8021a90J22J1J49M8p5J38j99j97L42k06J79r2r2J45k66M09j33j9R1j95k5J57l7
8044F5j27j36J46K64m40M05l58K85j03J18M8j80o9J10j32J85j34M2p4r8K94k75
8066a64O3P0J11k41r7J66N4J09j22K54j26l46M18j02q1J04j86J03J5j86L5K18
8088F9j53PJ94k09J90J1j44l2J08k33K74j89K56l34J09J19q2Q6N0m7j06Q4R9j54
$$ plain form
8112 -27 137 -5 51 246 6 86 -101 19 146 -84 75 -271 38 17 135 79 355 67 240 29 18 -94
8134 -94 -201 -80 156 -222 -81 40 -54 78 -213 -3 -216 22 -110 -30 77 -179 -87 64 -139 247 -90
8155 -90 -116 127 -2 91 94 98 189 73 -45 12 398 195 -28 -26 -100 -106 31 88 -21 91 80 67 99 -64 100 -255
8181 -255 8 -111 37 183 28 315 205 18 -21 -23
$$ packed form
8112b7J64j42N6J95k40Q0j87J20J27k30J59l46L09k1J18n6K76k88J73k11j1j12
8134i4j07J21K36l78J41J21r4J32k91K10k13K38j32Q0J07k56R2J51k03L86l37
8155i0k6K43j29R3LMR1j16j18N7L86k03k23Kp4oJ37N7j09J12j1j3L2j63J64l55
8181b55K63j19J48J46j55K87j10j87l9k
8191b3
$$ Imaginary data points
##PAGE= N=2
##DATA TABLE= (X++(I..I)), XYDATA
$$ plain form
0 0 0 0 0 0 0 0 0 0 0 0 0 0 0 -8 8 -8 8 -9 16 -16 20 -24 30 -32 40 -48 55 -63 73 -82 95 -107 122 -138 156
35 156 -176 197 -221 249 -276 308 -341 379 -420 464 -511 566 -623 687 -757 834 -918 1011
53 1011 -1117 1235 -1366 1516 -1691 1889 -2127 2409 -2757 3193 -3763 4536 -5658 7437 -10704
68 -10704 18684 -85054 -47519 87403 -29300 -61943 -19857 44087 -1481 -65481 4120 73611
80 73611 7001 -24564 -10024 21137 15019 -24397 -1919 28891 -21489 -33538 -3548 5400 -19686
93 -19686 -29564 26136 52808 -19589 -38821 27761 64016 30982 -9873 15919 57693 23069
105 23069 -17046 9380 55100 44564 -26400 -50365 14273 43358 -1773 -30471 415 27886
117 27886 -3932 -29046 12093 43685 18632 -6503 3903 20579 10080 -1131 18876 21071
$$ packed form
0@%%%%%%%%%%%%%qJ6j6J6j7K5l2L6m4N4o2P2q8J03j18J36j55J77k02K29k60K94
35A56l32L73m18M70n25N84o49P20p99Q84r75J077j189J310j444J591j752J929
53A011k128K352k601K882l207L580m016M536n166N950o956Q299j0194J3095j8141
68a0704K9388j03738L7535J34922j16703l2643M2086O3944m5568o4000O9601O9491
80G3611o6610l1565J4540L1161o118l9416K2478L0810n0380j2049K9990Q948k5086
93a9686r878N5700K6672p2397j9232O6582L6255l3034m0855K5792M1774l4624
105B3069m0115K6426M5720j0536p0964k3965O4638K9085m5131k8698L0886K7471
117B7886l1818k5114M1139L1592k5053k5135J0406J6676j0499j1211K0007K195
$$ plain form
129 21071 -14354 -26237 -951 6342 -27912 -37141 7544 14709 -45646 -62256 3210 39176 -12519
142 -12519 -49426 -261 37660 -7945 -43949 1477 46569 9686 -46484 -28664 19670 9195
154 9195 -31464 -27281 1790 -7503 -36559 -24277 8400 4176 -13868 -3140 10479 -3070 -8856
167 -8856 18651 35345 8412 -13015 9840 31716 9324 -17609 1618 32423 9689 -36251
179 -36251 -23911 28888 31751 -16517 -24225 21242 32814 -7666 -16680 27091 48231 12673 -14688
192 -14688 8951 34797 17397 -6584 2896 16338 -1962 -20955 -5232 11824 -4332 -18855
204 -18855 -1225 6674 -18345 -21858 15838 27209 -11193 -25700 13133 30682 -8157 -28569
216 -28569 9190 30867 -11761 -47647 -14349 24965 -1377 -43797 -26236 12024 -3505 -39233
$$ packed form
129B1071l5425j1883K5286P293l4254r229M4685P165o0355j6610O5466L5966n1695
142a2519l6907M9165L7921m5605l6004M5426M5092l6883n6170J7820M8334j0475
154I195m0659M183K9071r293k9056J2282L2677m224j8044J0728J3619j3549n786
167h856K7507J6694k6933k1427K2855K1876k2392k6933J9227L0805k2734m5940
179c6251J2340N2799K863m8268p708M5467J1572m0480r014M3771K1140l5558k7361
192a4688K3639K5846j7400k3981R480J3442j8300j8993J5723J7056j6156j4523
204a8855J7630P899k5019l513L7696J1371l8402j4507L8833J7549l8839k0412
216b8569L7759K1677m2628l5886L3298L9314k6342m2420J7561L8260j5529l5728
$$ plain form
228 -39233 -21379 19048 11227 -22413 -15598 12973 10060 -8106 973 16607 2848 -15818 -3893
241 -3893 13394 68 -18596 -5686 11844 -5941 -29294 -8455 26647 13145 -23161 -11699
253 -11699 29565 25601 -12464 -6438 36706 35778 -8920 -16577 23746 34953 -2181 -18146 8897
266 8897 19464 -8129 -19422 6435 18916 -2802 -13524 4984 12533 -2228 -1022 19937 18238
279 18238 -6100 -5402 19159 17426 -9775 -11273 13371 11222 -20824 -27015 4046 13969 -15157
292 -15157 -32270 -8108 11244 -6981 -24721 -5950 17950 5680 -19004 -11576 13490 12979 -9536
305 -9536 -13142 4259 4703 -14233 -16937 -77 2177 -15447 -18337 -3380 -2303 -14704 -7878 11698
319 11698 6670 -13874 -6346 19790 16145 -9308 -4080 24170 19465 -14465 -13954 21012 23450 -14098
$$ packed form
228c9233J7854M0427p821l3640O815K8571k913j8166R079J5634j3759j8666J1925
241c893J7287j3326j8664J2910J7530j7785k3353K0839L5102j3502l6306J1462
253a1699M1264l964l8065O026M3144r28m4698p657M0323J1207l7134j5965K7043
266H897J0567k7593j1293K5857J2481k1718j0722J8508P549j4761J206K0959j699
279A8238k4338O98K4561j733k7201j498K4644k149l2046o191L1061R923k9126
292a5157j7113K4162J9352j8225j7740J8771K3900j2270k4684P428K5066n11k2515
305i536l606J7401M44j8936k704J6860K254j7624k890J4957J077j2401O826J9576
319A1698n028k0544P528K6136l645k5453N228K8250m705l3930N11L4966K438l7548
$$ plain form
333 -14098 -22889 10220 20137 -10811 -20080 11760 24766 -3111 -15813 10566 25931 6724 -3832
346 -3832 14170 21861 3133 -4787 12046 16808 -2309 -9927 5215 8212 -11039 -15276 6014
359 6014 12037 -10911 -20392 2696 16174 -3326 -16021 4941 21103 2110 -18583 -2858 20055
372 20055 6191 -20187 -13554 9092 1891 -22222 -18358 4843 1345 -21633 -20270 1972 3982
385 3982 -12569 -9799 8826 6538 -10958 -6691 13863 10216 -11138 -7908 13120 7089 -17941
398 -17941 -12451 14986 9258 -22161 -19098 12939 13069 -16664 -14688 17898 20466 -9277 -12073 18507
412 18507 26080 -307 -8495 14893 22288 -454 -9361 10280 17034 -4528 -13429 5049 11178
425 11178 -6491 -9874 9086 12076 -6819 -8188 12622 16361 -1309 -4338 12206 15995 -1690
$$ packed form
333a4098q791L3109R917l0948r269L1840J3006k7877j2702K6379J5365j9207j0556
346c832J8002P691j8728p920J6833M762j9117p618J5142K997j9251m237K1290
359F014O023k2948r481K3088J3478j9500j2695K0962J6162j8993k0693J5725K2913
372B0055j3864k6378O633K2646p201k4113L864K3201l498k2978J363K2242K010
385C982j6551K770J8625k288j7496M267K0554l647k1354L230K1028o031k5030
398a7941N490K7437n728l1419L063L2037J30k9733J976L2586K568k9743k796L0580
412A8507P573k6387q188K3388P395k2742q907J9641O754k1562q901J8478O129
425A1178j7669l383J8960K990j8895j369K0810L739j7670l029J6544L789j7685
$$ plain form
438 -1690 -9566 6091 15019 -1664 -17193 -6233 8778 -2177 -19727 -10370 8069 -517 -19501
451 -19501 -11514 9178 5962 -11164 -7924 8818 6835 -9310 -7921 7609 6377 -10919 -12478
464 -12478 3364 2623 -15490 -14915 3982 1994 -19130 -15784 8914 8106 -13656 -9889 14264 12587
478 12587 -9781 -7894 16464 16919 -5938 -9598 10204 14954 -4506 -11463 5342 11767 -5770
491 -5770 -14049 2796 12912 -97 -7898 5891 13945 2146 -3888 9239 17435 6001 -2467
504 -2467 6972 14790 4135 -6518 1977 12018 926 -14162 -5048 11229 2239 -15792 -6420
517 -6420 13227 4867 -15339 -5821 16738 9761 -12465 -6616 14666 9906 -12500 -10242 10393
530 10393 6529 -16933 -15951 6052 4291 -18040 -16917 5253 3253 -18472 -13526 10728 7854 -14528
$$ packed form
438a690p876J5657Q928j6683j5529J0960J5011j0955j7550R357J8439q586j8984
451a9501P987K0692l216j7126L240J6742j983j6145J389J5530j232j7296j559
464a2478J5842p41j8113N75J8897j988k1124L346K4698q08k1762L767K4153j677
478A2587k2368J887K4358M55k2857l660J9802M750j9460o957J6805O425j7537
491e770q279J6845J0116j3009p801J3789Q054j1799o034J3127Q196j1434q468
504b467R439P818j0655j0653Q495J0041j1092j5088R114J6277q990j8031R372
517f420J9647q360k0206R518K2559o977k2226N849K1282m760k2406K258K0635
530A0393l864k3462R82K2003j761k2331J123K2170k000k1725M946K4254k874k2382
$$ plain form
544 -14528 -9741 12615 8689 -11822 -7426 13070 9059 -12574 -11823 7731 7848 -11797 -13849 5028
558 5028 8124 -10835 -13981 6666 12962 -4890 -8899 9296 15039 -687 -4916 10774 15434 1665
572 1665 -4504 7155 12402 594 -7467 1532 9511 -149 -9959 114 12033 2264 -10230 610
586 610 14621 4916 -8141 3040 17015 6763 -8762 49 14130 5775 -10062 -5366 8454
599 8454 2493 -13805 -10309 6502 3506 -13724 -11949 6093 4624 -12729 -9058 10190 7535 -10661
613 -10661 -7450 9795 6205 -10835 -8589 7058 3659 -13008 -11687 3857 2955 -12896 -13544 2576
627 2576 4291 -9844 -11091 5513 9215 -5406 -7947 7457 11794 -2023 -6296 6341 10671 -1892
641 -1892 -7340 3041 8884 -1256 -8800 -759 6961 733 -7926 289 11430 4701 -6036 1283
$$ packed form
544a4528M787K2356l926k0511M396K0496m011k1633P51J9554J17j9645k052J8877
558E028L096j8959l146K0647O296j7852m009J8195N743j5726m229J5690M660j3769
572A665o169J1659N247j1808q061Q999P979r660r810J0073J1919r769j2494J0840
586F10J4011r705j3057J1181J3975j0252j5525Q811J4081q355j5837M696J3820
599H454n961j6298L496J6811k996j7230J775J8042j469j7353L671J9248k655j8196
613a0661L211J7245l590j7040K246J5647l399j6667J321J5544r02j5851o48J6120
627B576J715j4135j247J6604L702j4621k541J5404M337j3817m273J2637M330j2563
641a892n448J0381N843j0140p544Q041P720o228q659Q215J1141o729j0737P319
$$ plain form
655 1283 13696 7830 -3895 2274 14726 8119 -6068 -1000 12415 6634 -8945 -5671 9138
668 9138 4874 -11258 -7618 9173 6668 -10483 -7774 10958 8904 -9165 -6086 12324 9175 -9387
682 -9387 -7101 9974 7290 -11379 -10711 5603 4046 -12901 -12648 3354 3892 -12354 -13440 3393
696 3393 6621 -8790 -10505 6136 9534 -6357 -9660 5898 9949 -5496 -10004 3683 7794 -5971
710 -5971 -11744 1020 7566 -5002 -12628 -574 9194 -1535 -10391 2168 13155 1781 -8389
723 -8389 3652 15197 3707 -7910 3798 14699 2789 -9003 1430 12482 1647 -10883
735 -10883 -1055 10781 2058 -9682 -801 12344 4430 -8234 457 13515 6461 -6678 273
748 273 12573 5305 -7755 -2221 9317 2946 -9420 -5610 5721 1459 -9807 -6785 4148 2373
$$ packed form
655A283J2413n866j1725O169J2452o607j4187N068J3415n781j5579L274J4809
668I138m264j6132L640J6791k505j7151K709J8732k054j8069L079J8410l149j8562
682i387K286J7075k684j8669O68J6314j557j6947K53J6002N38j6246j086J6833
696C393L228j5411j715J6641L398j5891l303J5558M051j5445m508J3687M111j3765
710e971n773J2764O546j2568p626J2054R768j0729q856J2559J0987j1374j0170
723h389J2041J1545j1490j1617J1708J0901j1910j1792J0433J1052j0835j2530
735a0883R828J1836q723j1740Q881J3145p914j2664Q691J3058p054j3139O951
748B73J2300p268j3060N534J1538o371j2366L810J1331m262j1266L022J0933j775
$$ plain form
762 2373 -8419 -6643 4265 4729 -5258 -6010 4437 5944 -4258 -7230 2689 5438 -5276 -9951
776 -9951 -646 4157 -5942 -11502 -1730 4841 -4746 -11310 -1244 7356 -1133 -8914 742 10159 1507
791 1507 -8168 928 11270 1863 -8909 -616 10476 1254 -10305 -1895 9908 1476 -10775 -1761
805 -1761 10843 3592 -8531 -349 12457 5681 -6501 919 13336 6780 -5821 -131 11789
818 11789 5723 -7007 -2752 8940 3813 -8286 -4883 7286 4196 -7353 -4992 7013 5171
831 5171 -5847 -4063 7205 6608 -4618 -4215 5715 5897 -4593 -6710 2790 4523 -5686 -9358 99
846 99 3943 -5439 -10687 -781 5313 -4175 -10462 74 8135 -1520 -9522 499 9327 -499 -10224
861 -10224 -717 9240 -630 -11802 -2497 8878 -635 -12550 -3054 9191 -112 -11832 -1637
$$ packed form
762B373j0792J776J0908M64r987p52J0447J507j0202k972R919K749j0714m675
776i951R305M803j0099n560R772O571r587o564J0066Q600q489p781R656R417q652
791A507r675R096J0342r407j0772Q293J1092r222j1559Q410J1803q432j2251R014
805a761J2604p251j2123Q182J2806o776j2182P420J2417o556j2601N690J1920
818A1789o066j2730M255J1692n127j2099L403J2169l090j1549K361J2005j842
831E171j1018J784J1268n97j1226M03R930J82j0490k117R500J733j0209l672R457
846I9L844r382n248R906O094r488o287J0536Q061r655q002J0021Q828r826r725
861a0224R507R957r870j1172R305J1375r513j1915R496J2245r303j1720J0195
$$ plain form
874 -1637 11504 2391 -9729 319 13315 3464 -8705 1283 13479 3663 -8609 238 11830
887 11830 2968 -9560 -1361 9955 2214 -9262 -1699 10214 3435 -7514 -614 10470 4468
900 4468 -5645 -176 9790 4952 -4837 -1245 7308 3897 -5218 -3514 4106 2850 -5768 -5650 2526
915 2526 2861 -5134 -6317 1984 4310 -3900 -6103 2540 5942 -2361 -6077 1302 5841 -2308 -7795
930 -7795 -808 4850 -2442 -9663 -2759 4932 -1820 -9966 -2968 6105 -367 -9049 -1548 8098 1436
945 1436 -7442 -578 8920 1922 -6946 -687 7814 1971 -6848 -1900 6952 2466 -7340 -3078 6816
960 6816 3197 -6696 -2487 8538 5123 -5759 -1987 9429 6681 -4404 -1647 8768 6595 -4273
974 -4273 -3208 6390 5633 -4284 -5132 4425 5815 -4496 -6535 4059 6619 -3519 -6202 4311 7481
$$ packed form
874a637J3141r113j2120J0048J2996r851j2169R988J2196r816j2272Q847J1592
887A1830q862j2528Q199J1316p741j1476P563J1913o779j0949O900J1084o002
900D468j0113N469R966m838r789L592Q553l411r115J704P620j256q618J18Q176
915B526L35p995j183Q301K326q210k203Q643L402q303l716P379M539q149n487
930g795O987N658p292p221O904P691o752q146O998R073o472q682P501R646o662
945A436q878O864R498o998q868O259Q501n843q819M948Q852m486r806M262R894
960F816l619r893M209J1025l415j0882L772J1416k748j1085K757J0415k173j0868
974d273J065R598p57r917q48R557J390j0311k039J0594K560j0138k683J0513L170
$$ plain form
989 7481 -2666 -6198 4219 7468 -2777 -6510 2868 6387 -3798 -8359 812 5390 -3803 -9539
1003 -9539 -533 5590 -3276 -9702 -867 6954 -1454 -8827 9 7959 -460 -8447 -611 7967 -120
1018 -120 -8671 -1167 6188 -602 -8884 -2166 5861 252 -8099 -2816 6158 1848 -6840 -1711 8051
1033 8051 3893 -5691 -1417 8623 4549 -5584 -1781 8164 4536 -5328 -3055 6560 4230 -5118
1047 -5118 -4035 5522 5503 -4246 -4375 5721 6805 -3215 -4388 6197 7678 -3003 -4776 5620
1061 5620 7050 -3439 -5442 4129 5475 -4207 -6395 2474 5366 -4048 -7072 2075 5901 -3408 -7634
1076 -7634 2236 6894 -2576 -7290 2547 7059 -2722 -7568 1465 5416 -3148 -7601 52 4084 -2941
1091 -2941 -7469 -1254 3839 -1355 -6266 -1143 4402 14 -5032 -1038 4779 1708 -4068 -1079 4764
$$ packed form
989G481j0147l532J0417L249j0245l733R378L519j0185m561R171M578r193n736
1003i539R006O123q866o426Q835P821q408p373Q836P950q419p987P836Q578q087
1018a20q551P504P355o790q282O718Q027n609q351N283Q974m310q688N129R762
1033H051m158r584M274J0040m074j0133L803R945l628r864K273R615k330r348
1047e118J083R557j9r749j29J0096J084j0020j173J0585J481j0681j773J0396
1061E620J430j0489k003R571J346r682k188Q869K892r414l024R147L826r309m226
1076g634R870M658r470m714R837M512r781m846R033L951q564m453P653M032p025
1091b941m528O215N093n194m911N123N545m388n046L994N817l071n776K989N843
$$ plain form
1106 4764 1606 -4248 -2138 3902 2463 -3583 -2901 3081 3041 -2998 -3871 3316 5374 -1661 -4191 3798
1122 3798 6963 -1117 -4423 4178 8071 -1422 -5305 3824 7481 -1946 -6279 3057 6973 -2464 -6620
1137 -6620 2412 7168 -2129 -6976 2690 7635 -1519 -7065 2306 8158 -1694 -7133 2404 7553 -1926
1152 -1926 -8125 1086 6569 -2601 -8371 126 5782 -2332 -7843 -572 5116 -1260 -7044 -594 5467
1167 5467 91 -6194 -874 5568 895 -6221 -1785 4783 574 -6252 -2647 3830 1108 -5681 -2971
1182 -2971 3937 2163 -4770 -3124 4741 3703 -4048 -3370 5232 5206 -3549 -3722 5349 5439 -3561 -4107 4644
1199 4644 5537 -3605 -5174 4301 5830 -3222 -4963 3847 6472 -2559 -4724 4127 6644 -1584 -4750
1214 -4750 3921 7078 -1738 -5446 3128 6382 -2335 -6003 2130 5343 -2557 -6172 1587 5162 -2020
$$ packed form
1106D764l158n854K110O040j439o046O82N982m0o039q73P187K058p035k530P989
1122C798L165q080l306Q601L893r493l883R129L657r427m333R336L916r437m156
1137f620R032M756r297m847R666M945r154n546R371N852r852n439R537N149r479
1152a926o199R211N483r170n770Q497N656q114n511P271N688o376n784O450O061
1167E467n376o285N320O442m673p116M436O568m209o826L605O477k722o789K710
1182b971O908j774o933J646P865j038p751O78Q602k6q755j73R071R0r000n46Q751
1199D644Q93r142j569R475J529r052j741Q810K625r031k165Q851K517q228l166
1214d750Q671L157q816l708Q574L254q717l668Q133L213p900l615P759L575p182
$$ plain form
1229 -2020 -5838 878 5107 -1144 -5626 666 5027 -757 -5573 15 4516 -518 -5686 -1051 3814
1244 3814 -748 -5616 -1755 3381 18 -4849 -2125 3066 1119 -4503 -2354 3736 2307 -3549 -2802
1259 -2802 3579 2999 -3339 -3492 3074 3657 -3112 -4155 3041 4076 -3018 -4331 2716 4682 -2273 -4194
1275 -4194 3061 5755 -1359 -4031 3145 6040 -1049 -4239 2902 6189 -715 -4513 2263 5770 -1371
1290 -1371 -4993 1696 5174 -908 -5135 1160 5538 -660 -4708 894 5718 -16 -4297 544 5334
1305 5334 65 -5418 -719 4872 233 -5516 -1544 4069 710 -5444 -2426 4041 1019 -5373 -2980
1320 -2980 3971 2163 -4946 -2923 4103 2576 -4733 -3535 4036 2918 -4824 -4337 3572 3339 -4943
1335 -4943 -4363 3590 3891 -4455 -4902 3715 4491 -3861 -4460 4187 5210 -3594 -4302 4123 5285 -3593
$$ packed form
1229b020l818O716M229o251m482O292M361n784m816N588M501n034n168M635M865
1244C814m562m868L861N136l363m867K724N191j947n622K149O090j429n856P47
1259b802O381n80o338j53O566N83o769j043P196J035p094j313P047J966o955j921
1275d194P255K694p114k672P176K895p089l190P141L287o904l798O776L507p141
1290a371l622O689L478o082m227O295M378o198m048N602M824n734m281M841M790
1305E334n269n483M699N591m639n749L972N613l359o154L018O467l022o392K393
1320b980O951j808p109K023P026j527p309J198P571j118p742M87P909k33q282
1335d943N80P953L01q346m47Q617P76q352n99Q647J023q804p08Q425J162q878
$$ plain form
1351 -3593 -4232 4368 4745 -3072 -4143 3524 4736 -2966 -4382 3292 4811 -2011 -3893 2799 5013
1366 5013 -1567 -3849 2484 5211 -1112 -3830 1813 4522 -537 -4052 1234 4214 -750 -3983 -6
1381 -6 3874 258 -3953 -936 3751 450 -4202 -1387 3728 1157 -4174 -1853 3585 1225 -4250 -2311
1397 -2311 3398 1609 -4243 -2834 2856 1615 -4123 -3413 2907 2268 -3905 -3741 2842 2903 -3519 -3672
1413 -3672 2927 3184 -3154 -3585 2804 3500 -3111 -3607 2524 3654 -2399 -3677 2248 3747 -1840 -3796
1429 -3796 1839 4100 -1220 -3630 1815 4843 -584 -3542 1557 4611 -182 -3290 1154 4078 -319
1444 -319 -3828 584 3995 327 -3380 -102 3893 959 -3661 -637 4167 1458 -3705 -1263 4143
1459 4143 1871 -4030 -1798 4062 1959 -4221 -2130 3472 1728 -4135 -2684 3312 2086 -3787 -3201
$$ packed form
1351c593o39Q600L77p817j071P667J212p702j416P674J519o822j882O692K214
1366E013o580k282O333K727o323k718N643K709n059l515N286K980m964l233L977
1381fL880l616m211L017M687l301m652K815N115k571n331K321N438k360n475J939
1397b311N709j789n852J409N690j241n738P10O320o39o173J64O583O1o422j53
1413c672O599K57o338m31O389O96o611m96O131J130o053j278N925J499n587j956
1429c796N635K261n320k410N445L028n427k958N099L054m793l108M444K924m397
1444c19l509M412L411l668l707L278L995k934m620L024M804k709n163K442N406
1459D143k272n901K232N860k103o180K091N602j744n863J451N996j226n873N86
$$ plain form
1474 -3201 2998 2938 -3675 -3347 3437 3157 -3838 -4076 3216 3133 -3834 -3951 3129 3485 -3524 -3992 2838
1491 2838 3219 -3143 -3730 2311 3796 -2841 -3884 2042 3947 -1807 -4207 2014 4247 -1630 -4020
1506 -4020 1841 4278 -1071 -3666 1531 4110 -1004 -3465 1233 3874 -428 -3374 874 4013 154
1521 154 -3587 316 4628 502 -3666 165 4456 856 -3988 -494 4493 1082 -4385 -822 4352
1536 4352 848 -4424 -1100 3912 1538 -3840 -1787 3232 1468 -3493 -1887 3293 1930 -3609 -2122
1551 -2122 3234 1589 -3542 -2056 3144 1620 -3544 -2196 2550 1343 -3176 -2035 2242 1696 -2503
1566 -2503 -2506 1316 2079 -1541 -2578 1402 2790 -1011 -3179 616 2666 -827 -2841 544 2902 -174
1582 -174 -2817 140 2806 549 -2405 -389 3189 1080 -2755 -553 3431 1345 -3330 -638 3886
$$ packed form
1474c201O199o0o613L28O784k80o995k38P292q3o967j17P080L56p009m68O830
1491B838L81o362n87O041J485o637j043N926J905n754k400O221K233n877k390
1506d020N861K437n349k595N197K579n114k461M698K641m302k946M248L139l859
1521A54l741L903M312m126m168L831M291l600m844L494M987l411n467L563N174
1536D352l504n272L324N012k374n378K053N019j764m961J606N180j363n539J487
1551b122N356j645n131J486N200j524n164J348M746j207m519J141M277n46m199
1566b503lL822P63l620j037L980J388l801k168L795K050l493k014L385K358l076
1582a74k643K957K666k257k954K016L578k109l835K202L984k086m675K692M524
$$ plain form
1597 3886 1186 -3660 -806 4215 1372 -4006 -1058 4222 1914 -3883 -1847 4299 1981 -3593 -2176
1612 -2176 3947 2629 -3548 -2379 3452 2721 -3416 -2629 3218 2388 -3426 -2388 3039 1921 -3279 -2208
1628 -2208 2785 1795 -3178 -1928 2570 1869 -2863 -2543 2337 2189 -2665 -2969 2110 2859 -2651 -3216 1728
1645 1728 3097 -1600 -3534 1056 3326 -954 -3318 556 2938 -459 -3056 -205 3169 367 -2824
1660 -2824 -417 3041 607 -3056 -545 3180 767 -2943 -457 3581 747 -3432 -425 4031 906
1675 906 -3991 -505 4111 1440 -3854 -1269 4388 1959 -3454 -1678 4348 2228 -3553 -1863 3909
1690 3909 2372 -3286 -2049 3312 2123 -3384 -1406 2863 1865 -2936 -1443 2483 1222 -2647 -1333
1705 -1333 2604 1306 -2778 -1676 2609 1622 -2891 -1735 2569 1694 -2510 -2128 1612 2122 -1753 -2577
$$ packed form
1597C886k700m846K854N021k843n378K948N280k308n797K036O146k318n574J417
1612b176O123j318o177J169N831p31o137P87N847q30n814J038N427j118n200J071
1628b208M993r90m973J250M498p01m732L20M880j48m854l04N079P49n510n65M944
1645A728J369m697j934M590K270m280k364L874K382l397k597K851L374k802l191
1660b824K407L458k434l663K511L725k413l710K486M038k834m179L007M456l125
1675I06m897L486M616k671n294K585N657k429n413J776O026k120n781J690N772
1690C909j537n658J237N361j189n507J978M269r98m801J493L926j261l869J314
1705a333L937j298m084J102M285r87m513J156M304q75m204L82L740N10l875q24
$$ plain form
1721 -2577 1040 2407 -835 -2411 213 2533 26 -2577 -390 2352 458 -2388 -759 2422 228
1736 228 -2101 -594 2075 675 -2180 -215 2191 633 -2437 -710 2500 665 -2634 -669 3051
1751 3051 1102 -3145 -1166 3458 1925 -3169 -1354 3311 2068 -3256 -2307 2899 2504 -2429 -2312 2278
1767 2278 2398 -1845 -2502 1784 2581 -1442 -2019 1481 2080 -1700 -2224 1536 1978 -1708 -1969 1593 2167
1784 2167 -1972 -2373 1689 2441 -1914 -3002 1561 3160 -1575 -3469 896 3402 -1224 -3871 344
1799 344 3341 -63 -3459 44 3386 98 -3434 -415 3014 60 -2801 -335 2667 34 -2684
1814 -2684 -145 2527 -37 -2651 311 2794 30 -3014 159 3169 224 -3093 -86 3445 654
1829 654 -3262 -775 3302 1328 -2980 -1675 3168 1878 -2551 -2096 2464 2107 -1807 -1736 1626 1941
$$ packed form
1721b577L617J367l242j576K624K320k507k603K187K742j894k846J629L181k194
1736B28k329J507K669j400k855J965K406j558l070J727L210j835l299J965L720
1751C051j949m247J979M624j533n094J815M665j243n324R49N206l95m933J17M590
1767B278J20m243o57M286P97m023n77L500N99l780n24L760M42l686k61L562N74
1784B167m139m01M062P52m355j088M563J599m735j894M365K506m626k647M215
1799C44K997l404l396L503L342l288l532L019L429k954k861K466L002k633k718
1814b684K539K672k564k614K962K483k764l044L173L010k945l317L007L531k791
1829F54l916K487M077j974m308J305M843j290m429M55M560l57l914P1L362L15
$$ plain form
1845 1941 -1523 -1759 1216 1793 -1179 -1654 1391 1253 -1509 -1369 1323 1181 -1853 -1705 1777 1651 -1902
1862 -1902 -2259 1490 2371 -2004 -3165 1577 2762 -1285 -3335 823 3077 -672 -3271 303 3019
1877 3019 -294 -2664 -679 2531 428 -2524 -443 2249 94 -1997 -77 2185 68 -1835 517
1892 517 1825 -114 -1748 217 2136 49 -2144 223 2448 246 -2523 -778 2437 1192 -2397
1907 -2397 -966 2421 1646 -1806 -1918 1966 2287 -1287 -2061 1056 2307 -468 -1972 426 2142 -488
1923 -488 -1748 264 1722 -245 -1785 738 1646 -463 -1769 932 2191 -933 -2374 1161 2824
1938 2824 -1090 -2873 702 3234 -907 -3570 318 3554 -363 -4008 -66 3495 239 -3559 -749
1953 -749 3295 654 -3534 -848 2638 727 -2772 -454 2198 332 -2269 -97 2240 98 -2403
$$ packed form
1845A941l464k36K975N77k972m75L045j38k762J40K692j42l034J48L482j26l553
1862a902l57L749Q81m375j161M742J185m047k050M158K254l749k599L574K716
1877C019l313k370J985L210k103k952K081K692k155k091J920K262k117j903K352
1892E17J308j939j634J965J919k087k193K367K225k202k769J745L215j245l589
1907b397J431L387p75l452j12L884L21l574p74L117J251k775j504K398J716k630
1923d88j260K012J458j967j540K523R08k109j306K701J259l124j441L535J663
1938B824l914j783L575K532m141k663L888L236l917l645L942L561l256l798K810
1953g49M044k641m188K686L486j911l499K318K652j866k601K172K337k142k501
$$ plain form
1968 -2403 236 2276 -244 -2692 59 2878 -26 -3016 -554 3013 721 -2866 -895 2965 1083
1983 1083 -2878 -1469 2609 1756 -1990 -1793 1602 1852 -1268 -2012 1095 1812 -761 -1813 832 1934
1999 1934 -840 -1563 1154 1365 -1004 -1381 1034 1330 -1384 -1630 1389 1432 -1515 -2234 1589 2159 -1149
2016 -1149 -2411 890 2911 -604 -3023 388 2793 -85 -3036 -292 2622 373 -2460 -560 1875
2031 1875 318 -1977 -616 1599 209 -1509 -368 1128 129 -1345 -234 1341 -226 -1742 9
2046 9 1986 -263 -1797 -228 2327 359 -2239 -525 2296 1388 -2107 -1370 1743 1524 -1677 -1809 1264
2063 1264 1939 -888 -1934 668 2069 -612 -2062 229 1731 -538 -1706 567 1305 -205 -1331
2078 -1331 502 1608 -813 -1706 852 1447 -814 -1589 989 2396 -779 -2334 1054 2499 -554 -2891
$$ packed form
1968b403K639K040k520k448K751K819k904k990K462L567k292l587J971L860j882
1983A083l961J409M078q53l746J97L395K50l120p44L107P17k573j052K645J102
1999A934k774p23K717K11k369l77K415K96k714k46L019M3k947p19L823N70l308
2016a149j262L301K021l515k419L411K405k878k951K744K914k249k833J900K435
2031A875j557k295J361K215j390j718J141J496r99j474J111J575j567j516J751
2046IJ977k249j534J569K555j968k598J714K821r08l495P37L113k19l201j32L073
2063A264O75k827j046K602J401k681j450K291J502k269j168K273P38j510j126
2078a331J833J106k421q93K558N95k261p75K578J407l175j555L388J445l053k337
$$ plain form
2094 -2891 207 2630 -31 -2579 -426 2582 634 -2568 -453 2106 780 -2210 -965 1867 896
2109 896 -1879 -660 1669 670 -1538 -813 1646 526 -1809 -595 1880 570 -1928 -512 2141 714
2125 714 -1976 -1155 2319 1282 -2116 -1510 2202 2002 -2085 -1861 1748 2007 -1677 -2097 1337 2092 -1243
2142 -1243 -2373 1233 2162 -1034 -1842 1070 1577 -1017 -1236 1142 1503 -1344 -1697 1287 1574 -1384 -1744
2159 -1744 1158 1720 -1420 -2212 1118 2265 -913 -2083 841 2236 -818 -2302 528 2235 -200
2174 -200 -1937 -4 1984 304 -1793 -417 1718 353 -1488 -624 1113 705 -1009 -443 1109 230
2190 230 -1010 -188 928 88 -1245 -296 1447 479 -1196 -942 1462 910 -1570 -1354 1618 1157 -1140
$$ packed form
2094b891L098K423k661k548K153L008j948l202K115K559j326k990J245K832r71
2109H96k775J219K329r99k208P25K459j120k335J214K475j310k498J416K653j427
2125G14k690Q21L474j037l398O06L712k00m087K24L609K59l684m20L434P55l335
2142a243j130L606R29l196q08K912N07k594k19K378L61k847l53K984K87k958l60
2159a744K902N62l140p92L330J147l178j170K924J395l054j484K830J707k435
2174b00j737J933J988j680k097J376K135j365j841Q64J737m08j714N66J552q79
2190B30j240Q22J116q40j333R49J743r68j675K54K404n52k480K16K972m61k297
$$ [...]
8191H2
##END NTUPLES=NMR FID
##END=
