##TITLE=1H_DE-27W
 DMSO-d6
 8 sc, 
 22.11.2023
##JCAMPDX= 6.0         $$ Bruker NMR JCAMP-DX V2.0
##DATA TYPE= NMR FID
##DATA CLASS= NTUPLES
##ORIGIN= UXNMR, Bruker Analytische Messtechnik GmbH
##OWNER= root
$$ XWIN-NMR		Version 3.5
$$ Wed Nov 22 12:56:18 2023 Russian Standard Time (UT+4h)  she@DPX200
##.OBSERVE FREQUENCY= 200.1313
##.OBSERVE NUCLEUS= ^1H
##.DELAY= (6, 6)
##.ACQUISITION MODE= SIMULTANEOUS
##.ACQUISITION SCHEME= undefined
##.AVERAGES= 8
##.DIGITISER RES= 18
##SPECTROMETER/DATA SYSTEM= spect
##.PULSE SEQUENCE= zg30
##.SOLVENT NAME= DMSO
##.SHIFT REFERENCE= (INTERNAL, DMSO, 0, 15.7039)
##AUDIT TRAIL= $$ (NUMBER, WHEN, WHO, WHERE, WHAT)
$$ ##TITLE= Audit trail, XWIN-NMR		Version 3.5
$$ ##JCAMPDX= 5.01
$$ ##ORIGIN= Bruker BioSpin GmbH
$$ ##OWNER= she
$$ F:/spectra/data/she/nmr/H-F/1/audita.txt
$$ ##AUDIT TRAIL=  $$ (NUMBER, WHEN, WHO, WHERE, WHAT)
(   1,<2023-11-22 12:54:50.28 +0400>,<she>,<DPX200>,
      <created by zg, POWCHK disabled, PULCHK disabled
       configuration hash MD5:
       00 E9 B6 7A A2 85 ED C7 34 08 36 98 17 FE 4E 26
       data hash MD5: 16K
       F5 A1 04 B9 32 9D 95 AB C8 15 CA 7E BD 4D 31 A1>)
$$ ##END=
$$ 
$$ hash MD5
$$ 24 BA C4 51 FC 5D 6E 00 20 CE A4 02 B8 7E 3D 1B
##$RELAX= 
##$RELAX= 
##$RELAX= 
##$RELAX= 
##$RELAX= 
##$RELAX= 
$$ Bruker specific parameters
$$ --------------------------
##$DU= <F:/spectra>
##$EXPNO= 1
##$NAME= <H-F>
##$PROCNO= 1
##$TYPE= <nmr>
##$USER= <she>
##$AMP= (0..31)
100 100 100 100 100 100 100 100 100 100 100 100 100 100 100 100 100 100 
100 100 100 100 100 100 100 100 100 100 100 100 100 100 
##$AQSEQ= 0
##$AQ_mod= 1
##$AUNM= <au_zg>
##$AUTOPOS= <>
##$BF1= 200.13
##$BF2= 200.13
##$BF3= 200.13
##$BF4= 200.13
##$BF5= 200.13
##$BF6= 200.13
##$BF7= 200.13
##$BF8= 200.13
##$BYTORDA= 1
##$CFDGTYP= 0
##$CFRGTYP= 5
##$CHEMSTR= <none>
##$CNST= (0..31)
1 1 145 1 1 1 1 1 1 1 1 1 1 1 1 1 1 1 1 1 1 1 1 1 1 1 1 1 1 1 1 1 
##$CPDPRG= <>
##$CPDPRG1= <>
##$CPDPRG2= <>
##$CPDPRG3= <>
##$CPDPRG4= <mlev>
##$CPDPRG5= <mlev>
##$CPDPRG6= <mlev>
##$CPDPRG7= <mlev>
##$CPDPRG8= <mlev>
##$CPDPRGB= <>
##$CPDPRGT= <>
##$D= (0..31)
0 1.2 0 0 0 0 0 0 0 0.06 0 0.03 0 0 0 0 0.0002 0 0 0 0 0 0 0 0 0 0 0 0 
0 0 0 
##$DATE= 1700643289
##$DBL= (0..7)
120 120 120 120 120 120 120 120 
##$DBP= (0..7)
150 150 150 150 150 150 150 150 
##$DBP07= 0
##$DBPNAM0= <>
##$DBPNAM1= <>
##$DBPNAM2= <>
##$DBPNAM3= <>
##$DBPNAM4= <>
##$DBPNAM5= <>
##$DBPNAM6= <>
##$DBPNAM7= <>
##$DBPOAL= (0..7)
0.5 0.5 0.5 0.5 0.5 0.5 0.5 0.5 
##$DBPOFFS= (0..7)
0 0 0 0 0 0 0 0 
##$DE= 6
##$DECBNUC= <off>
##$DECIM= 32
##$DECNUC= <off>
##$DECSTAT= 4
##$DIGMOD= 1
##$DIGTYP= 9
##$DL= (0..7)
0 120 120 120 120 120 120 120 
##$DP= (0..7)
150 150 150 150 150 150 150 150 
##$DP07= 0
##$DPNAME0= <>
##$DPNAME1= <>
##$DPNAME2= <>
##$DPNAME3= <>
##$DPNAME4= <>
##$DPNAME5= <>
##$DPNAME6= <>
##$DPNAME7= <>
##$DPOAL= (0..7)
0.5 0.5 0.5 0.5 0.5 0.5 0.5 0.5 
##$DPOFFS= (0..7)
0 0 0 0 0 0 0 0 
##$DQDMODE= 0
##$DR= 18
##$DS= 0
##$DSLIST= <SSSSSSSSSSSSSSS>
$$ [...]
##$SUBNAM2= <"">
##$SUBNAM3= <"">
##$SUBNAM4= <"">
##$SUBNAM5= <"">
##$SUBNAM6= <"">
##$SUBNAM7= <"">
##$SUBNAM8= <"">
##$SUBNAM9= <"">
##$SW= 18.0517328524113
##$SWIBOX= (0..15)
0 0 2 0 0 0 0 0 0 0 0 0 0 0 0 0 
##$SW_h= 3612.71676300578
##$TD= 16384
##$TD0= 1
##$TE= 0
##$TE2= 300
##$TE3= 300
##$TEG= 300
##$TL= (0..7)
0 120 120 120 120 120 120 120 
##$TP= (0..7)
150 150 150 150 150 150 150 150 
##$TP07= 0
##$TPNAME0= <>
##$TPNAME1= <>
##$TPNAME2= <>
##$TPNAME3= <>
##$TPNAME4= <>
##$TPNAME5= <>
##$TPNAME6= <>
##$TPNAME7= <>
##$TPOAL= (0..7)
0.5 0.5 0.5 0.5 0.5 0.5 0.5 0.5 
##$TPOFFS= (0..7)
0 0 0 0 0 0 0 0 
##$TUNHIN= 0
##$TUNHOUT= 0
##$TUNXOUT= 0
##$USERA1= <user>
##$USERA2= <user>
##$USERA3= <user>
##$USERA4= <user>
##$USERA5= <user>
##$V9= 5
##$VALIST= <valist>
##$VCLIST= <CCCCCCCCCCCCCCC>
##$VD= 0
##$VDLIST= <DDDDDDDDDDDDDDD>
##$VPLIST= <PPPPPPPPPPPPPPP>
##$VTLIST= <TTTTTTTTTTTTTTT>
##$WBST= 1024
##$WBSW= 4
##$XGAIN= (0..3)
0 0 0 0 
##$XL= 0
##$YL= 0
##$YMAX_a= 267503
##$YMIN_a= -275567
##$ZGOPTNS= <>
##$ZL1= 120
##$ZL2= 120
##$ZL3= 120
##$ZL4= 120
##$ABSF1= 10
##$ABSF2= 0
##$ABSG= 5
##$ABSL= 3
##$ALPHA= 0
##$AQORDER= 0
##$ASSFAC= 0
##$ASSFACI= 0
##$ASSFACX= 0
##$ASSWID= 0
##$AUNMP= <proc_1d>
##$AZFE= 0.1
##$AZFW= 0.1
##$BCFW= 1
##$BC_mod= 2
##$BYTORDP= 1
##$COROFFS= 0
##$CY= 11.3945322036743
##$DATMOD= 1
##$DC= 2
##$DFILT= <>
##$DTYPP= 0
##$F1P= 15.7292609196834
##$F2P= 12.9074282941183
##$FCOR= 0.5
##$FTSIZE= 0
##$FT_mod= 4
##$GAMMA= 1
##$GB= 0.15
##$INTBC= 1
##$INTSCL= 1
##$ISEN= 128
##$LB= 0.24
##$LEV0= 0
##$LPBIN= 0
##$MAXI= 10000
##$MC2= 0
##$MEAN= 0
##$ME_mod= 0
##$MI= 1.114404
##$NCOEF= 0
##$NC_proc= 0
##$NLEV= 6
##$NOISF1= 3.799351
##$NOISF2= 2.8
##$NSP= 1
##$NTH_PI= 0
##$NZP= 0
##$OFFSET= 15.70392
##$PC= 1
##$PHC0= -23878.99
##$PHC1= 18.85269
##$PH_mod= 1
##$PKNL= yes
##$PPARMOD= 0
##$PSCAL= 0
##$PSIGN= 0
##$REVERSE= no
##$SF= 200.130013532006
##$SI= 16384
##$SIGF1= 3
##$SIGF2= 2
##$SINO= 400
##$SIOLD= 16384
##$SREGLST= <1H.CDCl3>
##$SSB= 0
##$STSI= 0
##$STSR= 0
##$SW_p= 3612.71676300578
##$SYMM= 0
##$S_DEV= 0
##$TDeff= 0
##$TDoff= 0
##$TI= <>
##$TILT= no
##$TM1= 0
##$TM2= 0
##$TOPLEV= 0
##$USERP1= <user>
##$USERP2= <user>
##$USERP3= <user>
##$USERP4= <user>
##$USERP5= <user>
##$WDW= 1
##$XDIM= 8192
##$YMAX_p= 0
##$YMIN_p= 0
$$ End of Bruker specific parameters
$$ ---------------------------------
##NTUPLES= NMR FID
##VAR_NAME=  TIME,          FID/REAL,        FID/IMAG
##SYMBOL=    X,             R,               I
##VAR_TYPE=  INDEPENDENT,   DEPENDENT,       DEPENDENT
##VAR_FORM=  AFFN,          ASDF,            ASDF
##VAR_DIM=   8192,          8192,            8192
##UNITS=     SECONDS,       ARBITRARY UNITS, ARBITRARY UNITS
##FACTOR=    0.0002768,     1,               1
##FIRST=     0,             0,               0
##LAST=      2.2672688,     0,               0
##MIN=       0,             -275567,         0
##MAX=       2.2672688,     267503,          0
$$ Real data points
##PAGE= N=1
##DATA TABLE= (X++(R..R)), XYDATA
0 0 0 0 0 0 0 0 0 0 0 0 0 0 0 0 0 0 8 -8 8 -8 8 -12 16 -16 16 -24 24 -29 32 -38 44 -50 55 -63 70 -81 91 -100
38 -100 114 -124 138 -154 170 -191 208 -230 254 -280 309 -339 375 -412 455 -504 556 -617 687 -766
58 -766 860 -973 1109 -1282 1500 -1795 2209 -2842 3912 -6074 12170 -66519 -264422 -210024
72 -210024 -131115 -116242 -28617 176687 256329 143116 21890 -11721 -92069 -214560 -203709
83 -203709 -32144 103489 129690 159427 210636 134106 -61276 -180123 -162548 -147859 -151631
94 -151631 -44960 136407 195981 123523 73395 47560 -65052 -194137 -177503 -55705 20274
105 20274 63744 155592 218589 137642 -13931 -97347 -129644 -180728 -184717 -63539 89073 143783
117 143783 132877 132951 89624 -48629 -168993 -161450 -92617 -48001 26692 155810 215583 138229
129 138229 28927 -36824 -113472 -201991 -192440 -68957 46481 97874 140295 166879 99638
140 99638 -37191 -125245 -131397 -117610 -86040 13450 138026 179463 130979 71676 10311 -94361
152 -94361 -186250 -172408 -82388 -8175 52640 133677 172603 105485 -3285 -68001 -104531 -139117
164 -139117 -117458 -12159 95018 134736 132244 114986 48850 -68439 -155641 -155849 -109750 -58709
176 -58709 19677 120636 164580 114542 36202 -21394 -84626 -145608 -130902 -35239 54183 97212
188 97212 129121 139200 72862 -44153 -120827 -134755 -127474 -95223 -5076 101368 142665 114946
200 114946 71505 17953 -66595 -137951 -127776 -55825 10283 63212 123313 148279 88250 -11925
212 -11925 -78005 -111138 -137265 -118060 -26673 72692 113202 113055 101302 49759 -46383 -117747
224 -117747 -116309 -75678 -31079 32522 110215 139826 94080 19777 -38933 -92632 -137811 -125935
236 -125935 -46050 38455 84260 109207 116422 69662 -23002 -91159 -102598 -88828 -60419 6843
248 6843 90790 125355 96374 47682 -3735 -71770 -129803 -125720 -63085 3946 54142 100926
260 100926 124141 83851 1875 -60002 -85711 -97477 -82565 -14711 67767 103954 94638 71164
272 71164 26261 -51521 -114854 -116105 -73988 -27303 27708 92588 122645 87714 23971 -26692
284 -26692 -69044 -102381 -92454 -28518 41169 77827 91571 88055 44457 -34145 -93424 -103415 -85972
297 -85972 -54232 6633 78712 110863 88717 46539 2279 -53772 -100311 -94480 -41824 13053
309 13053 52730 87634 98218 57368 -15014 -67606 -88467 -94204 -73468 -9811 62758 94713
321 94713 86671 65317 25681 -40318 -93056 -90582 -51425 -11849 31235 82262 101487 62828
333 62828 1334 -41523 -73572 -99370 -85441 -20319 45314 74424 83927 82842 43459 -29536
345 -29536 -78824 -79827 -61755 -37584 13599 76021 95764 63848 22472 -14337 -62595 -101863
357 -101863 -88794 -31741 20267 52885 82985 93809 53443 -14938 -58553 -70191 -73597 -56472
369 -56472 773 64460 83718 66419 43676 7154 -53116 -97135 -85948 -43065 -4384 35956
381 35956 82948 98235 58878 1645 -36162 -62455 -83740 -69029 -9755 48290 68758 69324
393 69324 62579 24622 -43232 -87072 -80141 -55040 -29124 19665 79522 97113 61884 20767
405 20767 -11108 -53946 -90902 -75908 -19319 26306 49819 73205 78923 35857 -30623 -68410
417 -68410 -72784 -70456 -50114 8659 70389 86638 65869 42464 8700 -48747 -90145 -75765
429 -75765 -32106 1654 34830 76491 86656 42925 -13638 -45738 -66805 -82936 -63017 -1745
441 -1745 53503 72152 71918 62764 24354 -38447 -78817 -73182 -47870 -22147 20670 71975 86728
454 86728 50987 7339 -22864 -58613 -89154 -72284 -14211 33044 55786 74971 78785 37536
466 37536 -26370 -62699 -67267 -62939 -42898 8917 63385 78342 57137 30215 -2958 -51767
478 -51767 -87273 -74109 -29851 8471 40831 76219 86199 47341 -8388 -42538 -61576 -75316
490 -75316 -57827 -3284 48000 65206 63271 51635 14141 -42505 -76699 -71464 -46531 -15438
502 -15438 28407 72141 83393 54879 13202 -22112 -56095 -78841 -64920 -17225 28039 52606
514 52606 66512 64100 27438 -28092 -62572 -67307 -58808 -34113 15255 63419 77012 60174 32451
527 32451 -3780 -48643 -76878 -66503 -30807 6466 38457 66085 69927 37026 -10570 -43672
539 -43672 -60463 -66784 -48033 570 47386 64865 62708 50222 14784 -37153 -68481 -64382 -43492
552 -43492 -16311 23742 62909 70928 44212 8530 -23812 -55344 -72524 -55791 -11967 29697
564 29697 54150 66652 61767 26194 -24829 -57468 -62345 -54290 -31751 12099 55822 67185 49163
577 49163 24243 -7632 -47473 -71465 -58482 -22288 11638 41102 65528 66794 34239 -10817
589 -10817 -41874 -56704 -60087 -42337 343 43189 58415 51798 36557 7335 -36261 -64824
601 -64824 -57565 -31658 -5936 26101 60569 68230 40580 3697 -23724 -48843 -65064 -51347
613 -51347 -10250 27462 46668 54506 49818 19887 -25649 -54947 -55908 -42814 -22158 14954 55144
626 55144 66560 46171 18327 -8577 -42256 -66756 -55600 -18935 12654 35233 55522 57288
638 57288 27298 -14977 -41641 -50664 -50953 -33343 5998 44999 58388 49071 31312 3531 -34455
651 -34455 -61701 -55642 -28322 -1906 24382 52916 60376 34123 -3340 -27908 -44781 -55998
663 -55998 -43006 -3057 33854 48601 50868 43560 15201 -27554 -54101 -52560 -37431 -17714 14175
676 14175 49092 58755 38297 10607 -13088 -39551 -58922 -47669 -11279 20009 37756 51886
688 51886 52610 23795 -18567 -42905 -48016 -46092 -30839 6730 43197 52378 41061 24659 -6
701 -6 -34814 -56907 -47898 -20874 3984 28196 52142 55921 29922 -6342 -30041 -44207 -52621
714 -52621 -39704 -2150 33088 45315 44209 36997 11392 -28118 -51669 -46629 -30053 -11030 18596
727 18596 50224 56444 34129 6149 -15880 -39835 -56869 -44936 -9582 20494 35605 46220
739 46220 46445 19863 -20045 -42566 -43072 -38325 -24457 9935 44964 52321 37020 19812 -2210
752 -2210 -34804 -56691 -46129 -17874 4956 25971 47883 52157 25518 -9392 -29562 -40336
764 -40336 -46790 -33597 2707 35909 45110 41049 32433 8013 -29246 -51786 -45241 -26929 -8795
777 -8795 17853 46814 52550 29985 2657 -16640 -36614 -50751 -38748 -4804 23671 36057
789 36057 43259 41769 16019 -21729 -42712 -42130 -35726 -21932 9069 41941 48916 33248 15845
802 15845 -3386 -31649 -51629 -41427 -13098 9058 26202 44878 48632 22854 -11730 -30928
814 -30928 -38857 -44173 -32284 2374 34295 42438 37294 29079 7020 -27817 -48396 -40957 -22169
827 -22169 -4618 18915 45464 49612 26679 -516 -18453 -36272 -49034 -36660 -3384 23725
839 23725 34517 39458 37639 13734 -21510 -40230 -37880 -29945 -16615 11991 41032 45656 28983
852 28983 11608 -6507 -32078 -48823 -38236 -11406 9676 25140 40814 43442 19781 -11685
864 -11685 -28877 -34721 -37611 -26619 4297 33032 39689 32903 24044 4102 -27601 -46308 -38150
877 -38150 -20243 -3947 17942 42200 45739 23818 -1211 -17452 -33308 -44050 -31583 -1111
889 -1111 23462 32982 36886 33418 10081 -22336 -39336 -36284 -27966 -14699 12484 39295 42395
902 42395 26398 9912 -7212 -30753 -44805 -32681 -7234 11170 25219 38834 38145 14143
914 14143 -14207 -28541 -33995 -35171 -21987 7078 31363 36538 29985 20508 1275 -26264 -41363
927 -41363 -32977 -15698 -531 18801 38811 40022 18688 -4216 -18883 -32149 -40688 -27511 1382
940 1382 22716 30857 33982 29725 7225 -21777 -35536 -32125 -23926 -10609 14484 36963 38283
953 38283 22481 6024 -10181 -30266 -42223 -29493 -5006 12302 24710 36511 34780 11468
965 11468 -14631 -26972 -30602 -31135 -18016 9858 31340 33635 26423 16494 -3004 -27908 -39389
978 -39389 -30088 -13213 2231 20400 37124 36442 16068 -5526 -19144 -30414 -35815 -23211 3574
991 3574 23438 29403 30253 24723 3423 -23011 -34472 -30119 -20956 -7285 15781 35215 35538 20589
1005 20589 4289 -11280 -28988 -37704 -26141 -3147 14373 25188 33058 30176 8581 -16725
1017 -16725 -28544 -29730 -27764 -14871 11075 31530 32735 24379 13809 -4231 -26719 -36563 -26947
1030 -26947 -10561 4473 20886 34733 32319 13274 -7566 -20771 -29932 -32762 -20076 5003
1042 5003 24371 29881 28934 21667 2172 -22373 -33389 -28216 -17554 -4008 16130 33453 32690
1055 32690 17723 1576 -13452 -28746 -34886 -23285 -1602 15432 25989 31556 26728 7494
1067 7494 -15934 -27851 -28398 -23951 -11575 10598 29686 31633 21806 9974 -6531 -26002 -35475
1080 -35475 -25881 -8082 6772 20978 33136 30389 11583 -8505 -21018 -28324 -29734 -17039 5653
1093 5653 23364 28345 25697 17820 -163 -21980 -32601 -26927 -14714 -1673 16333 32242 31645
1106 31645 16150 -501 -13592 -26862 -32771 -20945 297 16315 24563 28986 23814 4961 -16951
1119 -16951 -27963 -27190 -21233 -8642 11707 29012 30977 20041 7398 -7099 -24553 -33202 -23923
1132 -23923 -5778 8603 19919 30032 28005 9670 -10577 -21462 -26138 -26939 -15236 6976 24336
1145 24336 27571 23593 15937 -914 -21214 -30834 -24599 -12650 -290 15671 30055 29556 13675
1158 13675 -2799 -14330 -25201 -30526 -19388 2117 17676 23525 26679 22267 4152 -17305 -26739
1171 -26739 -24497 -19436 -7964 12074 28152 28236 17292 5789 -7990 -24189 -31363 -21255 -3578
1184 -3578 9680 19760 28297 26058 7784 -11736 -20755 -23795 -24512 -13537 8028 23725 25062
1197 25062 20172 13188 -2114 -21684 -29547 -21451 -9762 1172 15588 29238 27245 11246 -4181
1210 -4181 -13728 -23442 -28075 -17480 3157 17418 21442 23832 19679 2841 -17922 -25618 -21978 -16506
1224 -16506 -6463 12393 27922 26107 14939 4052 -7639 -23220 -29763 -18993 -2052 9401
1236 9401 18537 26819 23435 5733 -12258 -19952 -22450 -21955 -10954 9311 23670 23446 18105 11300
1250 11300 -3100 -21559 -27960 -19526 -8108 2209 15611 27666 24088 8718 -5274 -13984 -22819
1263 -22819 -25527 -13930 4759 17179 20783 22067 16997 536 -17784 -24117 -20415 -14521 -4516
1276 -4516 13113 25882 23400 12335 2235 -8787 -22692 -27010 -15769 87 10023 18342 24967
1289 24967 20634 3322 -12660 -19400 -21051 -20038 -8801 10262 22114 21581 16397 9507 -4900
1302 -4900 -21354 -25692 -17156 -6537 3322 16310 26137 21930 7127 -5869 -14320 -21905 -23700 -11571
1316 -11571 5991 16931 19842 20526 14513 -1453 -17603 -23012 -18550 -12643 -2017 14263 24844
1329 24844 21837 11048 961 -10268 -21959 -24634 -14301 337 11008 18127 22918 17892 1887
1342 1887 -13057 -19049 -20226 -17372 -6218 11053 21780 21051 14852 6768 -6645 -20431 -24089 -16075
1356 -16075 -5021 4893 16150 23866 19367 6110 -6475 -14998 -20859 -20896 -9755 6455 17004
1369 17004 19614 19002 12004 -2300 -16841 -22069 -17958 -10883 -98 13738 22999 20414 9911 -934
1383 -934 -11246 -20733 -22544 -12786 1257 11972 18862 21385 15331 1082 -12617 -19430 -19460 -14986
1397 -14986 -4264 10456 20660 20523 13848 4435 -7735 -19097 -22540 -15038 -3434 6899 16371
1410 16371 21962 17750 5378 -7721 -15652 -19650 -18389 -8313 6219 16787 19447 16807 9117
1423 9117 -3170 -15895 -21245 -17155 -8295 2043 13402 21164 19490 8963 -2523 -11983 -19458
1436 -19458 -20447 -11736 1976 12514 18019 19239 13351 525 -12791 -19127 -18268 -13138 -2428 10532
1450 10532 19614 19718 12448 2661 -8287 -18000 -21077 -14304 -2414 8103 15986 19986 16516 4337
1464 4337 -8634 -15711 -18424 -16095 -7420 7221 17223 18670 14862 7585 -4212 -16436 -20535 -15813
1478 -15813 -7034 2936 13153 20562 18151 7597 -3930 -12041 -17832 -18923 -10485 3251 13664
1491 13664 16871 17159 12532 111 -13649 -18943 -16346 -11217 -2214 10614 19804 18612 10213 1536
1505 1536 -7877 -17239 -20421 -12695 -484 8524 15045 18679 15212 3275 -9675 -15777 -16739 -14661
1519 -14661 -6278 7378 17375 17625 12911 6564 -4104 -15749 -19895 -14127 -5039 3250 13204 19800
1533 19800 16857 5597 -4811 -12269 -17098 -17666 -9422 4150 13724 16410 15549 10851 -665 -13657
1547 -13657 -18168 -14846 -9208 -1138 10368 19043 17163 8398 144 -8138 -17144 -19438 -11197 545
1561 545 8764 14268 17999 13897 1594 -9877 -15107 -15617 -13228 -4778 8252 17194 16451 11323 5296
1576 5296 -4734 -16279 -19267 -12148 -3481 3668 12682 19269 15627 4108 -5724 -11405 -16515 -16627
1590 -16627 -7315 5833 13354 15019 14580 9325 -2379 -14165 -17319 -13658 -7899 -356 11057 18557
1604 18557 15850 6897 -658 -8506 -16342 -17946 -9380 1912 9015 13901 16758 12570 -174 -10780
1618 -10780 -14314 -14678 -12284 -3707 9054 16325 15199 10295 4340 -5808 -15859 -17949 -10771 -2400
1632 -2400 4453 12437 18262 14120 2861 -6187 -11761 -15449 -15390 -6215 6193 13432 14409 13555 8756
1647 8756 -3367 -14245 -16346 -12195 -7510 933 11594 17582 14420 6224 -1542 -8816 -16035 -16700
1661 -16700 -8234 2884 9596 13698 15851 10994 -712 -10678 -14054 -13716 -10796 -2611 9615 16026
1675 16026 14332 9730 3107 -6572 -15566 -16782 -10224 -1558 5563 12771 17009 12896 2082 -6893
1689 -6893 -11979 -14583 -13870 -4813 6741 13303 13770 12183 6903 -3942 -13543 -15713 -11637 -5803 1593
1704 1593 11476 16668 13459 5121 -2154 -9386 -15150 -15268 -7154 2895 9512 13761 14414 9371 -1366
1719 -1366 -10637 -13976 -13232 -9547 -1164 9378 15604 13746 8675 1907 -6640 -14616 -15845 -8978 -955
1734 -955 6160 12675 16121 11135 1452 -6983 -12017 -14174 -12485 -3946 6602 13157 13893 11419 5261
1749 5261 -4278 -13182 -15337 -10810 -4734 2879 10908 15803 12540 4388 -3275 -9154 -14421 -14149 -6452
1764 -6452 3523 10048 12934 13435 8460 -1476 -10366 -14048 -12102 -7952 -455 9036 14705 13200 7418
1779 7418 335 -7200 -14185 -14638 -8568 -133 6681 12361 14613 10328 800 -7458 -11811 -13477 -10703
1794 -10703 -3296 7050 12722 13259 9796 4242 -4511 -12914 -14775 -10113 -3521 3329 11042 14972 11732
1809 11732 4064 -3956 -9780 -13672 -12985 -5568 4080 10504 12673 12060 7304 -1844 -10536 -13235 -11314
1824 -11314 -6990 8 8936 14617 12859 6173 -346 -7210 -13394 -14210 -7661 828 7120 11608 13481
1839 13481 9791 452 -7960 -11471 -12139 -9848 -2453 7074 12687 12320 8640 3390 -4601 -12560 -13924
1854 -13924 -9078 -2657 3442 10476 14572 10817 2560 -4312 -9304 -12732 -12243 -4758 4889 10180 12048
1869 12048 10881 6611 -2303 -10553 -12836 -10469 -5796 608 9041 13873 11654 5073 -848 -7081 -12913
1884 -12913 -13115 -6622 1674 7498 11003 12659 8693 -80 -8635 -11386 -11164 -8996 -2035 7545 12636
1899 12636 11170 7412 2531 -5030 -12217 -13303 -7810 -1422 4031 10264 13840 10085 1614 -5123 -8993
1914 -8993 -12348 -11450 -3941 5236 10145 10758 10185 5803 -3352 -10996 -12325 -9185 -4931 1368 9521 13474
1930 13474 10396 4305 -1635 -7138 -12480 -12590 -5910 2312 7322 10637 11963 7688 -1355 -8585 -10819
1945 -10819 -10431 -8455 -764 7828 11951 10291 6667 1994 -5443 -12139 -12497 -7095 -749 4429 10152
1960 10152 13007 9174 939 -5474 -8838 -11483 -10472 -3189 5591 9963 10386 9106 5128 -3908 -11022
1975 -11022 -11543 -8191 -4396 1659 9431 12950 9627 3379 -1694 -7569 -12393 -11528 -4687 3112 7449
1990 7449 10359 11468 6721 -1932 -8776 -10571 -9632 -7180 -527 8341 11708 9684 6051 1354 -5908
2005 -5908 -11975 -11774 -6068 -83 4807 9960 12364 7960 296 -5791 -8952 -10689 -9223 -2198 5949
2020 5949 10014 9947 8451 3612 -4061 -10596 -11252 -7326 -3566 2273 9243 12719 8663 2473 -2421 -7212
2036 -7212 -11495 -10566 -3784 3323 7532 9659 10439 6025 -2417 -8562 -9873 -8923 -6072 38 7873 11574
2052 11574 9337 5291 365 -5964 -11514 -10925 -5567 166 5083 9641 11542 7314 -13 -5733 -8612
2067 -8612 -10275 -8317 -1473 6207 9852 9670 7522 2735 -4651 -10524 -10334 -7004 -2582 2648 9398
2082 9398 11556 8164 2096 -2914 -7693 -11093 -9682 -3061 3674 7429 9538 9767 4900 -3013 -8747
2097 -8747 -9589 -8749 -5333 991 8046 11024 8675 4550 -45 -6224 -10791 -10206 -4746 907 5446 9594
2113 9594 10846 6610 -902 -5822 -8468 -9729 -7678 -982 6151 9280 9062 6932 2290 -4766 -9871
2128 -9871 -10211 -6666 -2352 3345 9033 10906 7344 1622 -3225 -7526 -10397 -9018 -2595 3908 7238
2143 7238 9343 8960 4357 -3151 -8306 -9416 -7922 -4684 1459 7999 10418 8109 3931 -902 -6399
2158 -6399 -10466 -9395 -4254 1151 5411 9179 9573 5447 -904 -6166 -8408 -9233 -6421 -362 6516
2173 6516 9150 8312 5998 1814 -4824 -9869 -9277 -5718 -1600 3822 8624 10152 6937 772 -3466
2188 -3466 -7483 -9782 -8010 -2208 4096 7498 8505 8153 3400 -3280 -8121 -8962 -7377 -4042 1907
2203 1907 7833 10087 7577 3417 -1090 -6414 -9747 -8900 -3640 1673 5935 8889 9151 4915 -1370
2218 -1370 -6415 -8439 -8490 -5720 -6 6248 9119 8096 5552 1064 -5178 -9392 -9042 -5340 -576 4011
2234 4011 8339 9854 6310 618 -3957 -7539 -8873 -7221 -1607 4302 7757 8265 7296 3129 -3564
2249 -3564 -8210 -8678 -6745 -3118 2001 7386 9454 7153 2739 -1879 -6119 -9370 -8331 -3341 2204
2264 2204 5886 8318 8428 4508 -1490 -6435 -8073 -7484 -4957 151 6060 8847 7756 4770 401
2279 401 -4769 -9112 -8522 -4862 11 4308 7897 8879 5995 193 -4668 -7414 -8219 -6560 -1503 4728
2295 4728 7740 7864 6248 2550 -3754 -8073 -8506 -5980 -2510 1999 7236 9029 6487 1960 -2235
2310 -2235 -6349 -8809 -7725 -2891 2548 5820 7863 7499 4271 -1984 -6311 -7796 -7213 -4369 590
2325 590 6544 8532 7173 3699 -122 -4961 -8568 -8161 -4216 379 4259 7362 8636 5238 -215
2340 -215 -4707 -6988 -8021 -6226 -977 5014 7470 7116 5400 1868 -3400 -7912 -8145 -5581 -2085 2120
2356 2120 6911 9032 6181 1476 -2692 -6051 -8308 -7274 -2573 2842 6060 7458 7019 3967 -2400
2371 -2400 -6744 -7418 -6308 -3732 783 6154 8515 6698 3195 -526 -4739 -8530 -7853 -3614 772
2386 772 4438 7269 8401 5032 -765 -4701 -6657 -7490 -5454 -817 5082 7364 7003 5174 1635 -3678
2402 -3678 -7689 -7782 -4659 -1547 2789 6875 8550 5731 1052 -2673 -5604 -7889 -6728 -1928 3140
2417 3140 6064 7010 6543 3360 -2527 -6415 -7309 -6260 -3548 1158 6181 8152 6191 2913 -802 -4801
2433 -4801 -8091 -7020 -3201 1205 4382 7307 7487 4383 -1102 -4982 -6272 -6728 -5504 -319 4904
2448 4904 7109 6594 4459 972 -4322 -7946 -7153 -4243 -1263 3034 6679 8054 4906 732 -2717
2463 -2717 -5808 -7624 -5947 -1304 3367 5659 6849 6088 2674 -2629 -6602 -6805 -5525 -2895 1409
2478 1409 6298 7715 5415 2628 -995 -5105 -7655 -6500 -2436 1313 4516 7107 6922 3848 -1063
2493 -1063 -4853 -6248 -6615 -4807 327 5119 6964 6156 4047 896 -4191 -7167 -6607 -3831 -529 3081
2509 3081 6595 7449 4232 147 -3024 -5836 -7233 -5220 -921 3280 5856 6403 5593 2093 -2792 -6075
2525 -6075 -6484 -4871 -2387 1744 5891 7415 5010 1912 -1153 -5184 -7255 -5881 -2049 1705 4316
2540 4316 6530 6587 2923 -1556 -4939 -6042 -6077 -3663 772 4814 6460 5498 3724 48 -4155 -6635
2556 -6635 -6218 -3524 -327 3421 6567 6739 3982 -66 -3454 -5645 -6539 -4901 -466 3309 5653 6056
2572 6056 5015 1366 -3113 -5974 -6326 -4401 -1698 2318 5769 6642 4661 1594 -1907 -5022 -6592
2587 -6592 -5367 -2035 1927 4585 6076 5771 2682 -1668 -4959 -5970 -5374 -3323 983 4716 6327
2602 6327 5484 3097 -465 -4340 -6504 -6217 -3086 556 3627 5945 6299 3975 -240 -3637 -5416 -6066
2618 -6066 -4157 -391 3590 5553 5778 4270 1224 -3077 -6004 -5880 -3887 -1288 2282 5641 6403 4561
2634 4561 978 -1883 -4601 -6428 -4998 -1698 2136 4856 5620 4997 2458 -1855 -5288 -5737 -4618 -2810
2650 -2810 984 4714 6328 4773 2282 -402 -4070 -6142 -5470 -2293 1015 3377 5849 5814 3319 -693
2666 -693 -3650 -5102 -5662 -3967 -202 3955 5582 5155 3752 1083 -2830 -5901 -5567 -3135 -923 2267
2682 2267 5055 6185 4221 697 -2370 -4677 -6054 -5011 -1339 2469 4735 5161 4898 2124 -2257
2697 -2257 -4810 -5692 -4261 -2389 1101 4718 6172 4270 1735 -642 -4183 -6358 -5292 -1817 1236
2712 1236 3462 5108 5811 3074 -1103 -3847 -5007 -4935 -3648 53 3694 5592 4909 3212 898 -3244
2728 -3244 -5666 -5181 -2959 -413 2529 5188 6010 3410 136 -2426 -4287 -5638 -4493 -751 2727
2743 2727 4422 4928 4508 1829 -2557 -5202 -5131 -3982 -2213 1457 4837 5593 3861 1012 -846 -3880
2759 -3880 -6158 -4848 -1449 1281 3112 4876 5081 2611 -1425 -3789 -4800 -4550 -2874 573 4314
2774 4314 5257 4469 2760 256 -3316 -5622 -4769 -2391 -235 2516 4932 5516 2740 2 -2709 -4371
2790 -4371 -5473 -3990 -387 2940 4116 4629 4018 1491 -2485 -4719 -4664 -3528 -1519 1529 4786 5375
2806 5375 3431 1195 -1176 -4187 -5644 -4514 -1174 1266 3172 4895 4895 1863 -1400 -3614 -4445 -4444 -2924
2823 -2924 708 3931 4813 4073 2404 -298 -3554 -5380 -4473 -2227 -180 2391 4824 4756 2630 -236
2839 -236 -2493 -4061 -4911 -3569 163 3104 3947 4651 3632 843 -2721 -4827 -4392 -3422 -1143 1939
2855 1939 4591 4859 3366 890 -1270 -4103 -5103 -4036 -854 1402 3344 4918 4499 1541 -1777
2870 -1777 -3553 -3978 -4140 -2384 1263 3856 4500 3776 2402 -330 -3408 -5024 -4079 -1992 249 2438
2886 2438 4759 4775 2389 -345 -2567 -3996 -4751 -2998 -2 3082 4167 4015 3220 581 -2817 -4111
2902 -4111 -3878 -2967 -981 1985 4405 4718 2839 803 -1704 -3851 -4602 -3362 -786 1954 3407 4517
2918 4517 3890 1428 -1496 -3810 -4350 -3655 -1858 1106 3845 4317 3679 2073 -745 -3307 -4599 -3831
2934 -3831 -1735 525 2678 4432 4183 1966 -545 -3035 -4098 -4185 -2606 185 2663 4188 3636 2782
2950 2782 294 -2893 -4279 -4113 -2433 -507 2135 4216 4127 2936 234 -1476 -3948 -4295 -3130 -637
2966 -637 1867 3455 4192 3418 903 -1765 -3481 -3952 -3115 -1413 1307 3344 3920 3113 1593 -718 -2999
2983 -2999 -4471 -3640 -1407 897 2670 3855 3772 1631 -793 -2502 -4000 -3655 -2372 523 2747 4080
2999 4080 3490 2253 -14 -2442 -4152 -3765 -2113 -404 1997 3752 3987 2443 99 -1904 -3369 -4189
3015 -4189 -2823 -156 2056 3328 3921 2888 888 -1907 -3541 -3624 -2575 -1105 1401 3470 4007 2880
3031 2880 1067 -1004 -2902 -4112 -3097 -914 758 2676 3862 3745 1565 -1319 -2617 -3272 -3379 -2067
3047 -2067 825 2917 3691 3245 1789 -39 -2428 -3978 -3251 -1682 95 1973 3819 3866 2160 -300
3063 -300 -1970 -3197 -4054 -2441 193 2087 3097 3284 3041 689 -1865 -3682 -3617 -2468 -935 1224
3079 1224 3651 3984 2304 901 -1054 -3021 -4017 -2907 -791 1122 2485 3397 3254 1253 -1329 -2862
3095 -2862 -3324 -3039 -1741 905 3226 3433 2733 1704 -395 -2432 -3909 -3058 -1269 81 2145 3471
3111 3471 3647 1609 -374 -1928 -2919 -3321 -2488 334 1912 2944 3248 2477 438 -1791 -3508 -2974 -2357
3128 -2357 -574 1554 3341 3402 1991 598 -949 -2729 -3764 -2617 -451 1369 2410 3275 2824 813
3144 813 -1304 -2721 -2754 -2848 -1482 884 2904 2933 2583 1470 -195 -2533 -3724 -2766 -1105 467 2133
3161 2133 3162 3160 1360 -659 -2036 -3213 -3266 -1999 144 2144 2923 2823 2068 232 -1894 -3048 -2817
3178 -2817 -1875 -638 1286 3050 3160 1598 240 -904 -2755 -3314 -2423 -405 1313 2655 3100 2630
3194 2630 740 -1325 -2578 -3000 -2191 -1146 1058 2728 2710 2574 1314 -628 -2633 -3471 -2337 -879
3210 -879 -58 2367 3341 2641 1348 -562 -1918 -2625 -3159 -1633 596 2155 2702 2662 1692 -147 -1823
3227 -1823 -2787 -2672 -1840 -408 1753 2673 2992 1733 243 -1240 -2707 -2938 -1963 -10 1319 2337 2946
3244 2946 1980 51 -1350 -2461 -2939 -2300 -840 1229 2709 3083 1887 743 -498 -2499 -3002 -2213
3260 -2213 -789 560 1949 2886 2329 796 -634 -1676 -2837 -2644 -1271 687 1910 2621 2543 1271
3276 1271 -271 -2067 -2870 -2377 -1497 67 1759 2560 2595 1761 -53 -1441 -2701 -2810 -1582 -124 1556
3293 1556 2197 2589 1706 167 -1628 -2363 -2619 -1787 -678 1166 2449 2671 1985 816 -832 -2214 -2774
3310 -2774 -1966 -489 845 2042 2518 2237 772 -648 -2015 -2675 -2238 -1047 759 2147 2256 2141 1054
3327 1054 -84 -2020 -2401 -2366 -1204 211 1711 2594 2463 1410 -461 -1325 -2291 -2679 -1404 -220 1492
3344 1492 2349 2540 1517 44 -1517 -2229 -2323 -1961 -129 1241 2381 2393 1636 408 -894 -1942 -2407
3361 -2407 -1921 -489 958 1998 2282 1769 626 -1192 -1779 -2355 -2208 -793 453 1905 2362 1772 1009
3378 1009 -362 -1570 -2501 -1675 -945 239 1459 2154 2169 993 -267 -1449 -2361 -2244 -1424 268 1462
3395 1462 1917 2437 1277 43 -1546 -2240 -2125 -1440 -209 1304 2301 2337 1253 382 -948 -2098 -2452
3412 -2452 -1742 -414 963 1854 2171 1574 15 -1098 -1986 -2046 -1511 -791 928 1920 2272 1590 676 -116
3430 -116 -1957 -2189 -1902 -718 498 1642 1996 2065 991 -523 -1396 -2194 -1984 -964 444 1464 1743
3447 1743 1844 1155 -89 -1327 -2053 -1895 -1085 -137 1214 2045 2088 955 36 -898 -1915 -2154 -1543 -81
3465 -81 1133 1795 1930 1791 165 -1027 -1995 -1926 -1524 -635 739 1992 2235 1450 529 -689 -1683 -2199 -1645
3484 -1645 -362 477 1409 2274 1548 770 -574 -1362 -1829 -1670 -869 483 1473 2120 1806 1224 -146 -1515
3502 -1515 -1971 -1800 -988 -238 1178 2038 1742 974 -176 -921 -1670 -1990 -1176 117 1041 1443 1756 1605 312
3521 312 -1262 -1692 -1567 -1232 -479 814 2092 2077 1001 274 -491 -1612 -1746 -1651 -513 588 1305 1789
3539 1789 1510 756 -376 -1175 -1792 -1606 -715 753 1300 1467 1483 1003 -198 -1684 -1889 -1427 -905 151
3557 151 1071 1851 1727 800 -314 -1003 -1669 -2045 -751 86 986 1687 1330 1016 232 -1020 -1800 -1322 -1197
3576 -1197 -392 918 1741 1736 958 405 -491 -1418 -1940 -1162 117 642 1345 1540 1459 468 -663 -1121 -1223 -1375
3596 -1375 -649 587 1481 1389 1336 735 -345 -1355 -1693 -1093 -515 -7 991 1513 1520 598 -484 -805 -1458 -1722
3616 -1722 -885 281 996 1232 1467 1044 -43 -1010 -1424 -1187 -1307 -420 930 1296 1557 639 121 -709 -1392
3635 -1392 -1672 -622 -333 746 1318 1490 1051 207 -519 -1184 -1395 -1261 -343 605 1280 1237 1032 419 -363
3654 -363 -1294 -1429 -1023 -511 285 1100 1485 1488 294 -557 -1104 -1473 -1373 -673 43 1098 1053 1009 711 -245 -1112
3675 -1112 -1091 -1040 -669 -346 1212 1446 1491 738 26 -676 -1469 -1391 -756 33 980 1226 1211 801 64 -471 -1378
3696 -1378 -1497 -988 -161 636 1365 1220 579 383 -391 -912 -1097 -902 -313 226 1209 1449 1221 293 -552 -1148
3716 -1148 -1241 -1059 -594 350 841 1335 1270 746 -228 -768 -1514 -1165 -605 -52 612 1133 1060 569 -248 -738 -1131
3737 -1131 -1098 -959 78 799 957 1262 944 14 -650 -1267 -1236 -830 -102 468 1014 886 829 291 -607 -1151
3757 -1151 -1398 -973 -139 288 1022 1138 962 283 -403 -861 -1435 -1227 -697 823 1112 1212 1027 436 -199
3776 -199 -745 -1184 -683 -316 50 713 1020 1101 391 -6 -928 -1186 -1207 -487 237 466 1047 955 450 19 -818
3797 -818 -1071 -1076 -631 -122 679 1366 1057 642 275 -314 -872 -1115 -523 -75 467 1126 1258 662 289 -300 -976
3818 -976 -1165 -1041 -126 401 1137 848 722 459 -499 -892 -915 -1035 -397 32 983 1050 948 388 -57 -663 -1145
3839 -1145 -901 -501 265 866 830 874 545 -274 -754 -1021 -800 -467 165 566 939 725 590 -90 -504 -1191
3859 -1191 -927 -628 -14 627 940 809 619 80 -518 -783 -999 -711 -5 389 706 1052 699 424 -311 -682
3879 -682 -885 -746 -208 316 785 785 912 152 -393 -489 -1004 -1065 -625 41 501 1088 835 590 -108 -897 -1009
3900 -1009 -671 -415 385 739 1036 651 738 -18 -650 -834 -902 -501 -112 538 764 967 667 17 -478 -837
3920 -837 -848 -858 -185 632 803 875 563 290 -492 -797 -785 -562 -249 419 822 878 710 -118 -393 -701 -999 -644
3942 -644 -285 455 775 667 673 473 -598 -851 -998 -546 -565 46 833 1223 604 308 -12 -695 -1091 -859 -221
3963 -221 33 498 525 1009 336 -163 -588 -590 -785 -448 100 340 697 709 516 -2 -526 -589 -617 -490 129 302
3985 302 829 948 397 -27 -149 -629 -675 -663 -308 456 671 625 737 145 -219 -513 -901 -624 -300 201 651
4006 651 966 731 247 -323 -521 -568 -624 -355 232 273 724 728 292 -126 -226 -385 -691 -576 145 407 626 608
4028 608 148 25 -532 -756 -706 -393 -34 273 774 800 416 177 33 -539 -828 -429 21 252 635 748 324
4049 324 -49 -351 -770 -726 -405 -324 288 679 655 409 188 134 -526 -532 -345 -256 165 502 825 696 42 -126
4071 -126 -615 -676 -755 -327 -68 322 754 622 228 -160 -554 -577 -541 -594 -153 467 648 689 153 -225 -457 -587
4093 -587 -664 -259 -55 220 789 593 384 438 -224 -579 -446 -218 -68 224 651 730 413 -160 -228 -600 -686 -700
4115 -700 -259 62 740 619 490 256 -123 -341 -717 -498 -473 212 178 619 506 284 -140 -241 -612 -293 -214
4136 -214 0 550 599 738 687 -106 -312 -311 -468 -295 117 453 417 556 229 -81 -291 -560 -311 -85 167 369
4158 369 699 512 358 138 -258 -395 -629 -427 -54 190 383 555 482 76 -217 -615 -697 -618 -284 46 547
4179 547 598 365 236 -328 -432 -588 -571 67 241 406 575 444 137 -294 -309 -451 -672 -253 92 526 347
4200 347 99 179 -86 -99 -909 -602 -359 -43 339 703 481 167 -210 -175 -589 -183 -236 -78 290 630 584 320
4222 320 -149 -408 -632 -480 -414 -17 324 415 381 390 126 -96 -274 -399 -220 -1 22 425 548 275 120 -288
4244 -288 -389 -544 -520 -172 289 418 370 435 15 30 -467 -549 -376 -18 64 524 384 393 325 -291 -399 -461 -185
4267 -185 13 71 313 427 368 323 14 -370 -704 -163 -258 211 152 593 682 444 -139 -465 -265 -581 -485 -36
4289 -36 311 58 679 415 187 -486 -435 -427 -351 -249 239 452 482 268 124 -111 -167 -399 -524 32 -5 271 482
4312 482 393 378 -105 -271 -481 -268 -288 -21 241 328 368 215 -214 -437 -528 -443 21 237 646 236 520 169
4334 169 -70 -137 -381 -613 -219 30 488 313 671 238 -32 -110 -465 -514 -144 57 123 181 507 216 -36 -102
4356 -102 -389 -302 -435 173 128 308 529 240 77 -80 -312 -254 -379 -124 313 340 408 392 173 -300 -372 -525
4378 -525 -474 -56 211 353 463 466 198 -83 -349 -188 -387 -45 192 415 476 324 -11 -204 -161 -460 -251 -167
4400 -167 157 379 343 266 97 101 -224 -343 -436 -270 231 -110 311 365 248 -65 -281 -317 -444 -461 -167 331 349
4423 349 291 218 -101 -62 -235 -451 -375 -9 204 244 276 209 232 -26 -196 -255 -249 82 202 288 368 198 71 -398
4447 -398 -450 -512 -510 -111 -98 322 359 418 345 -295 -470 -283 -208 -63 86 207 371 490 -26 17 -184 -522 -571 -303
4471 -303 91 365 447 286 188 -195 -83 -179 -250 -319 -101 185 190 623 108 276 -449 -281 -159 -237 -180 176 348
4494 348 18 178 -62 -145 -67 -406 -248 -87 -5 206 372 336 -13 -103 -310 -172 -192 -43 123 83 357 365 136
4517 136 -396 -251 -494 -247 -220 -165 369 496 436 246 55 -430 -613 -154 -255 222 181 178 517 277 222 -220
4539 -220 -392 -454 -250 194 258 362 263 145 119 -326 -384 -227 -114 -14 315 241 461 241 252 -218 -398 -430 69
4562 69 -164 71 49 237 422 80 -133 -441 -332 -351 168 289 407 236 148 88 -164 -45 -477 -276 -117 259
4584 259 172 600 278 265 14 -304 -363 -184 -314 -54 66 274 286 75 293 -332 -317 -271 -57 215 124 304
4606 304 383 290 53 -248 -205 -258 -51 86 111 335 281 204 -71 -11 -305 -497 -132 146 209 120 304 393 26 -249
4630 -249 -108 -249 -173 207 247 133 376 365 36 -371 -201 -336 -150 -150 71 323 322 301 10 -191 -564 -294 -280
4653 -280 16 18 265 71 214 34 7 -108 -448 -380 43 38 158 374 195 261 -127 -183 -708 -298 -205 -138 63
4676 63 328 528 334 9 170 -279 -250 -274 26 204 540 320 -43 28 -406 -221 -549 78 145 80 308 497
4698 497 401 264 -168 -460 -395 -274 -264 179 111 483 533 -62 -50 -121 -312 -471 54 309 308 349 269 -103 -200 -171
4722 -171 -504 -118 -123 -153 -81 478 523 214 -142 -152 -451 -563 -181 105 510 158 87 146 -222 -145 -84 -357 -286 -62
4746 -62 354 844 371 384 -1 -24 -260 -516 35 154 161 161 516 65 -20 -93 -401 -597 -248 143 104 273 395
4769 395 467 140 -260 -141 -185 -277 -232 59 398 542 206 153 -146 -142 -320 -227 -20 199 243 163 124 448 -70 -275
4793 -275 -457 -369 -505 -19 268 381 307 -238 -135 -274 -302 -521 -130 92 302 323 129 361 76 -376 -344 -523
4815 -523 -98 192 248 83 410 147 116 -112 -428 -423 -361 -212 201 322 122 334 151 -209 -271 -519 -202 -348
4837 -348 285 286 228 378 153 -186 -384 -279 -141 -244 -98 362 469 458 99 62 -187 -419 -217 -147 303 201
4859 201 264 474 48 237 -290 -634 -636 -61 177 190 301 135 332 -113 -461 -499 -633 -92 -21 262 238 372
4881 372 193 -174 -196 -268 -363 -312 -89 227 356 514 217 104 -58 -511 -711 -236 19 108 388 279 361 -154
4903 -154 -109 -194 -450 -621 -246 265 161 227 219 385 135 31 -244 -406 -87 -12 266 291 82 124 -20 -176 -219
4926 -219 -424 -206 9 216 533 193 283 25 -489 -314 -375 -272 56 45 256 223 78 15 -160 -419 -495 -260
4948 -260 -138 183 534 213 570 122 -124 -381 -432 -245 -7 203 489 353 244 386 -318 -315 -399 -418 -212 335
4970 335 386 349 268 21 -236 -274 -347 -579 -275 128 267 622 476 105 -100 -97 -497 -486 156 25 267 272 201 10
4994 10 39 -560 -416 -86 -311 -56 275 342 370 236 -36 19 -339 -468 -296 -196 98 531 467 235 -1 -275
5016 -275 -628 -179 -154 -160 106 280 359 479 201 -86 -301 -150 -558 -159 58 319 438 297 200 -223 -82 -500
5038 -500 -272 -19 227 397 663 239 59 -112 -441 -246 -236 -296 345 223 272 540 377 153 -66 -159 -433
5059 -433 -50 133 14 427 609 212 -4 -356 -427 -270 -614 -148 491 191 313 219 1 -228 -105 -218 -395
5080 -395 -227 135 274 461 527 171 -159 -148 -206 -360 -314 -81 364 573 450 245 112 -346 -496 -383 -46
5101 -46 53 433 255 811 259 -35 -250 -123 -305 -142 74 413 558 340 328 -369 -179 -225 -477 -162 0
5122 0 209 284 606 223 -139 -223 -212 -637 -189 5 184 205 364 305 55 -208 -256 -554 -324 -99 366 189 546
5145 546 369 89 -170 -340 -471 -245 -41 223 381 412 237 216 -281 -331 -515 -546 -429 207 528 453 387 170
5167 170 -308 -334 -566 -403 -110 -311 200 477 349 174 -139 -348 -320 -519 -329 129 245 365 264 507 1
5188 1 -420 -550 -652 -265 2 146 488 426 157 151 -445 -409 -514 -704 30 267 400 638 503 139 -100 -367
5210 -367 -344 -421 -44 109 311 463 416 74 -281 -210 -360 -157 109 159 475 550 410 27 46 -54 -351 -318 -265
5233 -265 256 323 285 730 172 -36 -420 -555 -459 -204 -41 293 352 582 328 290 -240 -301 -418 -253 131 99
5255 99 523 219 432 131 -236 -501 -344 -413 108 295 610 373 220 -73 -25 -327 -470 -571 -217 197 453
5276 453 239 358 195 -172 -294 -514 -217 -178 74 479 544 517 431 -308 -377 -481 -288 -106 -8 269 411 403 322
5299 322 -4 -207 -795 -398 -253 -142 177 478 534 76 -194 -294 -633 -452 -382 -284 174 451 720 272 234
5320 234 -212 -305 -348 -367 -26 192 591 322 401 8 -421 -173 -743 -410 -280 218 433 700 466 269 -107
5341 -107 -395 -493 -345 122 188 352 560 356 178 -189 -237 -432 -622 -151 144 310 633 643 128 43 -301 -545
5363 -545 -457 -193 -67 369 413 496 371 -71 -280 -694 -218 -242 113 557 437 397 38 -115 -295 -596 -486 -435
5385 -435 31 334 405 405 495 215 189 -355 -475 -538 -260 190 442 670 431 380 -218 -429 -497 -650 -262 296 574
5408 574 426 421 282 -142 -255 -349 -494 -203 81 435 537 430 198 -229 -280 -270 -452 -316 48 300 441 374
5430 374 4 -16 -181 -362 -422 -324 -101 338 395 827 315 -10 -496 -387 -395 -414 -274 84 439 722 355 -22
5452 -22 -151 -252 -604 -345 -300 243 275 514 411 37 36 -246 -547 -182 -356 -177 407 529 524 266 -59 -324
5474 -324 -567 -566 -393 295 308 285 607 256 -96 -467 -458 -367 -445 -223 188 686 685 156 142 -198 -383 -555 -638 -52
5498 -52 90 492 656 229 -48 -426 -402 -391 -555 -386 115 501 578 350 222 -209 -548 -327 -394 -274 220 303
5520 303 823 81 198 -154 -494 -528 -407 -90 54 211 104 209 180 45 -398 -295 -549 -486 -6 333 439
5541 439 274 232 -36 -336 -677 -473 -333 175 158 483 545 430 203 -207 -126 -675 -316 -325 118 559 122 323
5563 323 288 -158 -517 -634 -170 -243 -56 303 490 280 211 26 -189 -426 -208 -240 43 587 563 637 530 -213
5585 -213 -245 -464 -385 -356 151 419 392 687 170 -46 -615 -517 -618 -291 -31 576 480 353 319 90 -181 -258 -504
5608 -504 -175 -55 127 567 583 564 -55 -100 -557 -690 -416 -217 322 585 494 260 10 58 -443 -486 -503 -163
5630 -163 -130 485 664 417 261 -217 -454 -727 -181 -252 108 318 448 116 420 -188 -484 -473 -242 -360 114
5651 114 451 486 229 356 -35 -173 -797 -593 -376 -40 251 453 532 444 -9 -271 -595 -639 -139 17 146
5672 146 275 675 165 85 -374 -598 -377 -272 -16 412 462 513 311 374 -282 -491 -457 -529 -236 -66 382 509
5694 509 539 321 -67 -393 -479 -235 -283 -142 489 350 387 310 -19 -350 -718 -304 -420 140 284 500 504 315
5716 315 -195 -298 -542 -283 -322 -37 100 562 760 374 -203 -213 -397 -646 -451 -3 -37 319 502 297 289 -195
5738 -195 -567 -486 -228 -206 266 565 715 308 80 -404 -593 -635 -547 -427 241 323 476 264 369 -477 -426 -472
5760 -472 -319 -47 -253 156 418 135 137 -49 -390 -327 -528 -371 104 249 325 507 349 7 -301 -318 -337 -285
5782 -285 -209 460 159 628 281 199 -265 -398 -413 -149 -1 112 149 660 564 24 -384 -424 -336 -333 -168 135 252
5805 252 363 306 375 -345 -287 -392 -472 -333 90 254 541 516 123 -53 -395 -561 -557 -120 -6 215 200 458 145
5828 145 -292 -351 -291 -311 -557 -87 321 424 444 317 -39 -450 -271 -352 -98 -126 113 515 692 208 145 -347
5850 -347 -365 -488 -703 142 245 428 367 594 300 -275 -407 -449 -294 -193 203 528 481 244 -117 -396 -387 -645
5872 -645 -116 -288 -43 320 609 514 317 99 -519 -404 -398 -273 56 201 753 227 379 66 -544 -531 -578 -121
5894 -121 -121 207 518 516 -18 97 -140 -481 -506 -333 -18 308 542 391 346 21 -381 -684 -595 -367 -202 145
5916 145 272 190 417 105 190 -387 -622 -564 6 32 301 466 459 177 -303 -246 -638 -472 -89 -45 577 625 358
5939 358 3 19 -443 -604 -553 -550 37 434 429 432 146 -103 -285 -442 -333 -386 -151 425 486 541 297 198 -569 -205
5963 -205 -422 -136 -119 431 355 344 182 -7 157 -432 -389 -296 -151 557 177 486 539 97 -196 -448 -311 -112
5985 -112 -74 186 611 574 632 281 -266 -329 -456 -265 -230 -20 660 566 407 259 -236 -361 -399 -391 -362 212 306 625
6009 625 457 -47 78 -566 -488 -584 -509 0 291 400 404 242 54 86 -510 -387 -359 66 296 406 671 451
6031 451 131 -407 -285 -312 -635 -280 85 292 620 250 105 -250 -377 -569 -347 -104 203 648 757 330
6051 330 266 -293 -286 -526 -414 -218 212 242 435 303 222 63 -365 -383 -567 -151 113 543 466 273 232 -12 -315
6074 -315 -431 -324 -371 201 279 375 571 104 -20 -211 -412 -384 -105 67 190 359 427 348 344 -149 -452 -471 -376
6097 -376 -190 163 750 365 499 334 -170 -521 -640 -364 -252 21 558 517 399 449 -84 -300 -386 -185 -285
6118 -285 246 144 478 293 300 -114 -311 -622 -735 -140 45 436 509 334 262 211 -310 -343 -404 -411 -261 153 378
6141 378 350 444 217 -169 -423 -402 -247 -238 232 222 528 470 64 -78 -274 -543 -470 29 220 517 545 401 379
6164 379 52 -387 -491 -205 -341 103 290 341 318 421 72 -351 -780 -423 -162 -131 407 432 479 71 55 -132
6186 -132 -58 -235 -342 124 298 430 442 432 -90 84 -401 -517 -310 -76 373 531 237 451 99 -490 -203
6207 -203 -225 -199 -66 238 416 509 415 423 -225 -409 -564 -388 -117 -54 485 227 457 334 -205 -507 -546 -356 -80
6230 -80 174 320 469 458 319 -72 -332 -652 -411 -215 47 119 364 337 333 -38 -196 -430 -525 -144 29 194
6252 194 502 400 349 -47 -412 -238 -189 -580 27 300 558 396 448 65 -238 -414 -318 -95 -238 303 298 441
6274 441 254 44 22 -305 -502 -354 -12 112 428 369 445 27 -50 -401 -721 -189 -270 2 292 476 364 175
6296 175 30 -319 -195 -506 -352 395 99 213 747 325 51 -332 -774 -437 -350 -92 294 354 305 253 96
6317 96 -20 -677 -488 -107 -61 -51 318 288 261 105 31 -128 -529 -602 -14 -189 431 555 435 325 -48 -353
6339 -353 -356 -268 -214 354 518 580 491 89 -83 -332 -521 -320 -243 204 227 561 357 293 172 -253 -697 -482 -418
6362 -418 48 182 354 473 390 -13 9 -449 -427 -241 -13 127 210 262 336 96 -280 -224 -297 -285 37 257 322
6385 322 673 627 146 -186 -292 -343 -347 -153 227 354 491 492 -32 13 -412 -400 -286 -155 115 233 419 150 190
6408 190 -136 -157 -339 -230 -250 183 19 356 263 217 170 31 -540 -393 -12 -119 189 339 522 285 -49 -68
6430 -68 -301 -557 -527 93 440 587 428 525 316 -169 -605 -436 -207 -14 105 395 313 482 72 -151 -231 -333
6452 -333 -195 -66 -124 325 329 168 98 -57 -565 -223 -134 -172 148 393 340 518 315 14 -374 -284 -217 -77 -71 209
6476 209 285 622 457 -145 -28 -216 -315 -333 -225 237 207 533 379 55 -29 -338 -112 -317 -84 139 185 278
6498 278 203 -182 -22 -250 -458 -471 -353 105 166 389 328 197 -50 -326 -445 -310 -332 46 258 427 344 181
6520 181 287 -312 -716 -384 171 243 426 274 423 324 -134 -157 -557 -282 -289 -3 394 487 509 423 -141 -367 -224
6543 -224 -485 -132 49 299 328 329 122 114 -115 -209 -9 -386 -33 171 582 103 212 96 132 -225 -484 -169
6565 -169 -112 12 389 249 337 268 189 -22 -269 -359 -88 70 -14 81 366 64 17 -352 -461 -614 -206 -37 430
6588 430 250 501 403 -205 -55 -361 -337 -267 -91 106 211 111 341 131 -120 -273 -417 -303 -249 191 102 379
6610 379 99 -64 -88 -365 -338 -353 31 -253 144 402 477 115 -251 -258 -324 -328 -207 -99 211 411 549 208 -47
6633 -47 -604 -582 -298 -115 -59 3 317 380 301 -62 -452 -416 -477 -196 115 226 458 459 316 -21 -118 -703 -27 -378
6657 -378 -59 75 406 286 149 -153 -371 -362 -784 -333 -170 -136 189 260 319 -38 -202 -93 -291 -211 -130 276
6679 276 335 185 466 253 -123 -425 -276 -330 -188 14 369 212 296 173 -232 -287 -487 -344 -156 -188 494 634
6701 634 154 358 -37 -195 -401 -310 -358 -114 260 521 289 369 -149 -221 -425 -358 -153 -112 322 276 274 252 169 -264
6725 -264 -213 -629 -223 -93 191 234 586 285 91 -95 -319 -123 -360 -343 282 312 116 378 84 128 -13 -352
6747 -352 -80 -277 -49 216 295 398 489 14 -216 -99 -181 -527 26 337 213 126 328 7 -324 -204 -295 -344
6769 -344 -253 217 204 246 290 116 -210 -641 -408 -450 -22 255 -98 305 228 128 -285 -77 -501 -488 -98 -99 288
6792 288 317 390 -66 12 -361 -388 -380 -198 5 287 338 297 194 153 -259 -372 -197 -87 175 264 414 321 492 -16
6816 -16 -340 -167 -290 -245 -13 101 400 545 196 182 -69 -207 -237 -471 -60 298 475 450 247 -11 -184 -2
6838 -2 -326 -110 -37 72 336 393 165 248 2 -346 -549 -238 -37 14 420 557 199 -4 -111 -227 -289 -63
6860 -63 19 148 -3 186 145 155 -96 -171 -357 -70 -135 257 66 535 363 8 142 -181 -311 -277 -226 -176 61
6883 61 446 416 532 193 -19 -462 -332 -336 -215 324 233 444 117 206 89 -353 -311 -101 -146 87 465 287 351
6906 351 153 -131 -206 -194 -212 -222 -136 456 366 273 141 0 12 -470 -423 -153 144 -119 241 144 164 272 -176 -294
6930 -294 -342 -388 -119 60 63 324 232 82 -24 -121 -379 -332 187 2 320 366 19 176 -74 80 -322 -287 -162
6953 -162 66 178 463 312 260 -72 -347 -177 -170 -229 -268 42 167 411 111 -73 -94 -331 -520 -122 68 348
6975 348 454 25 75 159 -359 -288 -160 -183 142 147 401 439 143 132 -62 -443 -421 -257 137 12 306 421 329
6998 329 122 29 -294 -458 -204 -207 215 104 278 -18 -44 -51 -143 -415 -226 -190 86 360 229 103 116 -29 -409
7021 -409 -17 -352 53 155 88 329 351 306 10 -59 -383 -342 -140 316 322 206 293 120 184 -221 -487 -397 -238
7044 -238 -55 16 260 242 215 265 -14 -193 -383 -44 -173 150 220 552 302 305 -194 -337 -107 -49 17 -2 165
7067 165 276 276 49 151 -316 -318 -244 -2 -129 266 307 365 131 23 -326 -191 -119 73 120 268 334 516 300
7090 300 -106 -78 -81 -163 -368 62 83 29 332 -95 -157 -17 -93 -337 -343 -115 343 243 79 256 80 -153 -99 -206
7114 -206 -196 -175 185 68 295 272 -86 21 -439 -138 -520 -355 172 315 435 215 107 -222 -375 -112 -176
7135 -176 -37 57 45 163 208 193 -124 -175 -299 -208 -182 165 196 208 204 74 152 -217 -247 -284 20 -8 358 339 371 199
7161 199 -49 -83 -164 -392 -3 -245 34 235 344 174 -2 59 46 -239 -240 -168 65 472 118 84 172 -225 -98
7184 -98 -234 -215 -194 105 381 70 362 -15 -147 -47 -571 -306 -271 30 155 104 146 226 221 161 -257 -170 -339 43
7208 43 326 287 280 169 26 132 -225 -495 -249 -92 49 225 302 71 73 -15 -235 -569 -30 -145 343 91 448
7231 448 408 274 -192 -278 -57 -298 162 -98 109 107 23 323 138 -153 -437 -303 -372 -81 266 288 7 -119
7253 -119 3 -110 -327 107 -110 -93 187 291 218 -12 22 -51 -248 -247 154 -52 -86 105 435 143 -102 -280
7275 -280 -274 -357 -306 -23 -181 159 226 466 -75 101 -294 -346 -315 -71 -35 322 286 221 -57 -298 -32 -486 -172
7298 -172 -110 66 26 291 361 240 -169 -8 -426 -385 -166 -44 131 387 103 560 308 -90 -223 -271 -104 -167
7320 -167 221 281 112 144 -257 -211 -176 -187 -107 89 204 163 243 96 36 -37 -195 -78 -244 -120 -94 179 121 189
7344 189 283 6 -117 -337 -242 -331 25 406 282 295 54 -18 -6 -95 -94 -309 -84 264 421 395 72 181 -249
7367 -249 -273 -288 -357 -144 -1 41 375 132 -33 -172 -210 -345 -270 71 259 56 296 -108 133 -167 -74 -301
7389 -301 -432 -103 112 210 319 262 64 78 -212 -269 -337 -118 3 236 236 237 64 60 -83 -229 -285 3 10 -98 96
7414 96 374 246 -11 -70 -136 -102 -318 22 316 525 26 151 122 79 -65 -220 -259 -384 43 94 18 230 20
7437 20 -9 -177 -269 -50 -139 267 113 143 277 229 -123 -173 -119 -38 46 85 47 201 170 93 100 -178 -210 -257 -456 61
7463 61 392 59 333 174 -165 -29 -296 -176 29 -140 126 226 368 227 155 -273 -82 -254 -94 80 107
7484 107 215 -65 157 -123 6 -305 -193 87 -32 40 160 144 -19 -22 229 -294 -355 -253 82 109 66 385
7506 385 163 92 -183 -226 -471 -133 -108 23 217 294 229 86 153 -263 -316 -257 -353 298 -43 167 117 145 383 -239
7530 -239 -499 -346 213 34 84 280 373 -10 65 -56 -348 -125 -118 24 327 170 166 3 -21 -10 -147 -296 118
7553 118 -5 23 168 271 110 229 -11 -146 -289 195 -93 -1 44 261 241 296 -56 -275 -48 -130 57 50 266
7576 266 246 84 336 -30 -75 -94 -179 -98 -57 125 282 268 37 59 -270 -61 -207 94 -139 51 78 188 51
7599 51 192 13 73 -65 -334 -23 338 278 261 245 -24 -179 -191 83 -157 -366 13 173 208 260 71 124 -247
7622 -247 -120 -142 -433 -143 180 359 309 338 -22 -306 3 -286 54 -83 396 278 375 -160 36 -244 -243 -282
7644 -282 -108 -129 145 444 -59 -132 181 -74 -219 -136 -543 -65 -60 77 354 537 231 -157 -18 -244 -247 -16
7666 -16 362 250 188 391 299 -138 -126 -247 -99 -271 133 342 489 79 357 209 -17 -345 -36 -396 -70
7687 -70 247 171 102 -145 65 -192 -199 -49 28 -26 -244 403 250 170 -163 -256 -50 -385 -57 30 -32 567 190 213
7711 213 80 -172 -221 -472 -110 -392 0 259 115 62 105 -89 -285 -150 -20 -7 -67 160 138 168 3 -36 -87
7734 -87 -84 -166 -93 0 181 -18 199 385 155 -71 -132 -15 -213 29 -99 -35 197 490 61 -219 -205 -187 23
7757 23 -44 31 319 0 257 -58 -223 -61 104 -172 -236 165 192 356 154 312 13 -458 -345 -254 -189 -127 387
7780 387 23 92 226 -61 7 -167 -400 -116 -265 114 67 239 -56 -53 118 -294 -255 -224 124 130 28 103 94 -49
7804 -49 -382 -214 -140 -86 131 -101 281 656 233 178 23 -78 -145 -219 -350 55 233 247 95 48 -167 -153 -175
7827 -175 -96 -96 -17 296 70 259 -12 94 -197 -371 -35 80 115 21 350 29 68 -76 -2 -154 -209 -167 111
7850 111 48 214 239 4 -218 -150 -18 -100 -282 -194 -68 239 394 54 142 57 10 -50 21 73 -49 206 204 -9
7874 -9 10 -157 78 -298 -63 -379 209 -48 272 -61 -64 -275 -190 1 -69 205 -108 192 197 258 117 -184 -211 -326
7898 -326 49 120 -107 220 134 317 199 186 87 -412 -414 -322 138 -120 152 198 369 -4 -151 -218 106 25 124 79
7922 79 74 13 158 259 32 -245 -177 -192 20 -26 109 172 57 56 82 -103 -15 14 -184 -29 137 253 244 127 59
7947 59 -90 -177 -115 109 -172 121 73 172 69 85 -271 -151 -157 -280 -252 27 45 166 311 85 -171 -178 -111 -314
7971 -314 -26 -139 101 209 77 -127 -130 71 -464 17 17 110 -48 -93 276 -159 -103 -384 -225 -149 100 178 -99
7994 -99 381 224 -20 92 -154 -113 -73 119 112 242 120 205 139 -157 -300 -97 90 -170 6 120 -54 175
8016 175 307 -155 -146 -315 -134 -30 80 484 112 55 88 58 -31 -328 -180 -108 -230 84 108 257 286 88 191
8039 191 262 -156 -52 -8 -24 108 232 113 -314 -120 -224 -182 -456 35 254 168 -4 -53 2 125 -61 -130 -149
8062 -149 -338 -62 109 275 179 -241 -25 13 -445 -431 -189 -19 350 118 39 150 -132 106 -157 153 -359
8083 -359 116 85 -74 95 125 258 157 -3 -56 -51 -104 159 158 340 -13 320 -122 -231 -122 49 -55 -31 87
8106 87 379 248 199 -72 -237 -168 -4 -287 28 212 27 38 -115 91 -204 -29 -344 -80 64 174 -108
8127 -108 61 194 5 -60 -441 -242 -122 -47 -149 102 90 203 76 -166 74 -216 -121 -189 280 368 119 316
8149 316 132 -36 -226 -134 -340 45 -148 -253 273 135 -23 216 83 -212 51 -145 -96 198 176 326 -100
8170 -100 -384 -127 110 49 -48 -313 128 187 -1 133 52 -297 -184 58 67 48 -273 416 303 1 -73
8191g3
$$ Imaginary data points
##PAGE= N=2
##DATA TABLE= (X++(I..I)), XYDATA
0 0 0 0 0 0 0 0 0 0 0 0 0 -8 8 -8 8 -11 16 -16 24 -32 32 -40 48 -56 65 -77 89 -104 121 -137 156 -178 201
33 201 -230 260 -293 329 -368 413 -460 511 -568 630 -698 774 -853 942 -1037 1143 -1262 1389
51 1389 -1530 1685 -1861 2057 -2276 2527 -2814 3150 -3544 4019 -4603 5337 -6297 7612 -9531
66 -9531 12611 -18374 32969 -156552 -213106 41349 73793 164178 267503 255495 25617 -137183
78 -137183 -164595 -160598 -191642 -86231 122983 245154 190399 123219 78202 -40800 -226781
89 -226781 -275567 -161090 -45688 6943 117022 245219 223804 60840 -48277 -82342 -148805
100 -148805 -204609 -109804 66410 149365 143634 155149 135138 -3623 -168087 -209051 -159079
111 -159079 -117985 -53989 90240 213508 197641 99983 30869 -37142 -148786 -204937 -118931
122 -118931 13692 79781 121982 179332 157225 14797 -120088 -156085 -158610 -159283 -79165 76324
134 76324 172764 160224 119380 77452 -20262 -141243 -173507 -105579 -28689 28370 107017 172243
146 172243 138620 25897 -63263 -106432 -150123 -163543 -80082 49022 117538 127680 135299 106566
158 106566 -603 -108863 -131595 -100973 -71212 -12580 88414 152265 122216 51128 -7540
169 -7540 -72315 -145204 -160518 -86704 9996 69918 112535 146262 118263 17237 -74637 -103045
181 -103045 -104661 -97718 -35344 70118 129066 109288 69500 28435 -49904 -135751 -148839 -86625
193 -86625 -19741 33793 100699 148911 117760 29205 -41277 -78295 -110169 -113356 -47083 49692
205 49692 99437 98895 88750 53763 -33232 -118293 -131454 -90839 -49496 5463 89962 143561
217 143561 114845 46952 -5238 -55436 -111426 -119777 -54709 25402 69171 92589 105127 69974
229 69974 -17616 -93564 -112727 -99807 -74145 -13754 75961 128023 111483 66071 21452 -40004
241 -40004 -107329 -119510 -65544 -945 43343 85526 113541 82365 987 -66461 -94665 -106104
253 -106104 -94903 -32681 56221 108336 107333 85835 48132 -22831 -96117 -114199 -76743 -30100
265 -30100 16018 75327 115738 90010 21094 -35763 -74833 -109614 -109506 -47701 34180 82772
277 82772 101020 103938 70436 -7166 -78587 -99970 -85683 -58167 -5771 66473 108606 91298
289 91298 44092 -3007 -57074 -108833 -113572 -60168 5982 55148 94125 115151 84891 10905
301 10905 -53883 -84136 -94523 -82146 -26997 49289 92437 89599 66247 27112 -38427 -99625
313 -99625 -110214 -71870 -23248 26938 84525 118280 93183 29667 -25695 -65349 -97887 -97902 -43043
326 -43043 29886 71012 83468 83127 50846 -21232 -85305 -98810 -78490 -49905 1206 73071
338 73071 113126 92974 47161 5137 -45500 -97653 -103850 -52843 5426 43223 76418 96543
350 96543 66768 -4002 -60217 -80419 -85624 -73676 -18154 56580 95651 88931 67449 33332
362 33332 -29108 -89177 -98849 -62731 -22137 17468 67733 99536 73030 13306 -32235 -62444
374 -62444 -90008 -87193 -31708 37178 73130 82962 83138 53416 -14866 -74752 -87191 -69991 -46695
387 -46695 -3557 59087 93891 73733 31002 -4211 -45496 -89688 -92619 -41211 15364 47666
399 47666 75137 94221 66709 -2020 -54335 -69464 -75302 -68576 -20106 48154 79863 68360
411 68360 49383 22253 -32259 -84565 -86657 -47859 -9715 24397 70209 97639 70240 11426
423 11426 -29724 -54985 -80547 -80116 -29438 33302 60517 64079 64721 39441 -22424 -72781 -75712
436 -75712 -54878 -33246 6662 63779 91429 68721 28222 -4647 -42321 -81347 -82750 -37509
448 -37509 12489 40471 60508 74734 50811 -9732 -55336 -64056 -61208 -51364 -8257 53679 81284
461 81284 65644 43033 17069 -31500 -78404 -79742 -43020 -7951 21609 58495 79640 54660
473 54660 2847 -33987 -52870 -67959 -62594 -17383 39706 65980 65077 57856 32711 -21568 -69137
486 -69137 -73223 -51279 -28308 6144 54645 78346 56334 17934 -12090 -43651 -72576 -67806
498 -67806 -24845 20805 48265 65032 69004 41493 -11290 -53014 -65367 -60213 -43375 -4382
510 -4382 45540 70090 58463 33204 5072 -35163 -70486 -68550 -33623 3205 33155 63283
522 63283 75039 47936 24 -36319 -57063 -67407 -55089 -13256 34339 58517 59003 46871
534 46871 19446 -25733 -62171 -64837 -42303 -15145 18204 57163 74844 52957 14180 -16468
546 -16468 -45912 -70474 -63777 -23072 18996 43656 59018 61142 32480 -15761 -50356 -59359 -53282
559 -53282 -33502 6653 51308 70350 56945 30408 -576 -39492 -70562 -67477 -33344 3072
571 3072 31698 58640 68188 41424 -4752 -37862 -53378 -60148 -46340 -3843 41541 61365 58488
584 58488 43899 14131 -30532 -64732 -65483 -41878 -13383 19157 53533 68234 47739 8670
596 8670 -22056 -44370 -61608 -54856 -15528 27908 49531 56109 54619 28854 -19240 -54678 -60194
609 -60194 -49580 -31357 4291 47110 65843 51383 24546 -2898 -35832 -63297 -60578 -26888
621 -26888 10328 35830 55973 63910 39852 -6758 -41804 -54412 -56983 -45771 -7470 38541
633 38541 59066 52854 38270 13092 -27593 -60157 -59417 -34923 -6787 22330 53006 65608 45100
646 45100 6401 -25179 -46490 -60136 -53624 -18060 24928 48016 52585 48672 26562 -16521 -51612
659 -51612 -56036 -41698 -22956 8057 46664 64325 48414 18665 -7571 -36548 -61841 -58694
671 -58694 -25868 10213 33817 50688 57161 36195 -5965 -38849 -48902 -48138 -37117 -3897 38632
684 38632 57660 48224 31716 9107 -27261 -58913 -58259 -32258 -5626 19356 47993 60994 41146
697 41146 4371 -22669 -40184 -53046 -46178 -12069 26485 45653 48067 42883 21019 -18490 -50420
710 -50420 -54209 -39314 -21017 7126 42451 59532 44168 16230 -6952 -31750 -54239 -51479
722 -51479 -19759 13706 32636 46242 51363 30482 -9584 -39413 -46962 -44464 -33616 -3003 35770
735 35770 53147 43500 26919 7420 -23717 -52170 -51405 -25125 -44 19519 43141 55278 35679
748 35679 -734 -25835 -38344 -48779 -43537 -10780 26780 43211 42604 38041 19287 -16896 -46538
761 -46538 -47342 -31701 -15167 8643 40724 54552 37700 9976 -11410 -31650 -50976 -47792 -16978
774 -16978 15423 31947 41479 45395 27127 -9983 -36873 -41338 -36673 -26366 542 35006 49343
787 49343 37659 19936 1934 -25223 -49835 -47406 -21669 2855 20318 39709 49860 31827
799 31827 -2132 -25080 -34637 -41230 -36517 -7207 27092 41006 37314 30633 14161 -18621 -46072
812 -46072 -45012 -27336 -11277 10045 38435 51668 34522 7096 -12002 -28936 -45910 -42099
824 -42099 -12243 18238 31562 37803 39654 21454 -13941 -39209 -40215 -33478 -22585 2966 35482
837 35482 47660 34794 16203 -334 -24758 -46336 -42498 -16689 6501 21658 37683 44395
849 44395 25728 -7076 -27717 -34421 -38405 -31431 -3419 28541 40012 34789 26742 10674 -18794
862 -18794 -42471 -40681 -22723 -6775 11786 35628 46204 29254 2790 -14612 -29317 -42924
874 -42924 -38228 -9545 19240 31705 36013 36952 19190 -14147 -36682 -37407 -29944 -18925 5335
887 5335 34624 44265 31146 13091 -3798 -26449 -45109 -39636 -14115 8478 23057 37384 42490
900 42490 23615 -7616 -27330 -33087 -35505 -27735 -286 28935 37792 31763 23222 6488 -22222
913 -22222 -41936 -37443 -20384 -4040 14766 36704 43488 26372 1723 -15526 -28865 -39509
925 -39509 -33203 -6312 19594 30243 33139 31700 14351 -16197 -35955 -35258 -27104 -15928 7601
938 7601 34409 42005 28592 11789 -4605 -25673 -41921 -35574 -11950 8913 22448 35266 38223
951 38223 19284 -9905 -27675 -32291 -33029 -24242 1851 29062 36896 30177 21411 5180 -21700
964 -21700 -40031 -34626 -17434 -2798 14684 35024 39577 22121 -652 -16461 -28943 -37869 -29106
977 -29106 -3388 20160 30092 32657 29367 11706 -16224 -33834 -33018 -24316 -12577 8551 32175
990 32175 38656 25028 8175 -6476 -25549 -39230 -32008 -9416 10368 22641 33636 34799 16910
1003 16910 -9436 -25935 -30735 -30528 -20628 2607 26770 34441 27648 17126 1653 -21295 -37695
1016 -37695 -32674 -15012 555 16158 33313 37561 20300 -2541 -16507 -27558 -34614 -26085 -2040
1029 -2040 19608 28209 29682 25166 8600 -16639 -32286 -31379 -21784 -9307 10235 30830 36371
1042 36371 23570 6477 -8272 -24228 -35787 -29691 -8127 10860 22207 30501 30311 13655 -10840
1055 -10840 -25424 -29070 -27190 -16812 5076 26215 32777 26093 14932 -708 -20793 -34173 -30172
1068 -30172 -13824 2300 16523 30035 33263 18369 -3603 -18429 -26292 -30746 -22891 -441 20812
1081 20812 28630 27278 22183 6388 -16677 -31272 -29248 -19152 -6790 10838 28624 33221 20828
1094 20828 4134 -10347 -23718 -32514 -26162 -5790 12734 22841 28331 27530 12202 -11444 -25677
1107 -25677 -27224 -24051 -14459 5430 25593 31121 23010 11697 -2335 -20825 -32332 -27263 -10774
1120 -10774 4749 17781 28719 30024 15899 -5298 -19390 -25481 -27470 -20165 299 20872 27325
1133 27325 24354 18184 4625 -16508 -30290 -26907 -15421 -3929 11416 27678 31391 18469 1358
1146 1358 -10987 -22482 -30264 -23749 -4224 13831 22091 25895 24224 9943 -12153 -25841 -25373
1159 -25373 -20549 -11660 6586 25895 30407 20499 8757 -3444 -20180 -31621 -25541 -8216 5960
1172 5960 16717 27284 28215 13080 -7449 -19269 -23775 -25289 -17629 2530 21656 26749 22508
1185 22508 15779 2597 -17349 -29901 -25201 -13088 -2045 11463 26917 29396 15548 -1172
1197 -1172 -11690 -21245 -28435 -21117 -1118 15089 21432 24005 22178 8182 -13406 -25353 -23917
1210 -23917 -18273 -10033 7080 24885 28498 17857 6354 -4183 -19341 -30129 -23334 -5893 7558
1223 7558 16570 25791 26819 11437 -8748 -19413 -22331 -23922 -16028 3742 21463 25182 20194 13960
1237 13960 1117 -17632 -28582 -23033 -10750 -647 12539 26287 27615 13604 -2656 -12495
1249 -12495 -21133 -27307 -19445 68 15398 20518 22132 20159 5822 -13907 -24122 -21996 -16363
1262 -16363 -7602 8860 24429 26603 16163 5077 -5720 -19637 -28154 -21341 -4626 8069 16354
1275 16354 24308 23785 9289 -9142 -18636 -20935 -21405 -13075 4777 21098 23436 18496 12277 -160
1289 -160 -17851 -26739 -20848 -9807 347 12796 25049 25058 11753 -2883 -11853 -20295 -24968 -16679
1303 -16679 1760 15325 19777 21370 18158 3606 -14519 -23244 -20974 -15209 -6572 9415 23646
1316 23646 24218 14752 4384 -6682 -19412 -26329 -18268 -3227 8218 16588 23265 21374 6789
1329 6789 -9480 -18500 -20657 -19770 -10888 6053 19722 22140 17354 10268 -2137 -17255 -24678 -19225
1343 -19225 -8038 2216 13340 23370 22639 9879 -3904 -12997 -19792 -22464 -14281 2336 14956
1356 14956 19223 19760 15408 2176 -13909 -21585 -19376 -13096 -4127 10081 21851 22584 13401 2747
1370 2747 -7970 -18720 -23720 -16892 -2789 8868 16795 21324 18777 6096 -9266 -18078 -19644
1383 -19644 -17272 -8852 6740 19059 21267 16581 7914 -3715 -16901 -23174 -18436 -7322 4029
1396 4029 13899 21643 20390 9544 -4392 -14229 -19233 -19833 -11773 2577 14999 19679 17800 12393
1410 12393 589 -13575 -20926 -18802 -11262 -1312 10525 20244 20947 12266 970 -9447 -17628 -21089
1424 -21089 -14605 -1552 10370 17046 19455 15857 4487 -9452 -18190 -19018 -14938 -6492 6690 18245
1438 18245 20910 14596 5658 -4924 -15845 -21544 -16787 -5781 5021 14218 20184 18460 7989
1451 7989 -5400 -14533 -18802 -17867 -9896 3141 15160 19337 16821 10185 -361 -13169 -20638 -17569
1465 -17569 -9229 386 10700 19470 19829 10504 -982 -10322 -17247 -19862 -13442 -436 11113 16785
1479 16785 18027 13829 3811 -10153 -17994 -17872 -12722 -4813 6863 18135 19988 12788 3457 -5453
1493 -5453 -15103 -20803 -15901 -3804 6358 13478 18607 17651 6735 -6520 -14654 -17025 -16068 -9111
1507 -9111 4041 15681 18255 14611 8098 -1238 -13170 -20382 -16551 -7094 1413 10313 18955 19255
1521 19255 9095 -2594 -10341 -15926 -18629 -12649 1021 12065 15954 16542 13010 2184 -11114
1534 -11114 -18076 -16717 -11367 -3702 7680 17742 18995 11651 2307 -6044 -14997 -19795 -14518 -2275
1548 -2275 7442 13075 17631 16076 5397 -7960 -14920 -15856 -14661 -8289 4942 15946 17473 13082
1562 13082 7545 -1797 -14009 -19424 -14877 -5912 2015 10525 18238 17851 7547 -3605 -10791 -15350
1576 -15350 -17665 -11287 2023 12511 15191 15266 12097 1582 -11772 -17540 -14893 -10387 -3169 8451
1590 8451 17642 17691 9704 1676 -6283 -15161 -18901 -12519 -1020 7663 13243 16966 14916 4022 -8552
1605 -8552 -14622 -14793 -13489 -6878 5844 16058 16315 11662 6250 -2742 -13956 -18634 -13361 -4632 2660
1620 2660 10763 17845 16349 6239 -4264 -10185 -14957 -16445 -9508 3056 12497 14701 14001 10614
1634 10614 291 -12024 -16978 -13591 -8783 -2185 8786 17245 16351 8320 733 -6726 -14802 -17900
1648 -17900 -11213 106 7804 12894 16079 13380 2645 -8632 -13911 -14330 -12363 -5310 6303 15658
1662 15658 15982 10928 5265 -3412 -13722 -17549 -12222 -3740 3495 10608 16988 15128 5202 -4807
1676 -4807 -10635 -14343 -15118 -7961 3804 12282 14583 13330 8774 -770 -11775 -16276 -13166 -7522 -814
1691 -814 8837 16390 15417 7399 -736 -7182 -14026 -16438 -10060 755 8419 12736 14933 11942 1601
1706 1601 -8803 -13530 -13759 -10881 -3882 6762 14606 14785 10179 3965 -4382 -13251 -16268 -11338 -3033
1721 -3033 4229 11172 15990 13581 4539 -4929 -11151 -14116 -13581 -6541 4073 11567 13952 12336 7405
1736 7405 -1847 -11553 -15153 -12405 -6688 417 9269 15466 14362 6903 -1176 -8092 -13496 -15153 -9061
1751 -9061 1053 8462 12686 14127 10469 1157 -9013 -13674 -12935 -9902 -2906 7098 14161 13991 9047
1766 9047 2693 -5132 -12703 -15316 -10452 -2181 5236 10907 14686 12453 3611 -5606 -11213 -13173 -12239
1781 -12239 -5814 4425 12145 13543 11386 6264 -2133 -11411 -14809 -11495 -5559 1469 9198 14858
1795 14858 13348 5794 -1827 -8490 -12992 -13990 -7904 1620 9112 12631 12919 9291 583 -9239 -13096
1810 -13096 -12360 -8466 -1838 7114 13867 13888 8103 1544 -5268 -12285 -14697 -9898 -1337 5728 10778
1825 10778 13690 11421 3051 -6235 -11209 -12345 -11155 -5196 4802 12015 13099 10026 5198 -2571 -11203
1840 -11203 -14467 -10723 -4335 2129 9113 14127 12580 4869 -2828 -8342 -12415 -13107 -7219 2602 9547
1855 9547 11911 11564 8457 92 -9340 -13025 -11580 -7562 -1445 7215 13381 12975 7239 824 -5449
1870 -5449 -11921 -13903 -8961 -386 6298 10404 13079 10547 2144 -6731 -11174 -11536 -9992 -4423 5280
1885 5280 12149 12605 8939 4312 -3028 -11422 -14049 -9837 -3449 2540 8928 13766 11813 4233 -3499
1900 -3499 -8603 -11850 -12187 -6473 2897 9551 11260 10595 7743 -699 -9439 -12938 -10146 -6504 -870
1915 -870 7507 13371 12092 6231 134 -5536 -11826 -13420 -7901 377 6281 10043 12455 9636 1213
1930 1213 -7319 -10901 -11087 -9316 -3281 5718 11672 11661 7834 3558 -3261 -10843 -13568 -8694 -2567 2958
1946 2958 8490 13149 11032 2962 -3992 -8115 -11029 -11450 -5348 3501 9307 10723 9896 6275 -1363
1961 -1363 -9471 -12277 -9349 -5655 -199 7597 12991 11017 5262 -441 -5713 -11333 -12791 -7031 1053
1976 1053 6450 9575 11806 8787 334 -7275 -10077 -10116 -8767 -2690 6109 11631 11048 7305 2865 -3764
1992 -3764 -10715 -12587 -7717 -1428 3265 8907 12920 10032 2233 -4375 -7954 -10567 -10590 -4387 4326
2007 4326 9286 10279 9033 5604 -2063 -9881 -11500 -8697 -4746 562 7432 12279 10378 4402 -1060
2022 -1060 -6225 -10760 -11674 -5995 1948 6703 9269 10797 7942 -371 -7726 -10022 -9352 -7413 -1893
2037 -1893 6243 11008 10217 6572 2229 -3978 -10811 -11854 -7144 -1169 3946 8779 11839 9056 1513
2052 1513 -4761 -8146 -10348 -9600 -3799 4408 9249 9653 8344 4924 -2519 -9177 -11005 -8123 -4328
2067 -4328 1024 7639 11362 9440 3730 -1456 -6294 -10504 -10562 -5006 2049 6790 9205 9901 6899 -572
2083 -572 -7209 -9875 -8777 -6732 -1016 6381 10600 9723 5820 1343 -4603 -10177 -11255 -6387 -633
2098 -633 4181 8504 11068 8138 994 -4721 -8375 -9638 -8470 -2989 4534 9010 9567 7923 3931
2113 3931 -3014 -9338 -10578 -7482 -3431 1810 7558 11152 8688 3093 -1852 -6586 -10259 -10072 -4433
2128 -4433 2332 6563 9095 9639 5928 -1066 -7412 -9265 -8553 -5825 -529 6449 10268 9008 5092
2143 5092 700 -4561 -9788 -10151 -5680 -54 4551 8642 10490 7524 618 -4927 -8281 -9403 -7844
2158 -7844 -2074 4665 8851 8876 6902 3012 -3009 -8769 -10305 -7030 -2475 2036 7528 10520 7887
2173 7887 2400 -2743 -6615 -9375 -9178 -3929 2702 6997 8640 8716 4830 -1345 -7667 -9056 -7981 -5332
2189 -5332 392 6529 9995 8577 4459 51 -4901 -9359 -9751 -5305 482 4518 8389 9721 6638
2204 6638 209 -5132 -8141 -8628 -7139 -1989 5115 8742 8562 6381 2278 -3536 -8558 -9703 -6368
2219 -6368 -2239 2947 7342 9988 8027 2037 -3024 -6874 -9053 -8156 -3321 3092 7191 8568 8002
2234 8002 4528 -1686 -7535 -9433 -7244 -4466 490 6395 9596 8106 4351 -508 -5029 -8830 -9203
2249 -9203 -4888 575 5183 7836 8717 6140 88 -5498 -8134 -8022 -6312 -1340 4782 8716 8477 5621
2265 5621 1612 -3554 -8301 -9315 -5836 -1604 3169 7105 9333 7125 1574 -3437 -6843 -8578 -7304
2280 -7304 -2873 3371 7316 8401 7076 3784 -1998 -7255 -8708 -6937 -3633 834 6167 9174 7918
2295 7918 3332 -904 -5092 -8461 -8424 -4579 1118 5680 7652 8121 5529 -442 -5911 -7776 -7414 -5533
2311 -5533 -892 4859 8415 8050 4976 1310 -3413 -8203 -9108 -5316 -890 3313 6803 8658 6653
2326 6653 1329 -3619 -6667 -7899 -7227 -2884 3361 7275 7283 6585 3372 -2094 -6794 -8420 -6086 -2917
2342 -2917 1279 6066 8777 7348 2894 -1691 -5059 -8282 -8016 -4050 1478 5446 7244 7669 5117
2357 5117 -508 -5700 -7448 -7001 -4903 -576 4931 8237 7313 4283 610 -3759 -7897 -8507 -4854 -205
2373 -205 3526 6333 8514 6258 815 -3753 -6141 -7183 -6578 -2109 3761 7351 7248 6093 3010 -2098
2389 -2098 -7204 -7955 -5840 -2520 1458 6120 8688 6928 2271 -1709 -5087 -7944 -7645 -3383 2113
2404 2113 5605 6756 6917 4584 -823 -6001 -7622 -6538 -4432 -461 5001 8027 7112 3715 430
2419 430 -3935 -7750 -7947 -4355 -14 3589 6689 8120 5648 325 -4171 -6181 -6985 -5904 -1780 3902
2435 3902 6913 7052 5199 2613 -2669 -7041 -8017 -5054 -1867 1765 5850 8174 6245 1797 -2148
2450 -2148 -5143 -7539 -7130 -2699 2271 5579 7026 6397 3784 -1373 -5808 -7140 -6153 -3918 67 5019
2466 5019 7802 6335 3668 -76 -3995 -7589 -7482 -3411 480 3489 6226 7496 4958 38 -4241
2481 -4241 -6020 -6901 -5454 -1061 4063 6656 6529 5112 1865 -2880 -6535 -7145 -5004 -1377 2146 5768
2497 5768 7811 5616 1335 -2528 -5078 -7207 -6318 -2095 2776 5369 6270 6201 3333 -1775 -5823 -6865
2513 -6865 -5327 -3198 407 5401 7091 5841 3248 -441 -4285 -7032 -6531 -3532 684 3973 6227
2528 6227 6761 4371 -511 -4114 -5847 -6227 -4701 -857 4120 6444 6234 4285 1162 -3207 -6474 -6532
2544 -6532 -4548 -984 2454 5809 7029 5175 1161 -2349 -5112 -6844 -5456 -2092 2456 5444 6137
2559 6137 5525 2654 -2127 -5684 -6777 -5275 -2398 861 5087 6898 5561 2711 -1077 -4283 -6540
2574 -6540 -5896 -2605 1328 4080 5969 6451 3668 -683 -3987 -6131 -5764 -3939 -171 4040 6363 5697
2590 5697 3692 763 -3197 -6256 -6515 -3957 -404 2805 5732 6532 4710 1020 -2873 -5056 -6389
2605 -6389 -5212 -1625 2890 5322 5983 4973 2020 -2085 -5294 -6467 -4732 -2068 1394 4627 6549
2620 6549 4912 1742 -1334 -4199 -6133 -5751 -2627 1125 4127 5576 5593 3536 -828 -4380 -5769 -5349
2636 -5349 -3366 99 4018 6195 5827 3210 19 -2784 -6046 -6257 -3178 89 2857 5432 6447
2651 6447 4293 302 -3219 -4859 -5763 -4649 -1276 3007 5603 5363 4380 1751 -2346 -5500 -6048 -4400
2667 -4400 -1768 1434 4724 6373 4734 1651 -1764 -4102 -5896 -5353 -2130 1535 4277 5432 4960
2682 4960 2889 -870 -4662 -5471 -4660 -3027 66 4002 6211 5301 2849 133 -3081 -5684 -5993 -3080
2698 -3080 273 3106 4979 5681 4036 11 -3454 -4684 -5104 -4391 -969 3018 5538 5103 3802 1745
2714 1745 -2284 -5256 -5521 -3821 -787 1459 4607 6142 4405 860 -1486 -4091 -5692 -5185 -1646
2729 -1646 2336 4143 4777 4987 2854 -1377 -4526 -5293 -4264 -2820 356 4136 5575 4826 2316 -297
2745 -297 -3050 -5507 -5368 -2598 939 2861 4731 5783 3722 -555 -3341 -4636 -4675 -3768 -790 3309
2761 3309 5218 4395 3354 1186 -2344 -5070 -5516 -3432 -760 1725 4350 5970 4010 415 -1893
2776 -1893 -3911 -5202 -4665 -1342 2105 4220 4580 4563 2268 -1558 -4695 -4709 -3907 -2258 684 3787 5525
2793 5525 4493 1954 -225 -3341 -5632 -5189 -1974 706 2680 4575 5283 3108 -838 -3191 -4242
2808 -4242 -4714 -3615 -212 3515 5141 4261 3132 775 -2582 -5109 -4768 -2744 -604 1676 4435 5357
2824 5357 3407 555 -1961 -3831 -5125 -4122 -931 2419 4128 4613 3913 1971 -1691 -4361 -4693 -3580
2840 -3580 -1721 736 4032 5236 3870 1629 -799 -3408 -5492 -4516 -1840 961 2926 4687 4650 2813
2856 2813 -821 -3283 -4113 -4339 -2869 129 3624 4876 4013 2797 595 -2741 -5088 -4714 -2456 -322
2872 -322 2032 4530 5010 2986 100 -2141 -3864 -4914 -3730 -685 2169 3868 4385 3718 1377 -2026
2888 -2026 -4117 -4371 -3306 -1463 1106 4070 5010 3698 1188 -819 -3382 -4705 -4012 -1546 959 2791
2904 2791 4420 4461 1885 -1091 -3318 -4222 -4060 -2431 382 3460 4556 3947 2476 351 -2604 -4770
2920 -4770 -4472 -2346 -223 2088 4217 4642 2872 60 -2261 -3837 -4600 -3053 -272 2238 3925 4235
2936 4235 3041 1317 -2237 -4142 -4248 -2965 -1059 1554 3929 4425 3255 998 -1293 -3351 -4598
2951 -4598 -3709 -1208 1360 3099 3997 3918 1758 -1011 -3225 -3802 -3648 -2076 460 2974 4241 3407 2151
2968 2151 -308 -2731 -4263 -4052 -1826 459 2302 4139 4434 2574 -305 -2248 -3626 -3978 -2759 -309
2984 -309 2447 3759 3821 2657 887 -2155 -3890 -4187 -2724 -1040 1382 3728 4333 2945 833 -1545
3000 -1545 -3230 -4224 -3573 -819 1718 3169 3878 3415 1889 -1097 -3550 -3789 -3430 -1743 651 3111
3016 3111 4204 3197 1678 -469 -2548 -4151 -3823 -1629 622 2522 3768 3852 2050 -251 -2417 -3325
3032 -3325 -3504 -2441 2 2516 3683 3483 2228 604 -2054 -3942 -3953 -2460 -463 1433 3446 3808
3048 3808 2856 461 -1349 -2766 -3585 -2970 -806 1720 3456 3162 3017 1331 -1380 -3295 -3667 -2948 -1536
3065 -1536 718 3023 3977 3016 1281 -837 -2141 -3788 -3533 -1361 671 2316 3260 3736 2196 -911
3081 -911 -2620 -3528 -3324 -2319 -90 2685 3537 2999 1910 200 -1910 -3561 -3433 -1982 -385 1576
3097 1576 3334 3663 2434 135 -1472 -2926 -3681 -2888 -665 1832 2947 3240 2765 1026 -1575 -3134
3113 -3134 -3630 -2534 -1126 1032 3118 3554 2531 899 -522 -2608 -3690 -3282 -1054 866 2206 3321
3129 3321 3507 1761 -977 -2381 -3067 -3364 -2128 393 2564 3257 2518 1854 253 -2079 -3419 -3182 -1892
3146 -1892 107 1650 3321 3654 1926 239 -1475 -2771 -3324 -2461 -352 1880 2886 2737 2544 1091
3162 1091 -1680 -3019 -3059 -2106 -1346 878 2885 3190 2571 802 -626 -2581 -3521 -2665 -932 941 2193
3179 2193 2844 2895 1114 -898 -2366 -2694 -2798 -1681 445 2403 3241 2709 1626 12 -2148 -3401 -2836
3196 -2836 -1344 151 1655 3186 3172 1690 -352 -1768 -2769 -2977 -1963 -185 1682 2804 2783 2243
3212 2243 598 -1666 -2869 -2806 -1888 -865 901 2786 3025 2112 616 -875 -2461 -3134 -2411 -791 1069
3229 1069 2250 2789 2848 1039 -1138 -2363 -2748 -2432 -1456 746 2335 2890 2256 1155 -384 -2064 -2994
3246 -2994 -2476 -1181 124 1541 2877 2688 1505 -378 -1750 -2398 -2713 -1957 139 1761 2598 2605 1871
3263 1871 439 -1640 -2904 -2763 -1699 -241 1246 2857 2706 1890 415 -1024 -2468 -2807 -1938 -477
3279 -477 1363 1835 2641 2275 683 -1328 -2173 -2226 -2229 -1271 743 2454 2495 1948 979 -492 -2410 -2838 -2172
3298 -2172 -962 360 1730 2635 2625 1063 -447 -1702 -2220 -2301 -1548 215 1746 2443 2014 1618 273
3315 273 -1732 -2566 -2426 -1467 -344 1170 2517 2707 1529 69 -1473 -2278 -2805 -1918 -130 1197 2099
3332 2099 2657 1932 502 -1281 -2424 -2479 -1990 -766 664 2284 2568 1810 650 -556 -1913 -2492 -2058
3349 -2058 -818 501 1634 2468 2344 1099 -547 -1600 -2337 -2046 -1052 167 1674 2260 2075 1177 -200
3366 -200 -1329 -2182 -2081 -1241 -292 1494 2335 2284 1518 119 -1205 -2181 -2280 -1748 -234 1217 2171 2264 1624
3385 1624 496 -1158 -2139 -2152 -1478 -479 889 2172 2368 1676 555 -797 -1895 -2466 -1856 -475 695
3402 695 1645 2385 2115 704 -670 -1717 -2109 -2109 -984 428 1547 2237 1885 901 -400 -1387 -2494 -1850
3420 -1850 -1129 330 1024 2215 2341 1369 -210 -1127 -2024 -2225 -1413 -102 1232 1923 1994 1445 313 -1381
3438 -1381 -2083 -2073 -1607 -199 885 1788 2435 1057 303 -821 -1734 -2256 -1671 -680 573 1557 2209 2110 752
3457 752 -541 -1800 -1517 -1530 -902 417 1855 2100 1484 710 -113 -1489 -2101 -1668 -716 117 1192 2202
3475 2202 1873 1155 -461 -1291 -1708 -2023 -1354 -210 1192 1825 1485 1437 528 -1258 -1753 -1796 -1281 -263 890
3494 890 1900 2099 1458 210 -802 -1597 -1849 -1346 -185 1019 1925 1975 1730 467 -836 -1620 -1891 -1381
3512 -1381 -724 603 1737 1764 1398 583 -195 -1363 -1937 -1504 -726 351 1143 1956 1816 880 -692 -1165
3530 -1165 -1854 -1548 -1266 83 1517 1572 1368 1076 255 -1242 -1820 -1629 -1036 -296 957 1789 1772 1160 161
3549 161 -750 -1552 -1943 -1213 -178 896 1362 1539 1277 128 -918 -1330 -1642 -1303 -665 520 1399 1712
3567 1712 1269 246 -565 -1292 -2009 -1348 -476 352 1195 1728 1592 688 -477 -1252 -1536 -1363 -1046 415 1284
3586 1284 1647 1416 894 -102 -939 -1830 -1657 -679 -170 1072 1604 1811 992 -185 -874 -1344 -1519 -1078 197
3605 197 643 1560 1333 1115 340 -904 -1225 -1279 -956 -233 730 1482 1348 1386 263 -401 -1481 -1891 -1231 -203
3625 -203 586 1197 1456 1380 426 -327 -1120 -1240 -1451 -939 549 1294 1449 1476 735 -91 -1100 -1516 -1293 -363
3645 -363 119 818 1443 1496 646 -195 -709 -1664 -1793 -763 342 1029 1458 1594 1018 310 -861 -1397 -1267
3664 -1267 -751 -260 691 1473 1396 1125 382 -643 -1294 -1497 -1005 -228 559 1263 1756 1076 380 -597 -1115 -1351
3684 -1351 -976 -541 484 777 1241 1262 629 -205 -1158 -1292 -751 -334 297 873 1417 1211 646 -118 -802 -1493
3704 -1493 -1439 -605 429 863 1038 1399 805 230 -780 -1280 -1413 -976 17 642 1097 1282 660 15 -673
3723 -673 -1087 -1515 -955 -325 278 1190 1316 1134 371 -504 -935 -1160 -645 -544 689 1082 1190 1096 275 -140
3743 -140 -993 -1415 -992 -688 -27 990 1221 922 463 -361 -709 -1528 -1289 -678 236 823 1134 1114 627 -175
3763 -175 -864 -1152 -971 -543 -7 512 1114 971 551 146 -600 -961 -1238 -654 162 418 796 950 968 -2
3783 -2 -252 -1160 -1166 -806 -158 367 952 898 859 200 -359 -723 -1415 -936 -246 527 806 1075 1160 299 -190 -717
3805 -717 -730 -1047 -715 445 751 998 966 341 -94 -567 -856 -1033 -669 233 763 872 998 392 82 -543
3825 -543 -1026 -928 -843 -26 714 1187 1047 734 208 -553 -852 -1157 -789 -197 507 958 962 789 399 -267 -878
3846 -878 -1135 -734 79 537 583 1068 1006 42 -490 -890 -748 -630 -320 150 675 863 727 365 -278 -977 -1094
3867 -1094 -905 -618 250 647 1227 864 457 -424 -534 -856 -1302 -645 -38 606 706 995 500 194 -613 -808
3887 -808 -813 -318 -122 565 718 817 392 58 -234 -863 -878 -792 -100 401 933 980 849 195 -428 -906 -1009 -743
3909 -743 -303 508 854 884 804 398 11 -686 -970 -553 31 274 359 1006 674 97 -295 -620 -781 -1026 -363
3930 -363 243 422 643 825 384 144 -621 -872 -781 -527 -73 580 706 743 297 -153 -278 -806 -959 -537 -62
3951 -62 495 684 878 686 78 -372 -686 -711 -701 85 293 685 867 617 190 -258 -753 -706 -665 -328 422 780
3973 780 749 935 238 -317 -794 -631 -437 -639 203 523 974 481 380 -211 -799 -934 -626 -353 123 632
3993 632 1003 904 283 -22 -373 -651 -595 -207 -91 522 550 991 400 20 -374 -945 -724 -704 -76 564 583 831
4015 831 354 138 -324 -638 -711 -466 148 237 541 891 500 102 -116 -724 -841 -479 -59 287 582 672 560
4036 560 328 -3 -712 -638 -534 -518 420 591 642 462 261 -163 -642 -778 -551 -201 99 445 609 615 97 149
4058 149 -562 -776 -444 -656 65 540 486 721 525 -38 -441 -507 -543 -557 -228 431 673 436 598 217 -379
4079 -379 -643 -492 -537 -105 251 490 675 427 214 -252 -599 -1008 -666 -150 387 562 596 564 161 -111 -379
4100 -379 -474 -572 -215 52 589 692 579 108 -166 -389 -580 -408 -523 46 403 823 625 499 -235 -571 -591
4121 -591 -586 -79 -132 141 703 343 37 219 -255 -345 -372 -409 -127 301 468 473 293 51 -208 -719 -717 -407 -115
4144 -115 357 511 471 254 256 -419 -332 -437 -261 -116 113 327 510 515 274 -119 -386 -368 -422 -154 298 500 429
4167 429 425 515 -226 -333 -538 -303 -109 35 449 484 580 411 -148 -363 -670 -542 -294 -264 281 406 400 499 -12
4190 -12 -14 -545 -497 -369 -129 577 321 382 431 -13 -104 -542 -481 -466 -185 288 548 290 256 241 -9 -550 -192 -102
4214 -102 -207 174 575 615 239 223 53 -281 -457 -561 118 338 199 327 509 250 -327 -359 -269 -302 76 126
4236 126 430 578 203 92 -166 -322 -627 -491 -298 9 336 451 235 198 64 -455 -350 -506 -271 -43
4256 -43 464 426 567 251 187 -111 -634 -606 -193 -223 488 663 279 220 -129 -120 -689 -447 -185 -82 14 306 493
4279 493 491 138 -29 -610 -378 -265 -247 154 419 417 350 306 -102 15 -510 -249 -71 93 316 590 305 299 65
4302 65 -388 -420 -374 -360 32 85 454 229 222 189 -223 -532 -446 -127 -267 236 179 598 274 81 -343 -393 -601 -538
4326 -538 -118 133 215 610 356 431 -126 -350 -273 -297 118 55 256 295 334 1 -87 -256 -489 -209 -360 20 233
4349 233 481 328 97 -211 -445 -568 -222 -4 185 513 195 395 172 12 -216 -402 -569 -131 321 201
4369 201 295 555 180 -168 -380 -343 -164 -89 338 258 462 516 281 172 -612 -193 -425 -306 16 349 553 592
4391 592 280 -265 -189 -402 -598 -202 -90 -204 124 349 520 82 -169 -126 -378 -491 -225 236 203 235 472
4412 472 -67 155 -550 -229 -361 -181 298 143 593 317 275 -26 -553 -263 -685 -16 24 372 573 268 -13
4433 -13 61 -422 -554 -396 -256 80 25 296 408 140 51 19 -475 -581 -149 47 130 397 337 325 151 -495 -361
4456 -361 -167 -300 -148 147 477 461 17 32 -271 -419 -213 -359 -133 -92 411 535 188 28 -93 -377 -235
4477 -235 -380 59 -73 754 197 155 309 -152 -170 -533 -131 -39 -32 28 534 212 -29 -303 -116 -454 -39 -164
4499 -164 -19 465 453 336 269 -277 -288 -299 -394 -15 -65 -99 464 491 227 -114 -327 -225 -226 -168 192 4 249 315
4523 315 249 17 -217 -374 -347 -66 -176 217 577 117 55 52 -284 -91 -366 -245 -127 -28 120 425 385 75
4545 75 -153 -204 -427 -250 -270 -63 277 229 451 -27 56 -492 -175 -273 -153 -92 282 321 444 312 21 -427 -330
4568 -330 -284 -148 58 232 462 352 284 -158 -321 -245 -230 -223 74 195 395 145 199 59 -323 -106 -478 -138
4590 -138 -11 197 419 346 158 -177 -73 -354 -355 -259 -95 346 496 601 289 -329 -130 -572 -241 -237 -85 18
4612 18 166 133 28 124 -118 -383 -515 -401 -107 117 250 328 349 236 -187 56 -365 -269 -132 229 399 450
4634 450 382 139 110 -388 -357 -318 -170 -178 124 452 555 320 -41 -391 -112 -208 -406 -95 81 214 324 261 262
4657 262 -305 -466 -637 -88 -17 228 404 377 274 -125 -130 -305 -523 -368 -67 128 127 203 497 38 -202 -411
4679 -411 -329 -433 209 201 597 358 298 56 33 -211 -239 -277 -196 21 48 344 527 211 -217 -510 -433 -258 -45
4702 -45 205 201 287 519 232 -52 -28 -276 -281 -267 -153 238 283 215 99 -19 -179 -273 -465 -230 -104 338 306 309 339
4727 339 -51 -204 -661 -338 -417 61 286 323 413 192 149 -65 -270 -265 -468 -167 -72 199 453 343 197 -176
4749 -176 -259 -237 -175 -154 18 83 437 300 287 -219 -101 -552 -354 -111 -120 227 356 408 145 -35 -93 -202 -283 -249
4773 -249 77 179 351 195 417 -82 -66 -325 -295 -132 -409 300 319 389 247 328 53 -447 -312 -408 57 123
4795 123 311 220 431 59 -24 -242 -148 -377 -207 127 459 300 89 56 -335 -342 -145 -352 -280 250 227 379 299
4818 299 167 -239 -329 -348 -563 -109 344 97 473 336 122 -156 -286 -570 186 -125 133 324 359 210 152
4839 152 -268 -138 -746 -386 -210 -107 22 542 230 243 102 -253 -505 -249 -241 95 127 224 334 230 288 54
4861 54 -535 -354 -181 187 5 665 502 458 -75 -63 -326 -256 -346 -314 160 351 529 224 -71 28 -339 -478
4883 -478 -229 -239 -148 438 366 356 128 -239 -364 -299 -447 -192 16 122 482 409 181 -78 -396 -393 -206 -494 -32
4906 -32 265 293 526 311 44 -454 -374 -533 -157 260 124 420 368 256 133 -240 -518 -219 -203 -326 192 485
4928 485 172 476 102 -416 -320 -295 -356 -13 -137 328 396 258 57 -39 -158 -429 -289 -106 -411 95 433 3
4950 3 139 42 -256 -395 -136 -198 -201 144 335 197 267 110 -93 -572 -583 -280 161 270 355 408 152 -178 -291
4973 -291 -291 -199 -54 -86 37 225 349 168 124 -99 -327 -404 -415 -314 235 316 344 267 -46 23 -373 -513 -177 88
4997 88 -27 226 556 147 247 152 -396 -410 -394 -283 152 221 325 469 288 -92 -245 -457 -359 -176 175 154
5019 154 452 341 379 -111 -499 -432 -214 -362 93 143 390 307 194 74 -381 -500 -238 -255 -20 268 445 383
5041 383 60 29 -119 -647 -556 -509 -167 92 505 403 505 -36 -129 -477 -708 -176 -359 87 180 643 355 226
5063 226 -170 -544 -232 -600 -73 198 91 491 462 108 -160 -535 -382 -233 -433 -42 229 562 413 102
5083 102 -118 -404 -490 -300 -292 289 280 313 452 333 -64 -425 -341 -434 -125 -49 253 345 252 268 -101 -369 -436 -162
5107 -162 -318 -186 303 451 858 426 167 -57 -430 -525 -249 -191 312 127 438 329 186 -293 -31 -676 -159
5128 -159 -283 -80 340 736 166 508 92 -653 -439 -196 -132 288 307 441 302 352 10 -115 -143 -460 -176
5149 -176 -132 466 452 314 330 114 -131 -664 -554 -638 -161 57 462 595 226 -117 -30 -469 -498 -245 37 401
5171 401 308 397 190 83 -318 -462 -481 -407 -148 224 495 239 369 181 -260 -309 -351 -333 -264 -188 340 436 288
5194 288 218 -341 -195 -342 -436 -85 50 377 194 550 194 -18 -23 -555 -440 -54 17 22 462 516 273 260 -40
5217 -40 -552 -206 -220 -240 250 294 675 274 -143 -408 -357 -251 -233 -218 77 560 371 244 193 3 -330 -562 -98
5240 -98 -360 -14 404 621 322 -87 -208 -550 -232 -392 -232 -28 239 344 374 241 -144 -509 -531 -413 -111
5261 -111 61 364 524 383 262 -54 -381 -311 -376 -283 126 430 328 381 291 -2 -397 -472 -277 -356 -149 279
5283 279 614 595 337 -80 -75 -307 -235 -124 -291 171 627 465 385 -3 -14 -398 -619 -222 -290 162 431 561
5305 561 518 404 -222 -355 -443 -389 -143 -66 28 591 620 327 -131 -421 -490 -373 -545 -25 395 253 522 300
5327 300 -37 -398 -541 -614 -291 80 -138 250 580 82 387 -180 -269 -451 -202 39 68 474 566 346 -62
5348 -62 -417 -388 -517 -93 -235 307 508 566 508 73 -134 -493 -353 -416 -299 154 391 494 468 139 -170 -482
5370 -482 -701 -332 -197 160 419 343 582 303 15 -366 -190 -352 -328 -9 390 475 638 143 52 -440 -465 -470
5392 -470 -618 -77 248 605 466 77 67 -169 -322 -605 -263 -19 195 519 425 364 73 5 -242 -430 -392 150
5414 150 369 585 513 246 -16 4 -334 -420 -603 -145 -33 203 711 368 103 -132 -399 -605 -472 -108 -314
5435 -314 318 388 463 171 -4 -331 -319 -300 -407 115 457 632 432 256 11 -382 -484 -650 -280 -238 209 450
5457 450 591 237 78 -159 -475 -598 -364 101 336 246 612 485 136 -139 -369 -639 -570 -102 416 427 373
5478 373 391 202 105 -508 -411 -286 -141 124 297 446 509 348 -71 -222 -325 -287 -440 3 582 422 215 434
5500 434 8 -306 -404 -577 -249 -58 155 688 687 33 100 -414 -424 -559 105 121 258 602 493 375 90 -224
5522 -224 -545 -182 -139 68 271 315 588 200 -157 -198 -334 -487 -391 -33 91 149 456 514 117 -300 -328 -689
5544 -689 -398 -125 14 335 549 524 123 -230 -509 -543 -424 67 -160 335 549 400 71 -311 -100 -657 -621
5565 -621 -110 258 397 451 730 298 -226 -80 -325 -703 -501 54 284 691 508 526 299 -150 -840 -556 -291
5586 -291 -276 231 311 505 635 205 -100 -392 -718 -404 -137 -36 182 255 572 174 -131 -351 -650 -294 -297 56
5608 56 451 461 423 208 -80 -456 -408 -383 -257 376 237 533 480 359 39 -281 -548 -409 -165 -91 19 570
5630 570 560 354 -136 -198 -669 -811 -27 -16 51 458 536 339 315 -288 -525 -525 -203 109 181 672 601 542 115 -463
5654 -463 -379 -634 -411 -237 209 665 559 422 151 77 -396 -382 -617 14 157 505 587 645 329 -56 -422 -647
5676 -647 -498 -373 -142 337 784 500 513 15 -334 -367 -412 -281 57 356 698 438 352 -117 -94 -272 -604 -487
5698 -487 -120 105 323 520 322 80 -235 -683 -527 -513 -83 117 228 697 533 204 -172 -428 -638 -494
5718 -494 -167 129 493 643 281 345 106 -508 -442 -205 -15 238 328 523 439 404 -141 -246 -513 -558 -99 -49
5740 -49 193 160 351 277 76 -230 -443 -331 -109 -255 383 407 515 229 207 7 -506 -438 -202 -50 168 695
5762 695 528 330 -105 -143 -574 -597 -274 -248 163 695 315 347 164 16 -400 -692 -449 -64 282 358 567 446
5784 446 -53 -33 -298 -515 -700 -344 73 573 233 540 332 -141 -461 -332 -343 -248 75 103 651 412 382 43
5806 43 -444 -678 -259 -30 83 305 468 746 457 -29 -265 -580 -580 -473 -195 330 413 421 371 163 -208 -322
5828 -322 -595 -266 -341 -152 311 401 261 248 -205 -270 -532 -401 -144 87 354 216 385 187 -216 -290 -437 -318
5850 -318 -194 -41 397 621 557 429 -36 -233 -510 -640 -402 126 336 573 529 318 -63 -252 -242 -586 -397
5871 -397 41 288 244 440 259 101 -148 -600 -580 -193 74 105 271 622 569 100 -49 -377 -576 -342 -400 212
5893 212 446 502 255 -106 -354 -603 -256 -602 57 18 319 327 380 -8 -139 -343 -633 -694 -307 251 490 493 628
5916 628 318 115 -233 -304 -496 -316 -127 419 535 277 142 84 -342 -255 -636 -294 42 508 606 411 290
5937 290 16 -207 -410 -449 -598 -191 86 435 603 646 265 -376 -644 -420 -489 40 380 402 662 472 101
5958 101 84 -544 -457 -488 -197 366 424 395 313 292 -25 -103 -480 -436 -330 -24 617 563 335 434 65 -311 -322 -584
5982 -584 -113 -165 327 126 475 268 55 -48 -500 -569 -146 -191 99 345 399 65 -82 -216 -415 -370 -506 -374
6004 -374 126 364 556 351 260 -150 -338 -575 -463 83 160 397 491 282 142 -275 -361 -453 -183 -204 -80 474
6026 474 367 295 156 53 99 -451 -462 -24 194 107 368 323 491 -126 -408 -480 -575 -390 13 132 477 456 127
6049 127 64 -2 -488 -349 -139 7 550 419 667 97 366 -418 -185 -408 -379 -124 178 297 462 458 19 -344
6071 -344 -257 -377 -232 -130 139 196 384 511 232 -69 -450 -617 -497 -28 47 219 753 301 245 33 -184
6092 -184 -542 -396 -550 -202 367 345 296 249 -195 94 -391 -500 -377 88 342 165 687 391 -252 -187 -460
6113 -460 -605 -405 -18 94 175 647 99 -43 -407 -480 -188 -470 -462 325 426 383 363 211 -294 -409 -491 -183
6135 -183 -82 112 457 338 423 468 25 -433 -219 -420 -171 -77 592 366 341 242 118 -377 -676 -641 -377 -38
6157 -38 191 215 561 454 -107 -193 -496 -471 -276 -148 278 529 526 574 140 -276 -431 -618 -123 -62 -22 403 649
6180 649 388 167 105 -420 -172 -487 -186 426 403 428 503 148 -192 -501 -489 -372 -172 284 326 357 350 238 -296
6203 -296 -448 -340 -450 3 184 277 267 472 84 -361 -188 -353 -726 -248 -264 250 392 465 392 139 -414 -212
6225 -212 -336 -186 -122 199 729 386 232 30 -91 -387 -453 -332 -125 272 308 484 518 144 -84 -388 -276
6246 -276 -383 -354 -83 626 348 138 106 -86 -610 -729 -400 -130 45 444 343 473 16 -159 -421 -424 -261
6267 -261 -58 96 185 525 381 338 -31 -264 -546 -416 -662 -46 181 387 316 582 -49 -305 -405 -367 -174
6288 -174 -92 224 326 371 397 225 -139 -481 -651 -188 -231 -23 194 672 328 153 228 -364 -596 -685 -209 317
6310 317 247 390 271 195 15 -216 -603 -470 -302 266 241 511 488 -56 88 -399 -440 -374 -233 65 295 398
6332 398 356 381 -32 31 -478 -472 -218 -115 302 525 304 517 -99 -184 -445 -445 -303 -18 90 399 350 401 267
6355 267 -128 -340 -205 101 -137 129 314 356 293 56 185 -314 -261 -510 -457 271 139 530 275 195 52 -254
6377 -254 -549 -153 -252 -81 87 562 86 379 -7 -319 -539 -409 -220 2 128 436 232 63 255 -178
6397 -178 -247 -609 -252 -188 81 477 507 123 -148 -188 -451 -314 -290 -100 168 220 421 342 -98 -29 -414 -355 -220
6420 -220 -105 84 401 510 290 -121 -268 -69 -439 -333 -148 -87 454 285 608 146 -92 -39 -543 -258 -140
6441 -140 112 150 454 506 92 19 -228 -246 -354 -185 -250 66 430 548 353 -162 -207 -202 -653 -406 -33 275 245
6464 245 544 451 29 -121 -587 -344 -519 -78 397 306 447 324 93 -243 -451 -659 -510 -44 322 314 598
6485 598 563 166 -16 -370 -540 -468 84 121 -23 361 411 302 158 -498 -221 -602 -121 -23 212 337 463 252
6507 252 -51 -184 -172 -363 -166 -16 229 410 382 285 2 -73 -329 -508 -264 -231 164 569 157 443 381 -171
6529 -171 -196 -346 -315 -94 124 287 498 438 191 -235 -223 -380 -370 -120 99 301 412 295 174 42 -268 -492
6551 -492 -181 -396 159 214 269 438 128 135 -32 -234 -281 92 4 -26 398 150 305 13 -169 -369 -428 -170 -118
6574 -118 352 450 533 177 -80 -268 -461 -440 -220 -170 -36 163 276 162 -105 -259 -228 -506 -449 -130 197 465
6596 465 390 45 39 25 -174 -604 -466 65 157 260 285 592 31 -133 -576 -371 -410 -277 -67 -81 382 276 163
6619 163 -83 -87 -221 -183 -255 -144 122 441 370 225 267 -191 -178 -152 -229 -182 187 177 176 500 144 -229 -172 -359 -155
6644 -155 -84 370 516 567 191 336 -54 -221 -664 -129 25 152 225 377 291 159 -210 -212 -201 -578 -196 -13
6666 -13 359 127 507 241 33 -324 -327 -184 -202 -127 88 349 350 509 -34 136 -158 -431 11 -50 125 280 385
6689 385 396 -11 -241 -298 -283 -162 10 201 506 465 531 -86 104 -412 -458 -273 77 200 274 256 342 25 -184
6712 -184 -383 -415 -377 -245 212 360 391 264 180 -377 -486 -398 -403 -11 187 189 228 206 477 50 -53 -440 -320 -226
6736 -226 -289 140 401 384 -3 77 -178 -496 -486 -216 -36 195 268 389 117 2 -101 -379 -478 -142 29 8
6758 8 501 284 509 33 -345 -351 -356 -11 -11 337 292 454 299 76 -27 72 -30 -502 -250 170 120 157 628 197
6782 197 -100 -157 -403 -258 -312 -425 58 398 285 126 117 -6 -105 -88 -390 -27 121 412 385 217 102 -331
6804 -331 -375 -171 -141 -287 65 129 391 421 47 -248 70 -135 -356 -128 -77 283 381 217 191 131 -158 -397 -188
6827 -188 -225 -146 331 233 150 206 246 -362 -486 -119 -236 -3 199 185 678 424 -85 -234 -117 -383 -340 -79 298
6850 298 547 343 312 128 51 -121 -620 19 112 -115 341 384 196 257 -224 -77 -326 -80 4 -64 334 362 299
6873 299 303 -180 -241 -271 -278 -46 -25 142 226 375 175 108 -220 -347 -193 -197 64 193 297 246 286 102 -96 -362
6897 -362 -375 -203 -129 -12 297 329 346 -15 -20 -577 -441 -43 -12 321 222 249 377 -132 -71 -312 -429 -184 -219 73
6921 73 81 308 261 130 -203 -237 -221 -226 -309 39 211 390 251 190 130 -304 -133 -45 -165 147 414 350 430 112 117
6946 117 -155 -98 -481 -183 -14 546 192 314 326 19 -62 -14 -301 -272 -5 336 261 328 113 69 -68 -205 -278
6969 -278 -344 -134 170 74 281 259 -47 -242 -191 -425 -206 147 52 -151 571 390 -32 -81 -354 -259 -389 -43
6991 -43 -35 439 249 447 440 96 -253 -140 -138 -165 -146 163 422 268 222 64 -94 -438 -398 -320 -347 141 332 381 -98
7016 -98 61 -91 -276 -161 30 -9 76 278 147 31 106 -4 -26 -250 -202 136 -69 388 543 289 -24 -100
7038 -100 -234 -19 -204 20 21 394 187 458 366 -185 -213 -560 -360 -181 250 61 286 525 107 -251 -77
7059 -77 -11 -348 -116 -63 272 299 551 392 -155 -117 -117 -233 -395 -187 133 256 240 -34 205 -106 -480 -323 -242
7082 -242 -50 -25 396 376 270 66 -86 -56 -372 -344 -41 7 259 338 180 42 47 -268 -268 114 -153 130 82 215
7106 215 339 174 -15 -205 -187 -310 -170 82 47 175 443 538 -168 -105 -200 -94 -358 -130 64 331 391 288
7128 288 116 -140 -248 -363 -235 6 -29 440 287 156 48 -164 -271 -380 -40 30 159 351 -31 253 230
7149 230 -333 -248 -175 -344 -185 -137 144 395 230 318 102 -30 -384 -278 -66 201 111 309 143 327 180 -278
7171 -278 -277 -442 -281 -87 -102 180 329 409 135 -166 -192 -349 -187 -206 225 393 509 410 54 -120 -90 -121 -184
7194 -184 -121 110 382 339 320 -26 -44 -349 -179 -339 83 204 191 393 443 125 -75 -117 -420 -256 -85 -1 0
7217 0 564 247 153 320 -158 -547 -201 -237 97 340 336 377 -238 -52 -282 -582 -391 67 -328 111 449 205
7239 205 -24 293 -173 -80 -126 -120 -121 26 187 71 230 70 -290 -271 -138 -122 -260 263 171 250 366 307 76 -42
7263 -42 -216 -368 -205 -7 132 345 286 187 4 6 72 -229 44 -139 143 152 340 286 -158 -115 -65 -304 -15 48
7287 48 -14 633 271 227 144 13 -85 -190 -148 99 495 255 -12 153 17 -279 -241 -68 -253 -96 -108 196 105
7310 105 -167 -4 -208 -263 -351 -286 -405 -56 66 455 80 47 91 -258 -325 62 -91 172 70 451 252 12
7332 12 -166 -63 -225 -231 -329 -11 224 120 372 163 -247 -247 -309 -247 -197 -32 195 490 187 163 21 -135 -213 -347
7356 -347 -295 77 222 294 136 160 229 126 -40 -384 -382 -245 123 119 39 221 219 -118 -250 -394 -220 -361 -82 -54
7380 -54 347 338 67 215 -179 3 -131 83 210 274 57 367 -26 152 19 -170 -210 -184 -284 184 270 278 208
7403 208 149 -38 -305 -160 -224 -197 -53 169 223 308 78 -73 -15 -31 -507 -79 135 233 153 66 177 -209 -427
7426 -427 -211 -275 -112 299 234 50 181 287 212 -355 -110 -306 -226 63 -40 223 228 237 183 -33 -270 -132 -300
7449 -300 -127 0 105 50 54 -215 -33 80 -418 -257 -62 245 50 446 21 138 118 -533 -246 -346 80
7470 80 106 107 75 447 181 -186 -394 -177 -37 60 32 266 155 263 56 -1 -37 -295 -122 -28 -129 150 482
7493 482 40 215 -88 -239 40 -494 -354 102 64 302 154 -31 21 -161 -192 -160 -293 -103 47 -53 367
7514 367 206 201 270 -39 -327 -120 346 111 171 174 19 -190 100 -34 -100 -365 -74 -91 146 174 328 104 -39
7537 -39 172 -227 -130 -35 199 33 221 -3 -58 13 -238 -24 -37 -266 -23 134 365 390 90 68 -179 -294 -171
7560 -171 -45 -48 243 168 97 90 -219 -16 -240 -155 -298 -74 -204 413 233 219 -21 -171 -254 -343 -230 -241 -116 366
7584 366 330 374 178 133 -4 -273 73 -284 97 209 -114 251 281 -232 -269 -135 -229 -101 238 -184 321 351
7606 351 278 -286 -91 -56 -249 -149 41 42 242 433 353 150 -230 -217 -303 -277 -8 77 348 414 84 -322 54
7629 54 -205 -301 -381 156 -57 445 190 154 419 134 -332 -345 -149 -32 22 56 -62 -84 63 -270 -338 -302 -231 -159
7653 -159 1 186 180 5 179 141 -359 42 -356 -358 -104 130 595 85 135 -154 -126 -180 -294 -275 -213 43 311
7676 311 268 64 244 -47 -373 -381 -158 -230 -108 282 166 298 286 99 20 -427 -259 -210 -197 92 228 178 221
7699 221 149 -89 -284 -110 -239 11 205 539 67 -73 187 -112 -356 -328 -205 -25 -84 265 132 -106 -156
7720 -156 -21 -311 -352 -444 24 365 276 136 339 144 -271 -219 -301 -109 -56 -32 42 77 336 41 -89 -54 -60 -94
7744 -94 -18 -7 24 267 42 232 -37 -75 -142 -188 -39 187 -110 172 -119 131 153 46 -265 -307 -91 -7 262
7767 262 20 245 30 -9 -41 -206 -172 -141 199 -6 42 217 179 57 -238 -192 -321 -123 -113 -47 314 378 116
7790 116 137 3 -306 -363 -308 132 39 22 431 142 -2 -17 -337 200 -61 63 86 58 85 240 -93 130 78
7813 78 -235 -164 280 236 201 281 241 21 226 -141 138 -157 -343 78 254 154 14 198 101 13 -83 -120 -151 62
7837 62 46 177 -109 235 56 -73 104 -99 -191 -234 280 314 172 6 310 -131 -10 -56 -30 -125 -23 88 129
7860 129 -82 -46 37 -68 -71 17 -80 161 107 0 326 121 -27 -76 -240 -250 -164 115 237 -3 -34 532 204 -84
7884 -84 -398 -213 -419 283 246 312 193 -266 -75 -8 -390 -375 -400 -240 -117 246 267 195 -32 35 -271 -350 -86
7907 -86 78 48 135 368 214 141 -12 -247 -570 -250 -41 73 142 246 102 265 -4 -68 -102 -16 -188 5 157
7930 157 292 178 262 -73 -225 -58 -357 -238 57 155 -74 515 49 -62 -171 -51 -84 -343 144 173 427
7951 427 195 41 6 -31 -107 -88 -141 35 40 309 285 160 -45 -114 -268 -59 -167 -269 117 170 260 399 -69 -39
7975 -39 62 -32 -311 8 6 323 229 425 355 -249 27 -385 -93 -249 -233 71 192 222 191 106 -403 -135 -40 -262
7999 -262 -90 95 131 28 129 -10 -180 -88 -169 -217 202 244 298 215 105 -121 -171 -101 -479 -253 29 -59 86
8022 86 58 20 10 -23 -54 -343 -394 -327 -126 -24 419 73 189 -56 243 -201 -249 -257 -287 361 234 241 161 22 -121
8047 -121 91 -390 27 -113 -111 262 228 168 -104 39 -157 -134 -153 -135 65 171 -63 133 208 227 -23 -12 18 -45
8071 -45 37 231 154 -29 21 -61 -274 -184 -137 55 -34 320 364 100 2 -148 -279 -308 -327 -83 83 184 93 254
8095 254 344 -49 -165 -69 -95 -126 50 183 292 217 291 -55 -115 -109 -303 -223 0 -104 121 251 177 -43 70 -213
8119 -213 -65 -64 -213 118 -5 170 -44 243 120 -141 -320 -269 -113 -123 52 374 243 -152 -22 -98 -346 -88
8141 -88 -10 208 260 238 249 271 41 -188 73 -223 -182 11 279 90 350 159 131 86 -145 -70 80 -133 116
8164 116 321 196 319 -88 -255 -203 -210 -207 303 -93 160 -28 411 -4 109 -257 -63 -203 5 -201 -6 170
8186 170 145 -204 292 -83 -316
8191c16
##END NTUPLES=NMR FID
##END=
