##TITLE=1H_DE-27EXT
 D2O
 8 sc, 
 7.2.2024
##JCAMPDX= 6.0         $$ Bruker NMR JCAMP-DX V2.0
##DATA TYPE= NMR FID
##DATA CLASS= NTUPLES
##ORIGIN= UXNMR, Bruker Analytische Messtechnik GmbH
##OWNER= root
$$ XWIN-NMR		Version 3.5
$$ Wed Feb  7 15:36:39 2024 Russian Standard Time (UT+4h)  she@DPX200
##.OBSERVE FREQUENCY= 200.1313
##.OBSERVE NUCLEUS= ^1H
##.DELAY= (6, 6)
##.ACQUISITION MODE= SIMULTANEOUS
##.ACQUISITION SCHEME= undefined
##.AVERAGES= 8
##.DIGITISER RES= 18
##SPECTROMETER/DATA SYSTEM= spect
##.PULSE SEQUENCE= zg30
##.SOLVENT NAME= CDCl3
##.SHIFT REFERENCE= (INTERNAL, CDCl3, 0, 15.7039)
##AUDIT TRAIL= $$ (NUMBER, WHEN, WHO, WHERE, WHAT)
$$ ##TITLE= Audit trail, XWIN-NMR		Version 3.5
$$ ##JCAMPDX= 5.01
$$ ##ORIGIN= Bruker BioSpin GmbH
$$ ##OWNER= she
$$ F:/spectra/data/she/nmr/H-F/1/audita.txt
$$ ##AUDIT TRAIL=  $$ (NUMBER, WHEN, WHO, WHERE, WHAT)
(   1,<2024-02-07 15:35:42.35 +0400>,<she>,<DPX200>,
      <created by zg, POWCHK disabled, PULCHK disabled
       configuration hash MD5:
       00 E9 B6 7A A2 85 ED C7 34 08 36 98 17 FE 4E 26
       data hash MD5: 16K
       5B 64 7B 2D CE A9 5D C8 C5 9A 75 C8 FD 89 64 00>)
$$ ##END=
$$ 
$$ hash MD5
$$ 4C 36 2B DB B8 98 0C 38 42 F7 EC 35 FD C1 A3 7B
##$RELAX= 
##$RELAX= 
##$RELAX= 
##$RELAX= 
##$RELAX= 
##$RELAX= 
$$ Bruker specific parameters
$$ --------------------------
##$DU= <F:/spectra>
##$EXPNO= 1
##$NAME= <H-F>
##$PROCNO= 1
##$TYPE= <nmr>
##$USER= <she>
##$AMP= (0..31)
100 100 100 100 100 100 100 100 100 100 100 100 100 100 100 100 100 100 
100 100 100 100 100 100 100 100 100 100 100 100 100 100 
##$AQSEQ= 0
##$AQ_mod= 1
##$AUNM= <au_zg>
##$AUTOPOS= <>
##$BF1= 200.13
##$BF2= 200.13
##$BF3= 200.13
##$BF4= 200.13
##$BF5= 200.13
##$BF6= 200.13
##$BF7= 200.13
##$BF8= 200.13
##$BYTORDA= 1
##$CFDGTYP= 0
##$CFRGTYP= 5
##$CHEMSTR= <none>
##$CNST= (0..31)
1 1 145 1 1 1 1 1 1 1 1 1 1 1 1 1 1 1 1 1 1 1 1 1 1 1 1 1 1 1 1 1 
##$CPDPRG= <>
##$CPDPRG1= <>
##$CPDPRG2= <>
##$CPDPRG3= <>
##$CPDPRG4= <mlev>
##$CPDPRG5= <mlev>
##$CPDPRG6= <mlev>
##$CPDPRG7= <mlev>
##$CPDPRG8= <mlev>
##$CPDPRGB= <>
##$CPDPRGT= <>
##$D= (0..31)
0 1.2 0 0 0 0 0 0 0 0.06 0 0.03 0 0 0 0 0.0002 0 0 0 0 0 0 0 0 0 0 0 0 
0 0 0 
##$DATE= 1707305741
##$DBL= (0..7)
120 120 120 120 120 120 120 120 
##$DBP= (0..7)
150 150 150 150 150 150 150 150 
##$DBP07= 0
##$DBPNAM0= <>
##$DBPNAM1= <>
##$DBPNAM2= <>
##$DBPNAM3= <>
##$DBPNAM4= <>
##$DBPNAM5= <>
##$DBPNAM6= <>
##$DBPNAM7= <>
##$DBPOAL= (0..7)
0.5 0.5 0.5 0.5 0.5 0.5 0.5 0.5 
##$DBPOFFS= (0..7)
0 0 0 0 0 0 0 0 
##$DE= 6
##$DECBNUC= <off>
##$DECIM= 32
##$DECNUC= <off>
##$DECSTAT= 4
##$DIGMOD= 1
##$DIGTYP= 9
##$DL= (0..7)
0 120 120 120 120 120 120 120 
##$DP= (0..7)
150 150 150 150 150 150 150 150 
##$DP07= 0
##$DPNAME0= <>
##$DPNAME1= <>
##$DPNAME2= <>
##$DPNAME3= <>
##$DPNAME4= <>
##$DPNAME5= <>
##$DPNAME6= <>
##$DPNAME7= <>
##$DPOAL= (0..7)
0.5 0.5 0.5 0.5 0.5 0.5 0.5 0.5 
##$DPOFFS= (0..7)
0 0 0 0 0 0 0 0 
##$DQDMODE= 0
##$DR= 18
##$DS= 0
##$DSLIST= <SSSSSSSSSSSSSSS>
$$ [...]
##$SUBNAM2= <"">
##$SUBNAM3= <"">
##$SUBNAM4= <"">
##$SUBNAM5= <"">
##$SUBNAM6= <"">
##$SUBNAM7= <"">
##$SUBNAM8= <"">
##$SUBNAM9= <"">
##$SW= 18.0517328524113
##$SWIBOX= (0..15)
0 0 2 0 0 0 0 0 0 0 0 0 0 0 0 0 
##$SW_h= 3612.71676300578
##$TD= 16384
##$TD0= 1
##$TE= 0
##$TE2= 300
##$TE3= 300
##$TEG= 300
##$TL= (0..7)
0 120 120 120 120 120 120 120 
##$TP= (0..7)
150 150 150 150 150 150 150 150 
##$TP07= 0
##$TPNAME0= <>
##$TPNAME1= <>
##$TPNAME2= <>
##$TPNAME3= <>
##$TPNAME4= <>
##$TPNAME5= <>
##$TPNAME6= <>
##$TPNAME7= <>
##$TPOAL= (0..7)
0.5 0.5 0.5 0.5 0.5 0.5 0.5 0.5 
##$TPOFFS= (0..7)
0 0 0 0 0 0 0 0 
##$TUNHIN= 0
##$TUNHOUT= 0
##$TUNXOUT= 0
##$USERA1= <user>
##$USERA2= <user>
##$USERA3= <user>
##$USERA4= <user>
##$USERA5= <user>
##$V9= 5
##$VALIST= <valist>
##$VCLIST= <CCCCCCCCCCCCCCC>
##$VD= 0
##$VDLIST= <DDDDDDDDDDDDDDD>
##$VPLIST= <PPPPPPPPPPPPPPP>
##$VTLIST= <TTTTTTTTTTTTTTT>
##$WBST= 1024
##$WBSW= 4
##$XGAIN= (0..3)
0 0 0 0 
##$XL= 0
##$YL= 0
##$YMAX_a= 140313
##$YMIN_a= -195542
##$ZGOPTNS= <>
##$ZL1= 120
##$ZL2= 120
##$ZL3= 120
##$ZL4= 120
##$ABSF1= 10
##$ABSF2= 0
##$ABSG= 5
##$ABSL= 3
##$ALPHA= 0
##$AQORDER= 0
##$ASSFAC= 0
##$ASSFACI= 0
##$ASSFACX= 0
##$ASSWID= 0
##$AUNMP= <proc_1d>
##$AZFE= 0.1
##$AZFW= 0.1
##$BCFW= 1
##$BC_mod= 2
##$BYTORDP= 1
##$COROFFS= 0
##$CY= 11.3945322036743
##$DATMOD= 1
##$DC= 2
##$DFILT= <>
##$DTYPP= 0
##$F1P= 15.7292609196834
##$F2P= 12.9074282941183
##$FCOR= 0.5
##$FTSIZE= 0
##$FT_mod= 4
##$GAMMA= 1
##$GB= 0.15
##$INTBC= 1
##$INTSCL= 1
##$ISEN= 128
##$LB= 0.24
##$LEV0= 0
##$LPBIN= 0
##$MAXI= 10000
##$MC2= 0
##$MEAN= 0
##$ME_mod= 0
##$MI= 1.114404
##$NCOEF= 0
##$NC_proc= 0
##$NLEV= 6
##$NOISF1= 3.799351
##$NOISF2= 2.8
##$NSP= 1
##$NTH_PI= 0
##$NZP= 0
##$OFFSET= 15.70392
##$PC= 1
##$PHC0= -24598.35
##$PHC1= 9.052685
##$PH_mod= 1
##$PKNL= yes
##$PPARMOD= 0
##$PSCAL= 0
##$PSIGN= 0
##$REVERSE= no
##$SF= 200.130013532006
##$SI= 16384
##$SIGF1= 3
##$SIGF2= 2
##$SINO= 400
##$SIOLD= 16384
##$SREGLST= <1H.CDCl3>
##$SSB= 0
##$STSI= 0
##$STSR= 0
##$SW_p= 3612.71676300578
##$SYMM= 0
##$S_DEV= 0
##$TDeff= 0
##$TDoff= 0
##$TI= <>
##$TILT= no
##$TM1= 0
##$TM2= 0
##$TOPLEV= 0
##$USERP1= <user>
##$USERP2= <user>
##$USERP3= <user>
##$USERP4= <user>
##$USERP5= <user>
##$WDW= 1
##$XDIM= 8192
##$YMAX_p= 0
##$YMIN_p= 0
$$ End of Bruker specific parameters
$$ ---------------------------------
##NTUPLES= NMR FID
##VAR_NAME=  TIME,          FID/REAL,        FID/IMAG
##SYMBOL=    X,             R,               I
##VAR_TYPE=  INDEPENDENT,   DEPENDENT,       DEPENDENT
##VAR_FORM=  AFFN,          ASDF,            ASDF
##VAR_DIM=   8192,          8192,            8192
##UNITS=     SECONDS,       ARBITRARY UNITS, ARBITRARY UNITS
##FACTOR=    0.0002768,     1,               1
##FIRST=     0,             0,               0
##LAST=      2.2672688,     0,               0
##MIN=       0,             -195542,         0
##MAX=       2.2672688,     140313,          0
$$ Real data points
##PAGE= N=1
##DATA TABLE= (X++(R..R)), XYDATA
$$ [...]
1864B51n11k55J33M78P3j09L58j09m32l49K05j08J59j02N44K56j70m77K12J29
$$ 251 -260 -515 -382 96 169 60 418 309 -123 -472 -267 -375 -216 -318 226 482 312 -165 47 176
1884A76l88k80K03L34L5K26L18j1m71l74M4n7l49M07N00j19jnq1n51o4O2L68k24
$$ 176 -212 -492 -289 45 80 306 624 613 142 -232 -188 -245 -594 -187 313 194 193 188 107 -444 -508 -446 -78 -302
1908c02K79K14L67l44j09k29O4l98J30P7M53m7m6L62j06o88L49o78M10J79j48
$$ -302 -23 191 558 214 105 -124 -60 -458 -328 -251 202 155 109 471 365 -323 26 -652 -242 -63 -211
1929b11L92K15k35q6K68o77n2J28L99j98K3O16k50j00j56j56k6r0j41L90J93P9
$$ -211 181 396 161 75 343 -334 -386 -258 141 -57 -34 582 332 232 76 -80 -106 -196 -337 53 246 325
1951C25j08J31k9n05k52P7q8M57j70O27r9l18K19m33k14j31K18kL30J40O0K34
$$ 325 217 348 319 -186 -438 -361 -449 8 -162 465 366 48 267 -166 -380 -511 -293 -295 35 175 235 469
1973D69j38m66k13j9j86K02J67N45l4j10l9j37m09m1Q2J2L24q0M20j82Jj46k34
$$ 469 331 -135 -348 -367 -553 -351 -184 361 327 217 178 41 -368 -409 -327 -315 9 -71 349 167 168 22 -212
1996b12j23J20J8l3K78k8J81j11j3K6n47L27k8l06M80J74r0j45K34k41m66L34
$$ -212 -335 -215 -197 -230 48 20 201 90 77 103 -444 -117 -145 -451 29 203 113 -32 202 -39 -505 -171
2018a71p4K69J65J5J88j16j64j93Nj35o7j23N56K13q6L2k15r4m78L42j95M5L42
$$ -171 -245 24 189 204 392 276 112 -81 -76 -211 -278 -401 155 368 282 314 99 5 -473 -131 -326 -281 61
2041F1l8K88O1l00k86q5J5q4J65N46j65k33L15q9j23k34M2Q4l04K46L39j70J09
$$ 61 23 311 372 72 -214 -299 -284 -368 -203 343 178 -55 260 171 48 -186 -144 -60 -364 -118 221 51 160
2064A60J47l25j66mJ30l82L15L27J06q9K42m16m84K70Q6j53J5L72K89n42L24O4
$$ 160 307 -18 -184 -188 -58 -440 -125 202 308 219 461 45 -439 -169 -83 -236 -221 151 440 -102 222 286
2086B86m13p1J75n9l98O17j22J49j05L07n10q7O3p1J21j31L08K68nr5j93l57J51
$$ 286 -127 -198 -23 -82 -480 137 15 164 59 366 -144 -231 -168 -239 -118 -249 59 327 322 227 34 -323 -172
2109a72K13n88M36L83j85K9k93L21l16p1O9m3K11M59l74j30L68k27l37O6N7j84
$$ -172 41 -547 -111 272 87 116 -177 144 -172 -243 -174 -217 -6 453 79 -51 317 90 -247 -181 -124 -308
2131c08K77M6N0j24K06J03m50R9k10N9M19j24j4K03Q2l55P3j55o6j94K38J56j0
$$ -308 -31 15 65 -59 147 250 -200 -101 -311 -252 167 43 29 232 314 -41 32 -123 -189 -383 -145 11 1
2154AJ4M36j60m70L2j13J08O0p7L05r8K7j92R4jj2L2l7q4K71P9pK6k69l27J37
$$ 1 15 451 291 -179 -147 -260 -152 -92 -169 136 38 65 -127 -33 -34 -46 -14 -51 -135 136 215 208 234 -35 -362 -225
2180b25Q3m8L08n9j8K9K16k99J95l78l1O9Q9M9o5L79l26r5K25k68m2N2N5J75q6
$$ -225 -142 -190 118 59 41 70 286 -13 182 -196 -227 -158 -69 -20 -85 294 -32 -127 98 -170 -212 -160 -105 70 -16
2205a6K08N6k3r9j65n2k17n9L80K31k26L24m61J38j02l3j20M3q3P7N97l06Kk25
$$ -16 192 248 225 126 -39 -91 -308 -367 13 244 18 342 -119 19 -83 -116 -236 -193 -276 -199 398 92 94 -131
2229a31J23r0j75K70P3R1q9K89J07m69j95q6k3J41J14j31K17K63l30K69l66L80
$$ -131 -8 -98 -273 -3 70 161 72 361 468 -1 -196 -282 -305 -164 -50 -181 36 299 -31 238 -128 252
2251B52o17J18K90k66LK33R2j3k61r3J52l31L03K64o1J61K78m45km07P6J1K0M23
$$ 252 -365 -247 43 -223 -220 13 105 92 -169 -262 -110 -441 -138 126 65 226 504 59 57 -350 -274 -263 -243 180
2275A80J62j25M0j69J42l69R7l24J94J04j2K24J32k11j06k01R2rj09K36%J83K49
$$ 180 342 217 257 88 230 -139 -42 -366 -172 -68 -80 144 276 65 -41 -242 -150 -159 -268 -32 -32 151 400
2298D00l25K1N2j83o9m5L7K4J39l2J73k11Q1L9j86j60O1J26J27j8J71j16j25q7
$$ 400 75 96 148 -35 -104 -149 -112 -88 51 19 192 -19 62 101 -85 -245 -184 -58 69 51 222 106 -19 -106
2322a06l5J01k6N3M8J7o7K35k57rJ6n3J11k00J97J11K89m21j41K19k37j4Q8n4
$$ -106 -141 -40 -66 -13 35 52 -15 220 -37 -46 -30 -83 28 -172 25 136 425 4 -137 82 -155 -169 -81 -135
2346a35J91j00K99j45k8l49L3J99j15N1J3J43J1%M6q7k44J72j04L1N9K76r6o3
$$ -135 56 -44 255 110 82 -267 -234 -35 -150 -99 -86 57 68 68 114 27 -217 -45 -149 -118 -59 217 121 58
2370E8J1n5P4j77j08J89%J08O6j59J08J0k68K84j68R7Ok32L70J31l65q0K8k5p6
$$ 58 69 14 88 -89 -197 -8 -8 100 166 7 115 125 -143 141 -27 70 76 -156 214 345 -20 -100 -72 -97 -173
2395a73K95j07M1L9J00p6j07P3k44P4j09Q3J65n5K4N5J49k92K09j92j93J79L15
$$ -173 122 15 56 95 195 119 12 85 -159 -85 -194 -111 54 -1 23 78 227 -65 144 -48 -241 -62 253
2418B53j65P2j30J78j48j95J08l9P3j89J87J97j26o9p2m1r9J08J22j39M48k81
$$ 253 88 160 30 208 60 -135 -27 -66 7 -182 5 202 76 7 -65 -106 -205 -97 25 -114 334 53
2440E3j0j29q4K35N3k86j22L29N0O3P1r8Qk09Q7K09j83k61L77k00M0K55l53m6
$$ 53 43 -86 -170 65 118 -168 -290 39 89 152 223 125 133 -76 11 220 37 -224 153 -47 -7 248 -105 -151
2464a51j11J51rk23L29L41m32K87j54j43J29o8K01k42J62J3l11M18J54k01p1l4
$$ -151 -262 -111 -120 -343 -14 327 -105 182 28 -115 14 -54 147 -95 67 80 -231 187 341 140 69 35
2486C5Qn5J53Q5J51m16nj13k6O6m5J36M7MR9n5o0J07j14m9M0j67M4L23N4k46J17
$$ 35 43 -12 141 226 377 -39 -44 -157 -183 -117 -162 -26 21 25 124 69 9 116 2 -47 -7 -174 -130 193 247 1 118
2513A18j35j44j70O3K61J26k82L01K5j48j09K01n5k52nl4M19j75nM32k16p8k49
$$ 118 -17 -161 -331 -268 -7 119 -163 138 163 15 -94 107 52 -200 -205 -239 180 5 0 432 216 138 -111
2536a11J93k37L70j41J46m61N65k66k78J44J85k26K2J83N4m5K9K70l85J71j97
$$ -111 82 -155 215 74 220 -241 324 58 -220 -76 109 -117 -95 88 142 97 126 396 11 182 -15
2557a5q6J04J6q3J73q0k9P8j73J41j96K07k92L07l8M4L93n07k59K98K5j47q7K43
$$ -15 -101 3 19 -64 109 29 0 78 -95 46 -150 57 -235 72 34 78 471 -36 -295 3 28 -119 -206 37
2581C7J91k63J14k84L06j55j03R1n2K33k77K00l0K09k60p6J38j46q4K91o8J35
$$ 37 228 -35 79 -205 101 -54 -157 -66 -118 115 -162 38 8 217 -43 -119 19 -127 -211 80 12 147
2603A47K8p5j69k01J47J48k2j59R6R2P3l70r9M64j28j37J59r5j47R3K96Pj85k54
$$ 147 175 100 -69 -270 -123 25 3 -156 -60 32 105 -265 -364 100 -28 -165 -6 -101 -248 -155 141 148 -37 -291
2627b91K06K3R1k43K84J33j09J3l8L8j52j5O9L65k99p2J06j05N1k40J17K11k94
$$ -291 -85 -62 29 -214 70 203 94 107 69 107 -45 -60 9 374 75 3 109 4 55 -185 -68 143 -151
2650a51M0K93k60K0O1R1j0j21j74K69j41j3J55j1K11l03k09J05K30l70J83J28
$$ -151 -111 182 -78 -58 3 94 84 -37 -211 58 -83 -96 59 48 259 -44 -253 -148 82 -288 -105 23
2672B3n6K12j16L1k61K80r7rR0q2jk87L79p8K02k97J19k02J34n0jN3O5J04j15
$$ 23 -33 179 63 94 -167 113 16 7 97 15 14 -273 106 28 230 -67 52 -150 -16 -66 -67 -14 51 155 40
2697D0L25l57n8lj15N2J98k11J76j07R0k7n8N6m0j07j7K12m1L18j95j64j02L2
$$ 40 365 8 -50 -53 -168 -116 82 -129 47 -60 30 3 -55 1 -39 -146 -163 49 8 326 131 -33 -135 -103
2721a03P6J89l96P8k6M44j11J1q9j33r3J34k04M83j96m1oJ08j87r7nK71k96R4
$$ -103 -27 162 -234 -156 -182 262 151 162 73 -60 -153 -19 -223 260 64 23 17 125 -62 -159 -164 107 -189 -95
2745i5J83j11J67j8l0k13OJ73kk72K37k47M04j69np4J19k3J48l35O6N7r4J86m
$$ -95 88 -23 144 126 96 -117 -111 62 60 -212 25 -222 182 13 8 -66 53 30 178 -157 -91 -34 -128 58 54
2770E4l6rk0k51K15j27R6J53L2l59K48K06n29K42j32L16k99K92k21J0J33J66j94
$$ 54 18 9 -11 -262 -47 -174 -78 75 107 -252 -4 202 -327 -85 -217 99 -200 92 -129 -119 14 180 -14
2793a4J65n99M30R7j68M28k01j0k77K58k47R1O1j8J69j02n6P0j14J64k76J13r6
$$ -14 151 -448 -18 79 -89 339 138 128 -149 109 -138 -47 14 -4 165 63 7 77 -37 127 -149 -36 -132
2816a32n3J62P6l21L57j78k9M38j78j72n9J08r6K3M9L9n6M11k87k82j64K96J70
$$ -132 -185 -23 53 -268 89 -89 -118 320 142 -30 -89 19 -77 -54 -5 34 -22 389 102 -180 -344 -48 122
2839A22l36K55j80J39L8k06M8L46l06Q6K8j78L32k85K29j84j25J87QoR1p1q7J
$$ 122 -214 41 -139 0 38 -168 -120 226 -80 6 34 -144 188 -97 132 -52 -177 10 18 12 103 32 -55 -54
2863e4Q8k77L76J40m29K77k60n3K05n5M2k78L60k38N0K5r8K43k40J67j58Q1j54
$$ -54 34 -243 133 273 -156 121 -139 -192 13 -42 0 -278 82 -156 -106 -81 -179 64 -176 -9 -167 -86 -240
2886b40M05k82k7J34K01j83k63K54j54L73k44j33K29j41J43O1j55P6j21l1p2J52
$$ -240 165 -117 -144 -10 191 8 -255 -1 -155 218 -26 -159 70 -71 72 133 -22 54 -67 -98 -170 -18
2908a8O3j15L0P5k0N3p2R5q8j53M99k97k33J87k34L70j76rK39j39j3p1Rr9K3J24
$$ -18 45 -70 -40 35 15 68 -4 91 3 -150 349 52 -181 6 -228 142 -34 -43 196 57 44 -27 -18 -117 -94 30
2934C0j8j0j87J21Q6k92K20or5K09K4k02K26m7J28J7l81J05J88k17M0j38J84O8
$$ 30 12 2 -185 -64 22 -270 -50 -56 -151 58 82 -120 106 59 187 204 -177 -72 116 -101 -61 -199 -15 53
2958E3p2J7o9PJ65j7j57J18j25J6l07K17K89j69K39j94K1j44L48m18J13K23j8
$$ 53 -19 -2 -71 -64 101 84 -73 45 -80 -64 -371 -154 135 -34 205 11 32 -112 236 -182 -69 154 136
2981A36Q6k38n5K67k47k0q6J64k5Q9n1j45j15K14n6j14J86l0O4j53J12j39K28
$$ 136 222 -16 -71 196 -51 -71 -157 7 -18 71 20 -125 -240 -26 -82 -196 -10 -40 24 -129 -17 -156 72
3004G2QJ7k4o2j05J99j7r5l0k9K09l30J62J64j21O6M0j27Q3j57J17j91O3R6K19
$$ 72 80 97 73 11 -94 105 88 -7 -37 -66 143 -187 -25 139 18 84 124 -3 80 -77 40 -151 -88 8 227
3029B27j74l52L54k05J19J20m7j27o3M3K6P4Op6j6o9L4J13K87l60n8K19j34J31
$$ 227 53 -299 55 -150 -31 89 42 -85 -148 -105 -79 -5 1 -75 -91 -160 -126 -13 274 -86 -144 75 -59 72
3053G2m70K91J11j04J40k53j18K68J68J28k03J15N9j70j19P9j6j27K43k77J88
$$ 72 -398 -107 4 -100 40 -213 -331 -63 105 233 30 145 204 34 -85 -6 -22 -149 94 -183 5
3074EL36k73oK3K7Rq0N0j31p4J74q9j04Q3Q1Jj3J94m23N1J42N1j57K35Pl22k9
$$ 5 341 68 62 85 112 121 41 91 -40 -114 60 -29 -133 -50 31 32 19 213 -210 -159 -17 34 -123 112 119 -203 -232
3101b32M12l3k28L07k63M96m72k6K56q1l12J37J32o8J35l42R5K11j06Kq6j3n2
$$ -232 180 147 -81 226 -37 459 -13 -39 217 136 -176 -39 93 25 160 -182 -87 124 18 20 -66 -79 -131
3124a31Q5j18J95j54J02Q8l12L51k9r2j08k5J41j40R1J96j94K5R2j19R2j16K14
$$ -131 -46 -164 31 -123 -21 67 -245 106 77 -15 -123 -148 -7 -147 -56 140 -54 -29 63 -56 36 -80 134
3147A34j16K8k62J29M5M9P5j07m0NQ0j25J06j68K15k31K55j46r2M0K86k68L00
$$ 134 18 46 -216 -87 -42 7 82 -25 -65 -60 20 -105 1 -167 48 -183 72 -74 -166 -126 160 -108 192
3170A92l04k11N7P6R4O0J6P9J48k74J30k29M59l58J83j27j44n3J58R2Kk6J15j47
$$ 192 -112 -323 -266 -190 -96 -36 -20 59 207 -67 63 -166 293 -65 118 -9 -153 -206 -48 44 46 20 135 -12
3194a2J50j0k29J35j68K12l0K9j38K04j38k57J88k39L49l02P6M73l81K3j8L77
$$ -12 138 128 -101 34 -134 78 48 77 -61 143 5 -252 -64 -303 46 -256 -180 293 -88 -65 -83 294
3216B94m99L8K60j43J89jr1j78L07j62jK58j52pL2r7l49K67k5o1O6J06j0J24j29
$$ 294 -205 -167 93 -50 139 138 47 -131 176 14 13 271 119 112 144 47 -302 -35 -60 -121 -55 51 41 165 36
3241C6J45m54K22N7j76J01K00j37j29K95j75K10kK4k99k35M81j41n7l0L2K52j52
$$ 36 181 -273 -51 6 -170 -69 131 -6 -135 160 -15 195 193 217 -82 -317 164 23 -34 -64 -32 220 68
3264F8o5q6K22j33J27k52L4q1K13k1J26k45k2J33J81k46J58j67R5j51p9J35J5
$$ 68 3 -83 139 6 133 -119 -85 -166 47 26 152 -93 -115 18 199 -47 111 -56 39 -112 -191 -56 -41
3287d1J88j85M2q8J28j1K07k67J48j89K34m52L99o7K47k45K65k78j75PJ57j49
$$ -41 147 -38 4 -84 44 33 240 -27 121 -68 166 -286 113 46 293 48 313 35 -140 -133 24 -125
3309a25KM39k51J05j63J33Q0l45J55j87J47K3L3J03j96J86l17J20k0p8K3J25k0
$$ -125 -123 316 65 170 7 140 220 -125 30 -157 -10 13 46 149 -47 139 -178 -58 -78 -156 -133 -8 -28
3332b8Q7K41k85l5k03J07J7J80J59k48J15j52K18l04m3r2J18m3J6K32k40J07Q0
$$ -28 59 300 15 -20 -223 -116 -99 81 240 -8 107 -45 173 -131 -174 -266 -148 -191 -175 57 -183 -76 4
3355DP1nk64M3R1Q5o3J20n3K32l28N4K23j24j26j68L7J45J25k06O3J5O6R7j73
$$ 4 75 70 -194 -151 -60 25 -38 82 29 261 -67 -13 210 86 -40 -208 -171 -26 99 -107 -44 -29 37 134 -39
3380c9N8r3J81k40J82j06j04J74p5J86j13j44L53k05J13j18J3R6j41J26k58J6
$$ -39 19 -74 107 -133 49 -57 -161 13 -62 124 11 -133 220 15 128 10 23 119 -22 104 -154 -138
3402a38K22k56p4P8N6J18M0l1k03K6K7K65j03j50K76q8k38K72k76L8pJ84J34m4
$$ -138 84 -172 -246 -168 -112 6 46 15 -188 -162 -135 130 27 -123 153 65 -173 99 -177 -139 -146 38 172 128
3426A28k66J76J1M3k67K64k10P4J93k20l25K78L05j72j34k2J53K41k71j29J42
$$ 128 -138 38 49 92 -175 89 -121 -47 146 -74 -399 -121 184 12 -122 -144 9 250 -21 -150 -8
3447hK55l65j02K73mq8QO8K61n64J22K53k35K49J0q4L4Jm6n6j21L28j40j1j93
$$ -8 247 -118 -220 53 49 -39 -31 37 298 -266 -144 109 -126 123 133 49 83 84 38 -18 -139 189 49 38 -155
3472a55k25L25J02j04M5m5K69j78K6j48k42K17J04K85m23K24p3k5j24M31j82k36
$$ -155 -380 -55 47 -57 -12 -57 212 34 60 -88 -330 -113 -9 276 -147 77 4 -21 -145 286 104 -132
3494a32K3J98J07j9J25l88K1k99L78R7m0L0o2J76k49J24k74K26j8k19J80J74j11
$$ -132 -109 89 196 177 302 -86 -65 -364 14 111 71 101 39 215 -34 90 -184 42 24 -195 -15 159 48
3517D8N7j69J27J16k84j02K22Po0K86l99N3J30j12J42k40m2N94k62j14k26M22
$$ 48 105 -64 63 179 -105 -207 15 22 -38 248 -151 -98 32 -80 62 -178 -220 374 112 -2 -228 194
3539A94j4j9j57q7Q3r5K43m7j59j0L64o14K43K10k87j59M11j08J05N1m3k36J71
$$ 194 180 161 4 -83 0 -95 148 101 -58 -68 296 -318 -75 135 -152 -311 100 -8 97 148 105 -131 40
3562D0m5q1L14j79j6J57l5l88MK25m0J24k22K37k08J06J67Mj49KP2j12p8N1K79
$$ 40 -5 -86 228 49 33 190 155 -233 -229 -4 -44 80 -142 95 -113 -7 160 164 15 17 89 -23 -101 -50 229
3587B29k16k2l08K14J17P0p5j25J1J82M2n0l7K00P6j31k26l4l6J71j09K23k10
$$ 229 13 -9 -317 -103 14 84 9 -116 -105 77 119 69 32 232 308 177 -49 -83 -119 52 -57 166 -44
3610d4K03j10o9J13Q9j20Ro9K1j17J33k52J81Q2N8j9k27P6po9j72j45K42J2q6
$$ -44 159 49 -20 93 182 62 71 2 23 -94 39 -213 -32 50 108 89 -138 -62 -69 -138 -310 -455 -213 -201 -287
3635b87J11L29n3j9k24J98j83J60o5j77K06k14K30k8j2o2J1j2K8j64L76k13N9
$$ -287 -176 153 100 81 -143 55 -128 32 -33 -210 -4 -218 12 -16 -28 -90 -79 -91 -63 -227 149 -64 -5
3658eL7P8J4P1O0j23l61L09p9kl9K05k18K64r6r4j23M23l36p6Q3K37k61J17j40
$$ -5 32 110 124 195 255 132 -229 80 1 -1 -40 165 -53 211 115 21 -102 321 -15 -91 -8 229 -32 85 -55
3683e5j75M4K64l3j90K98l50J05O6J59l13J35L2j31m3L48j65R8k75J98K3q3m9
$$ -55 -230 -186 78 45 -145 153 -197 -92 -26 133 -180 -45 -13 -144 -187 161 -4 94 -181 17 40 -43 -92
3706i2K62j25k3l8M2p5M4j56M2o6J63O2j27J46L3q4j8J07j65K47j65q3K00k2j70
$$ -92 170 45 22 -16 26 -49 -5 -161 -119 -185 -22 40 -87 59 92 8 -10 97 -68 179 14 -69 131 109 -61
3731f1K32k57j9J47m5j44K19J44k58Q6j13M40n17K19J2j4k59K15M6M3J40p4j43
$$ -61 171 -86 -105 42 -3 -147 72 216 -42 44 -69 371 -146 73 85 71 -188 27 73 116 256 182 39
3754C9o2J96j93O7p4J00j52J50Nk25K90k25K42j64j69O5j42K41J73j46l22P5L50
$$ 39 -23 173 -20 47 -27 73 -79 71 76 -149 141 -84 158 -6 -175 -110 -252 -11 162 16 -306 -231 119
3777A19m04K61J03R9J5l79K68j55J18k03K78k7l01L33n3k46P1k6PK13q3o4%j48
$$ 119 -285 -24 79 178 193 -186 82 -73 45 -158 120 93 -208 125 72 -174 -103 -129 -122 91 8 -56 -56 -204
3801b04K73k87K38j22k0P5K35l13j38M79J30m16j00J78k4j26K89M0k50K73k34
$$ -204 69 -218 20 -102 -122 -47 188 -125 -263 216 346 -70 -170 8 -16 -142 147 187 -63 210 -24
3822b4j94L10j70K67l52P2J3N5K73l45K08k83K27m0R7k63J9R1q1K45k9R7k45O4
$$ -24 -218 92 -78 189 -163 -91 -78 -23 250 -95 113 -170 57 17 114 -149 -130 -39 -120 125 96 193 -52 12
3846A2LJ43P2k5p9k11n0J93k57J60R4j39j92K81j56K25K64m33J31j44j62M27o3
$$ 12 15 158 230 205 126 -85 -135 58 -199 -39 55 -84 -276 5 -151 74 338 -95 36 -108 -270 157 94
3869I4j6k79L07K7j41M6Q3k86J71k6l42L81P9J4J5o3M3j31P1j90M61j41j50J18
$$ 94 78 -201 106 133 -8 38 121 -165 6 -20 -362 19 98 112 127 64 107 -24 47 -143 318 177 27 145
3893A45j62j05L01j83N6j88n7M45m35N8J60k6j24n2P4J81k15M32n64J18K10j42
$$ 145 -17 -122 179 -4 52 -136 -193 252 -183 -125 35 9 -115 -167 -93 88 -127 305 -259 -141 69 -73
3915g3M65k56n2J81l01M3j42j88J15L70l44J15J73l88K97R4j75Q4J41p7j37j11
$$ -73 392 136 84 265 -36 7 -135 -323 -208 162 -182 -67 106 -282 15 109 -66 18 159 82 -55 -166
3937a66K30j43Q4j21J53J11j02j7L54m06j23J03k85J67J50O0k22N05l07N2m9M9
$$ -166 64 -79 5 -116 37 148 46 29 383 -23 -146 -43 -328 -161 -11 49 -173 332 25 77 28 77
3959G7l84Q3K29J13Q5n6k44L66k31j37j56J69j1J15Q9k08K38o3j62M9p3Q7M1R1
$$ 77 -307 -224 5 118 203 147 -97 269 38 -99 -255 -86 -97 18 107 -101 137 74 -88 -39 -112 -25 16 107
3983A07k35L18j81k01K99j29KM3j24kQ9m4m1J91k18P7J30K33Q2k07k07o1Q3r2
$$ 107 -128 190 9 -192 107 -22 -20 23 -101 -103 -14 -58 -99 92 -126 -49 81 314 396 189 -18 -79 4 -88
4007h8K53l74LK05J6j7k97K86J50j70J47k75K45J71k3j83j73mL96l77O3r5J17
$$ -88 165 -209 -206 -1 15 -2 -299 -13 137 -33 114 -161 84 255 232 49 -124 -128 268 -109 -46 -141 -24
4030b4O4k33J58R7J91j81l11K41j27r6l9K94j94Q9L44K9l51r5Q6p3J98j48J57
$$ -24 40 -193 -35 62 253 72 -239 2 -125 -221 -260 34 -160 -71 273 302 -49 -144 -58 -131 67 -81 76
4053G6j17L7Q0j44J06N7j63k20M46l87O9J85L10l39l3J28j00J28Jl49L42L2J0
$$ 76 -41 -4 76 -68 38 95 -68 -288 158 -229 -160 25 335 -4 -37 91 -9 119 120 -229 113 145 155
4076A55J36m80K21j7k85J92K86k71L60Qj47l2j72m6P0M8J90r2Rj66R6j64p3J24
$$ 155 291 -189 32 15 -270 -78 208 -63 297 305 158 126 -46 -92 -22 26 216 124 133 -33 63 -101 -174 -50
4100e0l01M34k47K71j43J72L8j24k02L2L04j07p4Q4L3k67J68j76K63P1m07K12
$$ -50 -351 83 -164 107 -36 136 174 50 -152 -120 184 77 3 87 120 -147 21 -155 108 179 -228 -16
4122a6m9Q5J5k9k75K20J67j23j41l18L04J47j56L27M2j88K9O4l9K02n45J01K66
$$ -16 -65 20 35 6 -269 -49 118 -5 -146 -464 -160 -13 -169 158 200 12 41 105 66 268 -277 -176 90
4145I0j26O3J84r4r2M8M0k35J63j6r2J69j42K18k47R8j05N9j16J22o6P6J44j46
$$ 90 -36 27 211 117 25 73 113 -122 41 25 -67 102 -40 178 -69 29 -76 -17 -133 -11 -77 -1 143 -3
4169cj08K40k0n6J3M2L5l18J4j62N28m05L34j7p7m44M32O7j17K49k81J5m8Q1j89
$$ -3 -111 129 109 53 66 108 143 -175 -161 -323 205 -200 134 117 40 -404 28 95 -22 227 -54 -39 -87 -6 -195
4194a95J37K1J80j11k38Q1q9J18J87q9J7j9J24j87J86J9o1q6J14M5j61J22k98
$$ -195 -58 -37 143 32 -206 -125 -214 -96 91 2 19 0 124 -63 123 142 81 -5 109 154 -7 115 -183
4217a83J71J35j20J24k13J07j58J07k26M04j07j54J17J7K5p8J9R7o2k97J55J23
$$ -183 -12 123 3 127 -86 21 -137 -30 -256 148 41 -113 4 21 46 -32 -13 84 22 -275 -120 3
4239Cj54K06J31j01k12K59KJ20l85L4o9J49j37%K96o7%Q2Q8j91j26J03N6j97q
$$ 3 -151 55 186 85 -127 132 134 254 -131 -97 -166 -17 -154 -154 142 75 75 157 245 54 -72 31 87 -110 -118
4264a18n2J22j67R5K3r6L56Kk25P5k40Q3J61l3O4k33K48l8o8K02j84K77k50j90
$$ -118 -170 -48 -215 -120 -97 -193 163 165 -60 15 -225 -142 19 -14 50 -183 65 27 -41 161 -23 254 4 -186
4288a86K45J28k33K40k01P9k05k18L28j23L14j49J41j52p4J11k20J90J46J14j36
$$ -186 59 187 -46 194 -7 72 -133 -351 -23 -146 168 19 160 8 -66 45 -175 15 161 275 139
4309A39J0l48L03o5o5K1m1M1J43j74K22m6k96J37N2j77L2P0k06L48l77M17j25
$$ 139 149 -199 104 39 -26 -5 -46 -5 138 -36 186 140 -156 -19 33 -144 -112 -42 -248 100 -277 140 15
4332A5N8j77J80k68J84l40J54M65m09M7O3N9J27l1q7R0k94J96q1q2J74P3j47r7
$$ 15 73 -104 76 -192 -8 -348 -194 271 -138 -91 -28 31 158 127 40 130 -164 32 -49 -131 43 116 -31 -128
4356a28J60j78L49l28N0q9o7J24J8j0N8p4J93J7j13r8J46J02k43K34l28K87k59
$$ -128 32 -146 203 -125 -75 -164 -231 -107 -89 -99 -41 -115 78 95 -18 -116 30 132 -111 123 -205 82 -177
4379a77J27K88m38n9jK87j43O4J39q4j20n3N54k41j08M5j56Q9J93k02m5K34J60
$$ -177 -50 238 -200 -259 -260 27 -116 -52 87 3 -117 -170 384 143 35 80 -76 13 206 4 -41 193 353
4402C53j62j82K74o1j49l49J25KN6r5L96l33Q4j89K20k50J49J06p9m9K00o0j72
$$ 353 191 9 283 222 73 -276 -151 -149 -93 -188 208 -125 -41 -230 -10 -260 -111 -5 -84 -133 67 7 -165
4425a65J19o7J22q0M7j88R5K15j37J18J01l19q7p0J61J12L1k67K20P7Lj52J58
$$ -165 -46 -113 9 -71 -24 -212 -117 98 -39 79 180 -139 -226 -296 -135 -23 8 -259 -39 38 41 -111 47
4448D7j59n6K02o1J44n5j3J12l4j4j82J21k09K67k7j28J04Q8j38K24n5l53L00
$$ 47 -112 -168 34 -27 117 62 49 161 127 113 -69 52 -157 110 83 -45 59 147 9 233 178 -175 125
4471A25j7l23K11j18P3o3J24R5k59j3k34N17k23j0K42l40K18K13j59j95j16L04
$$ 125 108 -215 -4 -122 -49 -112 12 107 -152 -165 -399 118 -105 -115 127 -213 5 218 59 -136 -252 52
4493E2J21K08n77M19k20k33K40n6J25r1k38J61N4l0N4J33q4m4J5k81M4P4K56p
$$ 52 173 381 -196 223 3 -230 10 -46 79 -12 -250 -89 -35 -65 -11 122 38 -6 9 -272 -228 -154 102 95
4517I5j44M9l7q3L66l48J22J05k12J6J15K27q9j19k00L41k40L8M3J4K6j27J01
$$ 95 -49 0 -37 -120 246 -102 20 125 -87 -71 44 271 182 63 -137 204 -36 2 45 59 85 -42 59
4540E9R3l48M01j77l51L11l0j35L26j65q9O8J0R1nq8J99L3l28P8J65j42q0K08
$$ 59 152 -196 205 28 -323 -12 -42 -177 149 -16 -105 -37 -27 64 59 -29 170 203 -125 -47 118 -24 -104 104
4564A04k27J61K0k30l24M00J50k76l9K39J67r8j3J26k34p3R9Q7k10J36k24L05
$$ 104 -123 38 58 -172 -496 -96 54 -222 -261 -22 145 47 34 160 -74 -147 -48 39 -171 -35 -259 46
4586D6k73J82K13p6k57K51L02n26K26J0j6l3j03J7j4l2J11j16n1K77p4qm48L61
$$ 46 -227 -45 168 92 -165 86 388 -138 88 98 82 49 -54 -37 -51 -83 28 -88 -139 138 64 56 -392 -31
4610c1J97m6j87J66l05K53J37k21Oj22K26k08P6j19L08l08J19O3J16l03K14p6
$$ -31 166 120 -67 99 -206 47 184 -37 -31 -153 73 -135 -59 -178 130 -178 -59 4 120 -183 31 -45
4632d5j7j92N82l67O0k2n2L0N6J29l53J48l4J90j83qJ57j17j93J86ok5j34K42
$$ -45 -62 -254 328 -39 21 -1 -53 -23 33 162 -191 -43 -77 113 -70 -78 79 -38 -231 -45 -51 -76 -210 32
4656C2j75J6M6k54L93l9j22R5J26j55k16K43L7m0K3n3j31K89K8j76P3j39J60J15
$$ 32 -143 -127 -81 -335 58 19 -103 -8 118 -37 -253 -10 27 -13 10 -43 -174 115 143 -33 40 -99 61 176
4680A76l90K69k13J89Rj03J78N0n21J57n9R4M8M7j12J58n5OjJ3J76p4j14l26M58
$$ 176 -214 55 -158 31 40 -63 115 165 -356 -199 -258 -164 -116 -69 -181 -23 -78 -72 -73 -60 116 42 -72 -398 60
4705F0p7j41J69J42l1k04L9M1M7p6K58j50L4m67L44J5j68K74o4L5j6k00K74k91
$$ 60 -17 -158 11 153 122 -82 -43 -2 45 -31 227 77 111 -356 -12 3 -165 109 45 80 64 -136 138 -153
4729a53r1K05l1Q0J13Ql23K52j9j10r5K43o4r9k4K15k85k6kK77j84J72j5R6r1
$$ -153 -244 -39 -70 10 123 131 -192 60 41 -69 -164 79 15 -84 -108 107 -178 -204 -206 71 -113 59 44 140 49
4754D9Q2j03j17J73j12k8p8K19j41q7p0K67l4KO6j42O8K47m26J9K63p8P6p1k48
$$ 49 131 28 -89 84 -28 -56 -134 85 -56 -143 -213 54 20 22 88 -54 14 261 -165 -146 117 39 115 44 -204
4779b04J20j1k1J00J84k11p0N7l2Q4M6N2q4J94l34J91j10j40M3J1K14k74K50o0
$$ -204 -84 -95 -116 -16 168 -43 -113 -56 -88 -4 42 94 10 204 -130 61 -49 -189 -146 -135 79 -195 55 -5
4803eR0l64L90l66J77j48L31l65R4K48K21m40J18J92j73j39k3K83Q5j98O7j05
$$ -5 85 -279 111 -255 -78 -226 105 -260 -166 82 303 -137 -19 173 0 -139 -162 121 206 8 75 -30
4825c0J76l15L5K13j4p5j16M43l75j57L73m4j73N0j17K17k50K56O1L4r0k65J01
$$ -30 146 -169 -134 79 65 -10 -126 317 -58 -215 158 114 -59 -9 -126 91 -159 97 158 192 102 -163 -62
4848f2J89p6o2J14k4o4j81L23k22O6j21q1m6L81n2j61K20k09K29o3j76KN9j87
$$ -62 127 51 -11 103 79 15 -166 157 -65 1 -120 -201 -247 134 82 -79 141 -68 161 98 -78 -76 -17 -204
4872b04L64k18J37J29m72L19k25K36L8j38pJ17K8m4P3j33j5k21L03J07l5k24J9
$$ -204 160 -58 79 208 -264 55 -170 66 104 -34 -41 76 104 60 133 0 -15 -236 67 174 139 -85 -66
4895f6mj11L93k87j67O0K38n6J04J0j36J86k20O5j59J15k15L56k07R1K9k76L03
$$ -66 -70 -181 212 -75 -242 -182 56 0 104 114 -22 164 -56 9 -150 -35 -250 106 -101 -10 19 -257 46
4918D6j94j61J81L43l14J39J08j25M2k63mL24L9k31RL61l03j04K48j44j24K3N1
$$ 46 -148 -309 -128 215 -99 40 148 23 65 -198 -202 122 161 -70 -61 300 -3 -107 141 -3 -127 -104 -53
4941e3J13K0j08J03j82RK40r2nJ9k35K50l5m5J68m3k40J69qj35N8K84k69j9K24
$$ -53 60 80 -28 75 -107 -98 142 50 45 64 -171 79 44 -1 167 124 -116 53 45 -90 -32 252 -17 -36 188
4966A88k38K85l68L15m67O0N40q6k49r8N7J26J44l38K06M1j45p9J64j98J16j0
$$ 188 -50 235 -133 182 -285 -225 315 229 -20 -118 -61 65 209 -129 77 118 -27 -106 58 -140 -24 -34
4988c4K41l19p4N36m17K13O4j47k23L9M0K26j66J94r8o0J5lk01J57j91J61K17
$$ -34 207 -112 -186 350 -67 146 210 63 -160 -121 -81 145 -21 173 75 15 30 27 -174 -17 -208 -47 170
5011A70j63J73l3k89L25j39J35J2j34n7k9k14K24j80K86j11J65q8o4O6j45K70
$$ 170 7 180 147 -142 183 44 179 191 57 0 -29 -243 -19 -199 87 -24 141 53 -11 55 -90 180
5033A80k28M7K0k61J87j05R9nJ0K22l64K52k63L85j98j66L11J63j93J02l63K69
$$ 180 -48 -1 19 -242 -55 -160 -61 -66 -56 166 -198 54 -209 176 -22 -188 123 286 93 195 -168 101
5055A01r3p0m6j41K54Rj38K33o3j06J4p2K46j06N0O0j69jj16K74j12NJ51k62k42
$$ 101 8 -62 -108 -249 5 14 -124 109 46 -60 -46 -118 128 22 72 132 -37 -38 -154 120 8 13 164 -98 -340
5080c40M89L6k55L8K24J0m01K99O2l03K71r8o2k49L6K69J68m71K82k72K44M4J06
$$ -340 149 185 -70 -32 192 202 -199 100 162 -141 130 32 -30 -279 -243 26 194 -277 5 -267 -23 21 127
5103A27j27J65k25L98l27J3m07M46k13L56k52n3J53J59j60l1r3J28j30j29M32
$$ 127 0 165 -60 338 11 24 -383 63 -150 206 -46 -99 54 213 53 22 -71 57 -73 -202 230
5124B30k78j93N6J74j13J99j37oj30K69M9k52J57R3J2j08np6R4K87l87j3M0J03
$$ 230 -48 -241 -185 -11 -124 75 -62 -68 -198 71 120 -132 25 118 130 22 17 -59 35 322 -65 -78 -38 65
5148F5j86K59r1RJ19J14p9j37jk27j56L70j68L84k81L2R7J9P1k28o7K13K5q0k49
$$ 65 -121 138 47 56 175 289 210 73 72 -155 -311 59 -109 275 -6 26 123 142 213 -15 -82 131 156 76 -173
5173a73J92k1k8m8j4N2N4J8L7J69l15J61Q0k79J97j46L9K96k26J89k88J82j37
$$ -173 19 -2 -30 -78 -92 -40 14 32 69 238 -77 84 164 -115 82 -64 -25 271 45 234 -54 128 -9
5196ij06J45J8j00J34k24O7Q9m6o4L8j36J43o0l4J80p7P7k59J19l4K34j0k4j05
$$ -9 -115 30 48 -52 82 -142 -75 14 -32 -96 -58 -194 -51 -111 -145 35 -42 35 -224 -105 -139 95 85 61 -44
5221d4J24n7k30K8R8Rk4M2J30j47J13J53n6j98K31l38J99q0P2j76q5K72k19K20
$$ -44 80 23 -207 -179 -81 -72 -96 -54 76 -71 42 195 139 -59 172 -166 33 -47 25 -151 -236 36 -183 37
5245C7K3j73Q7LR8j56Q7K58j75n7J50j14j13k2M6N2p7q2k43K69n5J14j29K34j19
$$ 37 60 -113 -26 -23 75 -81 6 264 89 32 182 68 -45 -67 -21 31 -46 -128 -371 -102 -157 -43 -172 62 -57
5270e7R8o5j24pM57m31p0K97j86J58o4p7j17K64n2n3j64K18J53m10J67k14K61
$$ -57 41 -24 -148 -155 302 -129 -199 98 -88 70 6 -71 -188 76 24 -29 -193 25 178 -232 -65 -279 -18
5293a8l5K56l37J35o7J55j90K37j14J1k1N6L7j93j49N6%M11k87j16J59j67L54
$$ -18 -53 203 -134 1 -66 89 -101 136 22 33 12 68 105 -88 -237 -181 -181 230 -57 -173 -14 -181 173
5316A73l36j1kJ57q4K24M8j89O2J57l7O3j91N3k45K63k41K14J69l85m7L37q9J73
$$ 173 -163 -174 -176 -19 -103 121 169 -20 42 199 162 225 34 87 -158 105 -136 78 247 -138 -185 152 63 236
5340B36m6k63J87j93J71j76j44O8J46j72P3L7k99L34o8k9J98p9L2K2K3j69J46
$$ 236 190 -73 114 -79 92 -84 -228 -160 -14 -186 -113 -76 -375 -41 -109 -138 60 -19 13 35 58 -111 35
5363C5m15k04J476j412K16L59J52N8l46J42Q2k50J54o4K10p4j61j15J52p4r4K79
$$ 35 -380 -584 892 -520 -304 55 207 265 -81 61 143 -107 47 -17 193 119 -42 -157 -5 -79 -173 106
5385A06J75k40j79J04j74L13J98m52K32l39l4L90k29K9K8J20j48O9M56l15k78
$$ 106 281 41 -138 -34 -208 105 303 -149 83 -256 -290 100 -129 -100 -72 48 -100 -31 425 110 -168
5406a68J38Q7K25m64J68m0j04N6o3O2J62m5k19K59m31N87q7P3m13L43k93K61l78
$$ -168 -30 57 282 -182 -14 -54 -158 -102 -165 -103 59 14 -205 54 -377 210 123 196 -217 126 -167 94 -284
5429b84N08k07n15M58J06k3j50J47j1k42N1K08P9j84J74j59J46j39Q6k35M41j07
$$ -284 224 17 -498 -40 66 43 -107 40 29 -213 -162 46 125 -59 115 -44 102 -37 49 -186 255 148
5451A48j57L8j98j31L88l7L9o8j34J79k34P2J61J9j98K26j12p3Q2q5J28K02l05
$$ 148 -9 29 -169 -300 88 51 90 22 -112 67 -167 -95 66 85 -113 113 1 -72 10 -75 53 255 -50
5474e0j5K4P8l19J70K70j24j12K01q2K0j42J91n8k96J79p3K56l3j57J97j15R2
$$ -50 -65 -41 37 -282 -112 158 34 -78 123 41 61 -81 110 52 -244 -65 -138 118 85 -72 125 10 102
5497A02k98K03r5J61k00N6J55p2J44m27Q8K41J05j88K07j50q0P2J03m52J72K28
$$ 102 -196 7 -88 73 -127 -71 84 12 156 -271 -183 58 163 -25 182 32 -48 24 127 -325 -153 75
5519G5l7J78j71k3q5P3r8P5L5O0K27l48J21k6J02j14j58J01J49Mk95K12q7L21
$$ 75 38 216 45 22 -63 10 -88 -13 22 82 309 -39 82 56 158 44 -114 -13 136 140 -155 57 -30 291
5543B91j91k56K20j97O9j73K06K04k68L09k13j77K79k07k3n4J32K25k91O7M59
$$ 291 100 -156 64 -133 -64 -237 -31 173 -95 214 1 -176 103 -104 -127 -181 -49 176 -115 -48 411
5564D11m97J40k00J97j11J15l7R1J04k41Q8j01J17j59J83K0r4j26P5J64j05J2
$$ 411 -86 54 -146 51 -60 55 18 109 213 -28 60 -41 76 -83 100 120 26 -100 -25 139 34 46
5586D6J35M7m14K05o2j15L43n6k10L8k35L28j72N5J88n6l1j90L82m99L44%k18
$$ 46 181 228 -186 19 -43 -158 185 129 -81 -43 -278 50 -122 -67 121 65 34 -156 226 -273 71 71 -147
5609a47P3l3J57J49m76K75L8P2j93K38P5k98L7j35K69l46J04p4J55k34L35k2K2
$$ -147 -74 -107 50 199 -277 -2 36 108 -85 153 228 -70 -33 -168 101 -245 -141 -215 -60 -294 41 19 41
5632D1j11K02k19J1K23k1k14J06JR9pJ49l34J39j68o3K87q7p1P7P7J5l50R9J16
$$ 41 -70 132 -87 -76 147 126 -88 18 19 118 111 260 -74 65 -103 -166 121 34 -37 40 117 132 -218 -119 -3
5657ck46L05N0j08k02n7K14j51j23L69k17J35O4j14O1J72k89r6O1K10J7j26O4
$$ -3 -249 56 106 -2 -204 -261 -47 -198 -321 48 -169 -34 30 -84 -23 149 -140 -236 -175 35 52 -74 -10
5680a0l7P9Pj52N2l0n2J56j31n7K49j94K63k41J41O3j84j6J38J03k09P4J48j73
$$ -10 -47 32 39 -113 -61 -91 -143 13 -118 -175 74 -120 143 -98 43 106 -78 -94 44 147 -62 12 160 -13
5704a3L6j6k40N4K63J30l23K91k45J3j51L11j46k81L41j06m7k8l3K59Q1j27r9
$$ -13 23 7 -233 -179 84 214 -109 182 -63 -50 -201 110 -36 -317 24 -82 -129 -157 -190 69 150 23 -76
5727g6m1j4J12k01J60K40j10K86m17J69k87M57k79P3J00r5k79J25P3j54n9P9N51
$$ -76 -117 -131 -19 -220 -60 180 70 356 -61 108 -179 278 -1 72 172 77 -202 -77 -4 -158 -217 -138 413
5750D13n84L12k21j37J52J14r4J55l72L06n6J7J34k42kJ35j59M1N4J27m7l26K18
$$ 413 -171 141 -80 -217 -65 49 -45 110 -262 44 -12 5 139 -103 -105 30 -129 -88 -34 93 46 -280 -62
5773f2J6o2K59k83L18j13k49N9j50N02j74m3OO1q7n4k0R4l1j09L64k63J15j06
$$ -62 -46 -108 151 -132 186 73 -176 -117 -267 235 61 18 24 85 -2 -56 -76 18 -13 -122 242 -21 94 -12
5797a2j90N6oJ94n8j7q8J26J10j96n0J73k0j79K13q2Rm1K13j88lj06L35l25K32
$$ -12 -202 -146 -152 42 -16 -33 -121 5 115 -81 -131 42 22 -157 56 -26 -17 -58 155 -33 -36 -142 193 -132 100
5822A00k64lJ37j19K19k16K17m0j8L6p5Rp2R2K04j1k64K5J02n1p1J29J01q3l56
$$ 100 -164 -167 -30 -149 70 -146 71 31 13 49 -26 -17 -89 3 207 196 -68 -43 59 8 -63 66 167 84 -272
5847b72K92J74j88O2P1j4j91J52r5K48k38p0J72l86M48Mj77R0p8j09J88r6N7P2
$$ -272 20 194 6 68 139 125 -66 86 -9 239 1 -69 103 -283 165 169 -8 82 4 -105 83 -13 44 116
5871A16j26%j88K4K55j04l22L34j4M09o10K95j08R1q7J02rk6j6k23J3J83j26K01
$$ 116 -10 -10 -198 -174 81 -23 -345 -11 -25 384 -226 69 -39 52 -35 67 58 32 16 -207 -194 -11 -137 64
5895F4p6q6O6oJ89m8K32j67l00M98j78K31j82o8j47j09Kj46J70O9r2J43m4J90
$$ 64 -12 -98 -32 -38 151 103 335 168 -132 366 188 419 237 169 22 -87 -85 -231 -61 8 -84 59 15 205
5919B05l02J09J5l05J19R3q9K06j67J67n2l9J05j37Mr2L60j90J32j15m2j06J45
$$ 205 -97 12 27 -278 -159 -66 -155 51 -116 51 -1 -40 65 -72 -68 -160 200 10 142 27 -15 -121 24
5942B4J7J95l24J9K72k42R6k8j03jJ38o3m18M73k18K20k29J49J61j88p4K03o3
$$ 24 41 236 -88 -69 203 -39 57 29 -74 -75 63 0 -418 55 -163 57 -172 -23 138 -50 -124 79 16
5965A6J17o1l62J18J82k74J80k1K39J04k21k7L87o85J50K29j17J51j78J58J12
$$ 16 133 72 -290 -172 10 -264 -84 -105 134 238 17 -10 377 -308 -158 71 -46 105 -73 85 197
5986A97k79J76k62o5K89j58R4j07M4mK72k10j19j32M58j91j73K75L9j77O4J22
$$ 197 -82 94 -168 -233 56 -102 -8 -115 -71 -75 197 -13 -132 -264 194 3 -170 105 144 -33 31 153
6008A53k16J76J8K6l20J08r3J23l37J86J80J54j86l7j1J13j08r1K00j42J40Pk03
$$ 153 -63 113 131 157 -163 -55 -148 -25 -362 -176 4 158 -28 -65 -76 37 -71 -162 38 -104 36 43 -160
6031a60J33J63l84N04l00qj2N9M7J0n5J19N7j17j05o2l9J95k11K3R5k5J64l95
$$ -160 -27 136 -248 256 -44 -52 -64 -5 42 52 -3 116 173 56 -49 -111 -150 45 -166 -143 -48 -73 91 -304
6055c04K36O6n5O3J42k15J19m2j32j5k0J21O9K4J8O6j70j90K79J24k70JJ29O2
$$ -304 -68 -2 -57 6 148 -67 52 10 -122 -137 -157 -36 33 57 75 141 -29 -219 60 184 -86 -85 44 106
6079A06q4K28l6l99k16K72N3K37p3k56J13p5J78k62L14k10J32j21J52p7J88k42
$$ 106 22 250 214 -185 -401 -129 -76 161 88 -168 -55 -130 48 -214 100 -110 22 -99 53 -24 164 -78
6101g8J43j05J77k00P1K33k00J4p2LL0K25k96L7K90l79M01l46J67n6k58J25R2
$$ -78 65 -40 137 -63 8 241 41 55 -17 -14 16 241 -55 -18 272 -107 294 -52 115 59 -199 -74 18
6124A8J25j32r1J05n0j72N35l90J08k95Q2P1qK28q8j97n1P2J6Q3j13K20jk5j5
$$ 18 143 11 -80 25 -25 -197 338 -52 56 -239 -157 -86 -94 134 46 -151 -202 -130 -114 -31 -144 76 75 50 35
6149C5Nr0J48k68M36m55J34J33j09k35L55L6j41m0L4J04q5L6j35K48j57J0j67
$$ 35 40 -50 98 -170 266 -189 -55 78 -31 -266 89 125 -16 -56 -22 82 -3 33 -102 146 -11 -1 -168
6172a68R5M1kp7L04l75K01O8n2NJ45k23o0J88k26n5O2J85j30K34L8k06n6m5K9
$$ -168 -73 -32 -34 -111 193 -182 19 87 35 40 185 -38 -98 90 -136 -191 -129 56 -74 160 198 -8 -64 -109 -80
6197h0r7L99j78j9m4K4L4l75M70n9N5j75Q1m4R0Rp1n7K6J82l37J61q6L58l72J17
$$ -80 -177 222 44 25 -19 5 39 -336 134 75 130 -45 36 -8 82 91 20 -37 -11 171 -166 -5 -91 267 -105 12
6223A2Q2l6N4o2L0r5J99r8O4J8j69J25k64LK4R0L63l82j21K31M9p2q9R3J39l26
$$ 12 94 58 112 50 80 -15 184 86 150 168 -1 124 -140 -137 -113 -23 340 -42 -163 68 117 45 -44 49 188 -138
6249a38M26k11j86R1j8K27m62K35P1j50M2J51K5j26ro8o9R1j47P1J50J40k61n4
$$ -138 288 77 -109 -18 -36 191 -271 -36 35 -115 -73 78 103 -23 -32 -100 -169 -78 -225 -154 -4 136 -125 -179
6273a79L40l23J16n6J43N3j28j0O5l6m2j4J91k75n4K68O2M1m6j97J42k36J56K93
$$ -179 161 -162 -46 -102 41 94 -34 -44 21 -15 -57 -71 120 -155 -209 59 121 162 116 -81 61 -175 -19 274
6297B74k78L9R7k36K54N3k85L5J54k91J48n0J44n5K10p2j82J49k95J60Om8J71
$$ 274 -4 35 132 -104 150 203 -82 -47 107 -184 -36 -86 58 3 213 141 -41 108 -187 -27 -21 -69 102
6320A02o3J53n2k27k2L45j09k32K39J5j40J38j52J24l80M14j74L2o2p0j31K63
$$ 102 39 192 140 -87 -109 236 127 -105 134 149 9 147 -5 119 -261 153 -21 11 -51 -121 -252 11
6342A1J02k8K7m07M94l02n7K69r1j77L62l3q9O3k51j34L16j85J36R8l41P9M5j0
$$ 11 113 85 112 -295 199 -103 -160 109 18 -159 203 170 81 144 -107 -241 75 -110 26 124 -217 -138 -93 -103
6366a03K92j58k6J21r3J4q3m5K20k73J76k03K81j36l29M40j59J77R5l75mK91j05
$$ -103 189 31 5 126 33 47 -36 -81 139 -134 42 -161 120 -16 -345 95 -64 113 208 -167 -171 120 15
6389A5Q7K2L8k63N0m3N4P7R9k73R7j65K19j2J33qj2j17k4O3j59J14j24J08M9O2
$$ 15 102 124 162 -101 -51 -94 -40 37 136 -137 -40 -205 14 2 135 127 115 -2 -26 37 -122 -8 -132 -24 25 87
6415H7J67k29j39K56j55K37n9j96J84RJ9q4l40K63o6j13o2L09o3N6q8K39k21J96
$$ 87 254 25 -114 142 -13 224 165 -31 153 162 181 97 -243 20 -46 -159 -221 88 25 81 -7 232 11 207
6439B07l57J22j4O3p9Q0L77j99k03k59M43L8k22m8J43j91J48p3P7l2P0k30J44
$$ 207 -150 -28 -42 21 -58 22 399 200 -3 -262 181 219 -3 -51 92 -99 49 -24 53 21 91 -139 5
6462EJ45k83n2K71j04j39R2j67K06K7k04L42j92K42Pm0L7k84K04mj60k8J71o4
$$ 5 150 -133 -185 86 -18 -157 -65 -232 -26 1 -203 139 -53 189 196 156 193 -91 113 109 -51 -79 92 28
6486B8J42p0L0j3k0j59J58k00K45n7k75J72J40r2l0j93L09MM0o2N9k99O3K44j73
$$ 28 170 100 130 117 97 -62 96 -104 141 84 -191 -19 121 29 -1 -194 115 119 159 97 156 -143 -80 164 -9
6511iJ76m56L62L7o6k79K66pl68K76K9L9n9O2j44M9J81j34O1j60K19k05K03Nr9
$$ -9 167 -289 73 110 44 -235 31 24 -344 -68 -39 0 -59 3 -141 -92 89 -45 16 -144 75 -130 73 78 -21
6536b1K3O9J44l23J99j95J80Pj60L0J69J59k10J49o08M15j30K05m2J35R9j30j80
$$ -21 2 71 215 -108 91 -104 76 83 -77 -47 122 281 71 220 -388 27 -103 102 60 195 294 164 -16
6559a6j73K20o9o2P3J94j41r8l5J45M22n00M5J56k75J80J63l1J37l8j99k01L5
$$ -16 -189 31 -38 -100 -27 167 26 -72 -107 38 460 -40 5 161 -114 66 229 198 335 297 98 -103 -68
6582f8M4o1N0N8J67l26P9pj02j16L88j15K8J8k22N06n42L70l4j33J9%qQ5j78J65
$$ -68 -24 -85 -35 23 190 -136 -57 -64 -166 -282 106 -9 19 37 -185 321 -221 149 115 -18 1 1 -7 78 -100 65
6608F5l8r3O5J61l08J89k44L85j95ML51m59P0M4j00K17j18o7J84K9J13k79r1j13
$$ 65 27 -66 -1 160 -148 41 -203 182 -13 -9 342 -117 -47 -3 -103 114 -4 -71 113 142 255 -24 -115 -228
6632b28K93K4j17J00j21J64j26j75R5K2k22J87K3k98L42L7j73K03J20j85J09J11
$$ -228 65 89 -28 72 -49 115 -11 -186 -91 -69 -291 -104 -81 -379 -37 0 -173 30 150 -35 74 185
6654A85j71j05KJ43R2k15pk24j32L62L48k22q1N6m6r2J19j80J63J47M7k00j75
$$ 185 14 -91 -89 54 146 -69 -76 -300 -432 -70 278 56 -25 31 -15 -107 12 -168 -5 142 189 -11 -186
6677a86J79J93k68j14J87j82L82k13J3K79j94q1J61k88J70o3K29k67M6K27k03
$$ -186 -7 186 -82 -196 -9 -191 191 -22 -9 270 76 -5 156 -132 38 -25 204 -63 -17 210 7
6698GK40n41J61Q2L02j95k92J06L28j90J04r8j1l0m4KJ97M6k51L15l52J24J23
$$ 7 247 -294 -133 -51 251 56 -236 -130 198 8 112 14 3 -27 -71 -69 128 174 -77 238 -114 10 133
6721A33j24l00L77n4J37j81j16j00K20j74L55j30j28J02O0k1j40K76l61K59j26
$$ 133 9 -291 86 32 169 -12 -128 -228 -8 -182 173 43 -85 17 77 56 -84 192 -169 90 -36
6742c6r7jP4J53j22J21r0l4ml3J68j2j55J18J7n6j65J73j36K46j76j01L60q7k07
$$ -36 -133 -134 -60 93 -29 92 2 -32 -36 -69 99 87 -68 50 67 11 -154 19 -117 129 -47 -148 212 125 -82
6767h2M8J97k51O4J04j98J14J00j58p2J04j76J45J82k49j21L16J04l30J66k02
$$ -82 -34 163 -88 -24 80 -118 -4 96 -62 -134 -30 -206 -61 121 -128 -249 67 171 -159 7 -195
6788a95J37l6J32m3j23K49n8l4n3m1J69k61J89P2p0l6k78M05k39j44M19k41K6
$$ -195 -58 -94 38 -5 -128 121 63 29 -24 -65 104 -157 32 104 34 -2 -280 125 -114 -258 161 -80 -54
6811e4k2J65M5k35l90M89Q3p1J05J47l69k57M21k5L69k83p8l8k00K94J23j88j58
$$ -54 -76 89 134 -101 -491 -2 81 10 115 262 -107 -364 57 32 401 118 40 2 -198 96 219 31 -127
6834a27R0J1J3P8j05K70j3k33l9l8j09J13J87M7l29L31J34l52J3J0J50l61M13
$$ -127 -37 -26 -13 65 -40 230 217 -16 -55 -93 -202 -89 98 145 -184 147 281 -71 -58 -48 102 -259 154
6857A54p9k80J85K63j31k47M4K78k61l5Q3N6Q8L8k9k37J54j26Q7m7K01k69K05
$$ 154 75 -205 -20 243 112 -135 -91 187 -74 -109 -26 30 118 156 127 -110 44 -82 5 -42 159 -110 95
6880I5j2k6O9l50J68j17J64n7J50K4j03p9L24j81K5k46m0K51j13J20Q5r4L4J53
$$ 95 83 57 126 -224 -56 -173 -9 -66 84 108 5 -74 250 69 94 -152 -192 59 -54 66 151 57 91 244
6904B44k86m6k7P7P7q1O6k3m20L41J11r0J24l08J13J75O1o8j89J61J20j01J33
$$ 244 -42 -88 -115 -38 39 -42 24 1 -419 -78 33 -57 67 -241 -128 47 108 40 -149 12 132 31 164
6927A64j37J11Mj23Q1J10j80j16K23k14M5J12r8n4j9k20M51j03J49k81L6L05k84
$$ 164 27 138 142 19 100 210 30 -86 137 -77 -32 80 -18 -72 -91 -311 140 37 186 -95 -59 246 -38
6950c8K85l17O8K1Q0k51K34j03O5J7j43j55M45J47l52k3R2k36L26k21j3J05m21
$$ -38 247 -70 -2 19 99 -152 82 -21 44 61 -82 -237 208 355 3 -20 72 -164 162 -59 -72 33 -388
6973c88J96M00k40N5k81J63Q7j74K03J2J02k20J27j55J57j73J6J68m9j66K79k55
$$ -388 -192 208 -32 23 -258 -95 -8 -182 21 33 135 -85 42 -113 44 -129 -113 55 6 -160 119 -136
6995a36J18j71J44m5m9K8J45j19j03L01k96J57P1N8N7j08k35K67k97L87k39M3
$$ -136 -18 -189 -45 -90 -139 -111 34 -85 -188 113 -183 -26 45 103 160 52 -183 84 -213 174 -65 -22
7017b2K10k96q4J44o4K76k15J09j65K07J66m82L37k42J25k3j38K94j69J1p7K5
$$ -22 188 -108 -192 -48 -112 164 -51 58 -107 100 266 -216 121 -121 4 -19 -157 137 -32 -21 -98 -73
7039g3j23Q6J51P4k89K58k24j6L85k69L63m12K86m7p4j55K71j84N7j06k73M89
$$ -73 -196 -110 41 115 -174 84 -140 -156 229 -40 323 -89 197 150 76 -79 192 8 65 -41 -314 175
7061A75k54L09p6l21j12K83M1j05K3L36k85P5J80k99k08K04n2MJ4J68j57k71M04
$$ 175 -79 230 154 -167 -279 4 45 -60 -37 299 14 89 269 -30 -238 -34 -86 -82 -68 100 -57 -328 76
7084G6j34k22K79%M5J84k41l2J98j38l1j1m1K10J83m32P0j8J79N1n46M04k5J73
$$ 76 -58 -280 -1 -1 44 228 -13 -45 153 15 -16 -27 -68 142 325 -107 -37 -55 124 175 -371 33 8 181
7108A81k88J61Q5k40L17k81K01j93Q3j4k10K21J09j37J6j06J1K7Q1L1j72K34m
$$ 181 -107 54 139 -101 216 -65 136 -57 26 12 -198 23 132 -5 11 -95 -84 -57 24 55 -117 117 113
7131A13p5K37j22l13J85P9j81J8nJ48PJ35l06L3K63k95J54N5j31O5K59j57j92
$$ 113 38 275 153 -160 25 104 -77 -59 -64 84 91 226 -80 -47 216 -79 75 130 -1 64 323 166 -26
7154b6j6Q2k0J9L3J49j22j71l8K82j91nRk87K02J83J37j46J12k78rm2K2Q1J52
$$ -26 -42 40 20 39 72 221 99 -72 -110 172 -19 -24 -15 -302 -100 83 220 74 186 -92 -101 -143 -121 -40 112
7179A12J3n2k74M7j51J36qK96L4k53Q8j05J09K46l91N5J18o1O8o5J80J2j70K2
$$ 112 125 73 -201 -154 -305 -169 -177 119 153 -100 -12 -117 -8 238 -153 -98 20 -41 27 -38 142 154 -16 6
7203Fj7j80L18m2j82K30j76K80j82J70o0k42J26r4Q1j61J07oJ57j84j06J01jJ97
$$ 6 -11 -191 127 85 -97 133 -43 237 55 225 165 -77 49 -45 36 -125 -18 -24 133 -51 -157 -56 -57 140
7227A40k76K14M5J2r4n2J65q6O2l08L18p6k25L72k02J65m24K05K4r3K47j13L7
$$ 140 -136 78 123 135 41 -11 154 68 130 -178 140 64 -161 211 9 174 -250 -45 -21 -114 133 20 57
7250E7p7R1l17Q2Q5K1K43l60k3jJ79R1j03j91L46j91J1J03j08N4J29j42r0M4j32
$$ 57 -20 71 -246 -164 -79 -58 185 -175 -198 -199 -20 71 -32 -223 123 -68 -57 46 -62 -8 121 -21 -111 -67 -199
7275a99O4K28M0k3k22K84j63K4j92K64k77K14l0j86L06k29K97k51L44m35M43q5
$$ -199 -135 93 133 110 -112 172 9 33 -159 105 -172 42 12 -174 132 -97 200 -51 293 -142 301 216
7297B16k13K28k59j49K72n4j97L19j68J52R5m14j20M74n6R0J2k15j54J45P6j87
$$ 216 3 231 -28 -177 95 41 -156 163 -5 147 242 -172 -292 182 126 216 228 13 -141 4 80 -107
7319a07j93L36k57J76p6K29R3j59J84L8l26Q8J66l20K73J32j07k21r9J32Q1Q3
$$ -107 -300 36 -221 -45 -121 108 201 42 226 264 -62 26 192 -128 145 277 170 -51 -150 -18 63 146
7341A46k16L4Q3nj75K81J8l16J86k08J10l4K57k74P7L53o51M64j97O9k5J05m5
$$ 146 -70 -36 47 42 -133 148 166 -150 36 -172 -62 -96 161 -113 -36 317 -334 130 -67 2 -23 82 37
7364C7R2k81K00l16L75k27j25M13k24J15o0J34j38P7r0M31l66m1M6k64P3J05r
$$ 37 129 -152 48 -268 107 -120 -245 168 -56 59 -1 133 -5 72 -18 413 47 6 52 -212 -139 -34 -43
7387d3r2K40k89J41P3L4j28K92n06K04J54N2K54l96L62k74k7j93P3J0j1K62r0
$$ -43 -135 105 -184 -43 30 64 -64 228 -278 -74 80 132 386 -10 352 78 51 -142 -69 -59 -70 192 102
7410A02q8P9j44J67j48k7J17J70j57J96l70K96k76J70j44J53j26j85J86J75k33
$$ 102 14 93 -51 116 -32 -59 58 228 71 267 -103 193 -83 87 -57 96 -30 -215 -29 146 -87
7431h7j12K50P6K72l10k6j62J68QLm9J34l17J97q6R7j95K69j89R4j28QL23l11
$$ -87 -199 51 127 399 89 63 -99 69 77 80 31 165 -152 45 -41 56 -139 130 -59 35 -93 -85 238 -73
7455g3oJ14p5p0J44K37l23J25j2J24o2Q9k22k7l0k02K25n6K57p0n8j1j45K09j13
$$ -73 -79 35 -40 -110 34 271 -52 73 61 185 123 212 -10 -37 -67 -269 -44 -100 157 87 29 18 -127 82 -31
7480c1n8j02p1L20K5n5r2O5J87k93K25r0J72l26R6L55k00j27j49J13Q0J3o0r3
$$ -31 -89 -191 -262 58 83 28 -64 1 188 -105 120 30 202 -124 -28 327 127 0 -149 -36 44 57 -3 -96
7504i6j59L42P4k08J09K5L2k92J15J03k1M5jj55P3j39L47k61R5l03K76K90l14
$$ -96 -255 87 161 -47 62 87 119 -173 -58 45 24 69 68 -87 -14 -153 194 -67 28 -275 1 291 -23
7527b3M5j38L14l36M1O1Jj96K6Q5J74J79l72J03O8N2j40j57J97jJ25p3o7J50N6
$$ -23 22 -116 198 -138 -97 -36 -35 -231 -205 -120 54 233 -139 -36 32 84 -56 -213 -16 -17 108 35 -32 118 174
7552A74l12L8J51j11J66Q1l45J91J3r3l2m0n9J90j61K2j43n0K67n0N8J93j89n2
$$ 174 -138 -100 51 -60 106 187 -158 33 46 -47 -79 -119 -178 12 -149 -127 -270 -320 -53 -103 -45 148 -41 -93
7576i3K33q3j31P1p6q9L34l16J47R3r8kr5J10n2K77j55j44L57J8k56j69K52j14
$$ -93 140 57 -74 -3 -79 -168 166 -150 -3 90 -8 -10 -105 5 -47 230 75 -69 288 306 50 -119 133 19
7600A9l7J70m50K04R1k05O5K89j70n3J69J3j94J86j13j5O4J24m9q8l33K96o3K90
$$ 19 -18 152 -298 -94 -3 -208 -143 146 -24 -77 92 105 -89 97 -16 -31 33 157 108 20 -313 -17 -80 210
7624B10j78j75K56n6J66l36o1J95K75l04J89k44K1J40j63J20j74J08k0P3j25N3
$$ 210 32 -143 113 57 223 -113 -174 21 296 -8 181 -63 -42 98 -65 55 -119 -11 -31 42 -83 -30
7646c0J26k75q3L65J19l86J76o3K54j03O6p7j27J32p4j06L22l26N1m9L6o4q6R5
$$ -30 96 -179 -262 103 222 -164 12 -51 203 100 166 89 -38 94 20 -86 236 -90 -39 -88 -52 -116 -202 -107
7670a07m6RK52j61q5J06K60k38M1K20m48JlJ51K11j01J2m3n7K8p5K01P0k26O6
$$ -107 -153 -144 108 -53 -138 -32 228 -10 31 251 -197 -196 -199 -48 163 62 74 31 -26 2 -73 128 198 -28 38
7695C8l34L20n2k02J99K13j93j6P7P8j80J45j88L12j53l11R7n3K51j51J56J12
$$ 38 -296 24 -28 -230 -31 182 -11 -27 50 128 -52 93 -95 217 64 -247 -150 -203 48 -103 53 165
7717A65K8j62kJ30j0j75Q9k23L6j62K32J70k32j03M2K87o2j28Q5J21k29K35k28
$$ 165 193 31 29 159 149 -26 63 -160 -124 -286 -54 116 -116 -219 -177 110 48 -80 5 126 -103 132 -96
7740i6J28mj80r7J47J09m4M0k06J02J53J11J9k30K08j71j96J97ll04N30j55J1
$$ -96 32 28 -152 -249 -102 7 -37 3 -203 -101 52 163 182 -48 160 -11 -207 -10 -13 -317 213 58 69
7763F9l9N3p9N9j59o0P6r0J62%j43L23o9j43O8O0J9q9R8J10l80M1J61M7k1j04
$$ 69 30 83 4 63 -96 -156 -80 -170 -8 -8 -151 172 103 -40 28 88 107 18 116 226 -154 -113 48 95 74 -30
7789c0q7K43k40P7O6P4j51O8L6j97Q2J74k00n4J06j0r6R5K88Nk57Rm1M3k1k6q
$$ -30 -117 126 -114 -37 29 103 -48 20 56 -141 -59 115 -85 -139 -33 -43 -139 -44 244 249 -8 1 -40 3 -18 -44 -52
7816e2J80k8m3j13J94l61jO12m41K8j0j3j72J65M4L0R8k80K76k0m19K42K51j89
$$ -52 128 100 57 -56 138 -223 -224 388 -53 -25 -35 -48 -220 -55 -11 19 117 -163 113 93 -326 -84 167 -22
7840b2J12R9k74J71J71m19K82O1k60j41K56J5j57J77k75K26k3J2o9k97K22L16
$$ -22 90 189 -85 86 257 -162 120 181 -79 -220 36 51 -106 71 -204 22 -1 11 -58 -355 -133 183
7862A83j48r0O2j8r9J07j43J93q8L80k21Q2k20mr2J12J72j37m7p9l9J35%M9j16
$$ 183 35 -55 7 -11 -110 -3 -146 47 -41 339 118 200 -20 -24 -116 -4 168 31 -16 -95 -134 1 1 50 -66
7887f6J51j6P0O4k82m4L62l34L35k72J43q3j83K30j39R7j2n1j1R0m1ML5J45j30
$$ -66 85 69 139 203 -79 -123 239 -95 240 -32 111 28 -155 75 -64 33 21 -30 -41 49 8 12 47 192 62
7912F2j28r2K20K4j1j38K06k52r2J46j32L02r6K1J39j07j51J46k7j18J20k18K75
$$ 62 -66 -158 62 86 75 -63 143 -109 -201 -55 -187 115 19 40 179 72 -79 67 40 -78 42 -176 99
7935I9j79J25R6k55j2J03M4o5J19q8M4k1J93j80K54k55J12L7J2Q5j16r2j68L05
$$ 99 -80 45 141 -114 -126 -23 21 -44 75 -13 31 10 203 23 277 22 134 171 183 268 152 60 -108 197
7959A97j68R4j52Pq3J58Q6j78N6j20Q8Q5K7J47j08n1q1m8rJ03j77k9n7J86J56
$$ 197 29 123 -29 -22 -105 53 139 -39 17 -103 -15 70 97 244 136 85 4 -44 -53 50 -127 -156 -213 -27 129
7984A29mm26M53j63R8J43j82j59L27k02m6q4L06l25M9J39J08m68J93j66K64j13
$$ 129 125 -301 152 -11 87 230 48 -111 216 14 -32 -116 190 -135 -86 53 161 -307 -114 -280 -16 -129
8006a29J20L28o33P2L97jj94k8J80j05J14j63N6j68K05J46j74q7l8P2j14K90j22
$$ -129 -9 319 -314 -242 155 154 -40 -68 112 7 121 -42 14 -154 51 197 23 -64 -102 -30 -144 146 24
8029B4J20p1Q6r1R8j97n5K14k07K28k21J78q0P9k51K35o4K30l29J29K58p2k20
$$ 24 144 73 159 68 166 -31 -86 128 -79 149 -72 106 26 105 -146 89 25 255 -74 55 313 241 21
8052B1k4L4k05O0j06P8K31j72q2K68L8k4j29J6O3j58N2p7J36J99k45k16J39J56
$$ 21 -3 31 -174 -114 -220 -142 89 -83 -165 103 141 117 -12 4 67 -91 -39 -116 20 219 -26 -242 -103 53
8076E3k08J43j19M85m51K22o4j64J94q9m9J31n2j8m5j6J78j82j5J48q9M1j90J94
$$ 53 -155 -12 -131 354 -97 125 61 -103 91 2 -47 84 32 14 -31 -47 131 -51 -66 82 -7 34 -156 38
8100C8rn9P5k34J55L3j72J93J91m55M33k43K69l67P5K74l43O9M0J02j49K81j31
$$ 38 29 -30 45 -189 -34 -1 -173 20 211 -244 189 -54 215 -152 -77 197 -146 -77 -37 65 -84 197 66
8123F6q0M7l7J88m39J19N8J14j60k1J71k90J22%J31L21r8j11l13K53j98K98j38
$$ 66 -14 33 -4 184 -255 -136 -78 36 -124 -145 26 -264 -142 -142 -11 310 212 101 -212 41 -157 141 3
8146CN4l5j94K10J00j26Q4j42j19J65J4j90L78k77p0Q1J02k04R0K64o7j32J29
$$ 3 57 22 -172 38 138 12 96 -46 -165 0 14 -176 202 -75 -145 -64 38 -166 -76 188 121 -11 118
8169A18n7K6k43J98N7j40J29n2P4l0k2O6k1j12J93l42K31J31j86j98N4K33
$$ 118 61 87 -156 42 99 -41 88 36 110 80 58 124 103 -9 184 -158 73 204 18 -180 -126 107
8191A07
$$ Imaginary data points
##PAGE= N=2
##DATA TABLE= (X++(I..I)), XYDATA
0@%%%%%%%%%%%%Qj6J6j6J6k4L2l4M2n2O1p3Q8j03J20j38J56j80K08k38K71l06
$$ 0 0 0 0 0 0 0 0 0 0 0 0 0 8 -8 8 -8 8 -16 16 -18 24 -28 33 -40 48 -55 65 -73 83 -97 111 -127 144 -162
34a62L45l90M40m93N50o15O86p62Q45r37J040j150J268j399J543j699J871k062
$$ -162 183 -207 233 -260 290 -325 361 -401 444 -493 547 -603 665 -734 809 -890 981 -1081
52a081K273k506K766l059L391l769M207m721N329o067O982q154R718j1919J5274
$$ -1081 1192 -1314 1452 -1607 1784 -1985 2222 -2499 2830 -3237 3745 -4409 5309 -6610 8664
67H664k1074L3872j15873O6700J50089j48478L9497J26916o8118j60135L6503
$$ 8664 -12410 21462 -94411 -27711 122378 -26100 13397 140313 72195 -87940 -51437
78e1437M9861l1643n487M8813J5030K2595j0312m5852J5815M1290r0469p2712
$$ -51437 -1576 -33219 -38706 10107 25137 47732 37420 -8432 7383 48673 -41796 -114508
90a14508R2171N3554q4501L7747J43610l3647j34206J9631M1599q6147l4330J03190
$$ -114508 -22337 31217 -53284 -15537 128073 94426 -39780 -20149 21450 -64697 -99027 4163
102D163N6581k9879l549J5097k5115l9666k8811J161L8532J2261k6117L0226O3857
$$ 4163 60744 30865 27316 42413 17298 -22368 -51179 -50018 -11486 775 -25342 4884 68741
115F8741k6649n8619L0361K1040p7389l7394O9139L5314l0782J8679N5919j6250
$$ 68741 42092 -16527 13834 34874 -42515 -79909 -10770 24544 -6238 12441 68360 52110
127E2110o9992k8892J7828L529j7606J8073O2824K3518m3950j6306L0696k1184
$$ 52110 -17882 -46774 -28946 -25417 -43023 -24950 37874 61392 17442 1136 31832 10648
139A0648o3863P772N2395p285k1659M2376L9223l0012m0328o12O65k5550j5568
$$ 10648 -53215 -45443 6952 -333 -21992 20384 59607 29595 -10733 -11345 -10680 -36230 -51798
152e1798L0066N0633R602k3826Q683K0019m4516n5102K7705L8289l0058n974O2713
$$ -51798 -21732 28901 38503 14677 23360 43379 -1137 -56239 -28534 9755 -20303 -26277 36436
165C6436J6196n1294p994K6163k7645m0795J5625K9222L686P542J9308R766o469
$$ 36436 52632 1338 -6656 19507 -8138 -48933 -33308 -4086 -400 7142 26450 36216 29747
178B9747k6918k9231L782J1976j7078N911N2343J3249m0358j418K3556l4706m2760
$$ 29747 2829 -26402 -22620 -10644 -27722 -21811 30532 43781 3423 2005 25561 -9145 -51905
191e1905K7497L0776j8050L922M0395M947k7199o458p93j7651j2483L154J1067
$$ -51905 -24408 6368 -11682 -7760 32635 37582 10383 3925 3132 -14519 -27002 -23848 -12781
204a2781K1159J4108o879N71O658k6091l4206J0951K1919j1425L986M1418J0948
$$ -12781 8378 22486 15607 16178 22836 -3255 -37461 -26510 -4591 -16016 -12030 29388 40336
217D0336l0405p763J0651k1306k6381J1829K2400J267K206J5708P483j2612j8761
$$ 40336 9931 2168 12819 -8487 -34868 -23039 -639 628 2834 18542 26025 13413 -5348
230e348j0224N65j995m827J4570K8383N514j4481J802L359k5145k4760J2071J7972
$$ -5348 -15572 -15007 -17002 -21829 -7259 21124 26638 12157 13959 17318 -7827 -32587 -20516 -2544
244b544n888M606K6991O919k3147j1440L292r421j6599N202K3779J0392j581N999
$$ -2544 -8432 -3826 23165 30084 6937 -4503 -1211 -10632 -27231 -22029 1750 12142 10561 16560
258A6560P498j0775k3089q452N286j057k300J5485K1123J015j2119l665j335j5716
$$ 16560 24058 13283 -9806 -18258 -12972 -14029 -16329 -844 20279 21294 9175 5510 4175 -11541
272a1541j4105P826J5870M647L068J3573N824j4269j7400l493j419q325K724J7022
$$ -11541 -25646 -17820 -1950 2697 5765 19338 25162 10893 -6507 -10000 -11419 -19744 -17020 2
286BJ4393m59j946P93p955j5289r810N244P607N356O991J3276M208j0956j1323
$$ 2 14395 13936 11990 12783 4828 -10461 -20271 -15027 -7420 -2064 4927 18203 22411 11455 132
301A32n051o120q665J852J5562J1040J450K312L823q616j6073p393L024K004K043
$$ 132 -4919 -11039 -19704 -17852 -2290 8750 10200 12512 16335 7719 -8354 -15747 -12723 -10719 -8676
316h676J1731J4058J281p822n133m706j1924r294N091J1453N504M651Q841K484
$$ -8676 3055 17113 18394 10572 5439 733 -11191 -20485 -15394 -3941 1563 6214 15055 17539
330A7539j0605j1862m202k187l099M245J2718J0174R51j435j844q254j2806n814
$$ 17539 6934 -4928 -9130 -11317 -14416 -10171 2547 12721 13672 12237 10393 2139 -10667 -16481
344a6481L039N176M685R176R372J5p338o263n219q098l337O591Q863N241N711
$$ -16481 -13442 -8266 -3581 5595 14967 14982 7644 1381 -3838 -11936 -15273 -8682 181 5422 11133
359A1133M470m237r846p325m996l990J908Q754Q741M906L582j071p294q461n552
$$ 11133 15603 11366 1520 -5805 -10801 -14791 -12883 -4129 4612 9518 13100 12029 4735 -3726 -9278
374i278l222J492O788P765N656L983j469p156p159n516n314l97P744P943M249
$$ -9278 -12500 -11008 -4220 3545 9201 13184 11715 4559 -2600 -8116 -13430 -13827 -6083 1860 6109
389F109M980K884o403r898l634l424l752N067J0462N185J904K777l676r937o091
$$ 6109 11089 13973 7570 -2328 -5962 -9386 -13138 -8071 2391 7576 9480 12257 8581 -1356 -7447
404g447k854k312L022R004N939L104M200k458r778n051p61n065j011J0452P460
$$ -7447 -10301 -12613 -9591 -587 5352 8456 12656 10198 420 -4631 -5392 -10457 -11468 -1016 6444
419F444j51K976K857q085j0927j869j116j623N485R577N437J775n69n881o019
$$ 6444 6293 9269 12126 4041 -6886 -8755 -9871 -11494 -6009 3568 9005 10780 10211 4330 -1689
434a689l649m902j066Q443P143j03L512N464p238j1798j191Q89n686J701J2365
$$ -1689 -5338 -10240 -11306 -2863 4280 4177 7689 13153 5915 -5883 -7074 -6185 -11871 -10170 2195
449B195O483j558J598Q04p312q822k558Q84K481M089N143N632K136n399p249j755
$$ 2195 8678 7120 8718 9522 2210 -6612 -9170 -8286 -5805 -1716 3427 9059 11195 5796 -1453 -3208
465c208l241n942K612J0263M489L92M354J736q036q411j285j210o09L760P187
$$ -3208 -6449 -12391 -9779 484 4973 5365 9719 11455 3419 -4992 -6277 -7487 -8096 -4336 2851
480B851N791O61l730l435l131o241m229L662N956K633L332N945P6o335m491k488
$$ 2851 8642 9303 5573 2138 -993 -7234 -11463 -7801 -1845 788 4120 10065 10141 3806 -685 -3173
496c173m311j508L596M949N200M146j074l762k587o451p003K299P477J199L392
$$ -3173 -7484 -8992 -5396 -447 4753 8899 7825 4063 1476 -4975 -11978 -9679 -2202 -1003 2389
511B389Q901k92q723k849o6o233k597N867M023J17M654L290m046k984k439o242
$$ 2389 11290 10998 2275 -574 -640 -6873 -9470 -3603 420 537 5191 8481 4435 1451 -988 -7230
527g230k081L986K253K845Q760L370o901k608k75q646o280P620N865j930N253
$$ -7230 -9311 -5325 -3072 -227 8533 11903 5002 2394 2119 -6527 -12807 -5187 678 -1252 4001
542D001P508n148p921R99k204o834K216O873Q07K596N649r86m703p44m089p231
$$ 4001 11509 6361 -1560 -561 -2765 -9599 -7383 -510 297 2893 8542 7556 2853 2109 -1980 -9211
558i211J677N073RL781Q525j793p266J8j780q779q7Q820J797m14P644K404p556
$$ -9211 -7534 -2461 -2452 1329 9854 8061 795 813 -967 -9746 -9833 -1013 784 370 8014 10418 2862
575B862l549P42n375l977M873M036P57M590K964l704l383j816n302k209M512L386
$$ 2862 -687 55 -5320 -9297 -4424 -388 369 4959 7923 4219 836 -980 -6282 -8491 -3979 -593
591e93P69N453L985m924m460N32l541n708K548N027R80J687M370K58m020l218
$$ -593 176 5629 9614 4690 230 762 -2779 -8487 -5939 -912 68 1755 6125 6383 2363 -855
607h55k364k628r2K559L103M895L498k141l074j263m545n077J396M685J732J149
$$ -855 -3219 -5847 -5939 -3380 -277 4618 8116 5975 2901 1638 -2907 -7984 -6588 -1903 -171 978
623I78M320J153l856l746j200j167j952L61M195M962P72o47J585j211p046m648
$$ 978 5298 6451 2595 -1151 -2351 -3518 -5470 -5109 -914 4048 4820 4173 5758 4547 -2499 -7147
639g147J978J278o66M676O912j18l942j510j815m544j949K429L920L100J079P77
$$ -7147 -5169 -3891 -4557 119 7031 6913 2971 1461 -354 -4898 -6847 -4418 -498 2602 3681 4458
655D458J060k129n604k842K168q66k311N351O517j529k477K707j677p646k023
$$ 4458 5518 3389 -2215 -5057 -2889 -3755 -6066 -715 5802 4273 1796 4503 2826 -4820 -6843
670f843L690R18N26N196L428j356k445l171l411j109k18p7L754N196k70j740J974
$$ -6843 -3153 -2235 -1709 3487 6915 5559 3114 -57 -3468 -4577 -4795 -4872 -1118 4078 3808 2068 4042
687D042p14p177k097L951j12j647M841N580j863k789K82k667m602j030J931K347
$$ 4042 3328 -3849 -5946 -1995 -2107 -3754 1087 6667 4804 2015 2297 -370 -4972 -6002 -4071 -1724
703a724K764K494M12M21j687m975k270J534J06r49M182N773j550k711J391j172
$$ -1724 1040 3534 3946 4367 2680 -2295 -4565 -3031 -2925 -3874 308 6081 4531 1820 3211 2039
719B039o411k377L630J461j74L195M607q20l282k189q64k170j561J597L980K970
$$ 2039 -4372 -6749 -3119 -1658 -1832 1363 5970 5150 1868 -321 -1185 -3355 -4916 -3319 661 3631
735C631o44q9J486k672n544j247K575j97m90M310M648j307l280L69q23m331k447
$$ 3631 2987 2898 4384 1712 -3832 -5079 -2504 -2701 -3191 1119 5767 4460 1180 1549 726 -3605 -6052
752f052L660K985M2J309K845K61m474l096j27o81j297K017M086K452r34m75K78
$$ -6052 -2392 593 635 1944 4789 5050 576 -2520 -2647 -3328 -4625 -2608 1478 3930 2996 2521 2799
769B799j807m477j134K464J429J17K133L583l49m163j814K03k144k290K342M563
$$ 2799 992 -3485 -4619 -2155 -726 -609 1524 5107 4758 595 -1219 -1016 -3160 -5450 -3108 1455
785A455R96m34J279J173l444m238k39J579l08K79L595L332j435k767k00l39l682
$$ 1455 2451 2017 3296 4469 1025 -3213 -3452 -1873 -2181 -1902 1693 5025 3590 823 623 284 -3398
802c398k353K774L569J64L42L136O41m321l143Q73L09k682J140N075K135k143
$$ -3398 -5751 -2977 592 756 1098 4234 4875 554 -2589 -1716 -1407 -4089 -2949 2126 4261 2118
818B118q31J586k304m932n75L179J062o72K622M146j520m014m40O83k699k376
$$ 2118 1287 2873 569 -4363 -4938 -1759 -697 -1369 1253 5399 3879 -135 -575 108 -2591 -4967
834d967K777M081O32j216J268Q24l353l812L42K130r25J4L901L342j712k770O16
$$ -4967 -2190 1891 2523 1307 2575 3399 46 -3766 -3424 -1294 -2219 -2205 1696 5038 3326 556 1172
851A172k57m133j581L256K582q40Q32K948m00l793k127O21m50j290J439L755K007
$$ 1172 915 -3218 -4799 -1543 1039 199 1031 3979 3579 -214 -2341 -1720 -2170 -3460 -2021 1734 3741
868C741j428p36N62j433l705j427K927J516j188J737L796o61m258q38J534k802
$$ 3741 2313 1577 2139 706 -2999 -4426 -1499 17 -1171 566 4362 3701 -557 -1395 139 -2663
884b663j988K770L854K1p75J741J91l107k886K86J248l87K49K690K728r59l103
$$ -2663 -4651 -1881 1973 1994 1219 2960 3151 44 -2842 -2556 -1308 -1695 -1446 1244 3972 3013 -90
901i0j05J96k880j979L187L536j357J40L686q1n017j737J827j171j876K230L607
$$ -90 -195 1 -2879 -4858 -1671 1865 508 648 4334 4253 -764 -2501 -674 -1845 -3721 -1491 2116
918B116L81r49qj29j873k631j93K131J051k12J506K647q39l052r77Q80j432k509
$$ 2116 2497 1548 1540 1411 -462 -3093 -3286 -1155 -104 -316 1190 3837 2998 -54 -1031 -151 -1583 -4092
936d092K361L702m21q37J769O41l566k719O67J180m65Q06L225R60j121j226l18
$$ -4092 -1731 1971 1550 713 2482 3123 -443 -3162 -2495 -1315 -1780 -974 2251 3211 2090 864 546
953E46r97j808j020J842J860j11J96K006M35k754k139O22q9j533R10M180J149
$$ 546 -451 -2259 -3279 -1437 423 312 508 2514 2949 195 -1944 -1322 -1411 -2944 -2034 2146 3295
970C295j677l91R14k244l542M89K416o4P4K240J463j368j687n08j08j134m67J107
$$ 3295 1618 1227 2141 -103 -3645 -3156 -740 -804 -730 1510 2973 1605 -82 -590 -698 -1832 -2299 -1192
988a192K067O95k95M92J002k358l269O65J125j036J0M020J978k612j189R18j937
$$ -1192 875 1570 1275 1767 2769 411 -2858 -2193 -1068 -2104 -2094 1926 3904 1292 103 1021 -916
1005i16k724J120K626M39J50J284N35j203j048j507j74J79p78K33K525J673j411
$$ -916 -3640 -2520 106 545 695 1979 2514 1311 263 -1244 -1418 -1239 -2017 -1784 741 2414 1003
1022A003q8J228j768l518N04K235l90K19K884J277k098j842J98j048j570Q31J655
$$ 1003 915 2143 375 -3143 -2639 -404 -794 -575 2309 3586 1488 -354 -156 -1204 -2774 -1943 -288
1039b88R28M71K59J3j26q41j887l82J275l61k35K559J810j570j302P91j303k808
$$ -288 640 1111 1370 1383 1257 416 -1471 -1853 -578 -939 -1174 1385 3195 1625 323 1114 -189 -2997
1057b997Q8K525P74j97J643Q41j314j846n23J82n43j46R40J495R39j028l2M53
$$ -2997 -2909 -384 390 193 1836 2677 1363 -483 -1006 -824 -1367 -1513 -573 922 1861 833 801 1254
1075A254j333k091m0J348O4O6K174J529j366j851J43m22j715j86J932K035o70
$$ 1254 -79 -2170 -2210 -862 -798 -732 1442 2971 1605 -246 -103 -525 -2240 -2426 -494 1541 871
1092H71j11R31m88k453m57P88r4n89J078J474M27k1m04n08n69j437p04J498J047
$$ 871 760 1691 1203 -1250 -1707 -919 -1013 -1602 -524 950 1377 1356 952 444 -125 -1562 -2266 -768 279
1111B79J21Q62J523r07k691p32Q59p04o10J745J863n85n87Q93o11j506k50m9J48
$$ 279 400 1262 2785 1878 -813 -1545 -686 -1390 -2000 -255 1608 1023 436 1329 718 -788 -1038 -1087 -939
1130i39M26O52P02Q60m0j467q32K7p37r84J506J830j1k46J153p16j800q04M71
$$ -939 -513 139 841 1701 1661 194 -638 -611 -1348 -2332 -826 1004 993 747 1900 1184 -616 -1420 -949
1149i49J83k95J175J227k97On05n84p33n39q3M92P97N84L09Q72k21j540r92O18
$$ -949 -766 -1061 114 1341 1044 1050 545 -39 -772 -1311 -1394 -902 -105 479 788 1660 1439 -101 -1093 -475
1169d75p29j83J362J294K09q03O17q86j455p42O67J58M04J026M11M85m48o84k50
$$ -475 -1204 -1387 -25 1269 1478 675 1292 406 -1049 -1791 -1124 -966 -562 464 875 1360 912 228 -22
1188b2p10l82k08Q62Q57M57K38J91o35j001p64k6Q0K38J073Q16J08k75m5q36p66
$$ -22 -732 -1114 -1322 -460 397 854 1092 1283 648 -353 -1117 -1143 -1063 -825 248 1064 1172 897 852 16 -750
1209g50n62M23M69J30R41M31J33n02p02o58m32m70L77J012R18K21K76l42p25p18
$$ -750 -1312 -889 -420 -290 651 1082 1215 713 11 -647 -1079 -1549 -1172 -160 758 979 1255 913 188 -530
1229e30m26QM9K98R06P63J30o77n59k84l65p40M88R92K66M22O06m12p82o46k98
$$ -530 -956 -948 -899 -601 305 1068 1198 521 -38 -322 -687 -1427 -939 53 319 741 1347 935 153 -493 -791
1250g91m7l27M74J042L22J76N7n64m31q79j85L24L97L30O84J120m65p45m21m92
$$ -791 -838 -1165 -691 351 673 849 906 342 -89 -968 -1153 -829 -432 -102 582 1702 1237 492 71 -421
1270d21p15j1P25P30L9N12K65l46r84n46j27j13M9N75J052M03r9n08q7m01p64
$$ -421 -1136 -1147 -422 308 347 859 1124 778 -206 -752 -879 -992 -943 -368 684 1087 988 480 393 -8 -772
1291g72m99N60M09M30K51P05k89o92m77k49o9m21N88J060M3J04J96j95q47n75
$$ -772 -1271 -711 -302 128 379 1084 795 103 -374 -623 -692 -1113 -525 535 578 682 878 683 -164 -739
1311g39k47M76p6N18L18O81k21l38l80o52l37M0O78Q5Q97j18L14j78q45o63K19
$$ -739 -986 -510 -586 -68 250 931 710 372 -8 -660 -997 -957 -279 -194 703 585 899 721 -124 -787 -568
1332e68j46J41K71O19P28m57j06L2o90l28n29R33q4K44P02K76l08n64k68l01l44
$$ -568 -714 -573 -302 317 1045 588 482 514 -176 -504 -1033 -100 -184 60 762 1038 730 166 -102 -403 -747
1353g47k44M88R03o5K48J32n57m58l26R3K90p4J22J037J15k01k61m91l68p31J20
$$ -747 -991 -503 400 335 583 715 158 -300 -626 -533 -243 -317 -195 842 957 756 495 4 -364 -1095 -975
1374i75N29L10K25N79J83k52p19o0m12j01R1N20O62L4K40l05l35o64m00J67K06
$$ -975 -446 -136 89 668 851 599 -120 -180 -592 -693 -602 -82 580 614 854 549 214 -450 -850 -683 -477
1395d77O4P68M29k10m9o02J62o88M0n8N01N27l6L61l05j65n40j17P9l33j20Q20
$$ -477 -413 355 784 574 525 -77 85 -603 -563 -621 -120 407 371 732 427 262 -278 -395 -316 -649 -769 51
1417E1K39L69p8l23m45M3o50jP07J09L70K93J72m19o50r9j76n56K06Q58N37j96
$$ 51 290 659 581 258 -187 -144 -794 -795 -88 21 391 684 856 437 -213 -312 -488 -1044 -838 20 557 361
1439C61L75j56l58p11J30N0p8j9O80M64k14j34o6m37n53l05K94L68M82Q7L35K35
$$ 361 736 580 222 -489 -359 -309 -387 -406 274 738 524 390 324 -113 -666 -971 -677 -309 173 260 595 830
1461H30m76n23j75J67o11J00J223l9k93M26K2p21n03k56M91p8M19N45l1Jk77k86
$$ 830 354 -169 -344 -177 -788 -688 535 496 203 629 651 -70 -573 -829 -338 -416 3 548 517 518 241 -45
1483d5k44j27k48j7P20K51j09K69K11n43p66R1K64j39J46N23M96k73p7j15l28
$$ -45 -289 -416 -664 -681 39 290 181 450 661 118 -648 -557 -293 -432 -286 237 733 460 383 268 -60
1504f0l84K22j08J79M11j2K46K0j02o75L9j54k32J63O38K06K5Mj1j80o62j56K43
$$ -60 -444 -222 -330 -151 260 248 494 514 412 -263 -224 -378 -610 -447 191 397 422 426 415 235 -427 -583 -340
1527c40M1M77K94P3J5j06o43N9m54k39M21L06K71N3K64M6m17m73l23K30k61L74
$$ -340 -299 178 472 545 560 454 -189 -130 -584 -823 -402 -96 175 228 492 538 121 -352 -675 -445 -706 -332
1549c32N84L34j43j67j84k90j86j78L17J81K95k5M03m8p35K12k28m54oL86M46
$$ -332 252 586 443 276 92 -198 -384 -562 -245 -64 231 206 609 561 -174 38 -190 -644 -650 -264 182
1570A82l03K99N52o95r5k90m7RL34m0O88J40l43l12r0J52r54J78L43N65n23P88
$$ 182 -121 178 730 35 -60 -350 -397 -388 -54 -94 594 734 391 79 -11 141 -813 -635 -292 273 -250 538
1592E38K48n12m45L00m77n00L70M17J86J48J54M9m30l19L7k14O7N98m77M25Q96
$$ 538 786 274 -171 129 -348 -848 -478 -61 125 273 427 476 46 -273 -236 -450 -383 215 -262 163 1059
1613A059p95l66K80j44r14L08L73K72N1L33L23q40j36Q7j70p5k0L12N54J6k40
$$ 1059 264 -102 178 34 -880 -572 -199 73 124 457 780 -60 -196 -109 -279 -354 -374 -62 492 508 268
1634B68j31K28l10r10K15O40L21l07K76N61n11p03M67l08l42j80N43N92j11n7
$$ 268 137 365 55 -855 -640 0 321 14 290 851 340 -363 104 -204 -546 -726 -183 409 298 241
1654B41J84j97l40n30K51L35k36J07N67K82m64l32K63k62o30M37M10M20m96K34
$$ 241 425 228 -112 -642 -391 -56 -292 -185 382 664 200 -132 131 -131 -761 -324 86 506 10 244
1674B44J94m89j64m5K39l26l12N54P02j88m39M88q5n59l73K16M81j36j6J53L09
$$ 244 438 -51 -215 -260 -21 -347 -659 -105 597 409 -30 458 373 -186 -559 -343 138 2 -14 139 448
1695D48l41l22j6M14n06k49N21O68j69l62L95j93n76k87M58K7n61K73Q48L31q51
$$ 448 107 -215 -231 183 -323 -572 -51 617 448 86 481 288 -288 -575 -117 -90 -651 -378 470 801 -50
1716e0J57N8m97J1J48K19K20qn9L27j41p35n6L47l80r9K55Q18O0p83J82K92k99
$$ -50 107 165 -332 -321 -173 46 266 258 199 526 385 -350 -406 -59 -439 -538 -283 535 595 -188 -6 286 -13
1739a3p13N50K31j05J6O93j41n77J06j28j95j91J9M00J24K27l5p9J42n88m6lL81
$$ -13 -726 -176 55 -50 -34 659 518 -59 47 -81 -276 -467 -448 -48 76 303 268 189 331 -257 -303 -306 75
1762G5l47J60Q33l29k02N5P2p17j73K00K31M71k70L20M6j90k72k74J16j09j4J86
$$ 75 -272 -112 721 392 190 245 317 -400 -573 -373 -142 329 59 379 425 235 -37 -311 -195 -304 -318 -132
1784a32Q11p45P5M27n29m19J09J21K79l20P3P08J54k91m45J19j81m14K23M34J91
$$ -132 679 -66 9 436 -93 -512 -403 -282 -3 -323 -250 458 612 321 -124 -5 -186 -600 -377 57 248
1805B48l11L98N7j03n42r4J32p6k8J96O19k89j64P4j23j20n22M60J87k21J46L10
$$ 248 -63 335 392 289 -253 -347 -215 -291 -319 -123 496 207 43 117 -6 -126 -648 -188 -1 -222 -76 234
1827B34K40k46p23M39l00J46l46N96O72n71lK79m15k27j94L32J32k06M08L94o31
$$ 234 474 228 -495 -56 -356 -210 -556 40 712 141 138 417 2 -225 -419 -87 45 -161 247 641 10
1848A0NN9j57j25k51P0N30K68j95N4J44k58m34O7J17j6q9N71K74r5n51K12l42
$$ 10 15 74 -83 -208 -459 -389 141 409 214 268 412 154 -280 -213 -96 -112 -201 370 644 549 -2 210 -132
1871a32m89J53K55K81J70k91L29K06m42oo5k41p2J74K42n4J80P1j0k01j75j52
$$ -132 -621 -468 -213 68 238 -53 276 482 40 34 -31 -272 -344 -170 72 18 198 269 259 58 -117 -269
1893b69MJ89j3K33L98j62m02M9l02L3m49N00R6M02l40J45K95n59j32PJ20m8J96
$$ -269 -265 -76 -89 144 542 380 -22 27 -275 -242 -691 -191 -95 307 -33 112 407 -152 -284 -277 -157 -205 -9
1916iM47j55p3j8j76M3l76KM98n8Qj23N04k3n06j91K58l15k02J90Q12l55j14K48
$$ -9 438 283 210 192 16 59 -317 -315 183 125 133 10 514 491 -15 -206 52 -263 -465 -275 537 182 68 316
1940C16j64k98J99j58j60J17K01L2K16L7k35j74K2q4k76M78L02l95j1N40j97m19
$$ 316 152 -146 53 -105 -265 -148 53 85 301 338 103 -71 -49 -133 -409 69 371 -24 -35 505 308 -111
1962a11k3j75N6k99M08J57J91j60L25l78j5j00l13L90K63L4j75L13j92k16j39
$$ -111 -134 -309 -253 -552 -144 13 204 44 369 -9 -24 -124 -437 -47 216 250 75 388 196 -20 -159
1983a59m0J98n31L23J70L53j77O4rn26J24p7O1n1J02M41nj13l3O6j58j64j70J58
$$ -159 -199 -1 -532 -209 -39 314 137 201 192 -334 -210 -287 -226 -277 -175 266 261 148 115 181 23 -141 -311 -153
2007a53O7J36K92J60k81k38k13O5K56k62K21J49N8j87J54j42j19l27K75m8Q0j61
$$ -153 -86 50 342 502 221 -17 -230 -165 91 -171 50 199 257 70 224 82 -37 -364 -89 -137 -57 -218
2029b18N19J71l39k15n1N3k39O5K94R0j16K17J41k14l74O5k05L28J05PK85l7k38
$$ -218 301 472 133 -82 -133 -80 -319 -254 40 130 14 231 372 158 -216 -151 -356 -28 77 84 369 332 94
2052I4P4%j20k91J36K78j52k7K59K21k82k11P2n24M28k75K68L2K34j28P2K03m47
$$ 94 168 168 48 -243 -107 171 19 -8 251 472 190 -21 51 -473 -45 -320 -52 -20 214 86 158 361 -86
2075h6l38J61R6R4J35J69Q1k14j85L08m97MJ42j60K34K15K18k79n5l48O1K21j38
$$ -86 -424 -263 -167 -73 62 231 312 98 -87 221 -276 -272 -130 -290 -56 159 377 98 43 -305 -244 -23 -161
2098a61J8k5N93M7k89L8j25k61j2K59p0q9M1J5L79l42j04O1k25J06J84l09K62
$$ -161 -143 -168 425 472 183 221 96 -165 -177 82 12 -77 -36 -21 358 16 -88 -27 -252 -146 38 -271 -9
2121iK54j54l7j36Q8m49K96M5j84M78qR6k28MK01k31l55J83K78k89L72L3p9r3
$$ -9 245 91 54 -82 6 -443 -147 -102 -286 192 184 280 52 56 257 26 -329 -146 132 -157 215 248 169 76
2145G6k41k3K71l85N3L17L10j19j63J46m90L35j96O7j69J07K41N1j02j44j43j46
$$ 76 -165 -188 83 -302 -249 68 378 259 96 242 -248 87 -109 -42 -211 -104 137 188 86 -58 -201 -347
2167c47J77k35J29KK79o1J90j82P4j90l1j9n5l1M91J88k47o7J5j28j69N0m5J61
$$ -347 -170 -405 -276 -274 5 -56 134 -48 26 -164 -195 -214 -269 -300 191 379 132 65 80 -48 -217 -167 -212 -51
2191e1K11%J0rj14m08M27k77L19k10J58j68k0O3L34m75J1P2j2K02J99j15m0k55
$$ -51 160 160 170 161 47 -361 66 -211 108 -102 56 -112 -132 -69 265 -210 -199 -127 -139 63 262 147 107 -148
2215a48K67j82J76q5k22L32k42q3K54Q2K94k80n22K43k64K23K01O0k5L5Q5j23
$$ -148 119 -63 113 28 -194 138 -104 -187 67 149 443 163 -359 -116 -380 -157 44 104 79 114 199 76
2237G6K6l97K22L8J64n8o7L60k34r7j91K35j39j39M1M76k53p0L98j79j83j12m0
$$ 76 102 -295 -73 -35 129 71 4 364 130 33 -158 77 -62 -201 -160 316 63 -7 391 212 29 -83 -123
2260a23p3o9K51K3K40Qj66p8r7Q5m05M18l1q5J98L9p7k04M1l3j58J24J16L9J50
$$ -123 -196 -265 -14 9 249 257 91 13 -84 1 -404 14 -17 -102 96 135 58 -146 -105 -138 -296 -172 -56 -17 133
2285A33K9j15J0J41k24p7K3n8J81J6K00r3j70RQ1m06J20J47k5K6P4J06P0l12J73
$$ 133 162 47 57 198 -26 -103 -80 -138 43 59 259 166 -4 5 86 -320 -200 -53 -78 -52 22 128 198 -114 59
2310E9j22M45m90J80j53L07k82J83j95j34m0K00j80M44m7N2q8k9l81QL28n9n5
$$ 59 -63 382 -108 72 -81 226 -56 127 -68 -202 -242 -42 -222 222 175 227 139 110 -271 -263 65 6 -49
2333d9J72j10J14L7J4l2k16n3J5J3J22k5k0J2L20M1k21j77j08K40l66M42L2k78
$$ -49 123 13 127 164 178 146 -70 -123 -108 -95 27 2 -18 -6 314 355 134 -43 -151 89 -277 165 197 -81
2357h1J15j7k8k87L18Jl13M23k60K49l57L92j36on6J45K0j16K3J30n0K8J43p57
$$ -81 34 17 -11 -298 20 21 -292 131 -129 120 -237 155 19 13 -43 102 122 6 29 159 109 137 280 -477
2381d77J50K01P3m7K93k61J1J54J59l23R3j30J55P2N0k08K29O1j01q2j06q4O8
$$ -477 -327 -126 -53 -100 193 -68 -57 97 256 -67 26 -104 51 123 173 -35 194 255 154 72 -34 -118 -50
2404e0L12k66j97L04j67M5L43l80q2PJ15M1j50K54N5r9m9P6l10J41j25L1K26m5
$$ -50 262 -4 -201 103 -64 -19 324 -56 -138 -131 -16 25 -125 129 184 85 36 112 -198 -57 -182 -151 75 30
2428C0J86l72L88k24k9J36r5O1k42L62Kj66N3K9j40j64J5K6L31r8k17K6j4J76
$$ 30 216 -156 232 8 -21 115 20 81 -161 201 203 37 90 119 -21 -185 -170 -144 187 89 -128 -102 -116 60
2452F0j25j7K14k59L5l8L04j46M2o8l06M73k27O2K87k88OJ18k71L05m14q1L44
$$ 60 -65 -82 132 -127 -92 -130 174 28 70 2 -304 169 -58 4 291 3 9 127 -144 161 -253 -334 10
2475A0j42L38L2j10l58L26j43r1r9m1J10L13J62j87o6j28L47l87J71j05M4k03
$$ 10 -132 206 238 128 -230 96 -47 -138 -237 -278 -168 145 307 120 54 -74 273 -114 57 -48 -4 -207
2497b07L16J86l35J32kj30k18J24l3K52j3k63J44L57k04j45J6L8j62K98K85m36
$$ -207 109 295 -40 92 90 -40 -258 -134 -167 85 72 -191 -47 310 106 -39 -23 15 -147 151 436 0
2519@q3L00r5l4l89N48l69LK15n7pM2q5j25J37O8q1j82J82J61p3J57m08P8L4p6
$$ 0 -83 217 122 88 -301 247 -122 -119 96 39 32 74 -11 -136 1 69 -12 -194 -12 149 76 233 -175 -97 -63 -139
2545a39o9j5J73R6J2l4j96L13n2P0j18r0J34k14M40l75K4R7k50L71j97q2L3J02
$$ -139 -208 -223 -50 46 58 24 -172 141 89 159 41 -49 85 -129 311 -64 -40 57 -193 178 -19 -101 -68 34
2569C4L76l55j1J72l30j19J15K18j68J35p4J11j03J96J46o30n0M73k06j5N5J81
$$ 34 410 55 44 216 -114 -233 -118 100 -68 67 -7 104 1 197 343 -287 -337 136 -70 -85 -30 151
2591A51l9L9l50K1K32k6j28k0L02k04L55k06j73l8o5Q2K15k04K25j79J92k38K45
$$ 151 112 151 -199 -178 54 28 -100 -120 182 -22 333 127 -46 -84 -149 -67 148 -56 169 -10 182 -56 189
2614A89k79K76m26Q1K64Q6J6j16j34j84J28J3J45o7j50Q5R1r5R7Q7j66L0k09K62
$$ 189 -90 186 -240 -159 105 191 207 91 -43 -227 -99 -86 59 -8 -158 -73 18 -77 20 107 -59 -29 -238 24
2638B4m5J00k86M26nl41J87k04L12k54k7K58k03K44l24J13K17j81p2k13J41O2
$$ 24 -21 79 -207 219 214 -127 60 -144 168 -86 -113 145 -58 186 -138 -25 192 11 -61 -274 -133 -71
2660g1K27n04M95j84R1J38p4k18j20K11MJ75k36J83q8J8j2k13J5Q0j57K31k53
$$ -71 156 -348 147 -37 54 192 118 -100 -220 -9 -5 170 -66 117 29 47 35 -178 -163 -83 -240 -9 -262
2683b62O4K88k32M13k48l31L12l4n5j4L12N7j00j66k20Q6k5Q1K20j67M1J10j35
$$ -262 -198 90 -142 271 23 -308 4 -30 -85 -99 213 270 170 4 -216 -130 -155 -74 146 -21 20 130 -5
2706eJ08m4j32J2K23j70K3L3J07J7k03QJ16k01K51j56R5j63L7J28k13J08j36K5
$$ -5 103 59 -73 -61 162 -8 15 48 155 172 -31 -23 93 -108 143 -13 82 -81 -44 84 -129 -21 -157 -132
2730a32j89K99k09J03L19j78j11K57j35k58K04j30Q2l08M07j7J69r1j16J59j12
$$ -132 -321 -22 -231 -128 191 13 -98 159 24 -234 -30 -160 -78 -386 21 4 173 82 -34 125 13
2751A3K3K7j51q2N70o04J49m1j56K04K52j00j92J77K6k33J22N7j51nL3J50k13
$$ 13 36 63 -88 -170 400 -204 -55 -96 -252 -48 204 104 -88 89 115 -118 4 61 -90 -95 -62 88 -125
2774a25K11k27M13m20K02j61j22L22m33k3K23L4J13K7j8k8j90L4J4K72J28k20
$$ -125 86 -141 272 -148 54 -107 -229 93 -340 -363 -140 -106 7 34 16 -12 -202 -168 -154 118 246 26
2796B6P6l4r1n4m7L1j11J04K63j03j36j64L69k69J08o4L3m6K47j76j25K05k7j53
$$ 26 102 68 -23 -77 -124 -93 -204 -100 163 60 -76 -240 129 -140 -32 -96 -63 -109 138 -38 -163 42 15 -138
2820a38J44k05K48j11N6k10L17o4j44M4J59J11l69J93k28K36J50K3j29k21k37
$$ -138 6 -199 49 -62 -6 -216 101 37 -107 -63 96 207 -162 31 -197 39 189 212 83 -138 -375
2841c75K23J58j21k3J78O9j49L26l98R9O1N1j38R6o0L7J09k1l7j49J38j92L7K82
$$ -375 -152 6 -115 -138 40 109 -40 286 -112 -13 48 99 -39 57 -3 34 143 122 85 -64 74 -118 -81 201
2865B01j76m6J84l17M9L4L0K01K4m1j07j24L58m27J94P7r1Q9J68m56L07q4j17
$$ 201 25 -21 163 -154 -105 -71 -41 160 184 143 36 -88 270 -157 37 114 23 112 280 -176 131 47 -70
2888g0J47R1j56LOn4K3J20j25J13l34M70k96M6J41l42M19k20K72j00q3k82L57
$$ -70 77 168 12 15 21 -33 -10 110 -15 98 -236 234 -62 -16 125 -217 202 -18 254 154 71 -211 146
2911A46q4j04k79L3M3J51L2K51l97l6K49K33l09J78K3k55J36N3j8O4K2j29j22
$$ 146 62 -42 -321 -288 -245 -94 -62 189 -208 -244 5 238 -71 107 130 -125 11 64 46 110 132 3 -119
2934a19L2L02k30K48k79k7K27k72J03J53k8q1q8j5K61r3o6k5%O2j31J29j58K88
$$ -119 -87 215 -15 233 -46 -73 154 -118 -15 138 110 29 -59 -74 187 94 28 3 3 65 -66 63 -95 193
2958A93j36r7J95k51nK69p3J46m12J76q7O5q9J6p0L49k2l25N7j1L81k33o8m5K77
$$ 193 57 -40 155 -96 -101 168 95 241 -171 5 -82 -17 -106 -90 -160 189 167 -158 -101 -112 269 36 -32 -77 200
2983B00m34M6n9O63n49J55j33N1J59k7k11J70K24k8l17K13m6n7k7p7K03j57N1
$$ 200 -234 -188 -247 416 -133 22 -111 -60 99 72 -139 31 255 227 -90 123 77 20 -7 -84 119 -38 13
3006A3n0J0n0j2K04q7J22k37j60J32j95N36j76L6q2j02L4j9J16M1P8o7j02N6l7
$$ 13 -37 -27 -77 -89 115 28 150 -87 -247 -115 -310 226 50 86 4 -98 -64 -83 33 74 152 85 -17 39 2
3031Bk2K65k02j5k85L57l75L04R5m8j66J86l03K87l01L32l11j04L56q3J24K1P7
$$ 2 -20 245 43 28 -257 100 -275 29 124 76 -90 96 -207 80 -221 111 -200 -304 52 -31 93 114 191
3054A91K9k20%L0L9j54L64r4j41M2m0k98K8L03j88J38J39K4k83J79l8Q6m16M41
$$ 191 220 0 0 30 69 -85 279 185 44 86 46 -252 -224 79 -109 29 168 192 -91 88 50 136 -280 161
3078A61l21L14m13M82j57j50%J49l8j20j73M31R8j1k56rK4P8p6j87q4L0J73j2
$$ 161 -160 154 -259 223 66 -84 -84 65 27 -93 -266 165 263 252 -4 -13 11 89 13 -174 -258 -228 -55 -67
3102f7O8L06l42q5J12q6R3j54M6N6K41j18lj23j39P2J76N5j01L00j81n4p7K9J38
$$ -67 1 307 -35 -120 -8 -94 -1 -155 -109 -53 188 70 67 -56 -195 -123 53 108 7 307 126 72 -5 24 162
3127A62ll97J88j02J81l6l0R5l5L40l73P7j58K07k97P4K75n1j07J09k11n6K02
$$ 162 159 -238 -50 -152 29 -7 -37 58 23 363 -10 67 -91 116 -181 -107 168 117 10 119 -92 -148 54
3150E4j94K55k41J10P9j5J1k54R9o4K41j0Q5j12m0r8j7J86J58k23o0j22L6J2R9
$$ 54 -140 115 -126 -16 63 48 59 -195 -96 -160 81 71 156 44 4 -94 -111 75 233 10 -50 -172 -136 -124 -25
3175b5N0o9J1O2J29j21k36J18j03J45J03k22K79j74o5J88k66J66k7R2K56l87J37
$$ -25 25 -44 -33 29 158 37 -199 -81 -184 -39 64 -158 121 -53 -118 70 -196 -30 -57 35 291 -96 41
3198D1k78Q2K12P6j44p4J79j38J7j07q9J70R7k8kk6j02j05L66N8O4l87l8J06j04
$$ 41 -237 -155 57 133 -11 -85 94 -44 -27 -134 -223 -53 44 16 14 -12 -114 -219 147 205 269 -118 -156 -50 -154
3223a54K46M1O3j43O2q1l35K88P1k61J28Rj71J85J94j96o3K87j42j38n8L71k29
$$ -154 92 133 196 53 115 34 -301 -13 58 -203 -75 -66 -237 -52 142 -54 -117 170 28 -110 -168 203 -26
3246b6J42Q2N2k21J84j17Pk22j3J38K06k89J92N7o2j18O2J7j66P7K5k6j8r1J55
$$ -26 116 198 250 29 213 96 103 -119 -132 6 212 -77 115 172 110 -8 54 71 -95 -18 7 -19 -37 -128 27
3271B7k78K79L6q6k33J87K25j19o9J06k1k70L35l36J46N7J91k43p3K38n7l2k1
$$ 27 -251 28 64 -22 -255 -68 157 38 -31 75 54 -216 119 -217 -71 -14 177 -66 -139 99 42 10 -11
3294a1J75k48l5L56m55K19K24l16j5P9L5L09l08l0JN5j40K26j24l5j34P6J90j57
$$ -11 164 -84 -119 237 -218 1 225 -91 -106 -27 8 317 9 -21 -20 35 -105 121 -3 -38 -172 -96 94 -63
3318f3O4m7K50p1j77J61J5r0j09M19k22R4j76j11M3l1J56j80oR7j7l7q4K31J54
$$ -63 1 -46 204 133 -44 117 132 42 -67 352 130 224 48 -63 -20 -51 105 -75 -81 16 -1 -38 -122 109 263
3343B63m42J65j35MK95k39K32k50q0K35M0j09k24J33J32R0j24J41k70R8k9o7J54
$$ 263 -179 -14 -149 -145 150 -89 143 -107 -187 48 88 -21 -245 -112 20 110 -14 127 -143 -45 -74 -141 13
3366A3k14J96k11K21J61k90J29o2K7jJ22j04oJ01O7jR8j49p7j44J69n4K2j07K98
$$ 13 -201 -5 -216 5 166 -124 5 -57 -30 -31 91 -13 -19 82 149 148 246 97 20 -124 45 -9 13 -94 204
3391B04j79P4J21j72q6j0n9J31P2l6r9L0J75j46M4k18j8L55q8q9J07j46K62p5
$$ 204 25 99 220 48 -38 -48 -107 24 96 60 -39 -9 166 20 64 -154 -172 183 95 6 113 -33 229 154
3415A54k48j0J9J8P7K33j42K1M3k2j15L9k63J95J85o9k13p0K03O2O0k51K62k22
$$ 154 -94 -104 -85 -67 10 243 101 122 165 143 28 67 -196 -1 184 115 -98 -168 35 97 157 -94 168 -54
3439e4o8K41P1j15k59J34j02J63M2j17J15K0P7O4j81k1j09j50L90l26K56nl7R8
$$ -54 -122 119 190 75 -184 -50 -152 11 53 -64 51 71 148 212 31 10 -99 -249 141 -185 71 66 29 127
3463A27j67M9L2k0J56j41k54K35J26k8j04L08j14n09K07P8O6q2L6O9J60j62j10
$$ 127 -40 9 41 21 177 36 -218 17 143 115 11 319 205 -304 -97 -19 47 -35 1 70 230 68 -42
3486d2j72M00j59j70L63j17k86J47Q0j03qr2l05M44Q8r5j0k9J09K31k24l0j39
$$ -42 -214 186 27 -143 220 103 -183 -36 44 -59 -67 -159 -464 -20 68 -27 -37 -66 43 274 50 20 -119
3509a19J20j7J24q1l49N30l50Q7QK26n53K51j65L19R7n5l35K05P0q3K80l29M7
$$ -119 1 -16 108 27 -322 208 -142 -55 -47 179 -374 -123 -288 31 128 73 -262 -57 13 -70 210 -119 -72
3532g2r5R8J99k06l5R4j2j26J68R7j72J47j29J23l8J04j44Q9k47J44P4Q8K1o4
$$ -72 -167 -69 130 -76 -111 -17 -29 -155 13 110 -62 85 -44 79 41 145 1 90 -157 -13 61 149 170 106
3556A06J4k96J15q7J70j79N8Mj58J62R1kj01j39K31j01l4N2J19r0K7j12K34r0
$$ 106 120 -176 -61 -148 22 -157 -99 -95 -253 -91 0 -2 -103 -242 -11 -112 -146 -94 25 -65 -38 -150 84 -6
3580fj15J42k08K23J32j20j61K22m2q6J81k70l7J79j65k5J96q2M0J77l06QJ15
$$ -6 -121 21 -187 36 168 48 -113 109 67 -19 162 -108 -145 34 -131 -156 40 -42 -2 175 -131 -123 -8
3603hQ1k12j6J70Pj3R8l25K92J88m73M08l43j7J80P0k23K64k15K16k17J6J68j81
$$ -8 73 -139 -155 15 22 9 107 -218 74 262 -211 197 -146 -163 17 87 -136 128 -87 129 -88 -72 96 -85
3627h5J21J1r4P8J34j68j83M40r1j78j70K38o8q5R9M7q7RN8K86l32r6K18j29q3
$$ -85 36 47 -47 31 165 -3 -186 254 163 -15 -185 53 -15 -100 -1 46 -41 -32 26 312 -20 -116 102 -27 -110
3652a10J09k84J88R6j36L17j71j1j89j14K44M5J56k81J86j30K19m0l18J80k6k6
$$ -110 -1 -285 -97 -1 -137 180 9 -2 -191 -305 -61 -16 140 -141 45 -85 134 94 -224 -44 -70 -96
3674i6R7j18L69l91J44k05PJ66J32k34J83l4J6j7m3j43K38P8R0l03j48L60q3k
$$ -96 1 -117 252 -139 5 -200 -193 -27 105 -129 54 20 36 19 -24 -167 71 149 239 -64 -212 148 65 63
3698F3q4J52k59nL09l54j8K62M9j54J14k10j87J44J32j53M22l41Q7N4j4R1l26
$$ 63 -21 131 -128 -133 176 -178 -196 66 115 -39 75 -135 -322 -178 -46 -199 223 -118 -31 23 9 100 -226
3721b26K74j60j3J64P1M0k38K1q5L36k58J77j10j9r2K98J3j14j08k77L28J31j24
$$ -226 48 -112 -125 39 110 150 -88 -67 -152 184 -74 103 -7 -26 -118 180 193 79 -29 -306 22 153 29
3744B9J82j86k75J75P4K3m2J8J65l77J23J20M1j51J99j07n0L0r1k6K46k48R1J77
$$ 29 211 25 -250 -75 -1 22 -20 -2 163 -214 -91 29 70 -81 118 11 -39 -9 -100 -126 120 -128 -37 140
3768A40N1p6L2k92n9K33l1k2K16L4n91N14Qj2qP4r4k65J10n0K47j31J9J67l22
$$ 140 191 115 147 -145 -204 29 -2 -24 192 226 -365 149 157 145 137 211 117 -148 -38 -88 159 28 47 214 -108
3793a08p5K52m07L15M0M8O5k3lk49J27j00Q3K81k38j1R7q6l3J78l23j61L88l10
$$ -108 -183 69 -338 -23 17 65 130 107 104 -145 -18 -118 -35 246 8 -3 94 8 -25 153 -170 -331 57 -253
3817b53K99Qn9P6l96L90j22O8O8j57Q7r7J80k29K09j58no2N0O4J40j89N8K7k63
$$ -253 46 54 -5 71 -325 65 -57 11 79 -78 9 -88 92 -137 72 -86 -91 -153 -103 -39 101 -88 -30 -3 -266
3842b66K32j24q3L02k30J09L05L0k26j33K41j42J7k55J61J23LR1o1n8oK09l97
$$ -266 -34 -158 -241 61 -169 -60 245 275 49 -84 157 15 32 -223 -62 61 64 155 94 36 30 239 -158
3865a58K94n6R8o5Nj63M4p9q4J90n2mJ09j07o7R7k2M5k15J56p7J95j70J54Q7l03
$$ -158 136 80 178 113 118 -45 -1 -80 -164 26 -26 -30 79 -28 -95 2 -20 25 -190 -34 -111 84 -86 68 155 -148
3891a48J31J48k72J87m1J49p0K5Q3j78K09k50L18m52R1mo9K41j2K13k26R5k41
$$ -148 -17 131 -141 46 5 154 84 109 192 14 223 -27 291 -161 -70 -74 -143 98 86 299 73 168 -73
3914g3J32q9j79J59mj75K97j4q1j8j6j89J89RP8L7r7O7R5n7j98J72o5M2pp9K96
$$ -73 59 -30 -209 -50 -54 -229 68 54 -27 -45 -61 -250 -61 -52 26 63 -34 33 128 71 -127 45 -20 22 15 -64 232
3941B32l07j80M43j66K5j54J54L0k5J48j75Jn8j82K10k37L46j75J04J3k88K87
$$ 232 -75 -255 188 22 47 -107 47 77 52 200 25 26 -32 -214 -4 -241 105 -70 34 47 -241 46
3963D6q7k7J94L0j97l5j52L01J36j20j05j94L30r1N5M4k07P5Q7j22j43P6K18j72
$$ 46 -41 -68 126 156 -41 -76 -228 73 209 89 -16 -210 120 29 84 128 -79 -4 83 -39 -182 -106 112 -60
3987f0J17k7q0Q4K94l89%K0n1R8n0K22l85L29k45R9j20R3l3J31j2j32L2Q7J99
$$ -60 57 30 -50 34 328 -61 -61 -41 -92 6 -44 178 -207 122 -123 -24 -144 -51 -84 47 35 -97 -65 22 221
4012B21k35kn0K6r0K74j69p5N7N3R9M1J11l11NO2k17J56L32n32K74J58l69M11
$$ 221 -14 -16 -66 -40 -130 144 -25 -100 -43 10 109 150 261 -50 -45 17 -200 -44 288 -244 30 188 -181 230
4036B30k67M9k29K28l8l3J78p7J7M9j99L17n02N37k74j23L74k81J78j04r1P7J4
$$ 230 -37 12 -217 11 -27 -60 118 41 58 107 -92 225 -277 260 -14 -137 237 -44 134 30 -61 16 30
4059C0k86L39k26M4R9K47k78J01J10k08J01R8j56p0R2o4J5O6kk00J15R6J39l55
$$ 30 -256 83 -143 -99 0 247 -31 70 180 -28 73 171 15 -55 37 -27 -12 54 52 -148 -33 63 202 -153
4083a53J28J16j10L41m56L07l35O5J03J14k81L93j78K9j72J56j57L8o7L42q8J53
$$ -153 -25 91 -19 322 -134 173 -162 -97 6 120 -161 232 54 83 -89 67 -90 -52 -119 223 135 288
4105B88j16k90O7K97q5l05M8l2qm1j0J55M1m8N7K4j43J67j99J35R1l58J55K32
$$ 288 172 -118 -51 246 161 -144 -96 -128 -136 -177 -187 -32 9 -39 18 42 -101 66 -133 2 93 -265 -110 122
4129A22k58R2j71J78j74J70j70K60p3J89j89L7k7k29k7M4M12n3j48L2K8k11K30
$$ 122 -136 -44 -215 -37 -211 -41 -211 49 -24 165 -24 13 -14 -243 -270 -226 186 133 -15 17 45 -166 64
4152F4k82K18K12j59j61L09j49l54J92M9J24k13mO4O6j51M3J11K01l44K25O1r3
$$ 64 -218 0 212 53 -108 201 52 -302 -110 -61 63 -150 -154 -90 -24 -175 -132 -21 180 -164 61 122 29
4175B9R1j58k07L75k01j24J91J42j96J68n2r3L01m49L18j0j5k21J02K06p8m7k93
$$ 29 120 -38 -245 130 -71 -195 -4 138 -58 110 58 -35 266 -183 135 125 110 -111 -9 197 119 72 -221
4198b21L27J3q9J8j26M5k47N10k07O3j16J27k75J30j10J64J01Pj8J0k33J96J0
$$ -221 106 119 30 48 -78 -33 -280 230 23 86 -30 97 -178 -48 -158 6 107 114 96 106 -127 69 79
4221G9k73J3J18J3o3k6K51o8r8j07R4K65j54j01l6j35L77k66p4R0j03R9O4q5O3
$$ 79 -194 -181 -63 -50 -113 -139 112 44 -54 -161 -67 198 44 -57 -93 -228 149 -117 -191 -101 -204 -105 -41 -126 -63
4246f3r5J93j44J87n6j81M55k85j8K85j95J79j49k55J52l4J61k19MQ2m3l2j06
$$ -63 -158 35 -109 78 22 -159 296 11 -7 278 83 262 113 -142 10 -24 137 -82 -78 4 -39 -71 -177
4269a77L45N1n08L47k3j05K5JJ87j71Q7k63L93j97Q8j35j21K8K19K6j52O6p3J68
$$ -177 168 219 -289 58 35 -70 -45 -44 143 -28 59 -204 189 -8 80 -55 -176 -148 71 97 -55 11 -62 106
4293A06Q1k80K55j53P5nk13m9K45r8j34J91l8K44k59n5R6j15K45j38M6J93m16
$$ 106 187 -93 162 9 84 79 -134 -183 62 -36 -170 21 -17 227 -32 -87 9 -106 139 1 47 240 -176
4316a76K34n5J41k61J34n5k72L85q2k84M38K2j38Q9j59o8K08l95L90k4j64m1K54
$$ -176 58 3 144 -117 17 -38 -310 75 -7 -291 147 169 31 120 -39 -107 101 -294 96 72 -92 -133 121
4339A21q2K33j0l28RP2K58k49l2K33j56m1J44k53J01Q0j61o4K36j79l5N8n7Q8
$$ 121 39 272 262 -66 -57 15 273 24 -8 225 69 28 172 -81 20 100 -61 -125 111 -68 -103 -45 -102 -14
4363a4J57j98J92m61L31p2j57J49J69k00l2K1K37o6l2o6J04J69l42J29K4n5M5
$$ -14 143 -55 137 -324 7 -65 -222 -73 96 -104 -136 -115 122 56 24 -42 62 231 -111 18 42 -13 32
4386C2L9q0k4L32j50j18MN2m7P9k73R1M9rLL4J17k93M1n1l1J78m7K96k85J21k64
$$ 32 71 -9 -33 299 149 31 35 87 40 119 -154 -63 -14 -23 -20 14 131 -162 -121 -172 -203 -25 -72 224 -61 60 -204
4413b04K53J55k49K41l59L00m91L56J17k95M3J78M5j21J45l80J59L28k14Q1J83
$$ -204 49 204 -45 196 -163 137 -354 2 119 -176 -133 45 90 -31 114 -266 -107 221 7 88 271
4434B71l43j60M64k72j95K92K73j28J06l05J68nj67J54R5l74m1J35J15j85J10
$$ 271 -72 -232 232 -40 -235 57 330 202 308 3 171 166 -1 153 248 -126 -167 -32 83 -102 8
4455HJ8j06Q8k82K24l4L3j87K57j30l3K99j02j17J37j50J09J23o4J65j98p4n2
$$ 8 26 -80 8 -274 -50 -84 -51 -238 19 -111 -144 155 53 -64 73 -77 32 155 91 256 58 -16 -68
4478f8M2M5l04N01n0m54K55K00k00j33J84q8J11p9o9M19k08r3J30k91q6N36k30
$$ -68 -26 19 -285 216 166 -288 -33 167 -33 -166 18 -70 41 -38 -107 312 104 11 141 -150 -236 300 70
4501G0K2r3%j07J46J0k3OM6k21J27K19k94J74L4J2k46J05j18Q4P4k14J7J24R4
$$ 70 92 -1 -1 -108 38 48 25 31 77 -144 -17 202 -92 82 116 128 -118 -13 -131 -47 27 -187 -170 -46 48
4526D8J42j28j78j53M7J97J1k87M68r2L2J78m36L45k78o4K20L3J3R9k20J59k16
$$ 48 190 62 -116 -269 -222 -25 -14 -301 167 75 107 285 -151 194 -84 -148 72 105 118 217 -3 156 -60
4549f0o9K07k73L72q0j94nJ43j27k8RL17k62N0k17N08k67o7L5M0J5p1k1k1J99
$$ -60 -129 78 -195 177 97 -97 -102 41 -86 -114 -105 212 -50 0 -217 291 24 -43 -8 32 47 -24 -45 -66 133
4574A33n9L00p53K44J45J42k61j09K28J98l1j63r0k5o7L41l03K24j59J1K19k14
$$ 133 74 374 -379 -135 10 152 -109 -218 10 208 177 14 -76 -101 -168 173 -130 94 -65 -54 165 -49
4596d9K35j82k17J88r4J90L6m9k5K7k47L55N0k38R7j51n2J01R4r2R7j30j10J31
$$ -49 186 4 -213 -25 -119 71 107 58 33 60 -187 168 218 -20 77 -74 -126 -25 69 -23 74 -56 -166 -35
4620c5K19l56K63k0j59o3L38k74p0R6L9K13l36J59P8k1j39p6jJ28K03j74m1j34
$$ -35 184 -172 91 71 -88 -151 187 -87 -157 -61 -22 191 -145 14 92 71 -68 -144 -145 -17 186 12 -29 -163
4644a63J48J7M8J70l3k37K14m2l01J10K25j92J01l1N5l57K51oJ11p8k42M58j60
$$ -163 -15 2 50 220 187 -50 164 122 -179 -69 156 -36 65 34 89 -268 -17 -23 88 10 -232 226 66
4667F6j16QK15j63K13m56p4Q4N7R5k3J08l45J39J71qk7j76M06j00j02j23J72O9
$$ 66 -50 -42 173 10 223 -233 -307 -223 -166 -71 -94 14 -331 -192 -21 -29 -56 -232 174 74 -28 -151 21 90
4691I0K41n67J56m1p1J57M7J6j59J56r2J76j02K9O3l5j05R2j13O6n1J05o0J81
$$ 90 331 -236 -80 -121 -192 -35 12 28 -131 25 -67 109 7 36 99 64 -41 51 -62 4 -47 58 -2 179
4715A79k33nP8J80l1K3j59j89L3O2p7O1K9m0J16k22K30n9M0p1J44k57K00j89n0
$$ 179 -54 -59 19 199 168 191 32 -157 -124 -62 -139 -78 -49 -89 27 -195 35 -24 16 -55 89 -168 32 -157 -207
4740b07J26oK9K56m64L31N5k05j07K67Mj27K09r4m1j50M4O5L07j72n0n1k54K33
$$ -207 -81 -87 -58 198 -266 65 120 -85 -192 75 79 -48 161 67 26 -124 -80 -15 292 120 70 19 -235 -2
4764bK0j75k6L26m0n9j78L01j95n6L25l36Q3j04K14PR2l42J42Q8j49j88L68K69
$$ -2 18 -157 -183 143 103 44 -134 167 -28 -84 241 -95 -12 -116 98 105 197 -145 -3 85 -64 -252 116 385
4788C85n28J92L7j12K0mJ86j11j59k61L78K5J81l43J28L9o5P7j91L61j99o3k6
$$ 385 -143 49 86 -26 -6 -10 176 65 -94 -355 23 48 229 -114 14 53 -12 65 -126 235 36 -27 -53
4811e3K1n0K3K34k92K62m8j65J70l21L75Jk73j12J66J05k9L5P8K2j21q2J67l07
$$ -53 -32 -82 -59 175 -117 145 97 -68 102 -219 156 157 -116 -228 -62 43 14 49 127 149 28 -54 113 -194
4835a94K26o4m0J95M4k09j37M50k13M8k25J96o3k93M19j62K0p8K82k22j49K71
$$ -194 32 -32 -72 123 167 -42 -179 271 58 106 -119 77 14 -279 140 -22 -2 -80 202 -20 -169 102
4857A02l81J00J29J02k35K18J58q7k80J47j0j46N06k32j69J92L7l70J46K5J35
$$ 102 -279 -179 -50 52 -183 35 193 106 -174 -27 -37 -183 323 91 -78 114 151 -219 -73 -48 87
4878H7J40J0O5l45J99lj04j50P4N1J21k9K2j90O7j13K32l06L07o1l45K22P6K57
$$ 87 227 237 302 -43 156 153 49 -101 -27 24 145 116 138 -52 15 -98 134 -172 135 74 -271 -49 27 284
4902B84l81k44K11J08J42n75L18J36N3oQk23P1K63M6k43j40J97n5J17j80K00L1
$$ 284 -97 -341 -130 -22 120 -455 -137 -1 52 46 54 -169 -98 165 211 -32 -172 25 -30 87 -93 107 138
4925A38j2k63K54j3j04J01k29O4J05m7J21K2l19J47j06J73j41m8R6M25k97n6r0
$$ 138 126 -137 117 104 0 101 -128 -64 41 -6 115 137 -182 -35 -141 32 -109 -157 -61 364 67 11 -79
4948g9J10N8m4lj92OJ52j51j43K50R7j86P8J33k94K47m3M6k66J58l3n9K74j54
$$ -79 31 89 45 42 -150 -144 8 -143 -286 -36 61 -125 -47 86 -208 39 -4 42 -224 -66 -99 -158 116 -38
4972c8J63k56J22Q9j07j93L12M5j19K6r4J47r8p5J97m1M5k03L96m68O5J74l4j2
$$ -38 125 -131 -9 80 -27 -220 92 137 18 44 -50 97 -1 -76 121 80 125 -78 318 -150 -85 89 55 43
4996D3l47J47L72m26K49j52N5q2J41p6LJ58K3j78J28j05N8J0j48K05K8l23J72
$$ 43 -304 -157 215 -211 38 -114 -59 -141 0 -76 -73 85 108 -70 58 -47 11 21 -127 78 106 -217 -45
5019d5p6qL53q2o9q9J25r3K00j87k54J46o7p0J77J14j92P5O5J65n5k28oq6K77
$$ -45 -121 -129 224 142 73 -16 109 16 216 29 -225 -79 -146 -216 -39 75 -117 -42 23 188 133 -95 -101 -187 90
5044I0j03l2qq6L17j90N1P6K06m92M82m47L7J02j31j9Q5o1J27K68j02r8j71J90
$$ 90 -13 -45 -53 -139 178 -12 39 115 321 -171 311 -136 -99 3 -128 -147 -62 -123 4 272 170 72 -99 91
5068I1k23K14k9K0K05m06J20k13L74k70R7Q9j47L3K17j4l93J37J94O1j96K26m58
$$ 91 -132 82 53 73 278 -128 -8 -221 153 -117 -20 69 -78 -45 172 158 -235 -98 96 157 -39 187 -271
5091b71L98o05N58P4k43P5L0n1J30r3J62q2r2M6j46J31q0P3o2l5K70j59k65K41
$$ -271 127 -478 80 154 -89 -14 16 -35 95 2 164 82 -10 36 -110 21 -59 14 -48 -83 187 28 -237 4
5115DK0k45K74J57l73K10l1L3n4J67l81K04l9l09L13m4j7R7p0M1j2O1m8k4J07
$$ 4 24 -221 53 210 -163 47 16 49 -5 162 -219 -15 -54 -363 -50 -94 -111 -14 -84 -43 -55 6 -42 -66 41
5140D1K8j11l6M8J30Q7l56J51j02J84l5m5m0O7L7J4n2oJ39k53Q2j74L69j5n9J94
$$ 41 69 -42 -78 -30 100 187 -169 -18 -120 64 29 -16 -56 11 48 62 10 4 143 -110 -28 -202 167 152 93 287
5166B87m71K29j34M9j9P3j43J98j90n1M8K59j45m2j44L32j30J10j88J39kR4l60
$$ 287 -184 45 -89 -40 -59 14 -129 69 -121 -172 -124 135 -10 -52 -196 136 6 116 -72 67 65 159 -201
5189b01J75MJ94l07R3Rl08O45l54oL1L5m8K34j71k7%K52k23j06J32O3j06l50L40
$$ -201 -26 -22 172 -135 -42 -33 -341 304 -50 -56 -25 10 -38 196 25 -2 -2 250 27 -79 53 116 10 -340 0
5214@k70L71J23j49q8k97K85K01k63K1pJ49p3j7r6J60k88K01l2r5J06K28k33J47
$$ 0 -270 101 224 75 -13 -310 -25 176 -87 -66 -73 76 3 -14 -110 50 -238 -37 -69 -164 -58 170 -63 84
5238H4J62l59L08j94J51j61P2k18L29r2j24j08J68K51j89k28K09M1O7m2O0Mm17
$$ 84 246 -113 195 1 152 -9 63 -155 174 82 -42 -150 18 269 80 -148 61 102 169 127 187 191 -226
5261b26K02k46L71l67K26P3l3J12k74K05O8r3J5q5k0M5k3q4J4M03k14J04l8j84
$$ -226 -24 -270 101 -266 -40 33 0 112 -162 43 111 18 33 -52 -72 -27 -50 -134 -120 283 69 173 135 -49
5285d9M6J30j30KJ44j91O7j6J30k25m4J99j71N4K4p8j66K58J8J0Rj20J77l11J60
$$ -49 -3 127 -3 -1 143 -48 19 3 133 -92 -136 63 -108 -54 -30 -108 -274 -16 2 12 21 -99 78 -233 -73
5310g3J55K2n3R1l09J05K19K3k74J4n4K71J0k43K65j07j20j31K45l00K23Q2p1
$$ -73 82 104 51 142 -167 -62 157 180 -94 -80 -134 137 147 -96 169 62 -58 -189 56 -244 -21 61 -10
5333a0r4J09j88K82j33L50l53n2K18N7k56jJ13k30K06N8k32J06q0J49K3l03K20
$$ -10 -104 5 -183 99 -34 316 -37 -89 129 186 -70 -71 42 -188 18 76 -156 -50 -130 19 42 -261 -41
5356d1K4R2Lj74K9L33l30K48n38J131q94j30N80k55J7k43M38j23k25J93m17L43
$$ -41 -17 75 78 -96 -67 266 -64 184 -354 777 -117 -247 333 78 95 -148 290 167 -58 135 -282 61
5378F1k64OL61k64J60l7m1n0o5K5J06M1R1q4J8Oj44k9K28j37l1r2K93pl4j34J20
$$ 61 -203 -197 164 -100 60 23 -18 -68 -133 -108 -2 39 130 46 64 70 -74 -103 125 -12 -43 -135 158 151 117 -17 103
5405A03J0k1k67P4J67j74J51k45K84l17L80k98M56k48Q7j34j12L1l04K90M20m41
$$ 103 113 92 -175 -101 66 -108 43 -202 82 -235 145 -153 303 55 142 8 -104 -73 -377 -87 333 -108
5427a08j13O8Q4J22mj3k36l2K9L72n0K44m06K9pK82l25m8M9J34J5j62J82P6k08
$$ -108 -221 -153 -69 53 49 36 -200 -232 -203 169 119 363 -43 -14 -21 261 -64 -112 -63 71 86 -76 106 182 -26
5452b6l0P6q5J15j60K95k64K14l43L41j07L5J30m22O51j27l54J90l2j0k9p2Q6
$$ -26 -56 20 -65 50 -110 185 -79 135 -208 133 26 61 191 -231 420 293 -61 129 97 87 58 -14 72
5475G2o8j36R8K6J37J83j44J5l12J30mj47K50j53j81L81j89J33j68N6j86K94J42
$$ 72 4 -132 -34 -8 129 312 168 183 -129 1 -3 -150 100 -53 -234 147 -42 91 -77 -21 -207 87 229
5498B29j89J9j33K09j6K4q8J41j18j32j01K78pj40j79J26J21J6Q2j13K1j43j42
$$ 229 40 59 -74 135 119 143 55 196 78 -54 -155 123 116 -24 -203 -77 44 60 142 29 50 -93 -235
5521b35K41Q4j18j41J28j8l7K59l1k11o9%R4l7P7K9lj47J24m4J74r6j26j06R9
$$ -235 6 90 -28 -169 -41 -59 -96 163 132 -79 -148 -148 -54 -91 -14 15 12 -135 -11 -55 119 23 -103 -209 -110
5546a10K00O7Nq3l15J22k1Q8M5J99j37j28O3j05k4J52m9p9K19q2j17N4L28l16
$$ -110 90 157 162 79 -236 -114 -135 -47 -2 197 60 -68 -5 -110 -134 18 -31 -110 109 27 -90 -36 292 -24
5570b4MJ71P0j70j41J90k50j62J94mJ71r0Q1j25Nr3L1q5L45j19K24l01M0J27l26
$$ -24 -20 151 221 51 -90 100 -150 -312 -118 -122 49 -41 40 -85 -80 -173 -142 -227 118 -1 223 -78 -38 89 -237
5595b37N0J29qQ0LK01m03k3L53O5l36J71m6Q1k04L06K9L5n39L44O4l0j43J55m11
$$ -237 -187 -58 -66 14 17 218 -185 -208 145 210 -126 45 -1 80 -124 182 211 246 -293 51 115 85 -58 97 -314
5620c14J99J25k34J36M57n07J60r6J81j68L12l19q3J94j50K19k88J89n9K34j99
$$ -314 -115 10 -224 -88 369 -138 22 -74 107 -61 251 -68 -151 43 -107 112 -176 13 -46 188 -11
5641a1j8k00L47l8k12J44k16R9p5J36K75k07J60k60R7J41p0k51K5M6K48p2k72
$$ -11 -29 -229 118 80 -132 12 -204 -105 -180 -44 231 24 184 -76 21 162 92 -159 -134 -88 160 88 -184
5664a84P0R9Q5j2m6L0j11K1K08q7L9j42k35R2L01lP7j33m4J25M8j36Pj38oK0j28
$$ -184 -114 -15 70 58 12 42 -69 -48 160 73 112 -30 -265 -173 128 125 202 69 25 150 198 62 69 -69 -75 -55 -183
5691a83K93j59m7j5P2r4Q5L8K6o9K79l69J81J28k4J11k22j41J47N8l36J88l20
$$ -183 110 -49 -96 -111 -39 -133 -48 -10 16 -53 226 -143 38 166 142 253 31 -110 37 95 -241 -53 -373
5714c73N13q9k14K04J97k61N1k58M1K13j83L61l77L28j08j82N0K30k4l48L90j81
$$ -373 140 51 -163 41 238 -23 28 -230 -189 24 -159 202 -175 153 45 -137 -87 143 119 -229 161 -20
5736b0j76K65J08k60j89K64J60j41Jj75O4K11o8m0o5N9m2K2J02j06l3J98K5l02
$$ -20 -196 69 177 -83 -272 -8 152 11 12 -163 -99 112 44 4 -61 -2 -44 -22 80 -26 -59 139 164 -138
5760a38L07l97L14m9j94J67J11r5n0K89k23k20L5L23j36N7m6l31K65%J96k58J40
$$ -138 169 -228 86 37 -157 10 121 26 -24 265 42 -178 -143 180 44 101 55 -276 -11 -11 185 -73 67
5783F7k33J73Rr1R9j73L4K17m8k00ML28j20j92mJ35k3j03M89n98K79l1J28l16
$$ 67 -166 7 16 -75 24 -149 -115 102 54 -146 -142 186 66 -126 -130 5 -18 -121 368 -230 49 18 146 -170
5807a70J6K95k11J66p5QL7Ml17L04J27k10RJ22k00J8m3J09P4p8J61k55j76M24
$$ -170 -154 141 -70 96 21 29 66 70 -247 57 184 -26 -17 105 -95 -77 -120 -11 63 -15 146 -109 -285 139
5831A39j86M6J02k55K78P6k65K34r5J4Q1j70Q1l1o9Q9o0LK79k14k76K32k81J79
$$ 139 -47 -1 101 -154 124 200 -65 169 74 88 169 -1 80 49 -20 69 9 12 291 77 -199 33 -248 -69
5855f9N4J69n16K38L87k44Jj25o2RP8k16L83j41n7Q2J35k91J51M5p1k31M19l2
$$ -69 -15 154 -362 -124 263 19 20 -105 -167 -158 -80 -296 87 -54 -111 -29 106 -185 -34 11 -60 -291 128 96
5879I6l0j24j63J82L1r6K32l42N2R4J89j59P1j72J06m6J30m2Q9o3j68KJ94J81
$$ 96 66 -58 -221 -39 -8 -104 128 -214 -162 -68 121 -38 33 -139 -33 -79 51 9 98 35 -133 -131 63 244
5903B44j82k15K75j53J0%J7qQ5k56K20j5k7m0j72K5K07K4o1J8J73k47jQ7k06J41
$$ 244 62 -153 122 -31 -21 -21 -4 -12 73 -183 37 22 -5 -45 -217 -192 15 39 -22 -4 169 -78 -79 8 -198 -57
5929e7J24J2j07l30O38k84j2j33o8M5L52k79L63k13k02j1J11Q0P3j06j26K03j6
$$ -57 67 79 -28 -358 280 -4 -16 -149 -217 -172 180 -99 264 51 -151 -162 -51 29 102 -4 -130 73 57
5952E7l25LK93JJ62m96L98k37K00Q8l16K15K19j14l35K01J48r2m2k64L5P1J59
$$ 57 -268 -265 28 29 191 -305 93 -144 56 144 -172 43 262 148 -187 14 162 70 28 -236 -201 -130 29
5975B9m08N99l49K14j66O2M2j3J4j68M9J17O9m5J01r0j4k48J37j54J70J91l16
$$ 29 -379 220 -129 85 -81 -19 23 10 24 -144 -95 22 91 46 147 57 43 -205 -68 -222 -52 139 -177
5998a77J60j3P2r5p0K40k03j14M02k07J17M3k35J96M0K1rN6l20J07n0J1J51l1
$$ -177 -17 -30 42 -53 -123 117 -86 -200 202 -5 112 155 -80 116 156 177 168 224 -96 11 -39 -28 123 92
6022I2j20K07j58p5K63k03L1n8j82K51j33m0L78k86Qj36JJ2J90j58K79j38%J33
$$ 92 -28 179 21 -54 209 6 37 -21 -203 48 -85 -125 253 -33 -25 -161 -160 -148 42 -116 163 25 25 158
6046A58j18l24J05L8KK65j93j9K12m90M52j39OJ49j41j19L35k3k54L35k46N5j38
$$ 158 40 -284 -179 -141 -139 126 -67 -86 126 -364 88 -51 -45 104 -37 -156 179 156 -98 237 -9 46 -92
6069i2K73l43J25r2J1PK27j1kjok83J9O9LK79J07k73J05m1r3r6KQ9l31L73M9j28
$$ -92 181 -162 -37 -129 -118 -111 116 105 103 102 96 -187 -168 -99 -96 183 290 17 122 81 -12 -108 -106 -17 -348 25 74 -54
$$ [...]
8191B40
##END NTUPLES=NMR FID
##END=
