##TITLE=1H_DE-27EXT-X
 D2O
 8 sc, 
 23.11.2023
##JCAMPDX= 6.0         $$ Bruker NMR JCAMP-DX V2.0
##DATA TYPE= NMR FID
##DATA CLASS= NTUPLES
##ORIGIN= UXNMR, Bruker Analytische Messtechnik GmbH
##OWNER= root
$$ XWIN-NMR		Version 3.5
$$ Thu Nov 23 16:10:56 2023 Russian Standard Time (UT+4h)  she@DPX200
##.OBSERVE FREQUENCY= 200.1313
##.OBSERVE NUCLEUS= ^1H
##.DELAY= (6, 6)
##.ACQUISITION MODE= SIMULTANEOUS
##.ACQUISITION SCHEME= undefined
##.AVERAGES= 8
##.DIGITISER RES= 18
##SPECTROMETER/DATA SYSTEM= spect
##.PULSE SEQUENCE= zg30
##.SOLVENT NAME= CDCl3
##.SHIFT REFERENCE= (INTERNAL, CDCl3, 0, 15.7039)
##AUDIT TRAIL= $$ (NUMBER, WHEN, WHO, WHERE, WHAT)
$$ ##TITLE= Audit trail, XWIN-NMR		Version 3.5
$$ ##JCAMPDX= 5.01
$$ ##ORIGIN= Bruker BioSpin GmbH
$$ ##OWNER= she
$$ F:/spectra/data/she/nmr/H-F/1/audita.txt
$$ ##AUDIT TRAIL=  $$ (NUMBER, WHEN, WHO, WHERE, WHAT)
(   1,<2023-11-23 16:09:56.87 +0400>,<she>,<DPX200>,
      <created by zg, POWCHK disabled, PULCHK disabled
       configuration hash MD5:
       00 E9 B6 7A A2 85 ED C7 34 08 36 98 17 FE 4E 26
       data hash MD5: 16K
       0B D8 8B 57 33 90 C2 14 3D 9F 2F 1F 12 E4 02 70>)
$$ ##END=
$$ 
$$ hash MD5
$$ 42 29 AB 82 4E 37 5D 50 99 B7 2A 56 64 12 58 C7
##$RELAX= 
##$RELAX= 
##$RELAX= 
##$RELAX= 
##$RELAX= 
##$RELAX= 
$$ Bruker specific parameters
$$ --------------------------
##$DU= <F:/spectra>
##$EXPNO= 1
##$NAME= <H-F>
##$PROCNO= 1
##$TYPE= <nmr>
##$USER= <she>
##$AMP= (0..31)
100 100 100 100 100 100 100 100 100 100 100 100 100 100 100 100 100 100 
100 100 100 100 100 100 100 100 100 100 100 100 100 100 
##$AQSEQ= 0
##$AQ_mod= 1
##$AUNM= <au_zg>
##$AUTOPOS= <>
##$BF1= 200.13
##$BF2= 200.13
##$BF3= 200.13
##$BF4= 200.13
##$BF5= 200.13
##$BF6= 200.13
##$BF7= 200.13
##$BF8= 200.13
##$BYTORDA= 1
##$CFDGTYP= 0
##$CFRGTYP= 5
##$CHEMSTR= <none>
##$CNST= (0..31)
1 1 145 1 1 1 1 1 1 1 1 1 1 1 1 1 1 1 1 1 1 1 1 1 1 1 1 1 1 1 1 1 
##$CPDPRG= <>
##$CPDPRG1= <>
##$CPDPRG2= <>
##$CPDPRG3= <>
##$CPDPRG4= <mlev>
##$CPDPRG5= <mlev>
##$CPDPRG6= <mlev>
##$CPDPRG7= <mlev>
##$CPDPRG8= <mlev>
##$CPDPRGB= <>
##$CPDPRGT= <>
##$D= (0..31)
0 1.2 0 0 0 0 0 0 0 0.06 0 0.03 0 0 0 0 0.0002 0 0 0 0 0 0 0 0 0 0 0 0 
0 0 0 
##$DATE= 1700741396
##$DBL= (0..7)
120 120 120 120 120 120 120 120 
##$DBP= (0..7)
150 150 150 150 150 150 150 150 
##$DBP07= 0
##$DBPNAM0= <>
##$DBPNAM1= <>
##$DBPNAM2= <>
##$DBPNAM3= <>
##$DBPNAM4= <>
##$DBPNAM5= <>
##$DBPNAM6= <>
##$DBPNAM7= <>
##$DBPOAL= (0..7)
0.5 0.5 0.5 0.5 0.5 0.5 0.5 0.5 
##$DBPOFFS= (0..7)
0 0 0 0 0 0 0 0 
##$DE= 6
##$DECBNUC= <off>
##$DECIM= 32
##$DECNUC= <off>
##$DECSTAT= 4
##$DIGMOD= 1
##$DIGTYP= 9
##$DL= (0..7)
0 120 120 120 120 120 120 120 
##$DP= (0..7)
150 150 150 150 150 150 150 150 
##$DP07= 0
##$DPNAME0= <>
##$DPNAME1= <>
##$DPNAME2= <>
##$DPNAME3= <>
##$DPNAME4= <>
##$DPNAME5= <>
##$DPNAME6= <>
##$DPNAME7= <>
##$DPOAL= (0..7)
0.5 0.5 0.5 0.5 0.5 0.5 0.5 0.5 
##$DPOFFS= (0..7)
0 0 0 0 0 0 0 0 
##$DQDMODE= 0
##$DR= 18
##$DS= 0
##$DSLIST= <SSSSSSSSSSSSSSS>
$$ [...]
##$SUBNAM2= <"">
##$SUBNAM3= <"">
##$SUBNAM4= <"">
##$SUBNAM5= <"">
##$SUBNAM6= <"">
##$SUBNAM7= <"">
##$SUBNAM8= <"">
##$SUBNAM9= <"">
##$SW= 18.0517328524113
##$SWIBOX= (0..15)
0 0 2 0 0 0 0 0 0 0 0 0 0 0 0 0 
##$SW_h= 3612.71676300578
##$TD= 16384
##$TD0= 1
##$TE= 0
##$TE2= 300
##$TE3= 300
##$TEG= 300
##$TL= (0..7)
0 120 120 120 120 120 120 120 
##$TP= (0..7)
150 150 150 150 150 150 150 150 
##$TP07= 0
##$TPNAME0= <>
##$TPNAME1= <>
##$TPNAME2= <>
##$TPNAME3= <>
##$TPNAME4= <>
##$TPNAME5= <>
##$TPNAME6= <>
##$TPNAME7= <>
##$TPOAL= (0..7)
0.5 0.5 0.5 0.5 0.5 0.5 0.5 0.5 
##$TPOFFS= (0..7)
0 0 0 0 0 0 0 0 
##$TUNHIN= 0
##$TUNHOUT= 0
##$TUNXOUT= 0
##$USERA1= <user>
##$USERA2= <user>
##$USERA3= <user>
##$USERA4= <user>
##$USERA5= <user>
##$V9= 5
##$VALIST= <valist>
##$VCLIST= <CCCCCCCCCCCCCCC>
##$VD= 0
##$VDLIST= <DDDDDDDDDDDDDDD>
##$VPLIST= <PPPPPPPPPPPPPPP>
##$VTLIST= <TTTTTTTTTTTTTTT>
##$WBST= 1024
##$WBSW= 4
##$XGAIN= (0..3)
0 0 0 0 
##$XL= 0
##$YL= 0
##$YMAX_a= 158900
##$YMIN_a= -166131
##$ZGOPTNS= <>
##$ZL1= 120
##$ZL2= 120
##$ZL3= 120
##$ZL4= 120
##$ABSF1= 10
##$ABSF2= 0
##$ABSG= 5
##$ABSL= 3
##$ALPHA= 0
##$AQORDER= 0
##$ASSFAC= 0
##$ASSFACI= 0
##$ASSFACX= 0
##$ASSWID= 0
##$AUNMP= <proc_1d>
##$AZFE= 0.1
##$AZFW= 0.1
##$BCFW= 1
##$BC_mod= 2
##$BYTORDP= 1
##$COROFFS= 0
##$CY= 11.3945322036743
##$DATMOD= 1
##$DC= 2
##$DFILT= <>
##$DTYPP= 0
##$F1P= 15.7292609196834
##$F2P= 12.9074282941183
##$FCOR= 0.5
##$FTSIZE= 0
##$FT_mod= 4
##$GAMMA= 1
##$GB= 0.15
##$INTBC= 1
##$INTSCL= 1
##$ISEN= 128
##$LB= 0.24
##$LEV0= 0
##$LPBIN= 0
##$MAXI= 10000
##$MC2= 0
##$MEAN= 0
##$ME_mod= 0
##$MI= 1.114404
##$NCOEF= 0
##$NC_proc= 0
##$NLEV= 6
##$NOISF1= 3.799351
##$NOISF2= 2.8
##$NSP= 1
##$NTH_PI= 0
##$NZP= 0
##$OFFSET= 15.70392
##$PC= 1
##$PHC0= -24238.46
##$PHC1= 17.25269
##$PH_mod= 1
##$PKNL= yes
##$PPARMOD= 0
##$PSCAL= 0
##$PSIGN= 0
##$REVERSE= no
##$SF= 200.130013532006
##$SI= 16384
##$SIGF1= 3
##$SIGF2= 2
##$SINO= 400
##$SIOLD= 16384
##$SREGLST= <1H.CDCl3>
##$SSB= 0
##$STSI= 0
##$STSR= 0
##$SW_p= 3612.71676300578
##$SYMM= 0
##$S_DEV= 0
##$TDeff= 0
##$TDoff= 0
##$TI= <>
##$TILT= no
##$TM1= 0
##$TM2= 0
##$TOPLEV= 0
##$USERP1= <user>
##$USERP2= <user>
##$USERP3= <user>
##$USERP4= <user>
##$USERP5= <user>
##$WDW= 1
##$XDIM= 8192
##$YMAX_p= 0
##$YMIN_p= 0
$$ End of Bruker specific parameters
$$ ---------------------------------
##NTUPLES= NMR FID
##VAR_NAME=  TIME,          FID/REAL,        FID/IMAG
##SYMBOL=    X,             R,               I
##VAR_TYPE=  INDEPENDENT,   DEPENDENT,       DEPENDENT
##VAR_FORM=  AFFN,          ASDF,            ASDF
##VAR_DIM=   8192,          8192,            8192
##UNITS=     SECONDS,       ARBITRARY UNITS, ARBITRARY UNITS
##FACTOR=    0.0002768,     1,               1
##FIRST=     0,             0,               0
##LAST=      2.2672688,     0,               0
##MIN=       0,             -166131,         0
##MAX=       2.2672688,     158900,          0
$$ Real data points
##PAGE= N=1
##DATA TABLE= (X++(R..R)), XYDATA
$$ [...]
1894c5J16m9J67J4q3l54K77j9l7Mk0K92j48L8j16j46q6J1O9O2P8J8m2l95P14k13
1920A17k14k11J00J36K18Q3q5k35J35k71K11j11QJ51j24J63N6k16m1K5o6L1N2
1943h8mN9M0l0K84q3m70J65J59j2n4r7K70J50j01j1k27k21J67j24L21K5j49K69
1967B38l76M72m19J3K8j32j3K13K36j18M3j15j55n3L8P8o7m8K57K01k05Oj1m3
1991F8j85j39J33K08k04L06k19j8j8K76l65K48j31O0ON6Qk18J97l56N4M0R7J12
2015A6r6k3J27J46k52K29j46j46l29M22J84Q6k5l20L57n68J4K61K11K16l33J80
2037B11k42J40j85j23p3J90j68K06R3j29L12n06L46l0l30J19J30R9K90j55J17
2058C12l80L7P2J69j49J34k31K93j87J00L1k39l32L68Nj4K8o2k3L38l80K1p7l24
$$ y = [-35, 81, 32, 199, 213, 130, -224, 53, 34, -3, 1, -19, 273, 125, 163, 47, -99, -185, -174, -105, -43, 35, 53, 11, -384, 330, 117, -97, -308, -208, -72, 146, 229, 144, -91, 44, -227, -16, -127, -119, 32, -92, 71, 127, -89, -130, -105, -171, -140, -88, -92, -33, 7, -23, 261, 178, -292, -127, 32, 20, -34, -131, 139, 289, 188, 177, -50, -271, -104, -228, 93, 118, -31, 238, -138, 334, -85, -72, -44, -176, -189, 24, 260, 142, 185, 70, -85, -138, -100, -22, -89, -137, 120, 321, 116, 122, 111, 68, -117, -256, -123, 85, -119, 187, -32, -50, -68, 208, -157, 91, -40, 20, 26, 82, 90, -128, 69, -287, -233, -193, -96, 16, -80, -103, 24, 170, -82, 147, 1, -145, -474, -52, 132, 218, 193, -127, 230, -338, -324, -63, 148, 364, 31, 211, -31, 109, -76, -199, -272, -82, -250, -44, 49, -80, 232, -274, 72, 42, -288, -169, -39, 60, 350, 195, 312, -68, -31, 41, 210, 61, 195, -36, 257, 70, 170, 201, -38, -370, -2, 3, -11, 17, -45, -68, 270, -110, -89, -166, -490]
2082d90K44q4K29p1K48J69k00K9j34l7qn0J09r7L36m1K2j74K04j64p6k76M14r8
2106Dr6K24Q0j81j93L42k51k8M0N3J44j66J22N5k97K10j6k87K21KR4j32O6O6m07
2131c31J88L6Ol9L07l18J47J2n4K92r9k90J55p9l15M31J19k32O6o4J61r1j23j4
2155a29K4O7k09L88p0Q0o1Lk83k31M93m00M14o1L9k49R9j80N00o23K71L52m13
2178a79L48o9j73J21l63J68J59k44K48p1r2P0K65r8j56p2M3O2KJ34J9N4p4J63
2202B65j88k14J9J65N2j76K15L8k35J11o1j49k11J5L36p3j44K69M5O5jl05R6J86
2226A20j94J79j51J57j70K11q1k08J38J21l60K49jj54K06N6L15k05j92j23Q2j39
2248a44K45J60k75J69o5j34M9M3k27J64L4J26j09j33N1K1M0l43J52K84j63MJ44
$$ y = [-490, -246, -330, -101, -172, 76, 245, 45, 74, -60, -97, -105, -155, -46, -143, 193, 152, 174, 0, 204, 40, -36, -312, 102, 4, -92, 132, 212, 31, -162, 180, -71, -99, -59, -6, 138, -28, 94, 149, -148, 62, 46, -241, -20, -18, 76, -56, 10, 76, -331, -143, -107, -101, -140, 167, -151, -4, 8, -46, 246, 147, -143, 12, -67, -382, 49, 168, -64, 2, -62, 99, 8, -115, -129, -105, -38, -247, 141, 71, 151, 90, 93, -190, -421, 72, -328, 86, 25, 64, -185, -86, -266, 234, -389, -118, 234, -179, 169, 100, -73, 48, -315, -147, 12, -232, 16, -55, -147, -77, 188, 90, -66, -138, -95, -33, -31, 103, 122, 176, 102, 265, 77, -137, -118, 47, 99, -77, 138, 176, -59, 52, -9, -158, -369, -354, -18, -91, -235, 34, 79, 144, 143, -162, -66, 120, -74, 105, -46, 111, -59, 152, 71, -137, 1, 122, -238, 11, 10, -144, 62, 118, 433, 228, 36, -87, -5, -144, 101, 261, -14, 155, 90, -44, 5, 48, -179, -15, 19, 145, 36, -97, -46, -25, 15, -328, -176, 108, -55, -51, 93]
2271I3J30o1m85J39J97l01M3L13k06J96j83R1J5j26RJ1K79l78J81k48P3M10j89
2294Cj31r7K72K20k18j09p9J57p5K11q9q7J1p2J2o5J39JL60j02l64L67m46KK27
2319D8j42m2J6L6K48J19n66M45j80k8J23p4N5O8L6j90Oj40K20j38l9K5K37J0j7
2344A36j21m3K90l81MK43J4j5j19o2J60O1o02L45j4J04j64K71M4j49J14n8j63
2367a05q3M08o2k09pQ0l4L42k07j53j08p6J24K6J90k19J25Okk43L60l24J44o4
2391i1j6k4K49k5q0j02J2K7m1O5J03k88O3Q9l9J0J20q6m9K96K10j34p43M36j41
2416a79L20l75M08j15l36J79K61k24L02n12M56l41J87M4J11k83j67L0J46J27J01
2437A40R0k59q8m9K97k32J58J37K79m95J49L1j06j78M6j30J60l8L32j24j31k5
$$ y = [93, 223, 162, -323, -184, 13, -288, -245, 68, -138, 58, -125, -34, -19, -145, -136, -125, 154, -224, -43, -291, -218, 192, 3, -128, -225, 47, 267, 49, -60, -139, 18, -57, 154, 65, -22, -11, -83, -71, -136, 3, 4, 364, 262, -102, 265, -181, -179, 48, -94, -136, -120, -84, 164, 283, -283, 162, -18, -46, 77, 3, 58, 126, 162, -28, -22, -162, 58, -80, -119, -94, 143, 153, 136, 15, -28, 262, -119, -115, 128, 142, 127, 8, -54, 106, 167, -435, -90, -104, 0, -164, 107, 151, 2, 116, 58, -105, -188, 220, 158, -51, -58, 22, -12, 330, 123, -30, -138, -214, -90, -64, 126, -93, 32, 38, 36, -207, 153, -171, -27, -91, -107, -131, 118, 93, 13, -89, -77, -50, -91, -26, 77, -211, -148, -59, -98, -88, 32, -54, -103, 193, 403, 269, -474, -38, -179, 141, -234, 174, 59, -277, -98, 163, -61, 241, -271, 185, -156, 31, 75, 186, -97, -264, -234, -88, 39, 140, 230, -29, -117, -166, 131, -101, 57, 194, 473, -22, 127, 158, 52, -126, -80, -210, -50, -88, 244, 120, -11, -36]
2459c6k15J93j02L09q1n0J09j66K96j95j0j46K69l45J21K92l1j18k6k43J05q7
2481a57J94l9m6K55j49P1k10L20r6j03k24J12q0J19K70q9n4j48M6j37J90j13r3
2504a61M14j52p6j9J54j74k71K08J23P0j29n8J46j90K3kJ98J17k36l7o4J24o4
2527e6K11K03o33L61k74P6L77l28K29k4j8j15P9k22q4J85N2P0k81N8L34m99J58
2550a41K21J6j9k39R2J30k58L88j29q5j56J38O1j60K02Q3qq7j35P2J36j60j85
2573b23J97K3J90j20j46O4J69k59Q5k14J23JO5j26K80K11Jl05j05q3R7O7k5L7
2597DJ19j68J47J42j78j25j87N2O0j3K49l2J00k22J32Lk63m7R8M05j92p1L23j55
2621A81k80J45j62N9p5K79J9R6q8k13k20J84J37j98J25J3M63n56N9K99l84j77
$$ y = [-36, -251, -58, -160, 149, 68, 18, 127, -39, 257, 62, 52, -94, 175, -170, -49, 243, 212, 94, 68, -175, -70, -157, 37, -2, -48, 207, 58, 129, -81, 239, 143, 40, -184, -72, -152, -33, 237, 148, 94, -54, -8, -145, 45, -68, -161, 253, 101, 25, 6, 160, -14, -285, -77, 46, 116, -13, -71, 75, -115, -92, -94, 104, 221, -15, -52, -116, 8, -56, 155, 358, -275, 86, -188, -112, 265, -63, 166, 142, 124, 9, 88, -134, -218, -33, 19, 89, -192, -134, 200, -299, -141, 80, 96, 77, -162, -70, 60, -198, 190, 61, -24, -180, -42, 19, -141, 61, 144, 136, 49, -86, -14, 122, -38, -223, -26, -3, 187, 67, -79, -15, 154, -105, -20, -234, -111, -110, -45, -171, 109, 320, 321, 16, -89, -172, -75, -8, -33, 4, 123, -45, 102, 244, 66, -59, -246, -194, -134, -147, 102, 70, 170, -52, 80, 83, -180, -227, -129, 276, 84, 13, 336, 181, -99, 46, -116, -57, -132, 147, 166, 262, 174, -39, -259, -75, 62, -136, -11, 2, 465, -91, -32, 267, -117, -294]
2643b94J66j64L32O4m3K8q8Ok26L68j17m0j08j90M73M2k79J64j09jo1p1p7JJ76
2668d8J76L8j04j14O6j35J60l3j84K31M23m72L33m9k52k64j21J33Q2p8L70p9M1
2691A20j73n4Jj05j63M40o8J36R5J38j30j16k1k55J9N6J31J8r3J41J20j26j77
2714f6j74K98kp3K67k2J0r2k30P6j69k22J31K24J58j81L25L0k70Q4l22J7j49K86
2738f6j17N66m30P9L08l92J21j69K6J05J10J30l2J11k48R5k53k39j6L10j08L27
2760B18l8r0K57l86j17j8o9Q1J71J1K14j67o4J18l03L4J22n2K9J93M5J03j04j91
2784cp9j73K28j05J89q9L78j77j30n0l0Q2Q9m29L0M11J70m2j76j93N0Q2n18N39
2808E4Q8m6k32J82K39l72L13m18M7L1J30j74J52K24n1r7lJ4m35J59K12k30pK01
$$ y = [-294, -128, -292, 40, 104, 61, 89, 1, 7, -219, 149, 32, -8, -116, -306, 167, 209, -70, 94, -15, -16, -77, -148, -225, -224, -48, 128, 166, 62, -52, 14, -121, 39, 6, -178, 53, 476, 4, 337, 288, 36, -228, -349, -216, -134, -212, 158, 79, 120, -53, -107, -106, -211, -374, 66, -2, 134, 229, 367, 237, 121, 100, -155, -136, -80, 51, 69, -24, 117, 237, 111, -66, -240, 58, 56, -17, 250, 228, 238, 146, -84, -8, -177, -399, -268, -44, 114, -67, 258, 288, 18, 102, -220, -203, -352, -66, -183, 383, -47, 32, 340, -52, 69, -100, -74, 31, 141, 271, 239, 350, 102, 197, -56, -295, -311, -1, -109, 218, 180, 90, 347, -39, -156, -174, -243, -162, 9, 20, 234, 67, 3, 121, -182, -148, -26, -78, -49, 144, 189, 292, 188, -3, -82, -255, -27, -132, 57, -32, 346, 169, 39, -11, -41, 41, 130, -299, -269, 142, 312, 270, 94, -99, -49, 33, -485, 54, 142, 96, -136, 46, 285, -87, 226, -192, -145, -114, 16, -158, -6, 218, 167, 70, 67, 81, -354, -195, 17, -213, -220, -19]
2832a9K57j96j64M5j81K18j46K44J61j11J75j50o1l70L26k93j69N28j0R6n9K4
2854A45o2j34j95L0K38J36j43K1P1j0j87J43n14J91K92m37L48J50Q2rq4P0l07
2877a65M0j34M8J05L8K90j52p5L36k78n8j19J2J12O2K29Kk16l0n7k1jk34L8K32
2902D%N9J63j30k00K06l85N0M24rJ15k53K14j38k77J86l01J60P3J74j23R8N8j67
2926An8k2l0Q3P6k06L68j68Q0q0j24J54j34j05j83K17K17K3j51J55q5m6O3j5k31
2951b01k8M22N4r0J8j5j09j02L7J09k6k6K32j33q3l8J28l67n8K59J05P5K71k46
2975A88n5k81n1k7J41J70k21K87j68J9N9J06j51l46L41j35Q9QP0K76l0m1k85J94
2999A57m58J16K17J08K31j34k16J37j18j4N8j44j67J52N2J38n7J0j40Q9j53l7
$$ y = [-19, 238, 42, -122, -77, -258, -40, -186, 58, 219, 108, 283, 133, 72, -298, 28, -265, -434, 94, 84, 180, 121, 145, 83, -51, -246, -216, 22, 158, 15, 36, 107, 97, -90, 53, -461, -270, 22, -415, -67, 83, 165, 156, 72, 142, -165, -125, -259, -211, -106, -68, 222, 70, -5, 331, 53, -5, -124, -112, 0, 62, 291, 293, 77, 47, -10, -31, -32, -266, -228, 4, 4, 63, 226, 96, -104, 102, -283, -233, 191, 182, 297, 44, 258, 120, -157, 29, -272, -112, -39, 135, 12, 110, 168, 1, -57, -79, -109, -26, 50, -156, 212, 44, 124, 44, -80, 74, -60, -165, -348, -131, 86, 109, -42, 113, 28, -18, 45, 30, -201, -229, 193, 247, 157, 175, 160, 51, -51, -14, 95, 69, 43, 275, 142, 59, 21, 149, -218, -276, -17, 88, 163, 434, 188, 133, -148, -199, -226, -85, 85, -136, 151, -17, 2, 61, 167, 16, -330, 11, -124, -35, -27, 43, 319, 289, 248, -37, 157, -301, -185, 32, 140, 371, 237, 21, 158, 40, 26, 84, -60, -227, -75, -23, 115, 58, 68, -72, 17, -136, -173]
3021a73q2N95p2j28m8M3J03m78J41j67P7n3K61L60k52l2K4l79J87j70K8J73P0
3044B8J3J66J5j66Q9L8k98O9k10L18k05L78j67k3K42j04m49l6J84r0L64J2l28
3067a60M18k12j65Rj1j65K32J88q9K32n1k57Rj01j4j24K46K00p6J86j33J17o09
3090c30L13k75p9M27O5n9J32K5j78p7j38%r4J28J51o8R6J56j83qP0j63K18j30
3114ar7K8L51j46J3l19R2J27o7o9o5J07K62r6l7j73j41J78m9L45l22K17k27L99
3138C10l24j6Q6k49K96R1m14K1K93j5OK25l30j39Q9j26K81N6O5k80K76k38N1j14
3162i9n9M1p7NK34KJ16j51J55m10L59l96K21M3K1K28L2n3o6k23j95P4j54N23q5
3187H6L7l28M40k36N6j81j28J88J11O6j88J28l8J30k04j48M8K43k48K86M1j22
$$ y = [-173, -255, 340, 268, 140, 92, 135, 238, -240, -99, -266, -189, -242, 19, 379, 127, 95, 119, -260, -73, -243, -215, -42, 28, 41, 207, 222, 56, 145, 183, -115, -46, -256, 62, -143, 235, 68, 45, 287, 183, -266, -302, -118, -208, 156, 168, -160, 258, 46, -119, -110, -121, -286, -54, 134, 45, 277, 226, -31, -22, -123, -137, -261, -15, 185, 109, 295, 162, 279, -330, -17, -292, -371, 56, 121, 62, 194, 219, 41, -36, -174, -174, -268, -140, 11, -57, 39, 195, 12, 4, 74, -89, 129, -1, -98, -70, 281, 135, 148, -171, -79, 48, -19, -88, -153, -46, 216, 120, 83, -90, -231, -53, -102, 243, -79, 138, -89, 310, -14, -30, 56, -193, 103, 194, -220, -199, 94, 79, 85, 310, -20, -159, -70, -196, 85, 141, 206, -74, 202, -36, 15, -99, -158, -117, -194, -189, 45, 47, 163, 12, 167, -243, 116, -280, -59, -16, 5, 233, 265, 212, 146, -77, -272, -198, -352, 171, 86, 123, -205, 235, -1, 55, -126, -254, -66, 45, 111, -77, 51, 13, 143, -61, -209, -161, 82, -166, 120, 161, 39]
3209C9L22l33k26K81j12M8r7J74mR2j45l6j13k3J40j38k3K00MN2Q8m06M65o56
3233d07J97p8K50J77j38j09R2J21p5j87qJ67L9R4o0J19j29K65k82l3k97L17Q3
3256A18j73J28j11J87k57L42l65j13N6LK79j37O3J71j13j13O8k45J57j05R0j6
3278h6J77J3K88m27J76m71O8n6J97J81J76kk77K69k49Jk46j02L13j8n7K32K0j67
3302d7m4J08p2j46Q9j05L71j70L73j59l27L68n99L61k2J5J20k43L55k58J8r3%
3325a07k01K13J46N7j39L9K58j27j96j04l55J41K44J60NK0n9J80l05q5J33K15
3347A33j75k66M89n03L29r4j96M25n00M21l26N6K61M2m3J1p9o3q6J81j79m1K45
3370D2j78L98l07M6N6l73J96k93K03J96Q2kJ49j8l44J27k06L9K16j31N0K21K35
$$ y = [39, 361, 28, -198, 83, -29, 19, -78, 96, 92, 184, 39, 3, -110, -133, 7, -131, -154, 46, 50, 102, 190, -216, 249, -407, -210, -288, -38, 139, 1, -108, -16, 105, 30, -157, -165, 2, 41, 135, 75, 194, 65, 330, 48, 15, -282, 35, 118, -55, 73, -38, 149, -108, 234, -131, -244, -188, -185, 94, -43, 20, 191, 78, -35, 33, -212, -55, -160, -70, -86, 91, 104, 392, -35, 141, -330, -262, -318, -121, 60, 236, 234, -43, 226, -23, -22, -268, -370, -57, -75, -132, 100, 120, -47, -91, 17, -55, -201, -112, -217, 154, -16, 357, 198, -129, 239, -360, 1, -21, -6, 114, -129, 226, -32, -14, -107, -107, -308, -95, 51, 108, -31, 8, 266, 139, -57, -161, -516, -375, -131, 29, 34, 54, -5, 175, -130, -215, -82, 133, -42, -308, 181, -322, 7, -87, -283, 142, -358, 63, -263, -207, 54, 96, 53, 64, -15, -78, -164, 17, -162, -203, 42, -136, 262, -45, 1, 57, -316, -120, -413, -210, -14, 68, 66, 215, 197, -147, -20, -226, -187, 29, -102, -52, 169, 404]
3393D04j25l27j32L81k99L7L4J20K64j44k09O1j68j16o7J91r4K10K34k68k24K39
3415BR6k98l1K95k93K56J03j32jK08j25k63m01N29l3Mq0L30n2r4K4L6j08J60N
3440A37j72RK76k2p9J08k58l7J74k52R5O2q5J82j15Q1m28J97j63K32lJ26N3J83
3464C01j16j9l21M8j96J62M18r1k81P8pj15N9j39Q9l25O24j80L9j8K15j34k24
3487a33J07j5m1J50k53L02j35K88m4j5j85j76j82L36K78l11P9o2K33j90m1l06
3509c16R7J64J26j86K15L13m47J63j8q9j33j23L9M10l94K3L12l95L67k95M8K35
3531A16K4o3J15k33J88j7k41j8p0J3K28J2l61M04K4j38j49J04k5J33Q4J6K20j47
3555B19k45J8O9j86K38m34Q8R9K69J80k17k45j31L48O5m37J48J65p5L13p2l6l57
$$ y = [404, 279, -48, -180, 201, -98, -61, -27, 93, 357, 213, 4, 65, -103, -219, -286, -95, -189, 21, 255, -13, -237, 2, 98, -200, -231, 64, -229, 27, 130, -2, -3, 205, 80, -183, -584, -55, -88, -84, -164, 166, 114, 20, 44, 80, -28, 132, 137, -35, -26, 250, 228, 149, 257, -1, -38, 136, -116, -21, 41, -44, 138, 23, 104, -324, -127, -290, -58, -61, 65, 118, 301, 185, 166, -155, -107, -303, -141, 277, 186, -95, -17, -24, -139, -80, -219, -130, -455, 169, -11, 28, 10, 225, 91, -133, -26, -41, -82, 68, -185, 117, -18, 270, 226, 211, 26, -150, -332, 4, 282, -29, 50, -12, 221, 31, -10, -316, -219, -55, 71, -115, 100, 413, -34, 129, 111, 22, -111, -234, -195, 215, -179, -156, 156, -239, 128, -167, -119, 116, 140, 77, 192, -41, 147, 130, -111, -129, -199, -186, 42, 54, -307, 97, 121, -17, -166, -62, -87, 46, 130, 146, 366, 219, -26, -8, 61, -125, 113, -321, -233, -134, 135, 315, 98, -147, -278, 70, 135, -302, -154, 11, -64, 249, 177, 141, -216]
3578b16p2J87O2j14km5K18J23n0K6j78L5j9j69J11L25j07q4Q3r9l28J89J61ml7
3603dJ58k29K08l52J27j21K58p1j68L52k54p4K89r5P2j45J86k85Q3K56j4j35J95
3626B37l54N1j1j54K10M3N3j14J09k35M80m77K57k4L3j92l8P1O8O1O1k1k57Mn
3651a44J83j42j75J84K87j1o9j65R6l45J82k02M79r1N6j58J47R1j77oQ0j96J17
3674B1Q3o1K7j32K36m34J13J36k55L83r3L0j3J67r4k92P6m3J3L9j49L51k71K87
3698A25k00J54k75J36k3l4NJ80K02L8k35j24R8o9N1J63j88J0j11J5m5N2K54l64
3722a85J58n2jK5L1r2M01k11j36N9p4p1O4J12mJ70k57M0J94q0j72P4m5R8j17L3
3748c8K33lk45K78j29j94L2J0M3j46M33j58n8m7j02o7J25OM5r9J90J87j21j08
$$ y = [-216, -288, -101, -39, -153, -155, -200, 18, 141, 91, 117, -61, -26, -45, -214, -103, 222, 115, 31, 114, 15, -313, -124, 37, 33, -4, 154, -75, 133, -219, -92, -213, 45, -26, -194, 158, -96, -170, 119, 24, 96, -49, 137, -148, -65, 191, 177, 42, 237, -117, -66, -77, -231, -21, 22, 75, -39, 70, -165, 315, -162, 95, 71, 104, -88, -126, -55, 13, 74, 135, 114, -143, -139, -144, 39, -103, -278, -94, 193, 182, 113, -52, 44, -301, -119, -321, 158, 67, 123, -35, 112, 203, 26, 20, 100, -96, 21, 104, 43, 70, -62, 174, -260, -147, -11, -266, 117, 24, 54, 41, 208, 114, -178, -102, -145, -132, -93, -242, 109, -162, 125, -75, 79, -196, -60, -83, -117, -112, 68, 270, 308, 73, -51, 47, -22, 29, 192, 4, 14, -97, -82, -127, -75, 179, -185, -27, -79, -80, -55, -24, -116, 285, 74, -62, -3, -77, -148, -84, 28, 24, 194, -63, -23, 171, 91, -81, -7, -52, 46, -71, -38, 195, 192, -53, 225, 96, -98, -66, -56, -13, -159, 274, 116, 58, 11, -91, -158, -33, -27, 18, -81, 109, 296, 175, 67]
3772F7j35K28j7l91L50%J73k07RJ26l74K04r3k62L41j36K57l0Q8l8m05J58r1K63
3796H5j41J55n0j4J42n6j57J78k64N86k72J61k06k65L28l24L05j20n2k78J19J23
3818a7n2j04M38k78j27J68j94J13j53L03j87J16k1J14K5k60OJ01Q5p0K05p0l16
3841a75J42j70K2Q9J36k38L77j04p7M9j14Q2M3J38k78KJ42M7M6Q3j1l28R0j40
3865a47J84M9l09N29l07K54k56K27l40M3J94n19K39O7J61J69j55%q6k59L43K0
3887A01k31J84n3K36j35j54J82k26K02k70p6p7M13j53N6j66K14l61K05r7J59J39
3909I2lk0J00m8M5l7l17nK52j28N4j06L29l65R8K32n39L88R0j95J2M82m75R6k23
3934a91J30R5k48J81N4J60k66J56J59l70K87L4q3m63K35M4J83j02P1j26P6o5J50
$$ y = [67, -68, 160, 143, -248, 102, 102, 275, 68, 77, 203, -171, 33, -60, -322, 19, -117, 140, 110, 198, 160, -245, -87, -178, 85, -56, 99, 49, 35, 177, 121, -36, 142, -122, 464, 192, 353, 147, -118, 210, -114, 191, 71, 19, -259, -140, -17, -69, -173, 265, -13, -140, 28, -166, -53, -206, 97, -90, 26, 5, 119, 144, -116, -110, -9, 76, 6, 211, 141, -175, -33, -203, -181, -92, 44, -194, 183, 79, 2, 51, -63, 19, 62, 200, -78, -76, 66, 113, 159, 242, 231, -97, -7, -147, 37, 86, -223, 306, -1, 253, -3, 224, -116, -73, 121, -398, -159, -92, 69, 238, 83, 83, -3, -262, 81, 101, -130, 54, 1, 237, 102, -52, 130, -96, 106, -164, -240, -317, 96, -57, -1, -167, 47, -314, -109, -206, -47, 92, 89, 69, 169, 121, 166, 129, -188, -193, 59, -69, -15, -121, 208, -157, -59, 173, -366, 22, 112, -83, -71, 411, -64, 32, -191, -61, 34, -214, -33, 21, 181, -85, 71, 230, -140, 147, 181, 98, -365, -130, -86, 97, -5, 66, -60, 16, -49, 101]
3957A01j60%K32k36L15l15J53j09l9P6L9j29M03j38k94J8QKM41m14k41K60K02
3980A75k22j60M35r9J34l27J8K6N7Ok07Q5J90j35R3q4O4j50K45k54J2J68J3R4
4004A77l2m09mK62J6qpj0M26n29L32M2l1m21J7J77M4o2Q0k73Q5L33l78L39l80
4029b14K06L43l04q3J95k72k21N01j92L9J2j07j04K41j31J12O1l42M33l49R9K1
4051e6J1K04k5P7q3k11j40J96j41L18l99M16k98J23k5L5r8K01k36J48R7Rn3lj69
4076a02OJ26j48k5K16J7j57K4K84M3j92k64j50P44l14J00l17J38n2K2r3L65k40
4099C1j13p7M04k55l1K9r2k22K62O9N5k40J40O3j52kj2L6P8M21o40K21K83l00
4123d4J94q5jM7k73n2r7J53K05k27QJ65K8J57r6j99Q0j79O0K90j70j48O9J15j95
$$ y = [101, -59, -59, 173, -63, 252, -63, 90, -19, -58, 18, 57, -72, 331, 193, -101, -83, -75, -73, 368, -46, -287, -27, 175, -47, -207, 228, 129, 263, -64, -46, -20, 37, 43, -164, -79, 111, -24, 69, -15, 49, -101, 144, -110, -98, 70, 83, 177, 145, -264, -268, -6, 10, 2, -5, -15, 411, -118, 214, 256, 225, -196, -179, -2, 42, -20, 60, -213, -128, 205, -173, 166, -214, -8, 335, 31, -52, 143, -129, -350, 151, -41, -2, 10, -97, -201, 40, -91, 21, 82, -260, 173, -176, -77, -56, -45, 159, 134, 211, 128, -83, -223, -27, -168, 150, -249, 167, -131, -8, -33, 2, -96, 105, -131, 17, 114, 123, 70, 67, -102, -96, 30, -118, -143, 73, 90, -67, -43, 241, 284, 92, -172, -322, 422, 108, 208, -109, 29, -23, -1, -94, 271, 31, -82, -159, 245, -10, -41, -12, -104, -326, -64, 5, 60, -180, -40, 23, -129, -131, -143, -107, -29, 392, -248, -27, 256, -44, 150, 65, 64, 111, -162, -214, -311, -158, 47, -180, -172, -7, 21, 178, 82, -117, -37, -216, -156, 134, -36, -184, -115, 0, -195]
4148a95J88oR6r4o9k17M29k41L02j38M8j65J37p2j04j02M0L12j56m7n8L39j35
4171I2l00J96J08j41j10J36O8m0jj91Q9L3Qj75L09k10K79k25l5m5o9K23j87L80
4195A92n26K85N6J30j65j3j85K99j31J80k15J5Pn7j21J1N5K65Q0j06j15m0p0J24
4219d5J57l2O3o0j21k18N21k96l7L52n9j15p4l8m0j21J96q3p5K9J53M0k46J96
4243D7K06l2j24k33K20k24R3J43n7L0J58k34Q4J46k90J05M4J11k02N6j32j24J77
4266c2J07m4J39k78J78k8k0M0J31j35l6p6J23K6J78l14L6k7J81J43m01P0n4J50
4290E7j48J64j87J06J28k36J97k01j42K44J62j66K6n4k8QJ63j78P3L7p0J19j4
4313F0l7j46L40k36J80l42J22LJ00R5l64K9N8J12j10K04P1l38J84L8l0kJl41M80
$$ y = [-195, -7, -13, 83, -11, -80, -297, 132, -109, 193, 55, 103, -62, 75, 3, -101, -203, -163, 149, -7, -54, -112, 227, 92, -208, -12, 96, -45, -155, -19, 49, 9, 8, -183, -94, -61, -53, -228, 81, -129, 150, -75, -110, -155, -224, -1, -188, 192, -334, -49, 7, 137, -28, -41, -226, 73, -58, 122, -93, -78, -71, -128, -249, -238, -183, 82, 162, 56, -59, -99, -169, -45, 112, 80, 143, 83, -38, -256, 265, -31, -68, 284, 225, 110, 36, -2, -42, -163, 33, -50, -125, -96, 57, 97, -149, 47, 253, 221, 97, -136, 84, -140, -47, 96, 39, 69, 227, -7, 77, 223, -67, 38, 82, 193, -9, 47, -85, -209, -32, 75, 31, 170, -108, 70, 42, 22, 62, 193, 58, 22, -54, 69, 95, 273, -41, -5, -32, 149, 292, -109, -39, -93, 57, -91, 73, -114, -8, 120, -116, 81, -120, -262, -18, 144, -22, 4, -50, -78, -70, 93, -85, -12, 25, -45, 74, 60, 23, -123, 217, -19, 161, -181, -59, -56, 44, 139, -225, -196, -138, -26, -136, 68, 139, -199, -15, 23, -7, -9, -8, -349, 131]
4338A31p5n6J36k11J37q1J43k16K21l30p3K20j64K05k80L30L3k23L67l08J76P9
4360A61j54J92k41KQj04Q6M5j39L22l51L26J2j10k15M13k34r6K6l8j0J27J90j49
4384F9M6rk32J83K6r1J29j55L0L8l34K7K67q1rL03l02L18j73k4Nj86J52J2j33
4409a24J40pl4k36L10j27j79K86o3o4R9q9J0P3J37K6k9j56k2K9j99j6J17J65n0
4434cJ93k06N1j11j80K66n9j44K4K20J55ok13JJ88k91R4J9j55RJ47j35K9l6K88
4459A45k62J25J3m18O24j13m00K58k5K3%K90l48K19j11k50L56q8l8n1M0j11J15
4482gp0M91l31l05M76k28L3N0r7j05P3j17L39l56K11j16j07J36j25L57k84J61
4504G9K8p1k47L19j92pJ46k50K51K4j07M0j58K11j11M07k34j36M9L5j03N2OK8
$$ y = [131, 56, 0, 136, -75, 62, -19, 124, -92, 129, -201, -274, -54, -218, -13, -293, 37, 70, -153, 214, -94, 82, 161, 7, 199, -42, -40, -32, -136, -50, -5, -144, 178, -173, 153, 165, 55, -160, 253, 19, -77, -51, -89, -99, 28, 218, 69, 115, 106, -126, 57, 83, -8, 121, -34, -4, 34, -300, -273, -6, -87, -96, 207, -95, 223, 50, 26, 31, -155, -3, 9, -124, 16, 9, -25, -261, 49, -78, -257, 29, -34, -98, 1, -88, -78, -5, 132, 158, 129, -27, -49, -20, -219, -235, -118, 47, -3, 190, -16, 35, -76, -256, 10, -49, -193, -169, 51, 206, 200, -13, -12, 176, -115, -21, -2, -157, -148, -1, -136, -107, -143, 145, -117, 8, 21, -397, 227, 114, -286, -28, -53, -30, -30, 260, -88, 131, 20, -230, 126, 38, 0, -51, -11, -122, -7, -77, 414, 83, -222, 254, 26, 59, 109, 12, -93, -20, -137, 202, -154, 57, -59, -166, -30, -155, 202, -82, 79, 107, 36, -211, 108, -84, -91, 55, -195, 56, 80, -27, 13, -145, 66, -45, 362, 128, -8, 41, 76, -27, 25, 31, 59]
4528E9j36q6K20J6K5J43m37J84J12j39p1j8K64j80O5rr5j93K20l3m0J32j41J53
4552A5j9P3J76l7j34M5n9j82L2j7L62k51r4K0M46l30l79J43K26l3K61o45K67J21
4576Gj26L32m14K73k05l6M25l92L15j07j76OO0j41K29M6k15j5N04m75K17k8j82
4599i8j9K4j89j55M04j37L02R1k08j27k06L54r8J45r5k34K31j74J53J51j82O4
4621cl13K97O3M7P0j14k46J87j00J95J24l37K05k08J05r3Q7r9K41j80n4J36L5
4644D5P5n26M26k43L25l11K37l31J77R6M3N0j48L42k97O1J01q2M8j25m8L2L20
4667B67k94K6O7j22J05j57J04L26k48j99M22k27Mj80k21L33j18J06j3n9J31J83
4689B36k41K9p1K9N4J10j60L8J05j73k21K85j60K49K0q5m5L6N7k86J59K45k62
$$ y = [59, -77, -163, 57, 73, 98, 241, -196, -12, 100, -39, -110, -128, 136, -44, 21, 12, -83, -276, -56, -89, -129, 3, -138, 15, -4, 69, 245, 208, 74, 119, 60, -122, -90, -107, 255, 4, -90, -70, 376, 46, -333, -190, 36, 3, 264, -381, -114, 7, -119, 213, -201, 72, -133, -169, 256, -136, 179, 72, -104, -98, -38, -179, 50, 96, -119, -134, 370, -105, 112, 84, -98, -117, -93, -282, -437, -33, -170, 132, 223, 15, -112, -318, 36, -62, 83, -12, -246, -15, -189, -36, 115, -67, -3, -316, -19, 44, 91, 161, 47, -199, -12, -112, 83, 207, -130, 75, -133, -28, -121, -34, -133, 108, -72, -126, 10, 45, 120, -406, 20, -223, 102, -209, 28, -303, -126, -30, 13, 63, -85, 257, -40, 21, 122, 40, 88, -37, -85, -53, 267, -27, -1, 66, -56, 49, -108, -4, 322, 74, -125, 297, 70, 74, -106, -327, 6, -112, -6, -19, -78, 53, 236, -5, 24, -47, -18, 36, 146, -14, 24, 129, -44, -265, 20, -140, 109, 129, 44, -1, 35, 92, -194, -35, 210, -52]
4712e2q2m1J04Pk7k2J19J51k22J08n8j48L40j46m9K09k0l66K85k13J69K5j27M72
4736D16m88J51m3K07l20k53K05r5L15LJ46n16K89L1o1P8m0k25K69l15P5J56J2
4759cJ06k44L7K21n55K00J58K15j93M9m5J85K9m02K41k02L54j68J29k92J98%J70
4782A88o7l2J25j34k49J95k6r0L3J12j17j17L21j07L4j24j24J98j67k85N24r5
4804dj50L74l55J70j6L3j01k7oQ3K5L2P1r9k91L57k20o3J49M8M2pJ85k52k14L13
4830G7j79L10j54j40jL3j05K7J80j50J47k6j03J59r4J10k10L4L6j57L6J78k2J63
4854A49j37P2j49L81l55k08L22J85k16O6m04K61J40K10m90M43m01O9m0k1J00j07
4876a30J16q7J89j2J15K4l00n9K91n6j80k6J18M2l9j63J37P0k41l2L85j64K19
$$ y = [-52, -134, -175, -71, -64, -91, -113, 6, 157, -65, 43, -15, -163, 177, 31, -18, 191, 171, -195, 90, -123, 46, 71, -56, 416, -72, 79, 36, 243, -77, -330, -125, -220, 95, 98, 244, -272, 17, 48, -13, 65, 25, -200, 69, -246, -171, -15, -3, 103, -141, -104, 117, -438, -238, -80, 135, -58, -9, -54, 131, 160, -242, -1, -203, 151, -17, 112, -180, 18, 18, 188, 121, 89, 214, 80, -169, 26, 0, -90, -57, 55, -62, -179, 142, 35, 69, -55, -179, 19, -148, -433, 91, -4, -154, 220, -135, 35, 19, 52, -49, -76, -82, 1, 26, 58, 129, 30, -261, 96, -124, -187, -38, 10, 52, 45, 230, -22, -236, 77, -102, 208, 54, -86, -87, -54, -159, -132, 48, -102, 45, 19, -84, 75, -19, 91, -119, -85, -49, -206, -170, 8, -14, 149, 12, 84, -65, 316, -39, -247, 75, 260, 44, 110, -294, -33, 107, 317, -173, 270, -131, -62, -102, -123, -23, -130, -14, -101, 88, 76, 191, 215, -85, -144, 147, 91, -89, -115, 3, 45, 6, -157, -20, 50, -191, -223, 162, -2, 217]
4899B17p0l60J58K60k93J37K3r7K26m11L37l00M72m13L13j19L0l03J21J60k30
4920a42J04K49K83m26Oo2l64L01P5j12l3L05k60L2K9n6L28m42J06J83l25K89J92
4943B60n68J45n6L26kP9j63J7K81j78k39M7J57m2K59j78k63J28K19j14o0M0O2
4966A57j97n3O1J06l01K49p4J35m2Lk22K97j40n4L05k08J22n2j56K7j48J37j24
4989a72J86n7K62j48R2q2j89K00j71K41M7k91O8L20l45J16k28R4J34p7M4K7k37
5012a66N0Q4L8K0L26l19k71K28j0j3K83k38J03k52K34j33k18K80J91l25k10L05
5034a3j40J89j08J32j36k4K4P7J97k22P0o8m0j8J70l58J15L90k64J07p8n6J8R2
5058E6JJ03j16K7P1l0j50P4L06l01j56L72j38k32J21P4j6k2N4j1j11j2p2j54L05
$$ y = [217, 147, -213, -55, 205, -88, 49, 72, -25, 201, -210, 127, -173, 299, -114, 199, 80, 110, -193, -72, 88, -142, -38, 211, 494, 68, 74, 12, -352, -51, 24, -88, -121, 184, -76, -44, -15, -71, 257, -185, -79, 104, -221, 68, 260, -308, -163, -219, 107, 105, 184, 21, 38, 319, 141, -98, -51, 106, 64, 323, 145, -118, 10, 229, 115, 55, 95, 157, -40, -93, -32, 74, -227, 22, -52, 83, 41, 44, -178, 119, -21, -75, 230, 22, 144, 92, -64, -37, -185, -48, -172, 14, -43, 219, 71, 163, 81, -108, 92, -79, 162, 209, -82, -14, 306, -39, 77, -151, -57, 77, 0, 44, 71, -166, -116, -32, 6, 26, 352, 33, -238, -10, -20, -33, 250, 12, 115, -137, 97, -36, -254, 26, 217, -108, -318, -13, -153, 36, -72, 60, -76, -100, -76, 1, 198, -24, 46, -22, -62, -80, 90, -268, -153, 237, -27, 80, 2, -54, -36, 56, 57, 160, 44, 71, 142, 112, -38, 36, 342, 41, -115, 257, 119, -113, 8, 82, 66, 44, 98, 87, -24, -36, -108, -262, 43]
5083D3J40j40k58l6Q6m6O4L67j44k00J11N9Q4j19j69K8L00p6j25J85j61K45l18
5106h0%J14J03k12L03l29L42j9m14J91J10k40K35j18J73j21m9J48M4k14K25j09
5128H3k63J98K4O8k66L92l48KK9j78P2L89j51O5J9l61K8M79l90J22r7J15K6l58
5152c01J91J26K71j98j32n0M9K23j06l60M16j84K25k1k77k9K69j81m6Q8r8K57
5174A32l59K89N5m0Mj84K30j04K9P2n2j81J02M2p7K5P7l1K13l06J47j41J18l7
5198B3j39K26o4m0q1j06P6M2n3RK94l12j82K71J34j64n2K11j41J96k35pK04j29
5222a9m31L78N7q3N8j75J57m9J66L41l92n7K13o7k48K37o2k21J27j6o1K23M2l21
5246b03K0J71m4P7j26k41M29J97k96j8Mk51J46M8o0qK52M6k36J18J45l98K85J32
$$ y = [43, 183, 43, -215, -251, -165, -211, -147, 220, 76, -124, -13, 46, 130, 11, -158, -130, 170, 94, -31, 154, -7, 238, -80, -80, 34, 137, -75, 228, -101, 241, 222, -192, -1, 109, -131, 104, -14, 159, 38, -11, 137, 181, -33, 192, 83, -180, 18, 42, 110, -156, 236, -112, -110, -81, -259, -187, 202, 51, 116, 135, -226, -198, 281, -109, 13, -84, 31, 57, -301, -110, 16, 287, 89, -43, -93, -44, 179, 73, -287, 129, -55, 170, 149, -128, -157, 112, -69, -115, -27, -125, 132, -227, 62, 117, 77, 81, -103, 127, 23, 52, 124, 72, -109, -7, 35, -42, -17, 60, 29, 242, -64, 83, -58, 60, 23, -116, 110, 46, 6, -75, -181, -105, -63, -116, -107, 187, -125, -307, -36, 98, -66, -118, 93, -48, 148, -87, -94, 110, -19, -450, -72, -15, -98, -40, -215, -58, -107, 59, 400, 8, -49, 164, 97, -151, 86, 24, -197, -70, -86, -147, 76, 118, -203, -183, -12, -56, 21, -105, -346, 83, 280, -16, -34, -30, -281, -135, -87, -147, -155, 97, 143, -93, 25, 170, -228, 57, 189]
5270A89j27P1l08J56m9O4K47l15M5j37K17l6k7O7j06J64j70R6R8l10J27nO1j10
5294i8kJ07k38L08L2n4j83J62j39K07O5mj37J06k42M21k73j40j06K52j90L17j26
5317D5Nr6M7K0K09k86N3J5L36m60R2J07l28N43m58J76k0m6L11j44J35j49qo5p7
5342d3N6q3J95j35L44o13K26K04N1rj92K37l16K67m71M37o3j40K14j79j90L14
5364A11j80P2k0R2J40l22L9K96j0k25J78l85M75l68j17K21k18M05l44J16J17q2
5386iK13m13K01o2K09j83q4K81j07k22L56k11l39L09Q5O9o0J47j15k15L28l42
5408a64L36j03j08J82q4J36l13K7o4O2N1J03N8j8J03j14p5L18l69J9K02m29L57
5431A13M6j10j92J3K94p8l9l17K16j02L11k8j32P5k72J32J36j31M2J3o6K21m60
$$ y = [189, 62, 133, -175, -19, -68, -4, 243, -72, -27, -164, 53, 17, -10, 57, -49, 115, -55, 41, 139, -171, -44, -49, 12, -98, -100, 7, -231, 77, 109, 55, -128, 34, -105, 102, 167, 163, 26, 132, -110, 311, 38, -102, -208, 44, -146, 171, 45, 50, -46, 1, 21, 230, -56, -3, 12, 348, -112, -20, 87, -241, 302, -156, 20, 0, -46, 265, 121, 256, 107, 99, 34, -43, 13, -70, 125, -10, 334, -279, -53, 151, 202, 193, 1, 238, -78, 189, -282, 155, 92, -48, 166, -13, -203, 111, -69, 3, -17, 75, 215, -107, -68, 228, 218, -7, 171, -214, 261, -107, -224, -3, -221, 184, -160, -44, 73, -9, 204, -209, -8, -70, 139, -44, -128, 153, 46, -176, 180, -31, -370, -61, 24, 93, 33, 180, 65, -150, 178, -164, 172, 69, -39, 143, 59, 195, -118, -91, -155, -93, -42, 61, 119, 101, 204, 90, 15, 333, -36, -17, 185, -244, 113, 159, 49, -143, -130, 164, 86, 47, -270, -54, -156, 155, 127, -5, 70, -202, -70, 66, -65, -23, -10, -76, 145, -315]
5454c15K68k3j06J40K34q8M7k26J11J12j66J14P2j07O5L5O6k58r5JM9K66k38J35
5478I3j92j05K42j1R1k17k04L74J09K9l87K07j2k34%J16j46L45j21K87k78r4k2
5501a30O3K76j2j61l8J15m0k61K52nj59J79l41K26J59k95Q2l7K13N2j12M7q7J47
5525A33j99J70k77J61l1J19j19J18P4j75K38k00J31l26L85j75k84J96R9L9p0k5
5547a8M3J05k84L33l82K14J1k52M17k15K80j18l07K83k24P4j54M42l3Qjl96J0
5570a64O4J90k81L21k4k66j65L58Q0J25l78M48m45o6L02j62J36K8J12K0j85j01
5592e3J38k96J09K29k42R5j27J50pk34M16j23k16J53m2j83L38j94r5K77Jj75K24
5615A43r7j78J71M4k1J18k39J54J30k15L5J75j62p2J19Om5J6k84J03K90k52j20
$$ y = [-315, -47, -70, -176, -36, 198, 110, 157, -69, 42, 154, -12, 102, 174, 67, 132, 167, 233, -25, -120, -119, -70, 196, -42, 93, -99, -204, 38, 27, 118, -99, -303, 71, 180, 209, -178, 29, 17, -217, -217, -101, -247, 98, -23, 264, -14, -108, -130, -67, 209, 197, 36, -2, 113, 73, -188, 64, 59, -100, 79, -262, -36, 123, -172, -90, -127, 86, 138, 26, 73, -14, 133, -66, 104, -173, -12, -43, 76, -43, 75, 149, -26, 212, 12, 143, -183, 202, 27, -257, -61, 38, 77, 7, -18, 25, 130, -154, 179, -203, 11, 22, -230, 187, -28, 252, 134, -173, 110, -114, -40, -194, 248, 215, 223, 222, -174, -164, -100, 90, -191, 130, 106, -160, -325, 33, 113, 238, -140, 308, -137, -203, 99, -63, 73, 101, 213, 233, 48, -53, 85, -211, -102, 127, -115, -20, -147, 3, -4, -238, 178, 55, -161, -8, -50, -233, 105, -89, -184, 93, 94, -81, 143, 46, -132, 39, 83, 62, 180, -59, 95, 225, 10, 45, 220, 58, -14, 105, 111, 66, 82, -202, -99, 191, -61, -181]
5638a81K11K9k08J82J26l2k4l53J82N7q6j91K94K23k85k39L53J6P7J4j14L15l60
5661Fk29K72j8M6r7k0j69J75l3L8n5m3J60o6K8K5k34J30K59k29L8k5o0m2K00j50
5687i3J89J77l14m6J62k8j79k2J63j91L16k51J27R1J57j05J02l31K8r9M49l01
5709Aj64K17J36l43K17j6J1j12j9J79n9n1j00K52O8j23kj66j35L47j58n7j18J13
5733h2K32k06J94j41j59J76l08N30j33Kj66J21J67j13l6P4l39J29q2K98q1m9j08
5756h0n2q0L09p0j31J81L1n6j2l57L31J42l8k07Q4J6J14r6j13l4j21M43j76J59
5780A87m23K26l8k4j88M77k10j10m8M05k18o8j12L40P1k71J08%j73j49J45L56
5802B83l61o6J01p7K38r0r6P7l2k91O76o4l02J18j49j2J89j15J22k46O2M3J16
$$ y = [-181, 30, 59, -149, 33, 159, 127, 103, -250, -68, -11, -97, -288, 6, 229, -56, -295, 58, 74, 151, 165, 51, 366, 6, -223, 49, 31, 77, -20, -40, -209, -34, -67, -29, -84, -127, 33, -33, -5, 20, -214, -84, 175, -54, -16, -41, -101, -143, 57, -93, 96, 273, -41, -87, 75, 47, -132, -154, 9, -182, 134, -117, 10, 101, 258, 153, 255, -76, -48, -147, 302, 1, -163, 54, 190, -153, 64, 48, 59, -53, -72, 107, 48, -3, -103, 149, 217, 94, 92, -74, -209, 138, -20, -77, -195, -82, 150, -56, 138, -3, -162, 14, -294, 236, 103, 105, -61, 60, 227, 114, 78, 152, -187, -58, -140, 158, 77, 28, -80, -132, -212, 97, 27, -104, 77, 108, 52, 40, -317, 14, 156, 118, -89, -5, 11, 125, 29, -84, -118, -239, 204, 28, 187, -236, -10, -48, -72, -260, 217, 7, -103, -151, 254, 36, -32, -144, 196, 267, -4, 104, 104, -69, -218, -73, 283, -78, -144, -43, -120, 118, 28, -68, 9, -23, -314, 362, 298, -4, 114, -35, -47, 142, 27, 149, -97, -35, 8, 124]
5825A24l34O7J2K31P6j23o2Rj3j67K15%R8k09R6J7Q1k1k24N4P9J57j99J15p9j14
5851a14J65m1j15K48k50J66q0J08m3j3J03Om28J49J36P7j63K91l48L4J8o6K9L42
5875B11j34k3J13r3k0n8J42k92K81k21K07j89o2j07K30K64j27J31k11j61J08K51
5897B40j29k98M44l54j8L82k66m14L98J49k76l6J84j28j6J09k2k3N4J84j12o3
5919a1j31J85J74k57p5M77l18m7Q8p8J80k27M27m56l4N7o9K90k80r4J83J26L8
5942A48J6k40m8J64K41j85k6j75J23K9k72M54k1N9l33J18M1J33n0kk88N3K71j95
5966A5j22J17l0r4j6m1k0K25R4Q0k56J07r1J27l2l6j52M2K15l0l7or7J96j85j24
5992a51J01k63L27K78m68J36j01K92m6k02K22n41L10J80J52k78n1J80j69J6J57
$$ y = [124, -210, -143, -131, 100, 176, 53, -9, 0, -13, -180, 35, 35, 133, -76, 20, 37, 118, 97, -127, -73, 6, 163, -36, 79, 0, -114, 51, 10, -105, 143, -107, 59, -21, 87, 44, 31, 134, 140, -288, -139, -3, 74, -89, 202, -146, -112, -94, -160, -131, 211, 77, 54, 167, 74, 54, -4, 138, -154, 127, -94, 113, -76, -138, -245, -15, 249, 122, 253, 42, -119, -11, 240, 111, -187, 257, -97, -115, 267, 1, -413, -15, 134, -142, -178, 6, -122, -138, -29, -51, -74, -20, 164, 52, -11, -142, 43, 217, -40, -115, 362, 44, -3, 85, 7, 187, -40, 387, -69, -103, -46, -115, 175, -105, -199, -16, 110, 148, 164, -76, -124, 40, 281, 96, 70, -105, 18, 47, -225, 229, 208, 267, -66, 52, 93, 226, 176, 174, -114, -61, 210, 15, -107, 10, -20, -114, -130, -171, -191, 34, 128, 208, -48, 59, -32, 95, 63, 27, -125, -83, 132, 102, 65, 59, -38, 158, -27, -151, -50, -313, 14, 292, -176, -40, -141, 151, 105, -97, 125, -416, -106, 74, 226, -52, -103, 77, -92, -76, 81]
6013H1o9Kj7J48l95K88n1K99k45N1o5l01J80M81l91K63l14J82k16M0L4R7k96o3
6037b77M58k51K9l47L86m9j36L84l1J6l88J94j02J21p1K73j09j46J5m6K18%j18
6060B3R8k83J73m0R3j12J71k17J50r6j03j1M24j84l91L53M7o2o5n6K08j94K19
6083A45o5K4j92L7K7j32R3j93R4M5J38o3j0k47J86J35R9m9r1k7P9K2j76J71j86
6108a36J32J34j70J38M0K1j9N1n6k19J52r8J53m6k89K94j57k5K40p6Q9j47K09
6131B15k54J75Jk31L7m3O1K63j33M9l14J36K18j21p6k04M32j86l14J10K73j65
6153g1K75j31k25K8o5J05J50m1k65M44p6j43j74L21J5j11J07k07K01J49n65L15
6175C6j60J91k29L14kk69K25k5J33k63J96k22K39m08J87q9O8L34m63L30j95K30
$$ y = [81, 12, 14, -3, 145, -250, 38, -13, 286, 41, 92, 27, -274, -94, 387, -4, 259, -55, 127, -89, -49, -15, 82, -214, -277, 181, -70, -41, -388, -2, -51, -187, 197, 166, 182, -206, -12, -114, 7, -64, 209, 100, -46, -31, -77, 141, 141, 23, 121, -162, 11, -29, 64, -48, 123, -94, 56, -40, -143, -154, 270, 86, -305, 48, 95, 33, -32, -88, 120, -74, 145, 80, 104, -88, -51, -24, -156, -63, -256, -162, -117, 21, -42, -52, -299, -113, 22, 121, 72, -19, -46, 33, 55, -121, 50, -136, -4, 130, -40, 98, 138, 159, 140, 191, 135, -84, 68, -30, 123, 77, -212, 82, -75, -100, 140, 64, 153, 6, 215, -39, 136, 137, -94, -57, -100, -39, 224, 91, 140, -174, -38, 180, 59, -17, -221, 211, 25, -289, -179, 94, -71, 204, 73, -152, -124, -189, -84, 66, 25, -240, 204, 128, -15, -189, 132, 147, 36, 143, -64, 137, 286, -279, 36, -124, 67, -162, 152, 150, -119, 106, 81, 214, -49, 147, -75, 164, -244, -57, -146, -78, 256, -207, 123, -72, 158]
6197A58p9J9M8M1j63o6J27j86k8K43r2O3k5j19j44J59K34k47J02J23k85K47j61
6220c1r8K48j23N5j35N1J09P8J9Q8l30j50J08K05j83L34k93j17K76O0j44j88K35
6243G4l17K17j40K88m93L63J01j64J09j77J69O0n0m2j89J33q8K31j33M8P4K85
6265C59l04j59J88j81Q2J44j32J82j11M8j40P3j53pj5q2L10nR5k84J9r4K65O7
6289A65l58L24l52J67j0J2n1j5L57n72K96J44J3l56K24J04K6q3j84j1r8Q5q9N29
6313B67j91k7l8M3j87K1L67o72N71op6o7Q6n0N5j65p5M99n1k65pj45K9J46j59
6338i7K52J19k87K46k97m6R6J17k05l4K7o8K22j46K93l08R7P4l5k8k33J18K36
6361A13J57J8l55l0J19M2j20K05j06o9O4P0j39J02j70K54j81j07K11k68J35m2
$$ y = [158, 79, 98, 146, 187, 24, -42, 85, -101, -129, 114, 22, 85, 60, -59, -203, -44, 190, -57, 45, 168, -117, 130, -31, -129, 119, -4, 51, -84, -33, 76, 154, 173, 261, -69, -219, -111, 94, -89, 245, -48, -165, 111, 171, 27, -161, 74, -243, -26, -166, 122, -371, -8, 93, -71, 38, -139, 30, 90, 40, -2, -191, -58, -146, 85, -48, 0, 74, 359, 55, -104, 84, -97, -15, 129, -3, 179, 68, 116, -24, 49, -104, -111, -126, -208, 102, 97, 192, -92, -73, -167, 98, 165, -193, 131, -221, -54, -64, -52, -103, -118, 239, -333, -37, 107, 120, -236, -12, 92, 118, 35, -149, -160, -258, -173, -262, 267, 76, 49, 11, 54, -133, -112, 255, -417, 154, 148, 72, 5, 91, 41, 96, -69, -144, 355, 304, 39, 32, -113, -84, 62, -97, 155, 274, -13, 233, -64, -110, -14, 103, -102, -136, -109, -177, 45, -101, 192, -116, -19, 55, 20, -8, -241, -123, 113, 270, 288, -67, -97, 22, 64, -56, 149, 43, -26, 38, 108, -31, 71, -99, 155, -26, -133, 78, -190, -55, -97]
6383i7K6K09J12l05J37O0k1l66J14K07J4j00Q3N9r0K15l66J16J04l28K17R3o1
6406C2O3j25J19k74L67k86j41J51K3l8P7L40l44K75M7k61L0R4j44N0L8K11m25
6429a21M34m48P4J74k77J33L1L5k1J16j62o2k11K57O6K06j04k71K77k52L3P7J25
6452A09Q5K9k02N9j34OJ20M5j14J7k31J55k18L42P7j51J50l37J08L6K43p3q6k79
6476b44Q7K33j30N0o4M6n8j55J12rJ82j50k9P0j10j03K62J04j27J33J84n23L10
6499G1k40Q8l9J94r1k4J24JOR3o1Q3k03Q6j08N7J23j31N0m8j37N5k36K00Q3P8
6525G4j02P7k9o8L0j25K04j00p1K33j08K08k11J34k00j77J43J49q4%J25j59q1
6548a38L54l75k04P53k64j05k37J50L7K26M0j66q2J88m28K19q3k5O7J1j4p2M38
$$ y = [-97, -71, 138, 250, -55, 82, 142, 121, -245, -131, 76, 90, -10, 73, 132, 42, 257, -109, 7, 111, -217, 0, 93, 32, 95, -30, 89, -185, 182, -104, -245, -94, -71, -109, -32, 308, -36, 239, 286, 25, 55, 149, 5, 55, 93, 304, -121, 313, -135, -61, 113, -164, -31, 0, 35, 14, 130, -32, -94, -305, -48, 18, 224, 120, -151, 126, -126, -93, -16, 109, 194, 223, 21, 80, -54, -48, 72, 117, 3, 20, -211, -56, -274, 68, 145, -6, 144, -193, -85, -49, 194, 121, 35, -244, -157, 76, -54, -4, -68, -22, -80, -235, -123, -132, 50, -100, -129, -59, -169, -272, -10, 94, -33, 100, 284, -239, 71, -169, -81, -120, 74, -17, -41, 83, 84, 90, 183, 122, 205, 2, 88, -20, 37, 160, 29, 79, 31, -106, -51, -287, -87, -4, 74, -28, 49, 20, -48, -18, -143, 61, -39, -110, 123, 15, 223, 12, 146, -54, -231, -88, 61, -23, -23, 102, -57, -138, 216, -159, -363, 390, 126, 21, -216, -66, -29, 197, 237, 71, -11, 177, -251, -32, -115, -140, -73, -62, -76, -148, 290]
6571B90k23Ql8l57M36k90J79j21L00o4r3o8nL0k19L00rLOj56k9P5o7K52r8j02
6597f0J41P4r1j08N5k04K62J9R1J02l58o6j7P2k1K42o7J59l03K04j28J85k62M04
6621C25l22r2J04p8r1J55j22R7K09l33J47L23m15Q7R7J3q3Q0l12K71j02L23k49
6644C2O7j47j08K24K04n81K04J00j4Q9l10L34j63r0L33Q2l23M0j44J98J89j30
6666H6j68J66j3jm14N10j03k03k06L44j91K23O4K46m55l8M8K97k77l9K01j10J4
6689a9m9k37N20k46R8l22M38k10O5R0j92K8K08J1Kl50K57J18pk90K54J11r8k60
6713h0K12j81j10l7R1L2P2k3J57k09K49l04J63k07L1p7pJ70N0j50K39N7m75L45
6737Ho6o4q8r8N60k23j06kL81q9k48N9q5L01j78p6j7j88N1N5K9Q7L48j79j07l2
$$ y = [290, 67, 75, 37, -320, 116, -174, 5, -116, 184, 120, 27, -41, -46, -16, -235, 65, 56, 59, 65, -91, -120, -45, -112, 140, 42, -60, 81, 155, 64, -44, 11, -193, 69, 88, 179, 281, -77, -143, -160, -88, -109, 133, 66, 225, -78, 126, -2, 183, -79, 325, 3, -89, 15, -63, -154, 1, -121, -24, 185, -148, -1, 322, -93, -6, 91, 104, 21, 101, -211, 60, -42, 281, 32, 99, -48, -156, 68, 272, -309, -105, -5, -19, 70, -240, 94, -69, -159, 174, 256, -67, -27, -171, 27, 216, 86, -82, 84, 71, 70, -344, 166, 63, -140, -346, -2, -193, 30, 94, 340, -115, -153, -105, 192, -85, -124, 77, -33, -19, -68, -305, 215, -31, 67, -255, 183, -27, 38, 128, -64, -36, 172, 183, 185, -165, 92, 210, 203, -87, 167, 278, 180, -80, 132, -49, -159, -196, -105, -73, -1, -24, 133, -76, 173, -131, 32, -175, -144, -221, -228, -58, -8, -158, 81, 138, -337, 8, -58, -122, -210, -308, 252, 29, -77, -79, 302, 213, -35, 24, -61, 240, 62, -14, -31, -219, -168, -113, -84, 3, 351, 172, 65, 33]
6763C3p5O6R1j50J68j49K07k13r6J06r9J45K1K27j46o9j46j56K08K5j29K37p3
6786C3l7j53K44k74L00j00r8L08j93J82q4jJ40k15j57L36k50J32M6j96k2l0k6
6809a15L33m36K21j62L57j54P9j7j98M5p7J69L2o7p1NR1r3k31K61J38k70M54n24
6833b30K85k14J02J17k51N24n15L42j39j61O2k6L1K77l41L36k63oj94K25L1m4
6855e2R7j44j69L10q2J06q7rm2J38l0q0j37K88J51o1J23l35M2pJ3J66n5k04P2
6880A2m7k37K38M6M1J65j23J08k81J67j61q0j16L17k87J32K90o9p8J13j25KJ00
6903A27j93J3j36J90oj13J42J79k31j45K60P7k13J25k6J01r8rk33Q0J08M94m97
6926dK79k71J46j64q7K21k18K28k35L6O6L2lj83R5MQJ8p1L97k49M6j39m1j5J68
$$ y = [33, -42, 24, 115, -35, 133, -16, 191, -22, -118, -12, -111, 34, 55, 282, 136, 67, -79, -235, -27, -2, -131, 106, 33, -4, -157, 87, -187, 113, 13, -85, 223, 30, 212, 128, 127, 267, 52, -105, 231, -19, 113, 159, -37, -59, -89, -115, 218, -218, 3, -159, 198, 44, 123, 106, -92, -47, -124, 45, 77, 10, -61, -56, 35, -58, -289, -28, 110, -160, 294, -230, 55, -159, -57, 60, -191, 333, -182, 160, 21, -140, -78, -104, -73, 204, -137, 199, -64, -70, -264, -39, -8, -52, 45, -99, -268, 42, -40, 66, -21, -30, -72, 66, 36, -44, -181, 107, 258, 197, 320, -15, 27, 20, 33, 199, 144, -60, 12, -35, -272, -34, 12, 53, 218, 95, 203, -78, 89, -72, -152, -268, 49, -238, -106, 184, 115, 37, 150, 25, 27, 127, -66, -53, -189, 1, -5, -118, 24, 203, -28, -173, 87, 164, -49, 76, 50, 151, 53, 44, -189, -109, -1, 493, -4, 275, 4, 150, -14, -101, 120, -98, 130, -105, -69, -3, 29, 26, -157, -62, -58, -50, -32, -103, 294, 45, 91, -48, -89, -104, 64]
6952F4J11k44k2P9k53O96m43j0N6k46r5P8L19K1j22J99P0n32J48J17R7N2j41k02
6976b03J50j00K25k23O1J40q6l6L9m6j21K01J35k13K41k20M8r7j09J37M2j56J16
6999g5J66l20J01J50l4P7j82J49J16j73J71m01R1K88m01K64j07k18K74N2k9M3
7021BJ54k30J14j91K31j10o2J09j38J44J09j01k50M27m4k54L97l92J83m1o8l6
7043d7j89L15l6j43K6R2k27J82l32L95J3j56Q9P2J26p8j03Q5jk0pj38K97k01O
7068B0P6j10o9L72n15J72J33n6o5k21L19l44K13rK02l95L69k57J91k01L00j17
7090HJ78J18j13j43Ro3j65J13j48N05k69o0jj21J40K6N8j61N9k6J32k74N24k63
7114F3j15K38k66J18K01l06K26M0j16j26J7j80J09j52J37L68k2j64l6j9k16jj01
$$ y = [64, 175, -69, -91, -12, -265, 431, -12, -22, 34, -212, -307, -229, 90, 111, -11, 188, 258, -274, -126, -9, 88, 140, -1, -203, -53, -153, 72, -151, -90, 50, -36, -72, -33, -79, -200, 1, 136, -77, 164, -56, -8, -105, -214, -77, -35, -191, -75, 91, -229, -128, 22, -12, 65, -117, 32, 148, -25, 146, -255, -164, 124, -277, -13, -120, -338, -64, -12, -41, 2, 156, -74, 40, -151, 80, -30, -92, 17, -121, 23, 132, 31, -219, 208, 164, -90, 307, -85, 98, 57, -11, -47, -236, 79, 43, -100, -74, 18, -209, -27, -359, 36, 49, -107, -18, 54, 180, 102, -1, 84, 83, 63, 56, -82, 215, 14, 20, 96, -14, -83, 289, -226, -54, 79, 23, -42, -263, 56, -288, -75, -84, 118, -277, 92, -165, 26, -175, 125, 8, 186, 304, 191, 48, 57, -6, -171, -58, -206, 299, 30, -30, -31, -152, -12, 14, 72, -89, -30, -56, 76, -198, 326, 63, -52, 186, -80, 38, 239, -67, 159, 199, 83, -43, -26, -206, -97, -249, -112, 256, 234, 70, 34, 15, -201, -202, -303]
7137c03J68MK0M7k1J35k33L25k01K09l2l9o6o9K32r3j03J64K25l28q1L9L35j20
7161B14j64q2M0k45m3L33j12J95q0j58M91k85j64J40k51K00Q0j46J71l3l64J83
7183h0J9l9J51L6n27M89k41J52J46OK16p2l43K42N5L7j18j98J03p9l3j39R6L4
7207h7J77K4M6j03k54J04J55j6K0J13l46J54J46j68P5p2r6J51o1j33J70j51K46
7230I4j44K42j26k36j13J44NN8J63j04k6On7K05k14J68J05m31J57J50L5o5j14
7253i8k1QO8M12k98l09J32p5K18Q6k25%O4R5j09Rq3oJ11K8j07m7J78J6j25Q6j86
7280a78J98J3n3J68j48J40k09l9J91k10N5j09K90k3J04j98k33O6k2J74j97j3J02
7303a31J59j23J46j89J4p7J49k7J64J16j82kL4l3K2R5m6LP6k37j39L40M8j28j67
$$ y = [-303, -135, -131, -111, -64, -85, 50, -183, 142, -59, 150, 118, 79, 13, -56, 176, 83, -20, 144, 369, 41, -40, -1, 334, 214, 50, -32, 8, -237, -280, 53, -59, 136, 56, -102, 389, 104, -60, 80, -171, 29, 109, -37, 134, 101, -263, -80, -61, -100, 51, 87, -440, 49, -192, -40, 106, 112, 328, 256, -87, 155, 210, 247, 129, -69, 34, -45, -78, -217, -121, -87, 90, 114, 160, 57, -197, -93, 62, 46, 66, 179, -167, -13, 133, -35, 40, -32, -128, 23, -38, -171, -1, -152, 94, -50, 192, 66, -170, -283, -139, -134, -76, 87, -17, -43, -37, -94, 111, -103, 65, 170, -261, -104, 46, 81, 16, -98, -119, -111, -43, 369, 71, -238, -106, -181, 37, 123, -102, -102, -38, 57, -52, -43, -126, -132, -21, 7, -100, -147, 31, 47, -78, 8, -178, 20, 33, -20, 148, 0, 140, -69, -108, 83, -127, -72, -181, 109, 86, 190, -8, -241, -175, -197, -23, -220, -233, -131, 28, -95, 51, -138, -124, -201, -52, -79, 85, 201, 19, 17, 51, 18, 40, 135, 89, 92, 168, -69, -208, 132, 180, 52, -115]
7328a15K83l24K04J63j76J13k4J15j77k6J01k55J15J4N7l61J88q4J28p0J85k0
7350C4J28P9m48L58j47j14J39N8l46M08Jj67k04L56k21L68j4m20L25k42J63Kj42
7373d6k8O5P6m4j77J36k87L29J43j62k04K16j14K39J5k9j81r8K28M9Q2o3k81J07
7397b9k28J20K67q6n0p6J36r8j47K61l16L25j82j1J73qq9k24K55J6k37P2O5j37
7421b28K9K20o0J29M5l46K57L62o21P6L37j07rP2l2j21M0k95O3K11j38K26j77
7444f7N2P5K11k90m3L1k02K47j91o0k2K29j4P8q7K51l45J45k3J50O2k13J52j26
7468@K37R7k41M4j36r0P9K03j34j98k72L36r3Q9K75k14J25J26o3j81k27L37r0
7491Ij71L00k63K49k05Q6j46J29J26k15O4m61N75J9l9L62l07j40O5J87j96j55
$$ y = [-115, 168, -156, 48, 211, 35, 148, 124, 239, 62, 36, 137, -118, -3, 11, 68, -293, -105, -189, -61, -131, 54, 34, 162, 241, -207, 151, 4, -110, 29, 87, -259, 149, 150, -17, -221, 135, -86, 282, 268, -152, 173, -69, 94, 96, -46, -74, -9, 67, 23, -154, -18, -305, 24, 167, 5, -199, 17, -97, 142, 157, 128, -53, -151, 77, 126, 208, 145, -136, -29, -257, -137, 130, 44, -6, -82, 54, -44, -191, 70, -246, 79, -103, -114, 59, 51, -38, -262, -7, 9, -228, -156, -91, -228, -199, 21, -39, 90, 135, -211, 46, 408, -213, -137, 200, 93, 84, 156, 124, 3, 43, -252, -189, 22, -116, 110, -67, -15, 60, 271, -19, -62, -31, -233, 14, -177, -237, -259, -30, -44, 34, -53, 198, -147, -2, -25, 125, 187, -26, 126, 0, 237, 334, 93, 137, 1, -89, -10, 193, 59, -139, -411, -75, -168, -79, 196, -18, 107, 233, 170, -11, -238, 99, 9, -162, 138, -125, 124, -81, 5, -141, -12, 114, -101, -37, -498, 77, 96, 57, 419, 112, -28, 37, 224, 28, -127]
7513a27K42k67J00L5K43j09r0J46j12k50K3J86k41J6J87Q5q1n3PK5nK9P2j72j5
7538a26JM9N1q1k2Q5J93k77J80L8N4k86K89k71J9Q6J13k46J86%jK0j31J57K5Q8
7564A93k29J63j60k09L64k16K96n47R5K58j5m6j3J75k86P6R8q7P9j27L31m49J64
7587i2J04o6K15K2k89N7p1O4K87k86o7j7J54K8J83l00J36M8j53J93j31j12J62
7610F9j71K48n7j54O0K53l37j11J86NK8j76Q0j64Q4M4j4J68n9j05N1L3Q0p4nJ71
7636A33q7j69N6L08k30L7k35L00j70K65l01m9R5j19J63N5N7j46J66k2l05J96J91
7659A89l35L73l94P9L55l20Q7l03K75k52J39K5l7J47j34J27j32P7k37N36k32k64
7681b31J1J94j57P2Q9K26k57j22L56j94k0J07K9j14L45j43l35M68k95k5j66K92
$$ y = [-127, 115, -152, -52, -17, 226, 117, 27, 173, 61, -189, -166, 20, -221, -205, -18, 67, -14, -67, -60, -35, -40, -11, 61, -111, -126, -125, -76, -25, -106, -128, -43, 150, -127, 53, 91, 145, -141, 148, -123, -104, -18, 95, -151, 35, 35, 34, 54, -77, 80, 105, 193, -36, 127, -33, -242, 122, -94, 202, -345, -250, 8, -7, -53, -66, 109, -177, -101, -3, -90, -11, -138, 193, -256, -92, 12, -54, 161, 183, -106, -49, -120, -56, 231, -55, -122, -139, 15, 43, 226, -74, 62, 110, -43, 150, 19, -93, 69, -102, 146, 89, -65, -5, 248, -89, -200, -14, -9, 19, -157, -77, -241, -157, -113, -127, 41, -18, -123, -72, -39, 41, -33, -38, 133, 46, -123, -67, 241, 11, 48, -187, 113, -57, 208, -93, -142, -47, -166, -3, 52, 109, -37, 129, 107, -198, -2, 189, -146, 227, -167, -88, 267, -53, 34, -269, 6, -246, -107, -82, -119, 28, -106, 21, -111, -34, -271, 265, 33, -231, -220, -26, -183, -111, -22, 204, -53, -175, 181, -13, -33, 74, 103, -11, 334, 191, -144, 324, 29, 4, -162, 130]
7703A30l4qK9KO9Nj61N7R8k7k82J1K6L2K38o7M7k97p0J03L15k16L3Q8k24P5O1
7730C3k65L42M4l80K24j61M3N8L7m7j43K73j21K84l00M9J31l3M2K0j40q9K01l68
7754b66L57l00r2L39R7n2k01r1N3Q6K97k25R8j01p7Q9J88p4K23n87J36Mj64M69
7778B06nl15P1o8K18j64j7m9J27J14l50K61j88K00r0L66j51j06O4O6N3l99L25
7801A69J7k79P7k8K98j65j47N0j91J76J78j01j01J42j81k01Q3O3N0nJ88J15l26
7824a19J59j68J65p3n5J64J50l10k06L32O7J83l01n9L05l57K51j07Q4p0K14k49
7846@N1oj39l26M06j28K70j67q3N9p0J80M9l7j30nJ01K91j69j36K7j65q5L78k79
7871a13K13j11O4n6o5PQ6o7p9r2j79L10J82J7n1n5r5L0J4J15k70K41k46j04M15
$$ y = [130, 96, 88, 117, 119, 188, 193, 32, 89, 187, 160, -122, -111, -85, -53, 185, 118, 165, -132, -202, -99, 216, 0, 33, 121, -103, -28, 33, -232, 110, 154, -226, -2, -163, -120, -62, -25, -72, -215, 58, -63, 221, -79, -30, 101, 68, 110, 130, -10, -99, 102, -266, 91, -209, -301, 38, 135, 83, -118, -209, -156, -70, 227, 2, 100, -1, -78, 11, 199, 125, 348, -239, -103, -99, -263, 206, 201, -114, -43, -111, 107, -57, -74, -123, 4, 118, -232, 29, -159, 41, -49, 317, 166, 60, 124, 190, 243, -156, 169, 186, -93, -16, -44, 254, 89, -58, -8, -199, -23, 155, 54, -47, 95, -86, -287, -204, -141, -91, -96, 92, 207, -119, 40, -128, 37, -36, -91, 73, 223, -87, -293, 39, 106, 289, -12, -71, 234, -123, 128, 21, 105, 35, 249, 0, 51, 45, -94, -420, -14, -142, 128, -39, -122, -63, -133, 47, 96, 59, -71, -76, 25, 316, 147, 11, 38, -127, -212, 166, -113, 100, -11, 53, -3, -68, -61, 25, -42, -121, -213, -392, -82, 100, 117, 66, 11, -84, -54, -40, 75, -195, 46, -200, -304, 111]
7896A11m38N0K44j89K64K4j31m10L07k1K94l23L24R3m90K22Q0qJ76q0k94J56J01
7919F2l60L85k8N2j0j33Q2J9k0k08M0K99J8l55L52k63J71K7k92K48o4K63j86j45
7943d6Q5k00N3o1J27L5J36J29l86J91j49J04L6J09k66J25O9k67O3J32j01N2l4
7966f4J7o9p3P2N8j53o3K37j0k69M19j36j82K43Q8Q0J09m85J87K10l49k8J04k6
7990h3J50l64k0N10k0j5n1Qq6l68K36j54J91L1j91L02k39j05lJ22J58K1J03k03
8014g0J41j56Q3Q8j56K31k84k13J79M11j17j35J89l80K86k3o3k64K69j36k0J05
8036c5J55L8k34r9K05n1k07MJ42Q9R9j0j46q4J40K3l38L40q0K04l02J77j46k3
8060a39o9J17P8r3J77j55Q1Q8k43L13l34J67j41J44k65L35m2j68K86q2J97l19
$$ y = [111, -327, -277, -33, -222, 42, 66, -65, -475, -168, -189, 105, -218, 106, 199, -291, -69, 11, 3, 179, 99, -195, -39, 62, -298, 87, 59, 111, 101, -32, 50, 69, 49, -159, -119, 180, 198, -157, 195, -68, 103, 130, -162, 86, 22, 285, 99, -46, 39, -161, -108, -169, -42, -7, 129, 258, -128, 63, -86, 18, 54, 163, -103, 22, 91, -176, -113, 19, -82, -30, -64, -47, -116, -189, -117, -59, -212, -275, -38, -48, -317, 102, -34, -216, 27, 115, 195, 304, -181, 6, 216, -133, -161, -57, -83, 67, -297, -317, 193, 173, 158, 107, 115, 29, -339, -103, -257, -66, -35, -226, 76, -163, -268, -271, -149, 9, 30, 133, -70, 71, -85, -2, 86, -70, 161, -123, -336, -157, 254, 137, 2, 191, -189, 97, 74, 11, -253, 16, -120, -140, -35, 120, 158, -76, -175, 30, -21, -228, -224, -82, 7, 106, 96, -50, -134, 6, 29, -309, 31, -49, 155, -147, 30, -116, -139, -208, -91, -13, -106, 71, -84, -3, 85, -158, 155, -179, -12, -153, -9, -274, 61, 19, -149, 137, 55, 252, -67]
8082f7J74k10R5R1m9J19j42r4L19k45m24P93k97R6m2M6k27M1J88k38o6MO4J3P7
8107A9Q7j43J13o9J17l35K09JJ86P6k87j2L05m05NJ6j13L05j29j69K42Nj11j09
8131a96J06Q7k06K37J97l06K54kj39j48N1m0q3L37n3K40l02L1k89M02j42k02J38
8154b8l8L20m50L23k8K1J80l35P0k91J66J72Pm26O01k94q3l4K62m5L1j86L0PK6
8179b2L9m00K74m3M9J09J7K8m1L9j10J09
$$ y = [-67, 107, -103, -8, 83, 34, 153, 11, -83, 236, -9, -433, 360, 63, 159, 117, 163, -64, -23, 165, -73, -139, -135, -71, -58, 19, 106, -37, 76, 7, 124, -211, -2, -1, 185, 261, -26, -38, 267, -138, -133, -117, -230, 75, -54, -223, 19, 24, -87, -196, -90, -3, -209, 28, 225, -81, 173, 171, 32, -116, -65, -105, -188, 149, 96, 336, 34, 65, -224, 178, 36, -166, -28, -66, 254, -196, 127, 99, 120, 300, -35, 35, -256, -90, 82, 89, -337, 264, -30, -113, -147, 115, 70, 101, -85, -55, -48, -22, 17, -383, -109, -152, -103, 6, 23, 51, 10, 49, -61, 48]
8191D8
$$ Imaginary data points
##PAGE= N=2
##DATA TABLE= (X++(I..I)), XYDATA
0@%%%%%%%%%%%%JrJ6j6J6j9K7l2M0m9N7o7P6r0J06j22J41j65J89k16K47k79L14
35A66l54M00m48N00n59O23o93P70q55R48j045J152j272J402j545J701j874K066
53A083k280K518k782L085l432L832m301M857n535O381p468Q925j0995J4191j9833
68a1754L2778j21979k1926J60739J030M8273P1739m437j45870r4205p318K746
80i0184k5636O1437J25597P2114l4929m0055k1333o4530j10684l0638P0117O8165
92b0559K4141N9362P7686j2156r9931o2600j2940l7021l4869N7804J04137M2639
104H5693p261Q298j1037q0839r0140j7569K9383K1962L5704P8119O3474j2530
116A03257n4098l7326l5583n7751k8093M8688P1108L3583K0952L0877j2036p7574
$$ y = [0, 0, 0, 0, 0, 0, 0, 0, 0, 0, 0, 0, 0, 1, -8, 8, -8, 8, -11, 16, -16, 24, -25, 32, -35, 41, -49, 57, -65, 76, -89, 100, -116, 131, -148, 166, -188, 212, -236, 264, -295, 328, -365, 405, -450, 498, -547, 605, -667, 735, -810, 891, -983, 1083, -1197, 1321, -1461, 1624, -1808, 2024, -2277, 2580, -2955, 3426, -4042, 4883, -6112, 8079, -11754, 21024, -100955, -122881, 37858, 38888, 87161, 158900, 154463, 8593, -85612, -92930, -90184, -115820, -54383, 71214, 143328, 108399, 68344, 47011, -17519, -128203, -158841, -88724, -20559, 3582, 62944, 140630, 128474, 28543, -34057, -46997, -84018, -118887, -61083, 43054, 85693, 78432, 86730, 75693, -5146, -95286, -112855, -83472, -61510, -25806, 52313, 115787, 103257, 49159, 11833, -23750, -81501, -109594, -60906, 10202, 43785, 64737, 95614, 83578, 6004]
128F004o9878j5542j956k854M4236Q3588M6442j0200j7740k1352n5150o3505j1477
141h9384L6494L6913L1517M4713L2121k1576n8439m4078k3526k4198m819M6249
153c8013O5417L2235M586N251j6739n8561n3188o354J5288J2692L2767N5037K7555
166G7973j9840l2657k6819l6931l7805j432L8654M3076K8440K5063J4545j9000
178E3267m8648m0790j4283k293O228L3325M9471K5351q410j7345k2102m0572l8714
191f5515k892K7378K8951K8422L4238J8078j7338l7496l1140k1716j5417M887
203d9560L1651L9588K3864M882p218k1899l8573l4178p675J3753K2185K9429L5052
216D1301J9328j0613k6633k6495k6359k1630J954K6417L1197K2834J5386P55k2001
$$ y = [6004, -63874, -79416, -81372, -84226, -39990, 43598, 90040, 79840, 62100, 40748, -14402, -77907, -89384, -52890, -15977, 15540, 60253, 92374, 70798, 12359, -31719, -55245, -79443, -84262, -38013, 27404, 59639, 64225, 69476, 52737, -5824, -59012, -65366, -50078, -37386, -4619, 50418, 77973, 58133, 25476, -1343, -38274, -76079, -77511, -38857, 4219, 32659, 57722, 72267, 53267, 4619, -36171, -50454, -52747, -46519, -13194, 36277, 61628, 53218, 35873, 13771, -26801, -65515, -68407, -41029, -12078, 16344, 50582, 68660, 51322, 13826, -17314, -39030, -54447, -49560, -17909, 21679, 45543, 50425, 43207, 21308, -17265, -51443, -59118, -45365, -23180, 6249, 41301, 60629, 50016, 23383, -3112, -29471, -51101, -49147, -22730, 8467, 31301, 46687, 47442, 25441]
229B5441l3810k7984j3691R40J7407L1560L1374J8436j48j6579k6568k9831k0251
242d3704j789J6229K5374K6735J9792K844j5825k6941k6961k0016n454J4301K6885
255h530K8273K0885Q178j0432k5118k7549k0421q639P947K2920K6755K0324P327
268D1920p549k1644k7620k1801q895P269K0647K7442K3809J1537m970j8675k5705
281d235k3722j2481L573J7441K4049K2309J2521k542j8087k4712k1991j3405P05
294d0577J5860K6347K4151J3513Q51j1575k3701k5939j4974o9J1067J9075K4310
307A8339J7643J063j3724k0066k0679j7959n907J2078K3554K2073J5025P824n215
320C4049k1742k6162j5592m076M010J4445K5245K1150L696r536j3441j9196k3110
$$ y = [25441, -8369, -36353, -50044, -49104, -31697, -137, 31237, 49673, 49525, 32946, 6378, -23453, -43704, -45493, -29264, -3890, 22845, 42637, 45481, 29656, 2715, -24246, -44262, -49716, -35415, -8530, 19743, 40628, 48806, 38374, 13256, -14293, -34714, -43353, -35406, -12486, 14269, 34593, 41920, 34371, 12727, -14893, -36694, -45589, -38320, -17673, 9769, 33578, 45115, 40145, 21470, -4235, -27957, -40438, -36865, -19424, 4625, 26934, 39455, 36913, 18826, -5886, -27877, -41282, -40577, -24717, 1630, 25781, 39294, 40145, 28570, 4869, -21070, -36044, -36113, -25046, -5971, 18339, 35982, 37045, 23321, 3255, -17424, -35383, -41290, -29212, -5658, 16415, 31440, 39264, 34049, 12307, -13855, -29447, -33523, -29513, -15068, 10177, 31327, 35023, 25487, 12046, -7150, -30260]
333c0260j0866R934K0168J7312J7432J5291j082k1194k3531j3681r396m521J2577
346b1817K6678J9965M163j285o964k0282k5846j0989O939J1151J4041K1572J9544
359C6870l15j7054j7018j3405j6180r256J1855K3869J5835P306P287k860k1324
372E610k4728r717J123L127J1952K4874K0046L75j0323j0365j5484k1172j0410
385c5092J0001J7808J2484J2611J2885j354k0016k0364r306n470l812J1522K5463
398G360J8028J684k332m288j7631k4109r698Q005R080R116J8127J6966k114j6494
412A1700j3449r826j3115p411J2231K2339J3454N564O066j693j9743k2334p627
425b3844J848J163R148K1670J6769k014r930o941j2706j8956p305J2003J5314
$$ y = [-30260, -41126, -31192, -11024, 6288, 23720, 39011, 37929, 16735, -6796, -20477, -29873, -34394, -21817, 4861, 24826, 28989, 27704, 20740, 458, -25388, -36377, -29438, -18287, -4246, 17326, 36870, 36555, 19501, 2483, -10922, -27102, -36358, -24503, -634, 15201, 22507, 29794, 26934, 5610, -19118, -28835, -27712, -24585, -12633, 12241, 32287, 32662, 22339, 11974, -3510, -24682, -35092, -25091, -7283, 5201, 17812, 30697, 29343, 9327, -11037, -20343, -25813, -29625, -18103, 7360, 25388, 27072, 24740, 20452, 2821, -21288, -30986, -22981, -13901, -4785, 13342, 30308, 28194, 11700, -1749, -11575, -24690, -32101, -19870, 2469, 15923, 21487, 27553, 25860, 6117, -16217, -23844, -21996, -20833, -11685, 9985, 26754, 24740, 14810, 7869, -4837, -23793, -31098, -19095, -3781]
438c781R858J1817J1393k681j8268j6615p677o038l194J0371K1124J3342O91k002
452A8340l980j5127j9829n804Q067Q205Q193J6187J4163l084j4781j1145q572
465i167j2253n536J1485J7495R797M635N210l388j6397j7269m916K185K363R197
479f559J7974J2689k030q734o822j0541j5921n887J0328J2604P110Q739R754l089
493A9615j5742j2907m804m349k118J0845J7888R847K83j770m512j3804j5936m003
507b1467O295O727P293J2469J0297l156j2351q923n884r217k645J0239J4260P742
521A1679L704L359l337j4638j3396l938R50K324Q447J3592R238j412o630o975
535B967r082j0314k940P551J1229P964O575M915l098j2219j1837m895k549L20
$$ y = [-3781, 6077, 17894, 29287, 26606, 8338, -8277, -15954, -21992, -25186, -14815, 6309, 19651, 20342, 18340, 14360, -767, -20596, -26400, -18333, -10128, -1935, 14252, 28415, 25331, 10550, -595, -9167, -21420, -26956, -15471, 2024, 11821, 16456, 21666, 18278, 1881, -15388, -20304, -18119, -15756, -6559, 11415, 24104, 22074, 13340, 6518, -4023, -19944, -25831, -15503, -2899, 4211, 12950, 22704, 19615, 3873, -9034, -13838, -18187, -20305, -9460, 8428, 18275, 18558, 16788, 12276, -1528, -17464, -21467, -15172, -8445, -1152, 11317, 21614, 18458, 6107, -2816, -8700, -17917, -20562, -10323, 3937, 11679, 15383, 18742, 15405, 767, -12629, -16567, -15617, -13293, -4846, 8746, 17984, 16572, 9942, 2967, -6115, -16429, -19369, -11818, -589, 7375, 13950, 18865, 15767, 3548, -8289, -13184, -15733, -15413]
549a5413Q256J3401P800M24k471n290j0676j0036k633M512P245Q138Q800N393
563A7450k582r013q990o845n227l14P323J0672P613L116K84m450r952r586l472
578a3973J522M185P974J0164N177j287n202p581q536o445o98N178P816P704N855
593A1853J711l688p585q675n871q58L258O879R422O376J092l160p065q277p359
608a1947k223K985O865Q047O889K396k415n676q589o773k235K323N529P932P498
623A0606K736k323n700p124p300m457J670O060O366P038M123j37n182p287o466
638g377m040N42M218P049P052M712n56m573o055p420n490k41M697O083O340N326
654A0267J786l906p142n882m580j925K481O894P184M819J061k067n166p971n960
$$ y = [-15413, -7157, 6244, 14044, 14468, 11997, 6707, -3969, -14005, -16638, -12126, -4881, 3257, 12057, 17450, 14868, 5855, -3135, -9980, -15207, -15521, -8198, 2474, 10087, 13203, 13487, 9037, -915, -10501, -13973, -12451, -8266, -292, 9872, 15049, 13762, 8560, 979, -7557, -14002, -14700, -9522, -1706, 5998, 11853, 13564, 9876, 2291, -6384, -12255, -13113, -9855, -2976, 6446, 12822, 13914, 10754, 3689, -4588, -11947, -14170, -11185, -4320, 3727, 10616, 13012, 10597, 4921, -3668, -10441, -12676, -10353, -4824, 3108, 10606, 13342, 11019, 5319, -1805, -9105, -13562, -11892, -5832, 534, 7572, 11695, 11558, 6376, -911, -7377, -11417, -10875, -6657, 392, 7444, 12156, 11600, 7027, 972, -6448, -11938, -12179, -7482, -1399, 4941, 10267, 12053, 8147, 1005, -4877, -9457, -11382, -8901, -2007, 5177, 9996, 11057, 8990, 3824, -4147, -10107]
669a0107j346K515M907O441O271K901k453n786n752m956l617J070O371O618M175
684G252K786L78m838q204n168k246J21L086P223P111K861j465l090n300o577m663
700a0733J187M327N315M955M820J069m499o564n215l488j853K547O968O412K932
715H180Q19j339m782p249m703K63K521L728N724O094J177l575m752m618n237k983
731a0732J985O208N217L633K454K59m623p128m202r03J77K544O661O366J553k712
747F757k499m160o472l951J875M381M099M440M221Q08m597n876l069k978j603
762h624K387O603N137J719n8p69m491p050l519J293K274K642N234N490P79l911
778E136l630l133m420k904K596N667L743K244K364%m750o418k975n26lK444O293
$$ y = [-10107, -11453, -8938, -4031, 2410, 8681, 11582, 9129, 3343, -2409, -7365, -10982, -9912, -3541, 3077, 7252, 10038, 10416, 5578, -2626, -7794, -10040, -9919, -6833, 390, 7501, 10362, 8897, 5807, 507, -6070, -10733, -9546, -5219, 96, 5051, 9871, 10940, 6441, -123, -5338, -8826, -10679, -8132, -1164, 5248, 8180, 8999, 7660, 2878, -4371, -9074, -8811, -6290, -2562, 3162, 9256, 10433, 6858, 2106, -2512, -7749, -10732, -8747, -2539, 2678, 6311, 8765, 9024, 4401, -2727, -6929, -7832, -7655, -5111, 1550, 7916, 9469, 6757, 4258, 98, -6374, -10325, -8450, -4069, 30, 4470, 8691, 9499, 4902, -974, -4043, -7021, -8624, -6237, 366, 5503, 7222, 7164, 6395, 1904, -5146, -8665, -7372, -5098, -2456, 2778, 8268, 9047, 5136, 1506, -1627, -6047, -8951, -6355, -688, 3055, 5299, 7663, 7663, 2913, -3505, -6480, -7006, -7009, -4565, 1728]
795A728N069O11j816k032l348n624k991K212L913K582L608M038O1m739n129k130
811c987k564j366K591O073M347Q07L94q10m262n669k839J669J776K468M305M436
827G369J58l877l370k603l509k418L025N096L003J668J895j19m599n077j849J09
843e098L29J633N394M269m77k082j739k740n042k081K819L101K308K955L179j76
859F552m389l989j323j979j126K593N015L397R4N0j045l631m856j726J467J964
875b932J780M077L519m87l319k240k369l017j520K823M430K272J065J463j123
890D422l686m417j382L69O01K067M405L295l95j590k106k216l998j449K094L465
906e21K094J867K085o57l716k972j763j006l73K285M306K256K36m23q82k983l714
$$ y = [1728, 6797, 7408, 5592, 3560, 212, -5412, -8403, -6191, -2278, 304, 3912, 7950, 8011, 3272, -1857, -3987, -6551, -7917, -5326, 747, 5094, 5901, 6295, 5485, 1223, -4446, -7285, -5616, -3840, -1372, 2933, 7369, 7527, 3650, 280, -2323, -5832, -8250, -5225, -129, 2874, 4542, 6437, 6318, 1719, -3358, -5207, -5098, -4769, -3136, 2258, 6527, 6050, 3968, 2229, -511, -5553, -7634, -4815, -1714, 594, 3549, 6728, 6552, 2163, -1826, -3149, -5128, -6254, -3661, 1354, 4751, 4845, 4895, 3850, 219, -4637, -6363, -4896, -2932, -1152, 2925, 6444, 5957, 2638, 398, -1971, -4988, -6508, -3685, 745, 3017, 4082, 5545, 4422, 736, -3681, -5063, -4694, -4093, -2026, 2379, 5674, 5279, 3689, 1583, -633, -4631, -6080, -3986, -521, 1573, 3440, 5525, 4868, 1152, -1820, -3583, -4589, -4962, -2677, 1629, 3885, 4121, 3698, 2816, -167, -3881]
923c881j162J340J686K060K952K203o19k848k378k028j629r88K238M013J631J014
939C604J104j168l170l185j149K25R65J772L333K280o07j714j933k095k387o29
955d754J933K589J964K073N81p05k857k770j573m61M57K250L086J900J25j106
971B732j202k881k396o21J189J744K194K278J148p79k206k041j834j179K24J897
987a733K464J840J158k62j315k628k404q89J97J353K266K478J356l22j440j731
1003C88k144j815l6J604J791K139J492J7j178k162k401r08m24R70J692K683J766
1020C474j10o25k000k069j412p64Q72J616J947J936M73m53j960j899j869p92P73
1037b862J459K373J952N15n67j344k018k029q26K85J769J577J860J083j95j274
$$ y = [-3881, -5043, -3703, -2017, 43, 2995, 5198, 4579, 1731, -647, -2675, -4304, -5292, -3054, 959, 2590, 3604, 4708, 3540, 370, -2815, -3964, -3739, -2774, -1002, 2331, 4611, 4004, 2290, 357, -1738, -4125, -4754, -2821, -232, 1732, 3805, 4386, 3681, 824, -1946, -3519, -3980, -3523, -1273, 1813, 3713, 3838, 2732, 1530, -1351, -3747, -4368, -3179, -1435, 759, 3037, 4185, 3406, 1200, -841, -2675, -3854, -3630, -1733, 731, 2571, 3729, 3467, 2152, -476, -2880, -3769, -3572, -2219, 47, 2525, 3881, 3559, 2119, 388, -1756, -3571, -3607, -2003, -212, 1927, 3419, 3436, 2258, 96, -2305, -3213, -3637, -2667, -975, 1708, 3474, 3364, 2739, 739, -1330, -2742, -3506, -2634, -1018, 929, 2865, 3338, 2885, 925, -974, -2843, -3635, -2862, -1403, 970, 2922, 3437, 2870, 1526, -492, -2521, -3347, -3062, -1293, 284, 2144, 3227, 3032, 1758]
1053A758k160j912j104O73M77K498K099R49j06r10j904k234j328J43J032J847
1069a82J441J735K40j349j942j290j437j81N88J987J923J325j44k85j352k388
1085a311j298k27P92J079J756J601Q01r14j575j374j745n69M39J386K033J249
1101B123P23P1j589k158j123l81l63R26K239J739l6M25j029j488j863j282M79
1118b587J365J122J691J365K91j691j466j402q79p95J016J781J672O42M12n07
1134B030j436k044q65k9N77P92J959J590O1r21j502o97j867k54O01J599J085J103
1152A782M68N9j524j545j038k47l71J194K022J470J33k81o36j406j622j150Q39
1169a853Q36J245J011J100J11j256j416r32r85l48Q77J709J531R7N65m50j362
$$ y = [1758, -402, -2314, -3418, -2745, -2268, 230, 2329, 3278, 3172, 2262, 358, -1876, -3204, -3061, -2029, -182, 1259, 2994, 3234, 1885, -57, -1347, -2784, -2965, -2377, -390, 1533, 2858, 2714, 2429, 1077, -1311, -2609, -2836, -2044, -965, 791, 2392, 3193, 2279, 704, -670, -2415, -2984, -2545, -1159, 874, 2123, 2846, 2917, 1328, -830, -1953, -2334, -2697, -1771, 468, 2207, 2171, 2596, 1567, 79, -1784, -3066, -2587, -1222, -100, 1591, 2956, 3247, 1556, 90, -1312, -2191, -2986, -1970, -189, 1483, 2125, 2537, 2030, 594, -1450, -2315, -2344, -1767, -975, 984, 2574, 2635, 1714, 212, -485, -2352, -2606, -2005, -406, 679, 1782, 2250, 2309, 785, -760, -1798, -2045, -2416, -1222, 800, 2270, 2403, 2122, 1486, 80, -1542, -2692, -1853, -1017, 228, 1239, 2339, 2450, 1194, -222, -1154, -2139, -2487, -1610, 99, 1630, 1727, 2292, 1842, 480]
1186D80j991o91M25L25P88J307J886n00q49j018p47j332q44J141J675O67J008
1203A730O69l45j775j341n44n6l88R00J672J277L48q00j66j389j337p21O92J065
1221e09Q01J259Q45n31j108j034p77o77k83M83J655J136J86J86k57j097j939l66
1239b027M94L65J065J284R07l0j045m50j254r20n06O92J422O55O18N60j44j252
1257D34j395m55q4O6P81J543R88k37l89l84r57j901J79M98R24K90J293Q16j37
1276A873j205j503p1p73j08J117J341O58j29M60p34j098j341%J37N79M14J494
1294A111M71j99q70m01n90j196oQ11R78N96K73L13J33j245j182m33J67JR86J034
1314G52N31K29o52n94p17r36k53N34P86Q30O53N93n82j007n30m69l74j31N76J466
$$ y = [480, -1511, -2202, -1777, -1452, -664, 643, 2529, 2029, 1180, 162, -585, -1917, -2761, -1620, 55, 722, 1730, 2399, 2054, 279, -1062, -1606, -1662, -2050, -1150, 522, 1799, 2147, 1347, 1181, -208, -1545, -2266, -1574, -509, 292, 1551, 2396, 1865, 757, -277, -1054, -1731, -2014, -1531, 124, 1260, 1446, 1632, 1375, 278, -1661, -2027, -1533, -1168, -103, 1181, 2088, 2058, 1013, 563, -691, -1611, -2117, -1425, -3, 652, 1270, 1830, 1686, 434, -961, -1416, -1500, -1434, -653, 890, 1878, 1641, 1252, 868, -89, -1990, -1811, -1313, -389, -99, 1194, 2010, 1873, 668, -835, -906, -1679, -1787, -670, 671, 1329, 1200, 1660, 926, -172, -1513, -1513, -1376, -797, -383, 1111, 1582, 1383, 513, 112, -478, -1674, -1680, -869, 109, 705, 978, 1291, 1424, 179, -1003, -1436, -1269, -1268, -282, 752, 1283, 1512, 860, 266, -451, -1387, -1640, -1106, -320, 510, 1163, 1756, 1174, 167, -363, -832, -1206, -1337, -761, 705]
1334G05L30M5J33m05j093p63k79j15Q12P86R78K19m11k12p36q25m32n8M74Q27
1354b0R86L71L1o25n61r53j13l00J90J027O90M25k07j76l84q81o36NK66O57P28
1375E20O13L40q04m18o18n18m62M08Q64P42N15r8J37p06q84l59n24J94O94K76
1395h8P85L87j50o79l44p93l68L67N41M48O80Q6J89n27n77p19k23p4L86N53L76
1416B56N70qk26n66p12j59L5N9O72O88L23p9k57o57p4r41q6N31M88N52N41Jl99
1439E52l38n37k35j99JM78M90N00k0J01m46o35m20k32R5L71M46P00L36m08l42
1460B58l93m71l77P7O27O78K64L7J5l59n30k60m18L15J51L59O92O0m1j75l70p05
1482e66j04J00J86K99L01N04K60l76p03k59k90pj31Q71L03Q8L75k95o38k93j72
$$ y = [705, 1035, 1080, 1213, 808, -285, -1048, -1327, -1442, -630, 156, 1134, 1353, 942, 730, -6, -831, -1263, -1321, -847, -20, 966, 1337, 1368, 743, 182, -771, -884, -1184, -994, 33, 723, 1148, 941, 765, 381, -500, -1136, -1131, -865, -208, 520, 1133, 1473, 669, 251, -367, -885, -1347, -939, -75, 667, 1182, 1084, 1221, 515, -369, -728, -1252, -1058, -364, -88, 697, 1084, 934, 255, -89, -882, -1250, -883, -342, 106, 786, 872, 1061, 534, -43, -762, -985, -1059, -673, -120, 256, 826, 818, 592, 26, -686, -845, -810, -751, -79, 609, 932, 853, 596, -61, -135, -1076, -1162, -631, -143, 409, 950, 951, 552, 214, -323, -558, -757, -756, -278, 212, 712, 692, 793, 347, -288, -708, -940, -845, -474, -28, 672, 1008, 600, 258, -135, -606, -983, -906, -279, 399, 663, 700, 715, 356, -174, -434, -852, -537, -386, -27, 665, 725, 684, 509, 139, -566, -670, -570, -384, -85, 216, 720, 980, 604, -99, -358, -648, -655, -786, 85, 388, 476, 851, 556, -82, -375, -547]
1503e47k05J46K48N85O68J50o31r7p25o0j54K69J63M18L54L95k01n13n87j82j0
1524e16k8J04O52Q9L31m2j39l93o77k98L34K81L40N85J12p8k98l74j87n71M33
1545c40p1R3P67N0J58j93m75l4m91o2L77J41M48J57J05l54k01l50N1l62L52K32
1567bM48r1J93Q2k53p21j20O3j05L24M20J22K22l09j3l52l62j97J51N75J34j24
1589H5P07l70m73p8l89K17j05N4M64K28K66l6k01n71l27O7K04K20J59R2J81J20
1611E14l61j80l31l7k1N7M09K63J80l9m6m61j82M5r0j1L02K4M27k41O3j01m12
1634b29k84k02M60J56K56J28K34k16l94Q0l43m7J23K07J72K7K10P8n05O9n43J38
1656d25K23J57j05N36J78m00rj65k79k4o3K47J50N6J78K90o3m37l61N5j30J08
$$ y = [-547, -752, -606, -358, 227, 895, 1045, 414, 317, -408, -468, -622, -353, -190, 228, 582, 977, 776, 263, -324, -506, -516, -544, -440, 212, 301, 632, 590, 451, 58, -619, -917, -583, -302, 38, 623, 735, 657, 359, -15, -202, -773, -340, -411, -318, 449, 499, 657, 464, -11, -45, -536, -598, -221, -80, 368, 525, 630, 276, 75, -275, -224, -586, -234, -2, 446, 355, 548, 630, 377, -344, -464, -401, -506, -182, 238, 360, 582, 273, 260, -92, -454, -651, -500, 75, 209, 85, 792, 422, -51, -129, -518, -301, -406, -352, 112, 340, 606, 570, 369, -202, -529, -462, -258, -38, 121, 213, 394, 514, 153, -27, -358, -395, -416, -359, 50, 313, 493, 454, 408, -53, -235, -190, -280, -291, 11, 35, 462, 221, 284, 183, -229, -513, -715, -255, -99, 157, 285, 519, 303, -91, -11, -354, -401, -278, -71, 101, 128, 338, 416, -89, -20, -563, -425, -202, -45, -150, 386, 564, 164, 155, -10, -289, -313, -376, -129, 21, 77, 255, 545, 482, 45, -316, -261, -391, -283]
1678b83L08M05j40Ko9k88l79j35M29k1J07J89J96J55j42m68K8k17j02Q5L38K28
1700B26R0J24k25k71m5j94L7m5K04M27J07j14l90p6j02M1j98L02l0J88J16J84
1722C56j54K2m25j42L9NR8K73J66Q8J07j98n7m21m5p9K10J87K13j8O2N4m33o5
1746a57N6l13P1L51ML83R9m62l02o9j65K08Q5J97K25J43j61L3j57q9l66KJ13K38
1770c3O6r7L39Mk64j23m6N9j19J46J16L39m1j12j37j13q6j24m2m6M27J76j16R5
1794B68l6k64k76N4J33R1N3J38nK25j49k60k2j29j83K68K26Q3j15j47N09m70J2
1817Dj13K72j81j41L54J25j64K40m29j10k31K32k1J6J43%K02j30k1l96K15k2l8
1840a94M40k19J13L8K72l60k61m2J96j35K00QJ84j24p0j41o4LJ65m61L03L51k14
$$ y = [-283, 25, 430, 290, 292, 223, -65, -444, -579, -150, -171, -64, 125, 321, 476, 334, -134, -106, -323, -425, -340, -2, 226, 316, 440, 215, -56, -101, -295, -258, -303, -99, 328, 435, 321, -69, -145, -247, -206, -404, -102, -132, 56, 172, 356, 202, 224, -201, -343, -304, -299, -201, 72, 238, 326, 433, 235, 178, -243, -288, -367, -157, 30, 243, 225, 287, 341, -92, -157, -101, -414, -343, 8, 12, 395, 494, 32, -270, -339, -504, -296, -211, -14, 211, 354, 193, 226, 69, -20, -386, -384, -271, -33, 33, -64, 275, 279, 15, -108, -154, -95, -214, -68, 48, 387, 346, 234, 97, -16, -102, -226, -268, -314, 113, 289, 173, 268, 232, -32, -308, -254, -121, -30, 23, 161, 156, 381, 232, -28, -50, -179, -362, -94, 132, 215, 100, -47, 462, -8, 4, -109, 163, -18, -159, 195, 320, 156, 396, -33, -143, -374, -142, -163, -147, -4, -4, 198, 68, 47, -349, -134, -156, -194, 246, 27, 140, 178, 450, 90, -171, -213, -17, -152, 48, 56, 240, 116, 46, -95, -159, -156, 9, -452, -149, 202, -12]
1863a2M65j95k43k46o0J45l5r0L01N9L73k93l26K6l4J83j73J50k17M23l38L67
1885B30k12J36j65m6K4n9K08k07J14L5j0j6O3m99M24j57j1K28J68j97q2j1k6k18
1909b86K15O4J49p4J36J05l36j63J31q6K79k85L93r5k25J72k94J84j24j03lK35
1931a1p5oj5KK30k75j0R6J3r2J84L55p6q3k61j00J62Q2k70o9M87k10J20kk19K38
1957A95j44K7r7j28K10j61L54j09l01J48n9k6oK17n4J01l09L28r0j02j58J28j98
1980b34K11L2J76j17j12q1j90M6L2K90j40J80l75N25j21j52J69J11o10L02K38
2001A80j90K60j93K66k50L3j63J73l82RM57jK0j70P9j06O1k46J52j99J16L95l83
2024h2J85n9l48J09K23j25n6K07J81l33K52j41k5J6k72K07J22n3m2O5J8o4L9r2
$$ y = [-12, 453, 258, 15, -231, -291, -146, -181, -271, 30, 89, 462, 169, -157, -131, -165, 18, -155, -5, -222, 201, -137, 230, 18, 154, -11, -57, -33, -92, 116, -91, 23, 58, 48, 32, 95, -404, 20, -137, -148, 80, 248, 51, -31, -42, -68, -286, -71, -7, 142, 68, 204, 309, -27, -190, -59, -145, 134, -151, 242, 147, -78, 94, -200, -16, -140, -243, -246, -11, -86, -92, -107, -105, 125, -150, -160, -64, -51, -143, 41, 396, 320, 237, -24, -124, 38, 120, -150, -219, 268, 58, 178, 176, -43, 195, 51, 78, -19, -147, 63, -98, 256, 147, -154, -6, -65, -91, -97, 120, 66, 167, -142, 186, 96, -6, -164, -36, -234, -23, 9, 185, 68, -44, -125, -315, -269, -237, 53, -87, 93, -282, 243, 122, -30, 139, 250, -360, -58, 180, -10, 250, 57, 323, 73, 106, -57, 116, -266, -257, 200, 199, 219, 49, 128, 22, 83, -163, -11, -210, -94, 301, -82, 103, 44, -304, -195, 28, -97, -153, 54, 235, -98, 154, 13, -12, 4, -268, -61, 61, 8, -34, 31, 49, -15, 24, -68]
2048f8q2P4K23J82n28K97J61k32M5l5q1k2l2J00R9Lj78L3J8L04m81MQ7O2q5K64
2074A32p0R1j21k8p9k9M9l11M21j63L18j80L20l26J68j45j64J46q1K78k24M89
2096D91l15l21K59k68k2r1K07j04J86N1J81r9j80PJ27l40K02k42L90O1r6j84J33
2119C3k21%J42m3j38L88k21O9J99l5k04J29j85O6k43L53J97l47n8J38r9%k8J34
2143B6k04J58n8J14r1R6j45k53K81RO5j57M18j56K16k91l46M36l24p7K51K3l3
2166d2L05k55K20o3k04J36L3J1p3o7j47N09m27R3r4k74M28k5k10K30o7J49j11
2189E5J6k27Q2LK12k32k85N75j13n5Q2k83K32k19K44k0P1k00L3K17k93J10l5K41
2213B11j48r7M3J03k1N4j50j68J4K70J98j4l36K01j28n8M4K98j06m32K51k34L46
$$ y = [-68, -150, -76, 147, 329, -199, 98, 259, 27, 72, 37, -44, -66, -98, 2, 101, 104, -74, -41, -23, 281, -200, -196, -109, -47, -132, 132, 62, 153, 32, 4, -75, -104, -55, -366, 55, -108, 210, 30, 350, 24, 192, 47, -117, 29, -52, 226, 2, 491, 176, -145, 114, -154, -176, -267, -60, -164, 22, 73, 254, 155, -25, -18, 109, -231, -29, -271, 119, 180, 84, -100, 33, -188, -188, -46, -89, -227, 161, -60, 9, 208, 173, -31, 98, -87, -21, -264, 89, 286, -61, -119, 19, -80, -80, -108, 26, -178, -20, -78, 36, -55, 41, -104, -357, -76, -67, -2, -159, 259, 103, 319, 28, -318, 118, -206, -283, -32, -9, -42, 263, 8, 228, 165, -39, 97, 130, 141, 68, 1, -146, 363, -64, 29, -65, -339, 89, 64, -146, 84, 17, 166, 55, 71, -156, -74, -71, 141, -91, -376, 199, 86, 31, 113, -170, 62, -157, 87, 67, 138, -62, -29, 188, -105, 5, -30, 211, 63, -34, 9, 112, 91, 145, -5, -173, -159, 111, 309, 295, -41, 160, 32, -26, 18, 316, 210, -222, 29, -205, 141]
2236A41j56M5L3k8J02J93k63j66pJ09J0k6o9J58R0j40q6j29L19k11J74R5k54J23
2260E7j36l6J27j40L27j70J34j57J16j06J29l41J79l6P8J33q1L2Q7k05o3M5m1
2283f8P1J1j25O9R9K3q7J6Mq4N8J97o7lJ22n02K10K99l54j09J76k8K16j62k88
2308c06J49K36Q7r8Q4J07k92r5J1j2J91O9j50j69J94k12Q5J57j11j67L14j44p4
2331a46m7K25j01l00L42j8j10O1L4p2K43k83N80n29J39M6j18J0J47m6l1J31k01
2354d4J76k28K25j10j83K32k14K18l7Q3j82K8j78K12K13l00R2J14K3k02j0J89
2376A17l5j51L%K89m7j16j08J0k99M70J09j92nJ62k74L13m37J91j26j09N20m90
2399b05J62L06k9k85L11o70M58j10k7L9j23L21N1N1J7l69J48j89k62K72QK05O1
$$ y = [141, -15, 30, 63, 35, 137, 330, 67, -99, -106, 3, 13, -13, -82, 76, 166, 26, -60, -189, 130, -81, 93, 188, -66, 57, -79, -115, 12, -128, 199, 29, 163, 6, 122, 16, 145, -196, -17, -53, 25, 158, 77, 109, 196, -9, -72, -27, -68, 3, 14, -111, -42, 57, 80, -7, 9, 13, -71, -13, 184, 117, 114, 236, -266, -56, 243, -111, -220, -44, -72, 144, -18, -306, -157, 79, 166, 68, 152, 259, -33, -128, -117, -129, 62, 131, -19, -188, 6, -206, -121, 36, -75, -242, 72, -72, -146, -193, 32, -69, -369, -27, -45, -155, -94, -60, -132, 111, -172, 408, -121, 18, 64, -54, -44, 103, 57, 26, 157, -44, 132, -96, 129, 19, -164, 68, -146, 72, 35, 118, -64, -36, -214, -2, 211, -89, 3, 117, 140, -62, -72, 117, 82, -69, -66, -66, 223, 176, 60, -48, -38, -337, 133, 242, 50, 45, 207, -67, 246, -191, 0, -126, -235, 285, -205, -43, 263, 234, -51, 260, -410, 48, -62, -89, -50, -173, 148, 199, 250, 267, -102, 46, -143, -405, -133, -125, 80, 141]
2422A41m22M89j74j22j22K82N2j61J61k63J7m7J68l1K8J77k01k6p7J03K67l5j93
2445A1J02l00J31k7J09J49k14K18M1l09o5L67k85r1K49l11M61j3L6j77J51l27
2467i4J6p8L25k11J02k5J08k0j48K5j38o3K41l60M80J28m11M50r6m46M42o7m25
2490b65J66L28q9L7R9k55j00J57j03j59J15J71j76K30j23O6j52j27J48K5MK00
2512A97j6k02R7j04m1mlq8Q8O7K90k67K30j95J6j03K7P1mK99o9j63%j71j30J57
2538b1r5J57j67j3J46J69j80q7k4K3j65K03N2k65M03M9j84J71j83N8j21l8J50
2561C8N7k98j31L93j0J16j39q3k06J6K62J6MJ13j18O0k65L92j81k28k5K67N4J49
2585B53k24J4k3j34k25J30k1O5J49K49j35j07K8j66l9p2K27K7j2OJ13M3M7k95
$$ y = [141, -281, 208, 34, -88, -210, 72, 124, -37, 124, -139, -122, -169, -1, -32, -4, 173, -28, -54, -131, -28, 239, 204, 11, 113, -187, -56, -83, 26, 175, -39, 179, 220, -89, -154, 213, -72, -163, 86, -225, 236, 223, 259, 82, 233, -94, -78, -156, 169, -42, 60, 35, 143, 123, -25, 0, -138, -201, 40, -320, 160, 288, -123, 327, 231, -215, 227, 160, -265, -99, 229, 140, 177, 276, 21, -79, 78, -25, -184, -69, 102, -74, 156, 33, 99, -53, -180, -32, -7, -3, 197, 181, -21, 76, -28, -69, -73, -76, -164, -76, -9, 281, 14, 244, 49, 65, -38, -11, 60, 56, 355, 286, 123, 123, -48, -178, -21, -116, 41, -126, -139, 7, 176, -4, -91, -115, -92, -257, -54, -2, -267, 136, 185, 1, 172, -11, 47, -74, -112, 38, 95, -203, -334, 59, 49, 165, 26, -57, -263, -247, 15, 31, 35, 148, 30, 90, -175, 217, 36, -192, -217, 50, 104, 253, 29, 43, 20, -114, -339, -209, -230, -165, -16, 233, 98, -9, 19, -147, -186, -258, -31, -4, -16, -10, 103, 146, 193, -102]
2609a02r3J11P1KJ03K8o8j3m0K08k64j22r6K04K17J23j47J24j91l6M6l49K61K18
2633A95k04k63N73q9j25K46m15o6O6p1Q9k08L85R3j13l2l59n0J68K46j17j28K09
2656C0R5P5N1k34m8l5j33L26j8p0J16O1j00n3R5k88K10m38K14K33N2j04J65p7
2680A25j89qL5QJ28k50M50m78K63j39j35K17j15r1J49J68o3o1k8M81m46P6k06
2703a09k31J77J8L97j23n6L71o73Q5k20K35L16j89q6J90K32l51J07j28l27J30
2724b35J22J26J48Qj12P3j11R2j99l2O1J15N0L45L8n47k09J56m3M8J04m3J74M1
2748A70j36oP0k40Q1L8j05k11M94K43k04j6k96J74N2l59l3N12j64J31j68o3j4
2771e0j77R3o8m3J25J85j28K45p3J0m31J03o4L65j83J60P5J67l50K9J98l73M0
$$ y = [-102, -195, -84, -13, -11, 92, 120, 52, 39, -1, 207, -57, -179, -275, -71, 146, 269, 122, 246, 55, 19, 65, -284, -23, 195, -9, -272, 301, 212, 87, 333, -82, -148, -82, -153, -64, -272, 113, 206, 93, 61, -298, -348, -180, 66, -51, -179, 30, 125, 200, 251, 17, -31, -66, -199, 127, 109, 39, 155, 216, 116, 63, 158, -130, 80, -358, -144, 89, 141, 37, 202, 125, -64, -72, -37, -29, 99, -151, 299, -179, 84, -55, -190, 27, -88, -179, -30, 138, 75, 14, -14, 467, 21, 97, -109, -340, -163, -145, 252, 129, 73, 444, -229, -144, -364, -129, 187, -2, -88, 102, 334, -17, 90, -38, -365, -235, -113, 13, 161, 169, 57, 130, 19, 111, -88, -120, -59, 56, 106, 451, 489, -58, -267, -111, -154, -106, -2, -45, 129, 170, 34, 28, 98, -142, -61, -23, -128, -339, 155, 398, 194, 178, -118, 56, 108, -251, -284, 228, 64, 195, 27, -36, -50, -227, -134, -202, -245, -120, 65, -63, 182, 109, 119, -312, -209, -273, 92, -91, 69, 144, 311, -39, -10, 188, -185, -145]
2794a45j69K21J10r3K17p4K05j1n62K93k70J27J38J78j78%J16l38J35j50j85L54
2816h1J78k59L50J11l65J7j37j47j32L95R8j95L49J90l79j05j64R1J41K1n3J72
2838I6j71K94l8k71J82l43Q8j3Q6O7k7J85J07k12J20k54m1P4r0J94J32j62P4P1
2862A48l53J69l07P3K96r6M16l84L55j03J8j86q1O9j48M1M12j84Q3J63m01K7m15
2885c88K46j25P02k55k54K43Kj89q8J8j21j05R5O1L70o1k1J2l78R6J1j78K25k6
2909a08J88J32l35K37k09J11k37o6M33q1n7K59k19K41j29j16J07m41m9O47k38
2930G0k4K27j88J26j32m0k90J84l01M88J20L0k06Qr6j99L9J95m8l5M41j23N7k22
2954H1J12j83j33j24K59Q8k42L81q2j98LJ29o4L6l8Q4Q4j49q0J62J71k06m82J30
$$ y = [-145, -314, -93, 17, -76, 141, 67, 272, 261, -301, -8, -278, -151, -13, 165, -13, -13, 103, -235, -100, -250, -435, -81, 97, -162, 188, 299, -66, -49, -186, -333, -465, -70, 28, -167, 182, 372, -7, -112, -276, -185, -44, -23, -76, 96, -75, 219, 181, -90, 92, -251, -163, -176, -90, -23, -50, 135, 242, 30, 150, -104, -145, -71, -161, 33, 165, 3, 77, 148, -205, -36, -343, -270, 26, -70, 346, -38, 317, 214, 232, 46, -35, 34, -114, -73, 339, 155, 238, 401, 0, 27, -388, -142, -267, 435, 180, -74, 169, 171, -18, -106, -88, -209, -314, -219, -158, 212, 151, 130, 142, -236, -140, -129, -307, -82, -108, 80, 212, -123, 114, -95, 16, -221, -287, 146, 65, 8, 267, 48, 289, 160, 44, 151, -290, -339, 308, 70, 46, 273, 85, 211, 79, 39, -251, -67, -368, 120, 240, 270, 64, 72, -24, -223, -184, 11, -37, -72, 369, 246, 303, 81, 193, 10, -123, -247, 12, 100, -142, 239, 157, -41, -38, 91, 27, 63, 25, 109, 193, 44, -36, 126, 297, 91, -391, -261]
2978b61L62q1j73K45J94k16Kk31L6j10p1K51J81P3P7m09j28J81J51k73J04J27
3000C1m1J17K16k80J7n8J67l03l1o0L88N5J70k67j0l6k70K6J85k58J9M09q6P0
3024A70k53Q6j14l40J25L77J3j15J36m8N4j75R3j70J71J0p2J96l8K2j87K15l00
3047a44R0j15J34L9L8J50oK1j48L8k40J71j53Q4J93r0j0j89K56m52K40K82m9j43
3071cJ68j30M4J85l77K7k10K70j3r1N0M2K35L5j57r9n9O6n1m5L36l96J94J35K83
3096D39m26k84PK25L4j12J15J63k51J15j18K2k7K1j29nM23%O0l4l62j82J95K19
3120A08q8l75J89N62k75Lj32J64k21L3O8K4k33K70R1K49m75LK9k38K30J15k22
3143a21J25m9J62l87L62k91J11J92k62J2j97O13m8J9l44K1p5N7m2K40k9O8k44
$$ y = [-261, 101, 20, -153, 92, 286, 70, 72, -159, -123, -233, -304, -53, 128, 201, 278, -131, -259, -78, 73, -200, -96, 31, -10, 107, 323, 43, 60, 2, 169, -134, -165, -225, 163, 218, 388, 121, 111, 75, -195, -169, 16, -242, -223, 186, 100, 170, -83, 3, -111, -451, -326, 51, 64, -51, 85, 37, 91, -84, 9, -161, 10, 20, -52, 144, 106, 128, -59, 156, -144, -54, -169, -35, 4, 42, 192, 186, 207, 59, 97, -143, 28, -125, -41, 152, 62, 52, -137, 119, -333, -93, 189, 140, -3, 165, 35, 79, 264, -113, -86, -296, -26, -39, -130, -80, -38, 197, 232, 75, -24, -83, -17, -68, -113, 223, -173, 21, 156, 439, 13, -271, -264, -39, -5, -117, -2, 161, -90, 25, -93, -71, -98, -77, -206, -211, 212, 212, 272, 238, -124, -306, -111, 108, 20, -355, -166, 396, 121, 124, -8, 156, -65, -32, 36, 60, -173, 97, 188, 437, -38, -35, -6, -244, -14, 101, -121, 4, -45, 117, -270, 92, -199, -88, 104, -158, -146, -343, 270, 222, 241, -103, -82, -157, -100, -142, 98, 69, 137, -107]
3166a07J52J17o6k78K03j61n7K47J67j96N6r1j82L2O6J02p5L08k8j68J37j75J04
3189A07l71L01k97N5K26j39J97k9K38q2m81K89q1j49P2J98r4N48m41j12N9l9k17
3212b42J57K92n9p9J69k10j72P2N9j17j2m3J92K35k25k04K51r6l21K48j14J61
3234e8K61k90M20l21r0J9k47K18m9M6O0M8MO0j23j71r3R9R2K80p8N5j27J8kJ6
3260D7q6j10j1j11J48J90j05L06k37r2L5m6J58k23K70n1k05J02L77j61k84j57
3282b46J01J0Q7J57q7J85N2j75J62k22m16K23K0M9J38K07j87r5L9k19M0K9J2J21
3306a5l4Q4m1K88p0l28j4j40J19J28K90j52J87j20q1r0l76L30KJ0J22j33M73m26
3330A3j0m9j67M1J06K27m7r7K02pj64j95Q6q4J95L7r3K36j66J62N1l3m47J58l34
$$ y = [-107, 45, 162, 96, -182, 21, -140, -197, 50, 217, 21, 77, -14, -196, -164, -98, 4, -71, 237, 209, 41, 178, 3, 107, -264, 37, -260, -205, 21, -118, 79, 50, 288, 206, -275, 14, -67, -216, -144, 54, -40, 508, 67, -45, 14, -25, -242, -85, 207, 148, 69, 238, 28, -144, -72, -13, -130, -142, -185, 7, 242, 17, -187, 64, -32, -353, -105, -219, -58, 203, -87, 333, 12, -78, -59, -306, -88, -137, -91, -31, 17, 21, 81, -42, -213, -306, -207, -115, 165, 87, 142, 15, 33, 31, 47, -39, -149, -160, -271, -123, 67, -38, 268, 31, -61, -26, -72, 86, -137, 133, 82, -123, -21, 356, 195, -89, -246, -145, -135, -48, 109, 22, 207, 259, 84, 246, 24, -392, -169, -149, -100, 38, 245, 58, -37, 2, -217, -177, -148, -136, -15, -49, 35, -6, 282, 212, -116, -130, -270, -151, -23, 267, 115, 302, 182, 101, 11, -365, -35, -33, -23, 99, -34, 439, 13, 3, -46, -213, -172, -66, 161, 114, 17, 219, 212, 48, -147, -61, -145, 50, 87, -6, 230, 64, 226, 277, 244, -203, -45, -379]
3355c79K10K81l04L46j2p1ko3p6m43M79r6n1J73J22o2j9j41M3k55L27K9J1J49
3379A96j24J60k59j06r7j7j6K68K0J88Mk42J82q1k37R7L6m6K27Kk46K86L54l73
3403A76j69l16J09K7J56j54M84k21m3j84J19m19J97kK11J24l03K35q0J67k66P7
3425g5L2J38J34k32k7J01J92k45m4N5j12J05j05J63J58j26q4j74k6Q7N5l0k29
3448b89L21K64k63l5j42j58L80m4j02J29J75k91j17J70Jk00L17K3j85M7J16J13
3470B30j17M5r5q8M33o62J73J36K7m0K32k65j86N7J28l46J84j02M3M62j69K7L03
3493D10j93k69K68l01R6m27L51J64R2j57K95k60j31n1p2l07L62L65j65k24K19
3514F5q6N8j78N2P1o7K57Q0q4l26O3L94m55J20n7J12K63q9j21R6o1k66O9J62j73
$$ y = [-379, -169, 112, -192, 154, 142, 71, 69, 6, -70, -513, -34, -130, -181, -8, 114, 52, 33, -108, -65, -320, 7, 36, 47, 196, 72, 232, -27, -133, -230, -247, -263, 5, 25, 213, 217, -25, 157, 76, -161, -64, -28, -74, 153, 155, -91, 195, 549, 176, 7, -309, -200, -173, -17, -171, 313, 92, 49, -135, -16, -435, -238, -240, -29, 95, -208, 27, -53, 114, -152, -75, -43, 95, 229, -3, -30, 71, 263, 18, -26, 29, -83, 22, -83, 80, 238, 112, 28, -146, -172, -85, -30, -60, -289, 32, 296, 33, -2, -144, -302, 78, 34, -68, 61, 236, -55, -172, -2, -1, -201, 116, 139, -46, 1, 117, 230, 113, 158, 63, -25, 408, -254, -81, 55, 82, 42, 274, 9, -177, -120, 8, -338, -154, -256, -213, 249, 80, 107, 410, 217, -52, 216, -85, 11, -416, -65, 99, 191, 34, 329, 69, -62, -113, -185, -492, -130, 235, 70, -154, 65, -21, 37, -141, -89, -18, -85, 172, 252, 168, -158, -95, 299, -156, -36, -93, 19, 282, 193, 72, 168, 107, -159, -90, 72, -101]
3539a01J13J3J35j70L52k92p5j02k6K4K11J02m0j2l5j55p4J2JJ01M3J93J47p1
3563B94j02J2l59K33o9Q2k26J30j26J71K10l78K14m57J64Q3J8M00j89q6P1l28
3585b38N28m99M4K23M9o3J02J3k42K05m37M55k72R0N9p7J83L17k59l44J49J44
3607A30j54k07O6o4K66n9mJ03j89M2R3j05L77l27R9K31j52k10L84o97M50k88M1
3630a74P1K68J71l67J88K88n20J33j09L2J1Q4j24L6j27M21k03k00J68k45K28J27
3652A57j36p0P9j19M0K9k48J9K47L7J47k49M33j90j14J1j28k13L85j25O9r3R4
3675F2R2k98j01J49j10J85nj9l2L28k54j11r6J97r9l6J81p4j23j2N4M7Q7k49M67
3700B30k01j81J84o8K70p7j44k23J30J4jr5K37rj66k2K26j06J77l95J76p4J47
$$ y = [-101, 12, 25, 160, -10, 342, 50, -25, -127, -153, -129, 82, 184, 144, 132, 97, -58, -132, -120, -119, -18, 25, 218, 365, 294, 192, 204, -155, 78, 9, 91, -135, -5, -131, 40, 250, -128, 86, -371, -207, -124, -106, 294, 105, 19, 90, -238, 290, -209, -165, 58, 107, 44, 146, 159, -83, 122, -315, 140, -132, -42, 17, -60, 123, 440, 181, -163, -14, 130, -24, -231, -165, -229, 37, -22, -26, 77, -112, -70, 23, -82, 295, -32, 67, 298, 146, -64, 320, -377, 73, -215, -174, -103, 165, 336, -31, 157, 445, -75, 58, -51, -19, -8, 76, -48, -12, -139, 282, 79, -121, 47, -198, 30, 157, 21, -49, 30, -89, -49, -20, -268, -249, -2, 35, 182, -67, 366, 176, 62, 73, -55, -268, 117, -8, 61, -32, 62, 154, -144, -245, -96, -206, -21, -26, -45, -77, 251, -3, -114, -210, -13, -112, -148, 33, -41, -164, -176, -122, -75, 12, -237, 230, 29, -152, 32, -36, 234, 157, 13, -210, -80, -66, -67, -162, 75, 66, -100, -122, 104, -2, 175, -220, -44, -118, 29]
3723B9j73K10L56k80k07K34r9k14J83nJ93j22l47M14k77K5k2j99J17r6J24L06
3745A50j4m6p9j0j39J8J47r3J72k58K46j06J47j58J6m8P1L2j19L71l40R9r1J65
3769A33l44j53M96l46M28l34K95l01M07j12j87j12l37P07l20K85j87MN7q5p9K95
3791B10m48O3L93j40km5j47K36O7p8l56o1J43L99o6J02l22j23J24o2k3r6J93P0
3815C1r3j6L81k75k75J18J45j79L41mj60N0R5J6j67k65K95j45K00j12P5N6J81
3838B93j83l09K59M8j23J62l3o4R0O7k42J69k66O4P8j75P6k07L61J82k79J53P0
3861A91r9j64L83k60o2P3Nn8j47p8J80n9j40J45l8k0l3J29Q6r5R7M5j48N3j33
3886a47K0L05j15j70K92l44J58K7m9qQ6j96M27j64k18J50J66k47j47J15K63p0
$$ y = [29, -144, 66, 422, 142, -65, 169, 70, -144, 39, 34, 227, 105, -242, 172, -105, -80, -102, -301, -184, -280, -156, 150, 136, 90, 11, 1, -138, -120, 27, -66, 106, -152, 94, -12, 135, -23, -7, -55, 16, 48, -71, 300, -40, 59, -32, 133, -211, -364, 132, -214, 214, -120, 175, -126, 281, 169, -18, -130, -467, 240, -80, 205, 18, 22, 79, -6, -85, 210, -238, -175, 218, 78, 76, 31, -116, 120, 187, 109, -247, -308, -165, 234, 168, 270, -52, -175, -51, -113, -136, -232, -39, 31, -62, -78, 303, 28, -247, -129, 16, -163, 178, 174, 14, 64, 159, 175, 8, -257, 38, -107, 93, -19, 56, 112, 293, 110, -199, 60, 108, -15, 147, 114, 50, 140, 207, -35, 134, -132, -68, 10, -165, -89, -296, 65, 247, -32, 121, 191, 92, -72, 311, 51, -11, 62, 67, 9, -138, -216, -36, -95, -235, -90, -128, -148, -181, -52, 34, -61, 36, 81, -67, -14, -147, -127, 178, 63, -107, 185, -159, -1, 26, -23, -31, 55, -141, 286, 122, -96, 54, 220, -27, -174, -59, 204, 134]
3908A34m4J3J33k87j12J34O6j84K34j39r6J14L00k65k88N8J55J6J44l09M35n6
3930A56k99J90j17M2J18j3j97K20k1j74K35l95K33J57l30L74j28m0N3J5K33l47
3952c5K72m35K60R8k44l7P8M9K31j33l39J32K3rJ04O9j6o6J68k28q0O4r2J00O8
3977BO9k37J14j12J23Q4Qk69K99j14k16L31m6m9l02J51j4K38j33J07k18K30M1
4000H7l6r9K29Mj88M0J2j26K3J29N6j62P4j82O0P9Lr1j22K83j61K03j9k50L13
4025A59m14K48r3J3K16j50K75j42k00P5j18K34j08j17J79N3j28N5K42l52n7L52
4047B22k64r1L72n28Q2L22j83j10K84j61J18k77L13j57K77l26R2p4R6J54j30K9
4069F0q1P4N3j03Q5M8j04p2J15J19l07O1l6j22J58M6No5J44M0m2j30j33J65K86
$$ y = [134, 90, 103, 236, -51, -163, -29, 37, -147, 87, -52, -148, -34, 266, 1, -287, -229, -74, -58, 86, -223, 212, 156, -143, 47, -70, -28, 90, 77, -120, 100, 79, -95, 140, -255, -22, 135, -195, 179, 51, 11, 64, 79, 312, -35, 237, -198, 62, 160, -84, -121, -43, 6, 237, 104, -235, -103, -80, -89, 15, 84, 68, 2, 170, -58, -138, -74, -166, -66, 2, 71, -166, -52, -164, -41, 43, 51, -218, 81, -33, -249, 82, 36, -13, -315, -164, -178, 60, -73, 34, -184, 46, 87, 51, -48, 181, 185, -3, 37, 49, -77, -54, 75, 131, -31, 43, -139, -79, 0, 3, -88, -210, 73, -88, 115, 96, -154, 159, -255, -7, -100, -87, 129, -21, 254, 112, -88, -13, -131, 103, -5, -122, 57, 110, -18, 37, 279, -73, -130, 222, -42, -133, 239, -289, -207, 115, -68, -178, 106, -55, 63, -214, 99, -58, 219, -107, -15, -89, 7, 161, 31, 60, -21, 53, 106, 3, 88, 136, 32, -40, 75, 194, -113, -52, -88, -210, -52, -6, -1, -66, 78, 118, 76, -54, -187, -22, 264]
4094B64l92K38j16J46O3l14L63k51Mj46M12l88J0J58j83N0k01Q7J61k0j16K53
4116H2m1j50R2J31k29J64j28K30p4q5K32k28O3J1j28l7K58k95O8M9l5o1M8J19
4140E6j38l7J12N2j87n4L61j82Q9j88J6J07p2K59o7k13J09j14L62k39j54L05l3
4163A50j46K34l55k02L30l1j44J64l84K61K82j25j20P5L8k69N16l70M30j90j68
4184b4m9j60K93n8NJ30l69J47K06m7J27k82J93j90k2M8rj4JL20l87r1K50k11K41
4209D8K9l03L91k60J69J82k31k9j17K91j0K1j14k16L13q3K9j36n6J57j57PO0J01
4233H6j24L8k12L39j87K0l1k10J71J4K00j94K77m8l20L06J20k36q9m1j6J68j9
4256A2J76k77K8M5l5K3J38j72J54J75j37j68M09k42l4j62L16k59OLj77PL01l59
$$ y = [264, -128, 110, -6, 140, 203, -111, 252, 1, 5, -141, 271, -117, -107, 51, -132, -82, -283, -196, -35, -55, -171, 82, 41, -109, -17, 114, -115, 49, -79, 151, 77, -8, 224, -4, 59, 70, -58, -95, 163, -132, -64, -15, -50, -111, -63, 56, -82, -119, -7, 45, -142, -196, 165, -17, 72, -116, -100, 7, -65, 194, 127, -86, 23, -91, 271, 32, -122, 183, 150, 4, 238, -117, -319, 11, -20, -164, 0, -384, -123, 159, 34, -86, -11, 27, -242, 274, -96, 334, 144, -24, -73, -233, 60, 2, 7, 137, -232, -85, 121, 74, 201, -81, 112, -78, -100, -52, -61, -75, -74, 246, -141, -232, 18, -193, 48, 77, -226, 165, -95, 74, 256, 25, -4, -121, 170, 160, 181, 67, -149, 164, 81, 110, -26, -82, 75, -82, -75, -15, 86, -38, 0, -212, 127, -60, -40, -71, -281, -110, -96, 104, -90, 187, 139, -181, 125, 245, 9, -80, -121, -137, 31, 12, 188, -89, -61, -16, -51, -28, 110, -62, 92, 267, 130, -38, 371, 129, 95, -67, 249, -10, -4, -1, -178, -171, 130, -229]
4280b29K87n3m3J68j13j71M38l26J52k47R8j01K00O0j41oK2l26L30J76j70J79
4302A84k24m5JJ73j62j45P6j3J50K5Pp4K6l1P2J76l54K80j38mJ00j87m3L44j70
4327B4J32k54j11K06J59j61Jj28L74l30J49J51k48M9K91j71k87L49k45pl8J60
4349F5J69J07n04L28j44J8j93J89j00r1p2R2L51l03K28j04k08J24mj6mJ3J37j27
4373d9P0k56J35R7O1l5J15j62j07N1K13LJ00j28p9P4j37J01j08R9k47K92j54j31
4397a82K17L6m3J31j18pj94J63k52K86K7P7k26L14j60k46N6j3J62r3Oj33K81K25
4421C14k60Q2k8j77K1J16o1j90Q0m5M3N6R9Q1k49n9J68K07l9k10MP1j05J8K7J29
4447I3j27J37MN1K8j11k94l5J45L69m11J20k16K48j37J6K76j26k47L68q4l6l7
$$ y = [-229, 58, 5, -38, 130, 17, -154, 284, -42, 110, -137, -39, -140, 60, 120, -21, -27, -5, -331, -1, 175, 5, 184, -40, -85, -84, 89, -73, -218, -142, -155, -5, 20, 27, -47, -21, -52, 20, 196, -158, 122, -16, -20, 80, -107, -150, 194, 24, 156, -98, -209, -3, 156, -5, -4, -132, 242, -88, 61, 212, -36, 13, 304, 133, -154, 195, -50, -57, -95, 65, 234, 341, -163, 165, 21, 39, -154, 35, -65, -156, -228, -136, 215, -88, 140, 36, -172, -48, -52, -68, -72, -59, 78, -49, 21, -235, -100, -3, 58, 23, 138, -24, -131, -80, 133, 136, 236, 108, 29, 103, -34, 67, -41, 58, -189, 103, -51, -182, 35, 71, 28, 159, 41, 34, -160, 3, -249, 37, 64, 141, -85, 229, 69, -177, -121, -134, 28, -65, -59, -192, 89, 314, 54, 136, 108, -69, -48, 68, 7, -183, -103, -148, -105, -49, 50, 131, -118, -177, -9, 198, 159, -51, -47, 24, -81, -63, -36, 93, -34, 103, 107, 158, 186, 75, -219, -254, -109, 260, -151, -31, -247, 1, -136, -120, 156, 30, -217, 151, 67, 31, -6]
4470fO1j08k14N19j4l19K03j16j14M9K18k52j37K67J87nk29K42n3r4j48O7j41
4493a37J20J08j86J93o1j26Q1j22Jl9N4J47O1l47L84q7n5K09k1j3l53N2L53k36
4517b0J01r7J44k08N9J79m5j45j96K73Q4j30n4K56l11j72M40l67M03M8k53M2j35
4540a04L50k93J20J58j98J03j61o7N2kL03l40K96l9k46K18l03N24l63o1J04L06
4562C57k58r6J24o4J42p7q4o6L14l86J51k5k87M2L24l5j15J44k08K51k30K2%m8
4586a08K52j52j59K70k16nL17j04j36j5l21K49l3J83j02J19k0l7Qj33nk2n8J78
4610e0J67k16K50k16J2L3P7K2j10j72J06R1J58K2j02Q8k23J32K28l85Rm1M11m35
4634a44K24j58l4K37k1q5Q3k7P2k25K6K3k82N8K90P7J5j05J00N6j69j3q4J86j80
$$ y = [-6, 55, -53, -267, 252, 238, -81, 122, 6, -108, -59, 159, -93, -230, 37, 224, 219, -10, 232, 179, 85, -63, 4, -137, -17, 91, -95, 98, 37, -89, -8, -130, -129, -168, -114, 33, 94, -253, 131, 44, -11, 198, 177, 164, -189, -137, 216, -20, 81, -16, 128, -80, -21, 158, 113, -32, -228, 45, 129, -1, -55, 201, -110, -282, 158, -209, 194, 242, -11, 31, -104, 246, -47, 73, 231, 33, 136, -25, -92, -40, -42, 261, -79, 217, 178, -68, 150, -153, 371, 8, -53, 51, 357, 99, 3, 127, 63, 205, 128, 44, -22, 292, -94, 57, 32, -255, -213, 111, 76, -39, 105, -103, 148, -82, -60, -60, -108, 144, -8, -167, 103, -113, -118, 199, 95, -41, -56, -377, -128, -161, 22, -80, 39, 19, -18, -10, -143, -148, -170, -228, -50, 117, -99, 151, -65, -53, -20, 57, 79, -31, -203, -97, -6, 152, 174, 72, 160, -63, 69, 297, -88, -79, -120, 291, -144, 80, -78, -112, 125, 104, 19, 102, 75, 147, -78, -52, -29, -311, -253, 37, 114, 129, 24, 124, 180, 11, -2, -86, 100, -80]
4659h0Q0Q9N7p9j51J59k06L40m33M18j76J30r1j80p8L14k29K04l50L50r5J05j4
4682H4j8J22l47j02L88j84J10k9OJ2j05KJ47J64k37j73K19j08nQ8n5K5p4M7OK6
4708In3K94k74p0K31K4j00K8K7j8k02K27j51PJ72K5k33K46j39q1K09J36l49J46
4732A11J85j26J5j73k9K38k90J48p5K28m44J63M9k8k37j92M06M6J64k25K75k99
4754i0J16L8P1j01p7j12J2J51K66q9m9k27r8K52m4J57k60J79j34J12NR7l12K54
4778A17J00j48O5k56j79K77K56j44Qj00J86j12J5M5j72QJ81k81J98O3L0l65j78
4801c86N35j73P2j4k07K14J53j28l38M16m51M04j82J94m19L06K23k23k59L06n5
4822a2J5p5K09q4j42K43k78K32J7j60J8k19J93K02j5J39m20J00j07P1J31j30l5
$$ y = [-80, 0, 89, 146, 67, -84, 75, -131, 209, -224, 194, 18, 148, 57, -123, -201, 113, -116, 88, -262, 88, -7, 98, 84, 66, 188, -159, -261, 127, -57, 53, 24, 30, 42, -63, -61, 86, 250, 13, -160, 59, -49, -54, 34, -21, 4, -70, -23, -17, 9, -44, 250, -24, -94, 137, 161, 61, 89, 116, 98, -104, 123, -28, -21, 151, 176, -57, 189, 50, -31, 178, 314, -35, 111, 296, 170, 185, 12, -17, 221, -69, 79, 4, 232, -212, -49, 0, -28, -265, -457, -51, -5, 159, -66, 209, -90, 26, 64, 135, 34, -43, -155, -143, 8, 274, 185, 136, -91, -189, 63, 19, 176, -84, 95, -39, 73, 78, 175, -137, 117, 217, 69, 134, -122, -301, -24, 232, 88, 96, -4, 182, 70, 85, 130, -42, -34, 147, -134, 64, 127, 157, -208, -386, 149, -24, 48, 34, -173, 41, 194, 66, -272, 144, -307, 97, -85, 109, -310, -4, 219, -4, -263, 43, -12, 3, -72, 137, 53, -89, 154, -124, 108, 125, -35, -17, -236, -43, 159, 144, 283, -137, -37, -144, -73, 58, -72, -107]
4845a07L1J62l10K11n6j60J59QM5JK7Qj55K87k17K86k26r5K40j51k68J00R6M9
4869c5J11p5N7j8o9j22J13k01m5K31k26K29M0n8l7K92Qn4jj40J81l00K64L7m43
4894b61N45k11j9q2k3J07m7N2l12m6L25j03J11j36K68o9J79l99K95l64L45k14
4916e9M6K00j14o5q5K8J12k18k8Q4o3J91n3J06j60L11k43j39K14J84m02M72n38
4939b19j6L09l3l30L86l02J95l41K14K10n7l41L64R5j41L54n45L40oo7j30o0M9
4962g2j42OQ0J21K71m73L27j14J3j17j68J00J78J74j77r6K0J2l52L29K14j37J25
4985A22k52L0J08j08J05J62k36Q3k15K13j22p9K83j22K25o8j68J05kK1j39J26
5007G2J39k81Q4K5P6k13k9M6j10J81k06L55j3m10L80j25j25L32j64j14L55j40
$$ y = [-107, -76, 86, -224, -13, -69, -229, -70, -62, -17, -16, 11, 19, -136, 151, -66, 220, -6, -101, 139, -12, -280, -180, -84, -35, 76, 1, 58, 40, -29, -151, -38, -239, -284, -53, -279, -50, -10, -68, -105, 187, 195, 141, 140, 0, 181, -119, 145, 182, -261, 284, 73, 54, -28, -51, 56, 9, 61, -251, -297, 28, -75, 36, -100, 168, 99, 278, -121, 174, -190, 155, -59, -13, 187, 73, 8, -77, -49, 63, -155, -183, -99, -162, 29, -24, 82, -78, 233, -10, -149, 65, 249, -153, 319, -219, -235, 74, 41, -289, 97, -205, -10, -351, -137, 73, 16, -325, 39, 134, -7, 347, -198, 142, 136, 69, -61, -121, -72, -214, -208, -128, -7, 264, -209, 118, 4, 17, -100, -268, -168, 10, 184, 7, -89, -69, -57, -409, -80, 134, -3, 122, -130, -100, 8, -100, 5, 167, -69, 14, -201, 12, -110, -189, 94, -28, 197, 129, -39, 66, 64, 85, -54, 72, 211, -70, 14, 39, 115, -98, -127, -81, -191, -10, -216, 139, 126, -284, 96, -29, -154, 178, 14, -100, 255, 115]
5029A15K7l2N6m78J77J11m0N7J64m15L34n4m8l57J99J72qL8J20j04K01k44k8K5
5053a2j17O9J70j32o1O7J37j75K7j9j95L47J1l1J07k25k72K21K2j89P4L96l01
5076h1J10p2J20j10j22K92n1p6j05M7jo6N2J50q8K10j66k39P6p7N0J86O2k05K52
5101A48K3k28m9j80L60j50N9K20l68M77k22O6j40j05p5RJ28n8j17Q1J19K28j74
5124E2J11k5l12J35p5L81j87O2l34Q5R9j43J11k80M41j17L37l30Ql5N4j82N7J00
5148A3k35K25P2J67l80K35o8n7N8Ok18J84nl0k89J97L84n68K48K05J74j52m9L6
5172A53j55qK8k5k48K56l43M43k65L88k27j70J35j98J47j59p9L07N9L9j22J47
5194A03j05L1K50k76L5j09J71j32J19J17l13O4J55j59KK21j2q0R5k02K44m31K22
$$ y = [115, 142, 110, 166, -312, -135, -24, -64, -7, 157, -258, 76, 22, -26, -383, -184, -12, -20, 18, 138, 34, 235, -9, -37, -12, -129, -60, 110, -22, -83, -16, 121, -54, -27, -46, -241, 106, 117, 86, 193, -32, -304, -83, -61, -250, -176, 220, -81, 29, -43, 77, -33, -155, 137, 86, 10, -95, -48, -49, -115, -63, 87, -1, 209, 43, -196, -120, -197, -147, 39, 101, -104, 148, 171, -57, -106, -286, 74, -76, -17, 203, -165, 312, 90, 156, 16, -89, -164, -155, -27, -85, -202, -121, -2, 226, 52, 163, 138, -174, -39, -114, 267, 80, 142, -192, -107, -8, -151, -40, -320, 121, 4, 341, 11, 19, -16, 38, -144, -87, 13, -222, 3, 75, 242, -138, 97, 29, -28, 30, 36, -182, 2, -3, -33, -322, -125, 259, -309, -61, 144, 318, 166, 117, 153, -2, -10, 18, -7, -255, 1, -342, 101, -164, 224, -3, -173, -38, -236, -89, -248, -327, -20, 39, 78, -44, 103, -2, 29, 279, 3, 38, -71, 100, -32, 87, 204, -109, -45, 110, -49, -47, 174, 162, 82, 177, -25, 219, -212, 10]
5217A0k76M0K52r6K19J34l04j2P5j78q8J07J34J09k57m5N6K8K6o9n2M00j38l65
5241b90M48k19o7K79j9m6p7K36l9j57k16K24M9k08NL39l40M42k94q9J69o8K2O0
5265A44K04k89j61k63O07j29K86m17j9K75k39k82K31l2j06J34k6m7M9J08Km2J40
5288A28r3o2L9J99j84m9r4L5j1L9J06r6Mp6J88k53K6K27j56r9K3K50j35K07k9
5313A34j80O7K87k11o4K6Q0l51K93Qk17J20R5r7j7J20q9rk32P7M27l9l64k4K63
5338A03j34k70J72o9J30O1K50k90j12k7M00Rj41j12N3r5p6M25j75k83j30J87P3
5361e1l9L2Q7K13n39K70jL31n90K47R5k50J41L34k99J8j4J04Lj34P6p8R4j70L39
5386B19m44J90P1N1j61J63R1j10J06k44J4M1P5k08O5J13O3q4q3Q5J28j3j87M49
$$ y = [10, -266, -226, 26, -70, 149, 283, -21, -33, 42, -136, -224, -117, 17, 126, -131, -176, -120, -92, -66, -135, -187, 213, 75, -290, 158, -61, -128, 151, 132, 86, 9, 245, 206, 49, -167, 57, 106, -102, -97, 242, -98, 344, 50, -39, 130, 62, 84, 144, 348, 59, -102, -365, 242, 113, 399, -18, -37, 238, -1, -283, -52, -84, -190, -56, -82, -129, -80, 28, 30, -12, 128, 35, -27, 12, 211, 27, -22, -116, -81, -92, -53, 53, -43, -39, -115, 73, -180, -154, 73, -83, -182, -159, 91, -44, 163, 134, -46, 21, 308, 97, 33, 59, 139, -212, 81, 89, -128, -8, 87, -10, -27, 93, 4, -5, -237, -160, 267, 228, -136, -160, 103, -31, -301, -129, -198, -68, -7, 243, -47, -159, -186, 214, 223, 82, -30, 23, -72, -148, 277, 102, -181, -311, -124, -51, -90, -58, 29, 242, -297, -27, -28, 303, -287, -40, 55, -195, -54, 280, -19, -1, -15, 89, 92, -42, 34, -44, 50, -120, 219, -225, -35, 36, 87, -74, 89, 180, 70, 176, -68, -54, -13, 62, -146, -81, 32, 95, 11, -72, 13, 141, 128, -59, 390]
5410C90n26J34j5Kp5j12p1K54Pj68L33l33L8O2K56MJ4Qo7q0k14K70k51K25l53
5435b68o7L69j63r5L29j63M3n3k6J36M0K40k84j87J97R5m7M0n2n1oj01K62j72
5459A6j32J42j67J66n0j4L5K4p8N8j98J5J29j73l3K81j18L49j60q2pk15L56j20
5483B4p6K37k48k2N1K29l45R8O1n6j27l7M6m6L6K45j55J31Q0l19L61l03J61j42
5507a16O5J40j38L7j12J76j45k37M03k85J90j49L77k05K6j8n4L4J81j22k70K02
5529b0O5Q3K3J17j18k17k44N86l6l02MR3r3k0J25q1J32k61J97Q9m1k0K7j09N3
5554C2K48J51n54R1n2N3K9J53j30L2m0N7j1k49L2K07p4J47j25p4J76j27P0L9M8
5579A29k52o2R9L97l71J14j42J85j14J01k77k5L5L6n4N8J28J77J05k15k15R9K53
$$ y = [390, -136, -2, -17, -15, -90, -202, -273, -19, -12, -180, 153, -180, -142, -80, 176, 180, 194, 202, 135, 55, -159, 111, -140, 85, -268, -335, 34, -129, -224, 105, -58, -15, -68, -94, 42, 82, 322, 38, -149, 48, 143, 96, 136, 84, 33, 27, -74, 188, 16, -116, 26, -141, 25, -25, -39, -4, 20, -58, 0, -198, -183, -54, -227, -260, 21, -97, 252, 92, 10, 3, -212, 144, 24, -52, 185, -63, -85, -34, 195, -150, -52, 9, -47, -174, -211, -165, -211, -175, 70, -85, 46, 126, -193, 168, -135, 26, -116, -51, 89, -49, -12, -124, 52, -93, -330, 73, -212, -22, -171, 206, 1, 27, 9, -45, -11, 170, 48, -222, -20, 45, 128, 151, 268, 150, -67, -311, 275, 239, -63, -59, 34, -59, -79, 46, -35, 97, -164, 33, 122, 81, 61, 88, -21, 32, 280, 431, -123, -32, -84, -31, -2, 151, 21, 53, 13, 70, 59, -190, -158, 49, -25, 122, -3, -77, 99, -28, 42, 81, 129, -123, -185, -86, 311, -60, 54, -88, 97, -17, 84, -193, -218, -183, -147, -201, -143, -15, 162, 267, 52, -163, -64, 189]
5602A89l23R1q6J68j40J24k53K41J02j39j62J04k08M52j56M6m31L26L10j76o3
5623A6J99k07k50K74j06j8o3K52r6o2K49j97J3k0Q1R3j26l2K5j9K20m17P8M0q1
5648a54J39J48j37j14K81k49K73k21K35k83l8N6mJ05j63J21k39J35J23o1n9J33
5670B7J87l07k9L51k95n2J81k43L0n9L16O1q4J30l36K57j90K29k23J73k05mJ58
5693G3J33Mj85j87L37l35J93J07j46j03j8L99k02o7j18K63j9J47l06Q8oL1j52
5716f9J70j63rN7N5R1j43k1P7J61l34L3J17J05N2m89K03P0J56j0k88K51j08j5
5740e1K03l97M16j14J7l1o3pl13O15k27n0J8k07M61j24k53L64j78M3j31q8K64
5763A67l94K99p5J15j50J6J9p0J01k39R3J30J74k5k09J9M5J0n2K88j74l7K6j51
$$ y = [189, -134, -43, -129, 39, -101, 23, -230, 11, 113, -26, -188, -84, -292, 160, 4, 50, -381, -55, 255, 79, 16, 215, 8, -242, 32, -74, -92, -155, 97, 1, -61, 188, -9, 4, -16, 65, 158, 32, 0, 25, 6, 226, -191, -113, -73, -154, -15, 133, -4, -118, 163, -86, 187, -34, 201, -82, -120, -64, -68, 37, -126, -5, -244, -109, 14, -47, -106, 27, 214, -93, -122, 229, -66, -118, 63, -180, -150, -209, 107, 168, 84, 214, -122, 135, -55, 174, -49, 124, -81, -85, 73, 206, 210, 25, -162, 175, -160, 33, 140, -6, -109, -127, 272, 70, 3, -115, 148, 129, 276, -30, 58, 52, 83, -69, 101, -62, -71, -14, 41, 132, -11, -32, 45, 206, -128, -95, 22, 127, 179, -310, -107, -37, 119, 109, -179, 72, -36, -51, 152, -245, 171, 57, 74, 43, -20, -27, -340, 275, 48, -2, 16, -191, 270, 146, -107, 257, 79, 122, -9, -97, 167, -227, 72, -3, 112, -38, -22, -3, -73, 28, -211, -118, 12, 186, 161, -48, -29, 16, 26, -26, 262, 88, 51, 77, -74]
5787g4P0p7lJ3J99j98k7K22J23k60K13O8k31j04j88K26M3R3k49K1J1rP6K58j27
5812H9j04J16l56K77q5R9k33K9P8J41K00k50J74k55N91m62j39J64k52Rl8K05L94
5835C92k80K5m67J17J98J58j85J14p4k7l0L4r7J97J10l11L19j00J13l72K19j02
5857d9J01N3k25K35l38J15N8J25o7k84M75j6k50J73j41O5j78K84j67p4J95j09
5879a9K62k47J20j31j06J09q7L81m00K66l03K19k60N60n85K86m8K9J50k0o5j20
5901iK69m53L32l00J51L2J44m72o5L47jJ5j88J7J01L29k17j83K52n0j8l8K21l23
5925a07J25k29J74N0M3j49k7J99j54k63K99Q9k4J43o2k05K70k57O7M15j74l72
5947a49MJ37l6j91R8K2J17OJ7M4O6K56j16n2j52m6L38l28m4J08j10J27k61L7J95
$$ y = [-74, -4, -81, -84, -71, 128, -70, -97, 125, 248, -12, 201, 269, 38, -66, -254, -28, 15, 108, -141, -120, -109, -118, -42, 216, 89, -15, 101, -255, 22, -63, 36, -197, -168, -90, 51, 251, 1, 175, -80, 511, 49, -90, 74, -178, -169, -207, -2, 392, 112, 137, -330, -213, -15, 143, -42, 72, -2, -29, -59, -25, -122, 75, 185, -126, 193, 93, 206, -166, 53, -49, 52, 105, -120, 115, -223, -108, -50, 75, 8, -276, 199, 183, -67, 106, -35, 30, -148, 136, -31, -105, 90, -19, 243, -4, 116, -15, -121, -12, -99, 282, -118, 148, -155, 64, -196, 364, -221, 65, 17, 46, 196, 176, 111, -9, 260, -193, 139, -161, -10, 22, 166, -306, -371, -24, -25, -10, -198, -181, -80, 249, 32, -151, 101, 51, 33, -5, 216, -107, 18, -211, -37, 13, 56, -93, -120, 79, -75, -338, -39, 50, 26, 169, 107, -98, 172, -85, -18, 397, 223, -149, -145, -8, -44, -235, -137, -115, 2, 8, 25, 69, 135, 391, 275, 223, 71, 25, 363, 35, -9, 99, -11, 116, -145, -108, 87]
$$ [...]
8191A52
##END NTUPLES=NMR FID
##END=
