##TITLE=1H_DE-27EXT-E
 D2O
 8 sc, 
 24.11.2023
##JCAMPDX= 6.0         $$ Bruker NMR JCAMP-DX V2.0
##DATA TYPE= NMR FID
##DATA CLASS= NTUPLES
##ORIGIN= UXNMR, Bruker Analytische Messtechnik GmbH
##OWNER= root
$$ XWIN-NMR		Version 3.5
$$ Fri Nov 24 13:47:07 2023 Russian Standard Time (UT+4h)  she@DPX200
##.OBSERVE FREQUENCY= 200.1313
##.OBSERVE NUCLEUS= ^1H
##.DELAY= (6, 6)
##.ACQUISITION MODE= SIMULTANEOUS
##.ACQUISITION SCHEME= undefined
##.AVERAGES= 8
##.DIGITISER RES= 18
##SPECTROMETER/DATA SYSTEM= spect
##.PULSE SEQUENCE= zg30
##.SOLVENT NAME= D2O
##.SHIFT REFERENCE= (INTERNAL, D2O, 0, 15.7039)
##AUDIT TRAIL= $$ (NUMBER, WHEN, WHO, WHERE, WHAT)
$$ ##TITLE= Audit trail, XWIN-NMR		Version 3.5
$$ ##JCAMPDX= 5.01
$$ ##ORIGIN= Bruker BioSpin GmbH
$$ ##OWNER= she
$$ F:/spectra/data/she/nmr/H-F/1/audita.txt
$$ ##AUDIT TRAIL=  $$ (NUMBER, WHEN, WHO, WHERE, WHAT)
(   1,<2023-11-24 13:45:19.20 +0400>,<she>,<DPX200>,
      <created by zg, POWCHK disabled, PULCHK disabled
       configuration hash MD5:
       00 E9 B6 7A A2 85 ED C7 34 08 36 98 17 FE 4E 26
       data hash MD5: 16K
       25 C3 8F 61 88 C9 66 83 50 8F B3 E9 A1 CF 7D 36>)
$$ ##END=
$$ 
$$ hash MD5
$$ 5D 7D B8 77 84 FE 2D 23 4B FA D5 4A 98 67 0C 7E
##$RELAX= 
##$RELAX= 
##$RELAX= 
##$RELAX= 
##$RELAX= 
##$RELAX= 
$$ Bruker specific parameters
$$ --------------------------
##$DU= <F:/spectra>
##$EXPNO= 1
##$NAME= <H-F>
##$PROCNO= 1
##$TYPE= <nmr>
##$USER= <she>
##$AMP= (0..31)
100 100 100 100 100 100 100 100 100 100 100 100 100 100 100 100 100 100 
100 100 100 100 100 100 100 100 100 100 100 100 100 100 
##$AQSEQ= 0
##$AQ_mod= 1
##$AUNM= <au_zg>
##$AUTOPOS= <>
##$BF1= 200.13
##$BF2= 200.13
##$BF3= 200.13
##$BF4= 200.13
##$BF5= 200.13
##$BF6= 200.13
##$BF7= 200.13
##$BF8= 200.13
##$BYTORDA= 1
##$CFDGTYP= 0
##$CFRGTYP= 5
##$CHEMSTR= <none>
##$CNST= (0..31)
1 1 145 1 1 1 1 1 1 1 1 1 1 1 1 1 1 1 1 1 1 1 1 1 1 1 1 1 1 1 1 1 
##$CPDPRG= <>
##$CPDPRG1= <>
##$CPDPRG2= <>
##$CPDPRG3= <>
##$CPDPRG4= <mlev>
##$CPDPRG5= <mlev>
##$CPDPRG6= <mlev>
##$CPDPRG7= <mlev>
##$CPDPRG8= <mlev>
##$CPDPRGB= <>
##$CPDPRGT= <>
##$D= (0..31)
0 1.2 0 0 0 0 0 0 0 0.06 0 0.03 0 0 0 0 0.0002 0 0 0 0 0 0 0 0 0 0 0 0 
0 0 0 
##$DATE= 1700819118
##$DBL= (0..7)
120 120 120 120 120 120 120 120 
##$DBP= (0..7)
150 150 150 150 150 150 150 150 
##$DBP07= 0
##$DBPNAM0= <>
##$DBPNAM1= <>
##$DBPNAM2= <>
##$DBPNAM3= <>
##$DBPNAM4= <>
##$DBPNAM5= <>
##$DBPNAM6= <>
##$DBPNAM7= <>
##$DBPOAL= (0..7)
0.5 0.5 0.5 0.5 0.5 0.5 0.5 0.5 
##$DBPOFFS= (0..7)
0 0 0 0 0 0 0 0 
##$DE= 6
##$DECBNUC= <off>
##$DECIM= 32
##$DECNUC= <off>
##$DECSTAT= 4
##$DIGMOD= 1
##$DIGTYP= 9
##$DL= (0..7)
0 120 120 120 120 120 120 120 
##$DP= (0..7)
150 150 150 150 150 150 150 150 
##$DP07= 0
##$DPNAME0= <>
##$DPNAME1= <>
##$DPNAME2= <>
##$DPNAME3= <>
##$DPNAME4= <>
##$DPNAME5= <>
##$DPNAME6= <>
##$DPNAME7= <>
##$DPOAL= (0..7)
0.5 0.5 0.5 0.5 0.5 0.5 0.5 0.5 
##$DPOFFS= (0..7)
0 0 0 0 0 0 0 0 
##$DQDMODE= 0
##$DR= 18
##$DS= 0
##$DSLIST= <SSSSSSSSSSSSSSS>
$$ [...]
##$SUBNAM2= <"">
##$SUBNAM3= <"">
##$SUBNAM4= <"">
##$SUBNAM5= <"">
##$SUBNAM6= <"">
##$SUBNAM7= <"">
##$SUBNAM8= <"">
##$SUBNAM9= <"">
##$SW= 18.0517328524113
##$SWIBOX= (0..15)
0 0 2 0 0 0 0 0 0 0 0 0 0 0 0 0 
##$SW_h= 3612.71676300578
##$TD= 16384
##$TD0= 1
##$TE= 0
##$TE2= 300
##$TE3= 300
##$TEG= 300
##$TL= (0..7)
0 120 120 120 120 120 120 120 
##$TP= (0..7)
150 150 150 150 150 150 150 150 
##$TP07= 0
##$TPNAME0= <>
##$TPNAME1= <>
##$TPNAME2= <>
##$TPNAME3= <>
##$TPNAME4= <>
##$TPNAME5= <>
##$TPNAME6= <>
##$TPNAME7= <>
##$TPOAL= (0..7)
0.5 0.5 0.5 0.5 0.5 0.5 0.5 0.5 
##$TPOFFS= (0..7)
0 0 0 0 0 0 0 0 
##$TUNHIN= 0
##$TUNHOUT= 0
##$TUNXOUT= 0
##$USERA1= <user>
##$USERA2= <user>
##$USERA3= <user>
##$USERA4= <user>
##$USERA5= <user>
##$V9= 5
##$VALIST= <valist>
##$VCLIST= <CCCCCCCCCCCCCCC>
##$VD= 0
##$VDLIST= <DDDDDDDDDDDDDDD>
##$VPLIST= <PPPPPPPPPPPPPPP>
##$VTLIST= <TTTTTTTTTTTTTTT>
##$WBST= 1024
##$WBSW= 4
##$XGAIN= (0..3)
0 0 0 0 
##$XL= 0
##$YL= 0
##$YMAX_a= 140867
##$YMIN_a= -148676
##$ZGOPTNS= <>
##$ZL1= 120
##$ZL2= 120
##$ZL3= 120
##$ZL4= 120
##$ABSF1= 10
##$ABSF2= 0
##$ABSG= 5
##$ABSL= 3
##$ALPHA= 0
##$AQORDER= 0
##$ASSFAC= 0
##$ASSFACI= 0
##$ASSFACX= 0
##$ASSWID= 0
##$AUNMP= <proc_1d>
##$AZFE= 0.1
##$AZFW= 0.1
##$BCFW= 1
##$BC_mod= 2
##$BYTORDP= 1
##$COROFFS= 0
##$CY= 11.3945322036743
##$DATMOD= 1
##$DC= 2
##$DFILT= <>
##$DTYPP= 0
##$F1P= 15.7292609196834
##$F2P= 12.9074282941183
##$FCOR= 0.5
##$FTSIZE= 0
##$FT_mod= 4
##$GAMMA= 1
##$GB= 0.15
##$INTBC= 1
##$INTSCL= 1
##$ISEN= 128
##$LB= 0.24
##$LEV0= 0
##$LPBIN= 0
##$MAXI= 10000
##$MC2= 0
##$MEAN= 0
##$ME_mod= 0
##$MI= 1.114404
##$NCOEF= 0
##$NC_proc= 0
##$NLEV= 6
##$NOISF1= 3.799351
##$NOISF2= 2.8
##$NSP= 1
##$NTH_PI= 0
##$NZP= 0
##$OFFSET= 15.70392
##$PC= 1
##$PHC0= -24235.66
##$PHC1= 18.25269
##$PH_mod= 1
##$PKNL= yes
##$PPARMOD= 0
##$PSCAL= 0
##$PSIGN= 0
##$REVERSE= no
##$SF= 200.130013532006
##$SI= 16384
##$SIGF1= 3
##$SIGF2= 2
##$SINO= 400
##$SIOLD= 16384
##$SREGLST= <1H.CDCl3>
##$SSB= 0
##$STSI= 0
##$STSR= 0
##$SW_p= 3612.71676300578
##$SYMM= 0
##$S_DEV= 0
##$TDeff= 0
##$TDoff= 0
##$TI= <>
##$TILT= no
##$TM1= 0
##$TM2= 0
##$TOPLEV= 0
##$USERP1= <user>
##$USERP2= <user>
##$USERP3= <user>
##$USERP4= <user>
##$USERP5= <user>
##$WDW= 1
##$XDIM= 8192
##$YMAX_p= 0
##$YMIN_p= 0
$$ End of Bruker specific parameters
$$ ---------------------------------
##NTUPLES= NMR FID
##VAR_NAME=  TIME,          FID/REAL,        FID/IMAG
##SYMBOL=    X,             R,               I
##VAR_TYPE=  INDEPENDENT,   DEPENDENT,       DEPENDENT
##VAR_FORM=  AFFN,          ASDF,            ASDF
##VAR_DIM=   8192,          8192,            8192
##UNITS=     SECONDS,       ARBITRARY UNITS, ARBITRARY UNITS
##FACTOR=    0.0002768,     1,               1
##FIRST=     0,             0,               0
##LAST=      2.2672688,     0,               0
##MIN=       0,             -148676,         0
##MAX=       2.2672688,     140867,          0
$$ Real data points
##PAGE= N=1
##DATA TABLE= (X++(R..R)), XYDATA
0@%%%%%%%%%%%%%%%%%%%jQj5J6j6J6j6K1k8L1l3L8m5M9n5O3p0P9q9J01j13J23
41F4j35J49j67J86k05K27k50K75l04L36l69M06m48M95n48O10o81P64q63R81j129
62f06J317j565J913k432L282m920R184m0424j11243L6565M4746l298M7453J11544
76I1516L6841n4650n2616k0453m2928o3642r944Q1513Q6501J9048M559L3019k8128
89H0636j10624o5525K0364L758j5810N5630R8210L1857k8537k2077k1504n9024
101c2646o3356O17O0104M8714J7102L6270M3276l0584q3476m2845j2307l5920
113i5051q990O9591Q0511K5322k89J774k7264o5155n6634o674K8894K6491L3465
126E991O4463M3776l4590o4405l2950l6537n2637M063O9390N4688K2630L0265
$$ plain form
0 0 0 0 0 0 0 0 0 0 0 0 0 0 0 0 0 0 0 0 0 -1 7 -8 8 -8 8 -8 13 -15 16 -17 21 -24 25 -30 33 -37 42 -47 54 -59 64
41 64 -71 78 -89 97 -108 119 -131 144 -160 176 -193 213 -235 260 -288 322 -359 405 -458 523 -606
62 -606 711 -854 1059 -1373 1909 -3011 6173 -34251 -145494 -108929 -64183 -67481 -20028 91516
76 91516 128357 73707 21091 638 -42290 -105932 -115876 -34363 52138 71186 75745 108764 80636
89 80636 -29988 -95513 -75149 -71391 -87201 -31571 66639 98496 69959 47882 26378 -32646
101 -32646 -96002 -95385 -35281 13433 30535 66805 110081 79497 -3979 -46824 -59131 -95051
113 -95051 -104041 -34450 46061 71383 71094 72868 45604 -19551 -76185 -82859 -53965 -27474 5991
126 5991 70454 114230 79640 15235 -17715 -54252 -106889 -102826 -33436 21252 43882 74147
138G4147J8261l6850o7356m6010j4274M215K1132M9598O4096K7549k6820l4436
150C3252k5516n1892n4579P220M9433L3515L2482N2217K0316m0121n5165l2840
162c1678k4602j7294J3297N0201N4010K3734j521p817k8786o3701n0657K765K6382
175e5667K2811M2826N8259J9804k9094l5233k9143l7836l2809O369M5475M7208
187B2970K6637J5791N810l1670o2679m1834l423L862J2836M8564N8856K0297j2981
200F3036j9158l0865m8465l6772L729L4692L6437K9068K9147J3754k7737n3188
212f322l5223j5711j4816Q148N0977N4365K0372R45m761l0395n2114l6316j138
225f1989J7957K4588L4094M0074J7128k2124l9170l1502k7784k4663P548M3721
$$ plain form
138 74147 92408 55558 -11798 -57808 -72082 -67867 -46735 2863 66959 94508 67688 33252
150 33252 7736 -44156 -98735 -91515 -42082 -8567 23915 76132 96448 56327 1162 -31678
162 -31678 -56280 -73574 -60277 -10076 43934 67668 66147 58330 29544 -34157 -84814 -82049 -55667
175 -55667 -32856 9970 68229 88033 58939 23706 -5437 -43273 -76082 -69713 -24238 22970
187 22970 49607 65398 71208 39538 -23141 -64975 -68398 -64536 -51700 -3136 55720 76017 63036
200 63036 43878 13013 -35452 -72224 -68495 -33803 2634 31702 60849 74603 46866 -6322
212 -6322 -41545 -57256 -72072 -63924 -12947 41418 61790 62735 57974 27579 -24535 -60851 -61989
225 -61989 -44032 -19444 14650 54724 71852 49728 10558 -20944 -48728 -73391 -65843 -22122
237b2122M4470K3627J5678M318k8564m9431l4447r512L690J7424L8295M2428J7707
250F3561j3192k4571k8506l6931k9439M348L3606L4004K8663K7690J0370k5170
262D4433m3166l1201j7616r376J0792L7964M1814J8124k564j0281k5789m2564
274b9430l2466K786K1890K2894L1719L7794J3721k2930l3181k5353k5935k1859
286f0350P714L7408L6000J7166R274J624k4938m5776k9108p07Q414J4507L5083
299F311M3326J3453j7127k1242k1444l4198k8969N997L2425K7068J8906K1400
311D5906R025k5173m1663k4709p519m804R365L7915M1921J3819q125r923k0810
324A5225l9448l1243M258K3768J8841K1959L0836J2390k4430l4932j9496j4768
$$ plain form
237 -22122 22348 45975 61653 65971 37407 -12024 -46471 -55983 -52293 -34869 3426 45854 63561
250 63561 50369 25798 -2708 -39639 -69078 -64730 -31124 2880 31543 59233 69603 44433
262 44433 1267 -29934 -47550 -56926 -46134 -8170 33644 51768 49204 38923 13134 -29430
274 -29430 -61896 -59110 -37220 -14326 17393 55187 68908 45978 12797 -12556 -38491 -60350
286 -60350 -52636 -15228 20772 37938 47212 48836 23898 -21878 -50986 -51693 -43279 -28772 6311
299 6311 49637 63090 45963 24721 3277 -30921 -59890 -53893 -21468 5600 24506 45906
311 45906 54931 29758 -11905 -36614 -44133 -48937 -39572 -1657 40264 54083 45958 36035 15225
324 15225 -24223 -55466 -51208 -27440 -8599 13360 44196 56586 32156 -2776 -22272 -37040
336c7040j6114P523L9567L7345J1673K253P12k2185m4216k8183L560J1476J0740
349b2889K8171L7903J0524k1424k3288j6185k5178k3633R333L6378K7895J3232
361C0839J5655P550k5861m2657k2251k446k775P567L4419L7801Q238j2647j1186
374B2246j7663l4551k4541J0461K8038J9064J8625K7206Q109k7446l5382j8157
386b3991j2663j3234R192L6875L3559Q719k192l061k0010l8944k4128Q291J7686
399b3901J2997K5590L4676P585k5950k6036j6042k3572k0611J1524L4787K5651
411A6698J2266J1508L175k4225l8347k0981R65M961J0850L2917L5746N773j7779
424C3527j4731j8232l3979k3076J2204K7049J9318K0199K3619L396k6756l2364
$$ plain form
336 -37040 -53154 -45631 -6064 31281 42954 45207 45919 23734 -20482 -48665 -45105 -33629 -22889
349 -22889 5282 43185 53709 32285 8997 -7188 -32366 -55999 -46666 -10288 17607 30839
361 30839 46494 54044 28183 -14474 -36725 -39171 -41946 -34379 40 37841 46079 33432 22246
374 22246 4583 -29968 -54509 -44048 -16010 3054 21679 48885 56994 29548 -5834 -23991
386 -23991 -36654 -49888 -40696 -3821 29738 38457 36265 33204 13194 -25750 -49878 -41587 -23901
399 -23901 -10904 14686 49362 56947 30997 4961 -11081 -34653 -55264 -43740 -8953 16698
411 16698 28964 40472 43647 19422 -18925 -39906 -38941 -33980 -23130 9787 45533 51306 33527
424 33527 18796 564 -33415 -56491 -44287 -17238 2080 22279 45898 49294 22538 -9826
436i826j7841r412o077J2140L5891L1837O162l682n333k5320m0155j9906Q503
449d3019J4664J6876K8884K8307L181k1352k3542j8362k0161j4880J1645L5100
461b659K7335R810R435K37l0316l9380j5226J131K54J5040L5734K8895M747j0417
475C4620j5460k2941k8922j7486J1002K8856K1404J4321J9596M717k9617l4791
487a4701j3397j0428j1554J5847M0431K7512N400k02p720k5781l2509j7065O217
500c7950J6171J5227K3111K9254N618k6227k6529j4953k0897j6392J6446L5574
512a547K1178J0621J1654p63k5416l3257j9647j547O342J3715K9711L1905M154
525D7103j9941j5846j5499k9413j8852J4048K5335J8727K0594K0140r95k4632
$$ plain form
436 -9826 -27667 -37079 -43156 -31016 4875 36712 42874 39192 33859 8539 -31616 -51522 -43019
449 -43019 -28355 -11479 17405 45712 48893 27541 3999 -14363 -34524 -49404 -37759 -2659
461 -2659 24676 34486 43921 44158 13842 -25538 -40764 -39633 -39379 -24339 11395 40290 45037 34620
475 34620 19160 -3781 -32703 -50189 -39187 -10331 11073 25394 44990 49707 20090 -14701
487 -14701 -28098 -38526 -50080 -34233 6198 33710 39110 38908 31188 5407 -27102 -44167 -37950
500 -37950 -21779 -6552 16559 45813 51431 25204 -1325 -16278 -37175 -53567 -37121 -1547
512 -1547 19631 30252 41906 41143 15727 -17530 -37177 -38724 -32382 -18667 11044 42949 47103
525 47103 27162 11316 -4183 -33596 -52448 -38400 -13065 5662 26256 46396 45401 20769
537B0769l0376j9931o851N38J0993K7772K9981O625r183o106j8232l5219k0204
550d9424J1333J7433J5543K5703K2869j111j8608k0716j9129j5509p532O917K6123
563f108K8327J1339N63k090k0917l4957j5910O464N676J0877K8583K5315K830
576C9992r803j4310k2160k3915j2000P384K3502K3533J3653Q885J617j9935k9794
589a3351j5318m780l889J2597L2092K5202N872m000j2725k3151k4048j2326L903
602c3922J6911J7506J6480J7744N174j9476k6224j4983j1418q464J5048K9789
614D165J9100P275L777o441k1176k4303j5398k061J0575J5942K0192K1986N559
627C9192j7972k0035j1574j6953j3315J2201K5326J5075J2499J4051l204k3572
$$ plain form
537 20769 -9607 -29538 -36389 -35851 -24858 2914 32895 39520 30337 24231 5999 -29220 -49424
550 -49424 -38091 -20658 -5115 20588 43457 42346 23738 3022 -16107 -31616 -39148 -32231 -6108
563 -6108 22219 33558 34121 32031 11114 -23843 -39753 -33289 -27613 -16736 11847 37162 39992
576 39992 30189 15879 -6281 -30196 -42196 -34812 -11310 12223 25876 34761 36378 16443 -13351
589 -13351 -28669 -33449 -37338 -24741 7351 32553 38425 34425 21700 -1451 -25499 -37825 -33922
602 -33922 -17011 495 16975 34719 39893 20417 -5807 -20790 -32208 -40672 -25624 4165
614 4165 23265 30540 34317 27876 6700 -17603 -33001 -35062 -24487 -8545 11647 33633 39192
627 39192 21220 1185 -10389 -27342 -40657 -28456 -3130 11945 24444 38495 35291 11719
639A1719k4167j5246o243M581J4278K1887K1008O191r376j1594j4136k3868j5475
652d0441R944J9799J4377J8258J6727k882k1313k0000j4171j1061k496J1555K2477
665G73K1435Q627k546p159j7753k6700j3398P858J2487J1925K1333J8968r84j5034
679A9832j5864j6199j7520p232J0334K2854K0022R642M208k795j9199k6006j1678
692b9601K182L080J0990K6287K0968j93j0057j1561j8993k1680q047R704J7774
705i147J5868J3610J1650m50j9153k3079j1978m988l048J2689K7654J8418J659
718B9705k830o868k0589k4467r058O396J0695J4181J9858J6712j090j7301j7521
731b177j2675j2957o841J3645K4681J5574O892N569m478k2578k4593j0209J190
$$ plain form
639 11719 -12448 -27694 -33937 -29356 -15078 6809 27817 34008 24632 13038 -1098 -24966 -40441
652 -40441 -30497 -10698 3679 21937 38664 35782 14469 -5531 -19702 -30763 -33259 -21704 773
665 773 22208 30835 28289 21130 3377 -23323 -36721 -28863 -16376 -4451 16882 35850 34866 19832
679 19832 3968 -12231 -29751 -36983 -26649 -3795 16227 25869 30077 27282 8083 -17923 -29601
692 -29601 -27419 -24339 -13349 12938 33906 33713 23656 12095 -6898 -28578 -36625 -26921 -9147
705 -9147 6721 20331 31981 31531 12378 -10701 -22679 -27667 -30715 -18026 9628 28046 29705
718 29705 26875 20007 -582 -25049 -34107 -27711 -17016 -2835 17023 33735 32645 15344 -2177
731 -2177 -14852 -27809 -34650 -21005 3676 19250 26142 31711 27233 4655 -19938 -30147 -28957
744b8957M788J3232K3724J8563m50j1453j2125j4474k0036r077J2950K0354J3233
757A0272J2526J2145m245k2359k1772j0100n548j657J3648K5347J7969K256m301
770B4181p158j7925k3758r268R668J3050J1584J8534J6951l233j9637j7300j1496
783a5807j3902o366J4114K4692J5689O277M856m256k1558k4250p980L503M655
796b0333J2483K3489J7962k600j3510j1477j5705k0279p178J3617J9678J3507
808I654J1836J1551m087k1368k0890q494l642j127J3257K4683J6426n7n643p625
822A4474j8225k2822p737R850J2446J1771J7448J5956k836j7905j5772j0229j2046
835b5627n759J3442K3080J4073L835L636m703k0214k3426p367L958M946J1370
$$ plain form
744 -28957 -24169 -10937 12787 31350 30900 19447 7322 -7152 -27188 -36265 -23315 -2961 10272
757 10272 22798 34943 30698 8339 -13433 -23533 -29081 -30738 -17090 8257 26226 28482 24181
770 24181 17023 -902 -24660 -33928 -24260 -11210 374 18908 35859 32626 12989 -4311 -15807
783 -15807 -29709 -36075 -21961 2731 18420 24697 29553 25297 3739 -20511 -28491 -24988 -20333
796 -20333 -7850 15639 33601 31001 17491 6014 -9691 -29970 -37148 -23531 -3853 9654
808 9654 21490 33041 28954 7586 -13304 -21798 -25440 -26567 -13310 11373 27799 27742 22099 14474
822 14474 -3751 -26573 -34310 -24460 -12014 -243 17205 33161 30325 12420 -3352 -13581 -25627
835 -25627 -31386 -17944 5136 19209 23044 26680 21977 1763 -21663 -29030 -25072 -20126 -8756
848h756K2664J7696k451j2407j0250j3497j8585p024J3070J8470J1243J0395R643
861C0211m691k1027j9914p624k885j96J3522K3631J5482o5n516p162j6553k0320
875b3107o236R507J1971R828J4947J2805m549j7483j4299r203r962k691J3403
888a5069K0672J2789M706J572n513j7532j9060p119L931N602J0056J8619J3873
901B7527l444j2607r686j1757j5046m675J2944J6730J0657R919P673n151j8547
914D537j7047p130k416J137J1385K0505J2169j250n826p127j5265j7877l815J0515
928a7505J1493J0698J4586R696n952j5561j3541q665p809j513J1982J9040J0733
941A7682J849K88o162j8071j6893k381N414O447J1569J7492R318m290j1009j0496
$$ plain form
848 -8756 13908 31604 29153 16746 6496 -7001 -25586 -32610 -19540 -1070 10173 20568 30211
861 30211 25520 4493 -15421 -23045 -25930 -26126 -12604 11027 26509 26444 20928 13766 -2787 -23107
875 -23107 -29343 -19836 -7865 1963 16910 29715 25166 7683 -6616 -15819 -25781 -28472 -15069
888 -15069 5603 18392 23098 24670 19157 1625 -17435 -24554 -20623 -15021 -4965 13654 27527
901 27527 24083 11476 1790 -9967 -25013 -29688 -16744 -14 10643 20562 28235 23084 4537
914 4537 -12510 -19640 -22056 -20919 -9534 10971 23140 21890 16064 8937 -6328 -24205 -28020 -17505
928 -17505 -6012 4686 19272 28968 23016 7455 -6086 -14751 -22560 -24073 -12091 6949 17682
941 17682 19531 19819 13657 -4414 -21307 -23688 -18274 -11827 -258 17234 26552 22262 11253 757
955G57j2090j1790k387J1589J6486R489N675M697n315j8294j4998l063p98J997
969a8045J3439J9702Q817j471o178r972j5003j3569k508Q803J2351J0079R805
982A6250Q151m705j7206j3135n430o036K47J5653J7962Q080R18p94q920j6446
996e411j3833m018M835Q216J1216J4665R482n303j3545j0285r080j0085n9J4108
1010i097J4875P897P385L284r139j7064j3979o314J111O647J1758J5640J0094
1023B3098l895q395p387j2102j4455q73J2236J1013R992J2199M672r900j4680
1036A523j2094q372l069L642J0711J6043J1718K91m634o572j5489j6168r69R744
1050a3695P665J0766J4733O000p575j0920j0458j2214q705J950J1271J5874J1761
$$ plain form
955 757 -11333 -23123 -25510 -13921 2565 12054 17729 22426 17111 -1183 -16181 -19244 -20042 -18045
969 -18045 -4606 15096 23913 22442 16264 6292 -8711 -22280 -24788 -15985 -3634 6445 16250
982 16250 24401 19696 2490 -10645 -16075 -22111 -21864 -6211 11751 19831 20749 19955 11035 -5411
996 -5411 -19244 -23262 -18427 -10211 1005 15670 25152 19849 6304 -3981 -13061 -23146 -23205 -9097
1010 -9097 5778 13675 21060 24344 15205 -1859 -15838 -22152 -21041 -14394 -2636 13004 23098
1023 23098 19203 10808 3421 -8681 -23136 -24009 -11773 -760 9232 21431 26103 16203 1523
1036 1523 -10571 -18943 -22012 -18370 -7659 8384 20102 20393 15759 9187 -6302 -22470 -23439 -13695
1050 -13695 -6030 4736 19469 25469 17894 6974 -3484 -15698 -24403 -22453 -11182 4692 16453
1063A6453L745o40o503j6136j4711j963L313L390J1820J7842P782m361p768j0748
1077A515j4540j0810N85R745J2805J0648P855M173m596j5718j3502n055l019J347
1091a8567J4694J8172O608j352l174j0016j5285j1252k264N264J0021J1632J1533
1104A6014Q371m336j4979j2003o462p039l39J3816J5484O092L853K348q981j6515
1118d676j2399m256J391P914J2631J3235Q705l278j0381q564q679j1407k584J1951
1132a0397J2510P368Q690N131q897j6585j0249n430k485M162J1812J4231R359
1145A9220J80n241p056j2868j4074j846R551Q702Q619J1955N778q152j1822r098
1159f152q253p074J957J1676J4296R897K362j567o427j4300j3147j616N234M032
$$ plain form
1063 16453 20198 19558 13055 -3081 -17792 -19755 -16442 -13052 -1232 16610 24392 20031 12263 1515
1077 1515 -13025 -23835 -23250 -13505 -700 9948 17803 21976 17380 1662 -11840 -16895 -19914 -18567
1091 -18567 -3873 14299 20907 19555 16381 6365 -8920 -20172 -22436 -17172 -7151 4481 16014
1104 16014 24385 20049 5070 -6933 -13395 -20434 -20773 -6957 8527 14619 18472 20820 11839 -4676
1118 -4676 -17075 -21331 -19940 -12026 605 13840 22545 19267 8886 322 -8357 -19764 -22348 -10397
1132 -10397 2113 9481 18171 23302 14405 -2180 -12429 -17859 -20344 -16182 -4370 9861 19220
1145 19220 19400 14159 7103 -5765 -19839 -21685 -12134 -3432 5187 17142 22920 14768 2946 -6152
1159 -6152 -14405 -21479 -19522 -7846 6450 16347 18709 17142 10715 -3585 -16732 -18348 -13114 -9082
1173i082R065J4301O984n844q088q411j1343q884J745R905J1807Q950N359K125
1187A8589n000j2922j2270l830J13J275J0819J5457O229l403m291o845j3034j0391
1201a9504R80O819P759R955R915M770n498j1664j0086o112m715J015J1600J3259
1215H493N295O91K58p137j4903r637k83L535N756J1103J2191M880n427q755p858
1230a798q223q045J063J0749J0473N404N182K510q268j4276q221j550m9M028J1932
1245I11J2436M495l028n067o957j1189r776J210Q885P319O708Q807L577q179j1882
1260a730o772m208m481L313J2389J1767M422N98j462p691j2806r981P38N192N241
1275e471Q903J1031L472o728q757o698p756o485L308J1803R858N430M405M70q575
$$ plain form
1173 -9082 -17 14284 21268 15424 7336 -1075 -12418 -21302 -19557 -9652 2155 11105 16464 18589
1187 18589 13589 667 -11603 -15433 -15320 -14045 -3226 12231 18460 15057 10766 3921 -9113 -19504
1201 -19504 -18524 -11705 -3946 6009 15924 20694 15196 3532 -6554 -12666 -17381 -16366 -4766 8493
1215 8493 13788 14479 14737 7600 -7303 -16940 -17223 -13688 -7932 3171 15362 20242 14815 6060 -1798
1230 -1798 -10021 -18066 -17003 -6254 4219 9623 14805 17315 9047 -5229 -13450 -15000 -15049 -11021 911
1245 911 13347 17842 14814 9747 2790 -8399 -18175 -16965 -8080 -761 5947 14754 18331 10152 -1730
1260 -1730 -8502 -12710 -17191 -13878 -1489 10278 14700 15298 13836 6145 -6661 -16642 -15904 -10712 -5471
1275 -5471 3432 14463 17935 11207 2450 -4248 -12004 -18489 -15181 -3378 6480 11910 16315 16785 8210
1290H210j3080q014j711N12M422J1251J1425L271l890n258p243j0898p295L124
1304a5174Q901P994P544P812J541q586j1723p515m418k950L997J1497J1153L695
1318A3768k86k327q566j2075p183J698O003O121J0098R783J769p370r193p806
1332e566p890n130M290J1299R234N343L270p17q417j2636o889m58K208N302J0998
1347D241J1299J825m752o415p436j0448o871L146Q875P870P368O690Q81q093j1086
1362b906o886m009j338N390J0952J0640L863j029m060q488j1853p459P87O264
1376a0132O997R001R147J974o472r074p565o398m405M534J1019R618N402K121
1390A5767j982q965j1873q000j055L256O243R873R926L431m641o937p122q726
$$ plain form
1290 8210 -4870 -12884 -14595 -14083 -9661 1590 13015 16286 12396 7138 -105 -11003 -18298 -15174
1304 -15174 -6273 1721 9265 17077 18618 10032 -1691 -9206 -13624 -16574 -12577 -1080 10073 13768
1318 13768 13482 11155 2589 -9486 -16669 -14971 -8968 -2847 7251 17034 18803 11433 2240 -5566
1332 -5566 -13456 -18586 -14296 -2997 6237 11580 14850 14133 5716 -6920 -13809 -14267 -12059 -6757 4241
1347 4241 15540 17365 12613 6198 -1238 -11686 -18557 -15411 -6536 1334 8702 15392 16273 8180 -2906
1362 -2906 -9792 -13801 -15139 -9749 1203 11843 15706 14677 10617 2129 -9724 -17183 -16396 -10132
1376 -10132 -3135 5866 15013 16987 10515 1441 -6124 -12522 -16927 -12393 -1374 8244 13646 15767
1390 15767 13785 4820 -7053 -15053 -16108 -12852 -6609 3264 13190 16621 11980 5043 -2079 -10805
1404a0805n381K488R139Q431O660N253o17p557j1196p717l631K88M941R809J0059
1419A0164M884j748m353p419j0117o368R47O392P205Q134O739J251n881r103q722
1434g995n926j768L285R443J0431N620P83k091p163j0485p432k77L016O251R258
1449D950Q139K136l716o952r056p590l478J997Q299R505O123L183J61o187j0443
1464b929p536j920O7M371R887R184L104k241n090p987q729n372J058O195Q052
1479A14P150N876K126n804r942o869l951k127L598R452Q639L392P96k214p679
1494B557r783o801k38M539O381P651Q243K748n304p652n752n618n233K741Q797
1509b724O971N239L853j305p437r587o338j747K091N278P732Q760L419l176n381
$$ plain form
1404 -10805 -16186 -13698 -4559 3872 10532 15785 15168 7611 -3585 -11302 -14933 -14645 -9704 105 10164
1419 10164 15048 13300 8947 1528 -8589 -14957 -14010 -7618 -413 7721 14460 15711 9830 727 -7995
1434 -7995 -13921 -15689 -12404 -2961 7470 13090 13873 11782 4619 -5866 -13298 -13575 -10559 -4308 4950
1449 4950 13089 15225 11509 4557 -4499 -12089 -15567 -13570 -5271 4234 10357 13540 13701 7514 -2929
1464 -2929 -10465 -12385 -12318 -7947 1940 11124 14228 11987 6897 -1090 -9819 -15191 -14133 -7938 114
1479 114 7264 13140 15266 9462 -480 -7349 -11300 -13427 -9829 -377 8262 11654 12450 10236 2557
1494 2557 -7226 -14027 -14265 -9726 -3345 4306 12549 15297 9993 2341 -3411 -9029 -14262 -11521 -2724
1509 -2724 4247 9486 13339 12034 4597 -4990 -11328 -13075 -10984 -5706 2026 10786 14205 11029 5648
1524E648n203q383o813K538Q071N743N695N665k54p336p538o026l728p18M077
1539h562Q142R172M537j567l561n599r902o104K587M911L643O728P981O78o034
1554G050o028n878o658k551M276Q507P727M183J111j135n926r847n703M33J287
1569i152K956R908Q442J78m542m148o491q000k867L373O888O562N333M024R24
1584A3388o905j0101n134j886j222M178J0758O915l9p60j858p622r061l431J814
1599a0966M055O899P651N481K50o563q012m676l507l679L991R802O113J783K694
1614A1316r63r101r615l291O34K381O084Q355O040J102m554n085n468p536m917
1629a4618M216Q858M911M340N336j538r353p326l192k327m87N566R243O790J981
$$ plain form
1524 5648 445 -7938 -14751 -12213 -4142 1601 7296 12961 12707 5371 -2167 -8193 -11921 -12639 -8562
1539 -8562 -420 8752 13289 11722 8161 2562 -7340 -13444 -10857 -5946 -2303 4425 12406 13084 7050
1554 7050 1022 -4856 -11514 -14065 -9789 -1282 6445 10628 11739 10604 4678 -5169 -10872 -10439 -9152
1569 -9152 -6196 3712 12154 12332 7790 3642 -2849 -10849 -13716 -10343 -3455 3107 8440 12464 13388
1584 13388 6483 -3618 -8752 -10638 -11860 -7682 3076 9991 9952 9192 7334 -288 -9349 -12780 -10966
1599 -10966 -6911 -12 7639 13120 13370 6807 -1205 -5881 -9388 -13067 -9076 726 6839 8622 11316
1614 11316 10353 1252 -8363 -11654 -11020 -8639 -2555 5800 11840 12942 8388 3303 -2165 -9701 -14618
1629 -14618 -10402 -1544 3367 7707 13043 11505 2152 -5174 -8366 -10693 -11180 -5614 3629 10419 12400
1644A2400j868m008o876r248m107L562N651M085O582O980j679o568o100m485o288
1659a1967j440O227Q813O571L288M81l229p140r024m397J257K441M373Q696P682
1674A2632o02n170m609o561p171j779N570O602N525N263L142k090o916q643n356
1689a0163j204O14M745R683O881j06k072k637o960q834k245L365M238N868P334
1704H507M846j698o201p269n449l953r34M671Q585O231K226J143k478p762q329
1719g864k811P64K603O152P747N478l68m261n693o427n633k705L954P157O233
1734D326M136L262j940p776o973l735j335O24N684Q036N642J320k148m834o834
1749b545p104k831K888N448N332N688M724j097o059o031n073l405o05N178P696
$$ plain form
1644 12400 10532 6524 -352 -9600 -13707 -10145 -4494 -409 6173 13153 11474 4906 -1194 -5679 -11967
1659 -11967 -13407 -7180 1633 8204 11492 11973 8744 1604 -7420 -11817 -10560 -8119 -3746 4950 12632
1674 12632 12030 6860 2251 -4310 -11481 -13260 -7690 -1088 4437 9700 12842 10752 3836 -4807 -10163
1689 -10163 -11367 -10753 -6008 3675 10556 10450 8378 5741 -1219 -10053 -12298 -8933 -4695 1173 8507
1704 8507 13353 11655 5454 -1815 -7264 -11217 -12151 -7480 1105 7336 9562 10705 8227 465 -7864
1719 -7864 -10675 -9911 -7308 -1156 6591 12069 11701 7440 1747 -4680 -10313 -13018 -9064 -1907 4326
1734 4326 8462 11724 9784 2008 -4965 -8700 -10035 -9411 -3727 4309 9951 11271 9123 4289 -2545
1749 -2545 -9649 -12480 -9592 -4144 1188 6876 11600 10503 4444 -1587 -6660 -10065 -10670 -5492 2204
1764B204N561K510k48l516o813p318l520J190L549M783P049N263j35m387n119
1779A053n058n505j453M348O198N477L373K352k449o749o680m395p55J900N043
1794c300P365N266N94k409m005n588o288j890K826N080N109M583L405j562n991
1809C195o109m410k490J03M498P113N916J706p95k977o015o586k972J453L857
1824d513M493N811M357p40m869n278m845l493j345L892P160N092K611J268j849
1839G752o656o574l236N88J939L880O878N162m56l445m602m773n235k056L437
1854g397O147M324M220K535j286n847o291l167j677K37M314P182M846O26j815
1869F951l058n651o210k381K361M377M771N032L937q91n294n562l425l351p54
$$ plain form
1764 2204 7765 10275 10027 6511 -302 -7620 -11140 -9950 -6401 -1618 5431 10694 10559 6172 1053
1779 1053 -4005 -9510 -10963 -6615 -417 5060 8433 10785 8336 1587 -5093 -9488 -10243 -8343 -3300
1794 -3300 4065 9331 9925 7516 3511 -2077 -8365 -10255 -7429 -2349 2760 7343 10748 9186 3195
1809 3195 -2914 -7324 -9814 -9711 -5213 1900 7816 9522 8727 5750 -265 -6851 -9823 -8370 -4513
1824 -4513 -20 5791 10148 9408 4539 -739 -5584 -9077 -10422 -6530 630 5722 8333 9601 7752
1839 7752 1096 -5478 -8714 -8126 -6187 -2307 4571 9733 9277 5832 1230 -3543 -8778 -10834 -7397
1854 -7397 -1250 3074 7294 9829 8543 2696 -3595 -6762 -8439 -8202 -3888 3294 8140 8766 6951
1869 6951 3893 -1758 -7968 -10349 -7988 -3611 1160 6192 10129 9238 3944 -1618 -5043 -8394 -9148
1884i148M235O604M424J722N38k301o736o320k341R93K588M593O780M316r46l814
1900E187l909m925n128j224M214N566M171L252K295k590o262n669k533j000P77
1915g778M900P298M526k44j899k910o038o083j287L200L733L879N440L130k490
1930G377n034m909l654l005kN033P024M375J317P5k723o831o367j460J426K171
1946e187M654P002L204j745l733m071n192m533j92M476N783M469L331J478k345
1961G399o852n867k142p22L45N568P402L309p34j725l085o492n562k40L270L841
1977b287M815N259K765k549o014m859l042k966k16N542O622L228J389O14l524
1992D777o905n603p98J253K607N407N869L466j706m317l830m676n057p54N528
$$ plain form
1884 -9148 -4913 1691 6115 7837 8375 6074 -662 -6982 -9323 -8330 -5742 -1149 5631 9947 9001 5187
1900 5187 1278 -3647 -8775 -9999 -5785 -219 3952 7204 9499 6909 647 -5022 -7555 -8555 -7778
1915 -7778 -2878 4420 8946 8702 6803 3893 -2145 -8228 -9515 -6315 -2582 1297 6737 9867 7377
1930 7377 2343 -2566 -6220 -9225 -9227 -4194 2830 7205 8522 8597 5874 -957 -7324 -8784 -7358 -5187
1946 -5187 -533 6469 9673 7928 4195 124 -5068 -9601 -9793 -5317 466 4935 8266 9744 7399
1961 7399 547 -5320 -7462 -8184 -7839 -2271 5131 8440 7706 5981 2896 -3596 -9158 -9398 -6128 -2287
1977 -2287 2528 7787 10552 8003 1989 -2870 -5912 -8878 -9094 -3552 3070 6298 7687 8301 4777
1992 4777 -2128 -7731 -8529 -7276 -4669 738 6607 10073 8367 4050 220 -4456 -9513 -10267 -4739
2007d739N500L224L737K117l924o741m485j871j296K052N551N827M030m49k510
2022F023l694n272n910r23M064M021L295N434K817l111n527l293l761l306J097
2037h046N611N921L731J312j019l264o321n028j217J877J647M400O404L319k173
2052G154l703l438n018l924J096M329M633L473L098O51k669n615n219k433j82
2067g767J013N488O866K484j257j625l135n959l793J23K424L207M948M400J460
2082H877k535n063n039k645j488M32N107N871K477P93N46l329o571m017m76P52
2098f308K969N556M219J771j681l578m640l427k872l20M031N466L689J897J120
2113G892l043o197l500j221m86K007M908M487K031K59k592m023m736m011l91L902
$$ plain form
2007 -4739 761 3985 7722 9839 5915 -826 -5311 -7182 -8478 -6426 -875 4952 8982 8533 6023
2022 6023 2329 -2943 -8853 -9776 -5712 -1691 1604 7038 9855 6744 1217 -2076 -5837 -9143 -8046
2037 -8046 -2435 3486 7217 8529 7510 4246 -2075 -7103 -8320 -6443 -4796 -396 6008 9327 7154
2052 7154 3451 13 -5005 -8929 -7833 -3504 1129 4602 7700 8351 5682 67 -5152 -7585 -7767
2067 -7767 -6754 -1266 5600 8084 6827 5202 2067 -3892 -7685 -7562 -5138 -1931 3017 7417 8877
2082 8877 6342 1279 -3760 -6405 -7893 -7461 -2354 3517 5994 6787 7333 4004 -2567 -6584 -7060 -6308
2098 -6308 -3339 2217 6436 8207 6526 2948 -1692 -5119 -7991 -8311 -4280 1186 4875 6772 7892
2113 7892 4849 -1348 -4848 -6069 -6555 -4548 360 4847 6878 7137 4545 522 -4214 -8225 -8616 -4714
2129d714M756K964L435J741l054m771k959k535k480J839M633M562L415L89j855
2144E366l815m731l739r53K808K732L377M499K762j966l884l462l925k782J245
2159f468M432L800L488J861j076k786m713m437j596J014K434M248N568K406j819
2174F356k992l121m456l063Q01L010L708L777K784L41k894m309m728k376K55J889
2190e018L930N298K532k00j572l136m885l677k33K349L129M218L608Q05k146l874
2206A128m312k707r73P65M022N126K912R05l49l212n111m285n55J049K426M485
2222A314L789K011j387l157m029l580k333K86L702M837K990K106Q15k901n157
2237f94l909j517m40J807M549M701K400l46k269l809m125l384k10K961L841L589
$$ plain form
2129 -4714 42 3006 6441 8182 5128 357 -2602 -5137 -7617 -5778 -1145 3417 6832 7221 5366
2144 5366 1551 -3180 -6919 -7872 -5064 -2332 1045 5544 8306 6340 2456 -1006 -4931 -7713 -6468
2159 -6468 -2036 1764 5252 7113 6037 3251 -1462 -5899 -7495 -6481 -4047 201 5769 8175 6356
2174 6356 3364 243 -4213 -7276 -6475 -3465 243 4020 6804 7145 4251 -58 -4786 -7162 -6907 -5018
2190 -5018 -1088 4210 6742 6542 4970 1834 -3051 -6728 -6961 -4612 -1483 2735 6343 7148 5002 1128
2206 1128 -3184 -5891 -6864 -6099 -2077 3049 5961 6866 6517 3305 -1806 -6091 -6646 -5597 -3171 1314
2222 1314 5103 7114 5727 2570 -1459 -5039 -7372 -7086 -3384 1453 4443 6549 7364 4463 -694
2237 -694 -4603 -6120 -6560 -4753 -204 4497 6897 6551 4282 473 -3652 -7036 -7246 -4285 -444 3145
2253C145L289J658k757m381l804k694j559J130M823L956K845J023j008l375n071
2268b780l623o16J785K842M169M190K087j961l665l465l767k878J120L860L975
2283A273K905K204K17l028m687m022j436J34K479M186M665K394r17k264l253m625
2299c775l454L23L069L038L532L306J102k515m236l686k536r31J578M264M936
2314D015K259L71j171l473m573l903p5J568K454M352L821J487j873l367l276l559
2330d943k163J070L907M484K437J942ll297m888l526j283J35J897M401M351K071
2346F592j090j867l087m724k626J41L478L300L214L239O18k693m367l502k300
2361e674j205J663M204M573J935K26o04l361m824k865m6J688K440M115L948N98
$$ plain form
2253 3145 6434 8092 5335 954 -2850 -5544 -7103 -5973 -1150 2806 5651 6674 5666 2291 -2780
2268 -2780 -6403 -7019 -5234 -2392 1777 5967 8054 6093 2428 -1037 -4804 -7682 -6562 -2702 1273
2283 1273 4178 6382 6599 3571 -1116 -5138 -6574 -6440 -3961 225 4890 7284 6367 4103 850 -3775
2299 -3775 -7229 -6906 -3837 -799 2733 6039 7141 4626 390 -3296 -5832 -6763 -5185 -921 4015
2314 4015 6274 6645 5474 2001 -2572 -6475 -6550 -4982 -2528 1824 5645 7132 5259 1892 -1384 -4943
2330 -4943 -7106 -6036 -2129 2355 4792 6734 6731 3434 -1454 -4980 -6263 -6128 -4231 170 4521 6592
2346 6592 5502 3635 548 -4176 -6802 -6661 -3183 117 3331 6570 7188 4495 128 -3374 -5674
2361 -5674 -6879 -5216 -1012 3561 5496 5722 5118 1757 -3067 -5932 -5978 -4290 -1850 2265 6213 6811
2377F811j967l134l305l423k175J424L675L749K675J557Jl080m455k911p21L15
2393d964J737M064M098J821j725k256k795m276k397Q01L067K921K614L250M78
2408F438k825l999k770j953p58J706M236L672J641j69j027l062m347l079N12J884
2424c900K433L090L719Q62k100l121k709k762j814J811L430L338K001J388l67
2439E299l184m199l326j68O07J592M350M006R91j465k150k551l828j928O72L276
2455b006K984K378K380m4k791m239k450j697j59J724L965L873J532m81j146l022
2471H01m408k043M50J791K909L356K657M97k255l773k721k175j420J899L718L547
2487B830J852P04l53l458m076k276n23J029K424L837K748R46j540k485l223l130
$$ plain form
2377 6811 4844 1710 -1595 -5018 -7193 -5769 -2094 1655 4330 5887 5888 2808 -1647 -4558 -5279 -4964
2393 -4964 -3227 837 4935 6756 5031 2775 -20 -4296 -6693 -5892 -2825 96 2710 5960 6438
2408 6438 3613 -386 -3156 -5109 -5867 -4161 75 3747 5388 5219 4192 1130 -3217 -6296 -5784 -3900
2424 -3900 -1467 1623 5342 6204 4104 983 -1726 -4488 -6302 -4491 -1061 2277 4278 5666 5299
2439 5299 2115 -2084 -5410 -5578 -4971 -3379 971 4977 5968 4503 2353 -198 -4026 -5954 -5282 -2006
2455 -2006 978 3356 5736 5692 2901 -1338 -3788 -5485 -5644 -3920 45 3918 5450 4969 3823 801
2471 801 -3607 -5650 -5200 -3409 -500 2856 5513 6010 3755 -18 -2739 -4914 -6334 -4435 -717 2830
2487 2830 4682 5386 5033 1575 -2501 -4777 -5300 -4271 -1847 1990 4738 5684 4144 1659 -1564 -4694
2503d694j602J110L310L414K268J972k50l261l563k186j613J05K167L776L101
2518D054J456m34k377l227l467k027N87K686K722K714L330O5k697l129k814k745
2534e303n32K312L499L101J879L15j789k799l583k651R9J444K306M064L430K66
2550F058k286k161l326l206p03J419K775K939K827J066n73k448m174l256l86Q11
2566d624K067M011L408O41q49j606l414l560j627N07K171L018L588J865m51k297
2582B848l651k910j164n26J500L939L565J252L97q28l482m467j441pJ173K970
2598h32L241K246Q16j936k526l188k270j502J120L710L587K202Q53n58l154l756
2614a947k228r62L25K461L632K591J317n72k444l433k719j875Q17L151K768K516
$$ plain form
2503 -4694 -6296 -5186 -1876 1538 3806 5778 5528 2267 -1296 -3482 -5095 -4990 -2823 953 4054
2518 4054 5510 5076 2699 -528 -3995 -6022 -5435 -2749 -27 2687 6017 6082 3385 256 -2558 -5303
2534 -5303 -5835 -3523 -24 3077 4956 5271 3482 683 -2900 -5551 -5452 -4008 -1702 2362 5792 6058
2550 6058 3772 1611 -1715 -4921 -5624 -4205 -1430 1509 4336 5402 4829 2381 -1793 -5049 -5435 -4624
2566 -4624 -2557 1454 4862 5503 4654 3048 -366 -3926 -5553 -5046 -2875 143 3731 5596 5145 2848
2582 2848 -803 -3713 -4877 -5403 -3903 36 3601 4853 5250 4422 940 -3527 -4968 -4975 -3802 -832
2598 -832 2409 4655 5471 3535 1009 -2179 -4449 -5951 -4831 -1121 2466 4668 5521 4963 1809 -1947
2614 -1947 -4175 -5137 -4812 -2351 1281 3872 5189 4617 2173 -1260 -3979 -5854 -5037 -1886 882 3398
2630C398K086J43k574l693k443k096m42K188L998K512K080j07j665l423l067k199
2646e304J73J873K612L042K938R19k847l030k445k561j276K173K962K698K158
2661D085J039q92k840l260k659p56J141J934L704L586M73j954j733k491l228j897
2677e748J181K745K374K691J905k35k564l317k638j277M96J484L334L195J032
2692D658r4j228k603m184k104J025J634K010L681K143P5k164k568k438j916j061
2708e134J529L646K879J159O49o04k818l768j831JN61J586L941K567M98j252j817
2725A792l020k720j358J597K780K440J850J505k2l126l193j914q77o72K481L373
2741I16K855N43qj608k977k855j667P18K049K272K352K469R4k761l050j725j828
$$ plain form
2630 3398 5484 5627 3053 -640 -3083 -5179 -5621 -3433 565 3077 5157 5050 3385 -38 -3105 -5304
2646 -5304 -5131 -3258 -646 2396 5334 6253 3406 376 -2069 -4630 -5906 -3733 -771 1927 4085
2661 4085 5124 4232 1392 -1868 -4527 -5283 -4142 -2208 1496 5082 5555 3601 1868 -623 -3851 -5748
2677 -5748 -4567 -1822 552 3243 5148 4913 2349 -968 -3606 -4883 -4387 -2903 431 3626 4658
2692 4658 4564 3336 733 -3451 -5555 -4530 -2896 -886 2795 4938 5013 2849 281 -2157 -4073 -5134
2708 -5134 -3605 41 2920 4079 4728 4124 1306 -2462 -4293 -4292 -3731 -2145 1796 4363 4861 3609 1792
2725 1792 -1228 -3948 -5306 -3709 -929 1511 3361 4866 4844 1718 -1475 -3389 -4266 -4938 -2457 916
2741 916 3771 4314 4306 2698 -279 -3134 -4801 -4083 -2034 238 2590 5059 5153 2392 -658 -2383 -4211
2758d211j110K216L375K080J266Q03p60l104l147j681R3R35K262K970K609j9j804
2775B773k033k265k419j524J822K785K102K015J477n34l063k741j656r74J95K103
2791a937L398K381K15n65j520k635l227j038J064J825K257K652K190p90k158k729
2807f17k020j659j14J843L283K307Q25K80r11l606k673j369L43J181K198L079
2823B370K155j7j585k267k307k518o92K064K493K173J705J220j337k776k780j843
2839c942p05N70K408L584K512j14p89j250k971l318p61J253J961K155K780J596
2855D969q11k631k684j775j690K88J915L201K330J199R3j402k992l183j064L04
2871c933J317K668K756J874n74j805k095k623k226k99J914K761K497J822R40j520
$$ plain form
2758 -4211 -5321 -3105 270 2350 3616 4419 3659 555 -2592 -4273 -4180 -3245 -983 1987 4596 4577 2773
2775 2773 740 -1525 -3944 -5468 -3646 -861 1241 3256 4733 4199 1136 -1605 -3261 -4235 -4040 -1937
2791 -1937 1461 3842 4057 3492 1972 -663 -3890 -4928 -3864 -2039 218 2870 5060 4270 2112 -617
2807 -617 -2637 -4296 -4410 -2567 716 3023 3848 4128 3217 -389 -3062 -4431 -4088 -2907 -709 2370
2823 2370 4525 4508 2923 656 -1651 -4169 -4861 -2797 -304 1869 3574 4794 3457 681 -2099 -3942
2839 -3942 -4647 -4077 -1669 1915 4427 4313 3524 2274 -697 -4015 -4776 -3523 -1562 593 3373 4969
2855 4969 4158 1527 -1157 -2932 -4622 -4334 -2419 782 3112 4311 4404 3002 10 -3173 -4237 -3933
2871 -3933 -2616 52 2808 4682 4108 2303 208 -2415 -4641 -4940 -3026 -265 2232 4054 4994 3474
2887C474k854k907j332n31M51K354L284J995L26j053j907k692k720p80J358K265
2903a269K394K348J687j110k475k519k184j445M17K002L354K003R34n87j267l047
2919g64k680q98N03J229K755K960J795p08j471k401k477k314m5J781K528K486
2935B279J344N65j077k651k613k032o2R67K373L201J680L59r32k196k700k323
2951c818q93J344J959K519K301Q46n45k399k638j815j021J85K075L345J876P43
2967D064j98j590k627k579j311L54J667K468K357J563q0j872k329k342j537l60
2983d352K149K628J998J476M86j410k967k271j609j83Q36K587K525J661K32r30
2999B856k113k497j824o80J391K548K136J238J299p25k503k507j591j235L11K434
$$ plain form
2887 3474 620 -2287 -3619 -4150 -3699 -1345 1939 3934 4260 3207 1300 -1392 -4112 -4892 -3534 -1269
2903 -1269 1125 3473 5160 4050 1575 -944 -3128 -4573 -4156 -2154 1200 3203 4137 3550 2283 -764
2919 -764 -3444 -4342 -3839 -2610 145 3105 4900 4192 2721 320 -2157 -4471 -4516 -2735 -207 2279
2935 2279 3623 4188 3111 460 -2153 -4185 -4247 -3280 -907 2294 3974 4333 3401 1205 -1495 -3818
2951 -3818 -4711 -3367 -1408 1111 3412 4258 3713 1314 -1324 -3139 -4160 -3975 -1900 1445 3321 4064
2967 4064 3866 2276 -351 -2930 -4241 -3887 -2220 248 2605 4168 4088 2216 -113 -2455 -3992 -4352
2983 -4352 -2203 425 2423 3899 4385 2975 8 -2263 -3872 -4055 -3219 -632 1893 3554 3786 2856
2999 2856 743 -1754 -3578 -4258 -2867 -319 1817 3055 4354 3629 1126 -1381 -2972 -4207 -3896 -1462
3015a462K597J693R41p01j719k057k267j097O93J909J927K294J729n84k098k127
3031c29k192j450oJ979K200J979J383J55j233k476k482j297K36J257K003K413
3047B140J927l91j650j355k334k237k62J755J733J997J928O97q49k462k426j384
3063c173k05O55J421K979J699K26q89j181k531k473m99P80J691K049K558O79p06
3080C080j800k119j565j203M5J746K752J917K98M57j144k971k610n96O45N85K375
3097a08K575J147k9j424j713k203j742l72J743K465J904O22R31n05l527k168o76
3114c080m12q5K847K955J272p7p35j438k503k000k31J054J531J859J542J607r17
3131C189k653j891j485j048L95K268K326J620N29K51j588k195k287j158N28J489
$$ plain form
3015 -1462 1135 2828 3769 3068 1349 -708 -2975 -4072 -3379 -1470 457 2751 4480 3896 1798 -329
3031 -329 -2521 -3971 -3977 -1998 202 2181 3564 3719 2486 10 -2472 -3769 -3533 -2276 -273 2140
3047 2140 4067 3676 2026 671 -1663 -3900 -4162 -2407 -674 1323 3251 3948 3099 637 -1789 -3173
3063 -3173 -3378 -2723 -1302 1677 3376 3602 2713 1532 -999 -3472 -3971 -3191 -1500 549 3107 3786 3080
3080 3080 1280 -839 -2404 -3607 -3562 -1816 936 2853 3151 3608 2464 -507 -3117 -3713 -3068 -2483 -108
3097 -108 2467 3614 3585 2161 448 -1755 -3497 -3869 -2126 339 2243 2865 3796 3291 -236 -2404 -3080
3114 -3080 -3492 -3577 -730 2225 3497 3420 2685 1247 -1256 -3256 -3487 -2433 -902 957 2499 4106 3189
3131 3189 536 -1355 -2840 -3888 -3493 -1225 1101 2721 3250 3501 1913 -282 -2569 -3727 -3199 -1710
3147a710K155K020J753q75k213j214j988j875R1K118K140J375J861N40j510k413
3163B55k274j456K58R14J953K746J419n95j135j503k282k234m1J439J658K144
3179A266K338O22j523k203j706j420r09O80J585K232J911N55n73j299k656k361
3195c461j72Q21J135K095K280J450j059j365j835k378j166L08J683K226J809O43
3211C014L77j249k680j872q33n4O49K259K803R40J17q21k078k429j482j50J154
3228b335J665J998J452J133j247k194k160j271p75O83K272K360J106R02k57j911
3244A421k381j919k72P7J593K012J994J234q04j835j743j655j304J67K044J927
3260E56J559J171M63j840k279j963r15J04O51K447J795J313Kj059j616k107j582
$$ plain form
3147 -1710 445 2465 4218 3343 1130 -84 -2072 -3947 -3856 -1738 402 1777 3638 4178 2668 255
3163 255 -2019 -3475 -3217 -2303 -350 2396 3815 3220 2085 582 -1700 -3934 -3975 -2536 -878 1266
3179 1266 3604 4226 2703 500 -1206 -2626 -3535 -2855 -1270 962 2873 3428 2855 1556 -1100 -3461
3195 -3461 -3633 -2812 -1677 418 2698 4148 3089 1724 -111 -2489 -3655 -3347 -1664 562 2371 3014
3211 3014 3391 2142 -538 -2410 -3243 -3297 -2648 -389 2414 3354 3471 2650 572 -1857 -3339 -3489 -2335
3228 -2335 -670 1328 2780 3913 2666 472 -1688 -2959 -3734 -3051 -779 1581 2687 3589 3332 1421
3244 1421 -960 -2879 -3151 -3074 -1481 531 2525 3759 2955 1120 -623 -2278 -3582 -3415 -1371 556
3260 556 2115 3286 3749 1909 -370 -2333 -3248 -3144 -2493 -46 1749 3062 3064 2005 389 -1718 -3300
3277c300j83J247J726J914K171L71j372j709k307j341q43J173J496K257J547K63
3293C110n22j460k162j604n46N07J555J988J860P36n43j703j824j580j180L40
3309c028J389K026J819R07J4j550k097j654q36J60R60J994K142J041k1j207k033
3326B6j825j294n27J603K081J654J167K30r87j995j960p92j78N28J874J962J299
3343B866K43o86j638k043j442n26Q58J557J715J454P73o15j788j964j104q78P03
3360b515J793J725J223R58m79j226k041j878p49K79J393J996J747Q73n07j103
3376A489j505j640j319K06J351J706J659J061J50j227k074j864o07l56R85J548
3392d37J928J406k19p52j381j960j582J63R83J279J872J559K88q17j989j573j333
$$ plain form
3277 -3300 -3483 -2236 -510 1404 3575 3946 2574 865 -1442 -2783 -3626 -2453 -957 1300 2847 3110
3293 3110 2588 1128 -1034 -2638 -3184 -2677 -1122 866 2726 3462 2919 1216 -608 -2188 -3368 -3028
3309 -3028 -1639 387 2206 3113 3127 1577 -520 -2174 -3010 -2850 -1890 104 2246 3287 3266 2059 26
3326 26 -1799 -3093 -3620 -2017 64 1718 2885 3115 2128 133 -1827 -2619 -2797 -2269 -395 1567 2866
3343 2866 3109 2423 785 -1258 -2700 -3226 -2368 -811 904 2358 3131 2516 728 -1236 -2340 -3218 -2515
3360 -2515 -722 1003 2226 3184 2705 1479 -562 -2440 -3189 -2910 -1517 479 2226 3099 2592 1489
3376 1489 -16 -1656 -2975 -2769 -1418 288 1947 3008 3158 1931 -143 -2007 -2614 -2970 -1985 -437
3392 -437 1491 2897 2678 1926 545 -1415 -2997 -2834 -1851 -572 1300 2859 3147 2330 341 -1232 -2565
3409b565l85L81J502K058J743O5l90j100k192j511m30N57J206J825J665P41r09
3426B261j589j388j382j280M76J480K199J026R93k9r92k019j572p87J60M89K212
3443B58J662J135k86p64j645j833j833J47J447J444J598J438N38j040j750j821
3459a305q87n28Q7J923K130J113j13o7j454k056j825J07P74R86J609J852O92m44
3477B594j615j584j430j000J55J740K170Q14P72K58j420k311j292n01Q9N04K230
3494A73K057R06n44j031j450j600j580K75J331J440J399J348O27j336j912j566
3510a463j004n49M30K360J472J533o2m50j120k352j366k71O91J294J540J797P68
3527C248r90j669j247j850n65O52J495J667J175J008Oj495j815j843n35K50P79
$$ plain form
3409 -2565 -2950 -2569 -1067 991 2734 2799 2409 1309 -883 -2394 -2824 -2267 -1061 764 2429 3170 2261
3426 2261 672 -716 -2098 -3378 -2902 -1422 777 1803 2796 2767 1775 -244 -1816 -2603 -2443 -1954 258
3443 258 1920 3055 2769 2005 360 -1473 -3306 -3159 -1712 -268 1330 2768 3306 2266 516 -1305
3459 -1305 -2192 -2720 -2633 -710 1420 2533 2420 2353 899 -1157 -2982 -2875 -2101 -1115 494 2346 3038 2594
3477 2594 979 -605 -2035 -3035 -2880 -1140 1030 1844 2616 2874 1454 -857 -2149 -2650 -2561 -2057 173
3494 173 2230 3136 2592 1561 111 -1489 -3069 -2794 -1463 -23 1376 2724 3351 2015 103 -1463
3510 -1463 -2467 -3016 -2586 -226 1246 2779 2717 2267 1147 -1205 -2571 -2842 -2151 -857 683 2480 3248
3527 3248 2258 589 -658 -2508 -3073 -2421 -926 741 1916 2924 2930 1435 -380 -2223 -2758 -2508 -1729
3544a729J890J922Q82n73q10j593j706j429M96J135J386J906J067J04j229j525
3560A94j593j167k2L65J968J674R87R5k58j656k020j501K82P02Q58K109J719N7
3578B793p71j136j445j742q76P51J654J623J108N24k16j206k068q32m21j38Q56
3595a542K063J693M33k76p70j769j651r43N51R75J459J526O50K17q66k011j302
3612a563n90o94J009J950J703M67N58q59j579j493r64l67P30R02J553J598L97
3629B758j179j298j230j104o50O55J978J011Q54O18j84j352j569j345m87L58J067
3646a099J766J195Q07o45j125j337j115j018N02J221J138J441J109m73r60j571
3662a64j372r52L5J101J219J524J078k1q26j498j727r47N93R76O15J616J054k61
$$ plain form
3544 -1729 161 2083 2965 2392 1582 -11 -1717 -3146 -2650 -1515 -129 1777 2844 2948 1719 194
3560 194 -1399 -2566 -2588 -2223 -255 1419 2406 2501 2243 587 -1433 -2934 -2652 -1950 -1092 1017 2736 2793
3578 2793 2022 886 -559 -2301 -3177 -2426 -772 851 1959 2483 2267 1061 -1007 -1839 -2260 -2398 -1542
3595 -1542 521 2214 2647 2371 1601 -168 -1819 -2762 -2211 -1236 223 1749 2399 2616 1750 -261 -1563
3612 -1563 -2153 -2847 -1838 112 1815 2282 2840 1981 402 -1091 -2055 -2422 -1692 -790 763 2361 2758
3629 2758 1579 281 -949 -2053 -2703 -2048 -70 941 1795 2413 2229 877 -692 -2037 -2524 -2166 -1099
3646 -1099 667 1862 2669 2024 899 -438 -1553 -2571 -2069 -848 290 1731 2840 2367 1407 -164
3662 -164 -1536 -2488 -2453 -1352 -133 1391 2469 2448 1622 124 -1603 -2550 -1957 -981 -366 1250 2304 2043
3680B043n18q67j918r53m41M98J592J395J304K12p63j062j301j413l0M18Q62J841
3698H99J465j11j18j247j409j323o82K77J270J378J296M99L5j139j614j318l12
3715b154j79J215J444J372R14l53q40j576j462o77lP22J499J500P92J58q71j640
3733a39j015p06n58R56J498J329P21rr6j516j276j449k69O89J408J327J308P4
3751B277l62j687q89j033o36L34J614J390O68N80k50j064j586j118n56J66R73
3768a179J757R25R78m01r16j081j452j185O32R40J359J265Q90r9j318j367j311
3785a563o92k51Q41J525J492Q91Lp88j073j632p11M6L80J128J405J231j1p12j085
3804D24j343j067n08L62J698J312Q46N56l62j329j436o97p36L12R89J420J545
$$ plain form
3680 2043 1525 658 -1260 -2213 -2654 -2156 -564 831 2135 2347 1584 522 -779 -2192 -2222 -1804 -942 899
3698 899 2364 2253 2135 888 -521 -1844 -2526 -2249 -979 399 1695 2194 2229 1090 -524 -1842 -2154
3715 -2154 -2333 -1118 326 1698 2612 2259 1419 -157 -1619 -2296 -2299 -1577 -78 1422 2214 2372 1501 -139
3733 -139 -1154 -1860 -2418 -1462 36 1365 2086 2077 1981 465 -811 -2260 -2529 -1840 -432 895 2203 2277
3751 2277 1915 228 -661 -1694 -2330 -1996 -382 1008 1676 2256 2006 942 -644 -1762 -2318 -2152 -1179
3768 -1179 578 1503 2481 2080 1164 83 -1369 -2554 -1922 -982 377 1642 2532 2433 1115 -252 -1563
3785 -1563 -2255 -2506 -1665 -140 1352 2243 2246 1458 385 -1247 -1958 -1912 -1532 -404 1001 2232 2221 1509 424
3804 424 -919 -1986 -2494 -2132 -434 878 1724 2280 1918 589 -847 -1544 -2280 -1968 -979 441 1986
3821A986M32q97o57j376j240o55L04J019J354J099J096j58j062j579r69p96q5
3838b184O64J732J198M67o8l38j277j419j335K37R09Q37J564J234J60r42j221
3855B18j041j162k85J75J573J496P59L24m44j042j607q57j43J86R89J279J336
3872A754M94o00o95j318j010p62K52R53J177J072R17j38r63j283j108o21j57O79
3890a357J598J306M85k27k38j202j381j086J56N50R32J357J181m6o95j248r65
3907h80r75o93R98J396R36J124L70n17j134j764n52j51K53J003P92J546L19o62
3925A409p21j131j111o43N23P12J491Q95R38j89j368j009j172k54k15O34J252
3942D1J457N6L42q24j190j046p44M35j1J432J151P70P3q53j025o46r99l38O59
$$ plain form
3821 1986 2418 1521 864 -512 -1752 -2407 -2103 -1084 270 1369 2465 2307 1245 -334 -1303 -2099 -2184
3838 -2184 -1520 212 1410 1877 1809 1471 194 -1225 -2560 -2323 -1414 -577 987 2221 2381 1439 218
3855 218 -823 -1985 -2270 -2095 -522 974 1733 2057 1613 571 -1036 -1893 -2036 -1850 -861 418 1754
3872 1754 2248 1648 953 -365 -1375 -2137 -1885 -932 245 1317 2234 2096 1133 -150 -1258 -1879 -2036 -1357
3890 -1357 241 1547 2032 1805 1567 365 -1016 -2102 -1946 -1396 -464 893 2074 2028 1333 85 -880
3907 -880 -1855 -2548 -1550 -154 782 1906 2276 1759 625 -1139 -1691 -1842 -1589 -586 206 1752 2071 1409
3925 1409 688 -443 -1554 -2197 -1674 -962 529 1424 2362 2173 805 -204 -1376 -1630 -1845 -1211 41
3942 41 1498 1554 1896 1072 -118 -1164 -1908 -1473 -1484 -52 1099 1869 1942 1089 64 -582 -1581 -1919 -1260
3961a260J192J059L41M79k71j217j092o04l44K18J009J305J171Ll82r95j116r98
3979a502m86M97R32R50P81O50j26j021j087n64o57l2R05J018J007O25k75n43j424
3998c52r63r34O77O93P79J591L12Q2j093p86q71q14m80J026J445O57O82Q0k76
4017A455j456p87r16l22J050M11J421O04M48m45j140q50q14n57P40O20J233N98
4035A293O54l02q55j155j032m85M97P87O04J492K83p8p78r69j296m55M29O19J142
4054C95P98N95r1q43r57j124m87k8P84J014Q62N67L14q87p44j303n45J88K0J195
4074b77J323O44J10o36p43j275q27p5K59J093J160R50j94J49j088j206p25l11
4092a669L1J120J148J056J65l50p31j452o53l82J29Q50J050O69P99L7j208p59
$$ plain form
3961 -1260 -68 991 1332 1811 1540 323 -769 -1373 -1717 -1499 -490 815 1986 1989 1607 612 -504 -1502
3979 -1502 -1988 -1491 -559 391 1172 1822 1696 675 -412 -976 -1633 -1665 -760 258 1265 1890 1615 1072 -352
3998 -352 -1315 -2249 -1572 -879 -100 1491 1803 1885 792 6 -865 -1679 -2159 -1133 312 969 1651 1731 1455
4017 1455 -1 -788 -1704 -2026 -976 -565 856 1460 1908 1463 323 -527 -1341 -1898 -1158 -538 695 1293
4035 1293 1947 1645 790 -365 -1397 -1882 -1385 -598 6 1498 1781 1703 925 -44 -1340 -1795 -1366 -747 395
4054 395 1193 1788 1697 854 -103 -1227 -1714 -1742 -958 56 918 1485 1799 912 168 -1135 -1680 -1492 -1472 -277
4074 -277 1046 1690 1800 1164 421 -854 -1681 -1756 -1497 -404 756 1706 1512 1661 573 -633 -1358 -1669
4092 -1669 -1638 -518 630 1686 1851 1501 770 -682 -1335 -1717 -1588 -738 312 981 1780 1817 609 -150
4110a50p97p58j6N56J670L86M81J75n29q89j408k30l70Q71R74R32R41l15l65j027
4130A32r23n79n39O83J085R38N31N10n85r27j157m63l19L19J060P39O99Q78p11
4149A371r23p01r44p84P55N40R21Q16O29k3q67q98q81l69k25M62J407Q04N42r
4169A623p79o40j208n51K77L30P94J179M52L8l68r73j086o71j63P26Q02R75P56
4188A513K10n42o72j219m83k19qP95J238R28J28m73q62q08r36j87K77N50J218
4207D48P16L34J25r92r40r08l01K0Q15J313O33L93k72m35j139q54n74L45M36Q09
4227b8R51Q95k18p18q50o69n57l11M08J102Q03L39K31M6j143r95o35j03K10P36
4247e06J385P23l03k8q88m85r82l27N9P89Q65P77K63l9j097n21o95j72r2Q12P85
$$ plain form
4110 -150 -947 -1705 -1721 -1165 505 891 1372 1547 1018 129 -1279 -1509 -1879 -1008 -34 898 1839 1524 1159 132
4130 132 -791 -1370 -1909 -1226 -141 797 1328 1838 1253 326 -831 -1294 -1613 -1294 -234 505 1204 2082 1371
4149 1371 448 -253 -1197 -1981 -1226 -686 235 1051 1680 1657 790 -108 -989 -1358 -1583 -1121 286 1090 1632 1623
4169 1623 844 204 -1004 -1555 -1278 -948 -154 1025 1477 1515 1147 174 -912 -1583 -1746 -1020 -218 757 1513
4188 1513 1723 1181 509 -710 -1193 -1412 -1420 -625 613 1541 1669 1196 334 -474 -1410 -1597 -1320 -770 448
4207 448 1164 1498 1623 631 -309 -1217 -1518 -1498 -683 630 1263 1656 1384 949 -190 -1044 -1618 -1273 -837 -28
4227 -28 923 1818 1600 882 32 -637 -1194 -1505 -1097 5 808 1147 1378 1424 281 -714 -1349 -1452 -1242 -506
4247 -506 879 1602 1299 1271 383 -102 -1084 -1411 -1352 -563 302 1079 1342 1303 206 -315 -1010 -1182 -1274 -462 323
4268C23Q91L18q0o29j032o47q89M53O97O71O67P62m46l44p27p27n20j37L59J046
4288IQ94M30J42l11j117r00j32l74O71L99P44Q68O8n57l59r89p24k79M87J014
4308a6L72Q98J65l55n79r21o55j95N4P82Q73R24K02m37m88j031o83j71J98M44
4328f19O03J105M34Lr40n78j031k86o5N22R43N97O75j5m48q50r66j34R6J22O62
4349a70R67P67k88l85q25o86m54m81M54Q28Q17O92J32l5r75o42r12J01K14O97
4369a84P27N36M8j96n22n69q05o00M47N32P11R20K38l0p66o88l21m97k13M97Q62
4390A27O37O88j73m50q95o18p81N66J68Q55P01M90O6m71p30q92p96m4P76O68O38
4411E30M82J29j18q86o89p40l8O0R82O03O70L15k44n78q42n15m00L68L12Q81P36
$$ plain form
4268 323 1214 1532 1452 823 -209 -856 -1745 -1292 -595 76 743 1505 1059 715 -12 -739 -1259 -1396 -1037 9
4288 9 903 1333 1475 1164 47 -853 -985 -1359 -688 -289 455 1323 1391 834 475 -514 -1238 -1517 -1030 -16
4308 -16 356 1254 1419 1064 485 -436 -1091 -1286 -1232 -450 423 1347 1549 1112 624 -407 -1090 -1261 -1063 -619
4328 -619 -16 1089 1523 1526 586 8 -1023 -1309 -1374 -852 91 688 1363 1348 900 50 -916 -1050 -954 -832 -170
4349 -170 797 1564 1276 891 66 -620 -1074 -1555 -1101 -273 544 1236 1368 1333 358 -284 -1196 -1095 -881 -184
4369 -184 543 1079 1127 931 409 -160 -965 -1565 -1118 -586 125 1045 1283 1253 487 -201 -522 -1019 -1232 -735 127
4390 127 764 1452 1279 829 -66 -684 -1465 -899 -731 124 825 1315 1381 910 180 -712 -1508 -1552 -776 -108 530
4411 530 1012 1141 1023 137 -552 -1292 -1330 -1270 -288 315 985 1300 1056 478 -364 -879 -1279 -911 -599 282 1018
4432A018O38n49n31j059l86l76K42M27P11P57K07O3n92o57o10n67R5K47J158N36
4452G72N82o2o48o41o81n22m4L09Q58J125K87L7l60o94p19m20l81K18R50P13M33
4473A112j5j63o48o02p20l22J40P70O37P42K17J3m97j024l58n54J64N50P73M50
4493F65P27k27m78p96p45l37J14O56O97N23L89J87p17o62p92n37J53M04N90R52
4513G66M98j18j8r90o19m81n18N63O53P05P96j35l70l67p14n70n61N51M09J139
4533F19L32J77p7r11m26o27l64M32J84Q97M85O16l17k63j041p39k66K42N93M62
4553HP69K15j69j00p45q00k13k68P22N43P77N06o6l02m59j078l62J19P0M08R97
4574E72M23J40k00o45n47q63j83M14Q15M88O56J16L0p03j018l96k62J72N62Q56
$$ plain form
4432 1018 1656 1107 576 -483 -869 -1245 -1003 -576 135 892 1099 1162 570 -87 -697 -1264 -1169 -922 236 772
4452 772 1354 1292 644 3 -678 -1200 -1244 -935 -77 1048 1335 1372 1012 318 -401 -821 -1202 -984 -34 679 1112
4473 1112 1097 934 286 -316 -1036 -1358 -1218 -448 189 931 1148 1161 664 -360 -718 -1272 -1108 -558 215 665
4493 665 1392 1165 687 -109 -854 -1191 -1077 -421 276 799 1188 1375 658 -4 -796 -1333 -1180 -776 -186 766
4513 766 1264 1146 1128 138 -481 -962 -1480 -917 -264 441 1237 1102 732 365 -349 -919 -1480 -929 -520 619
4533 619 951 1128 1051 140 -286 -913 -1277 -845 -661 236 721 1337 1020 757 -284 -1023 -1289 -1047 -454 8
4553 8 777 992 823 723 -22 -822 -1035 -1303 -581 -38 739 1245 1179 877 418 -660 -1022 -903 -833 -425 572
4574 572 995 1135 935 290 -257 -1120 -1303 -889 -74 414 1070 1186 1216 513 -505 -901 -1163 -991 -429 427
4594D27N90K05k14o58o70m57j93J43L70N81M45O63k06l74o12m50o66J30L30O72
4614E6N33K37J46j72p68o06k12k05M54M86Q58K71M2m24m47n82o68l7m2R98O77
4635E95K16L95n09m57o30m48o0o8N44Q11M90R2Q4n43o55q08j43L16N06O6Q08N19
4657A121l51m88m82m22j74j26M47Q84N00J75j18j93p86n48o27L13R4P53O35K81
4677H88j4m79m13o02n91K50L69O68M86M01M4l54m19p71k72k91O8P59R47L87j58
4698I03k40j25n91j139K13K61K95P73K29O46m1p92p63r8n64J3L75Q30L29J85M77
4719A176n51o19o88l75m2L83P38O65K06p2k89n99n29l68j02M87L28N04M75K21
4739I49q7q46k91j78n56J57P73O42L96l1J8n66p12n15k43L42M03N19P00J13k85
$$ plain form
4594 427 1017 1222 1008 350 -320 -777 -970 -827 -457 124 569 1232 1026 652 40 -410 -1076 -946 -616 56
4614 56 589 826 972 800 32 -574 -786 -991 -537 -51 807 1078 1120 696 249 -333 -1001 -1038 -1080 -82 595
4635 595 811 1206 697 240 -390 -838 -898 -966 -422 389 879 971 1055 512 -143 -951 -1094 -778 -272 -206 602 1121
4657 1121 770 282 -200 -622 -796 -922 -475 409 909 1084 966 773 -13 -561 -1188 -875 -781 -28 607 888
4677 888 874 395 -18 -620 -1211 -961 -592 76 562 963 1007 653 234 -537 -809 -1100 -1032 -273 674 1061 903
4698 903 663 538 -53 -1192 -979 -718 -423 350 579 1225 1184 392 -371 -469 -1033 -1020 -645 185 514 699 1176
4719 1176 625 6 -682 -1057 -1099 -716 22 687 893 821 532 -67 -596 -964 -1066 -579 -251 253 728 949
4739 949 862 16 -275 -453 -1009 -852 -79 563 959 928 946 380 -332 -847 -1090 -748 -345 174 874 987 702
4760G02l71n25m88l98K08L41P67M98L37qn04j002j70m15L4M90N45P22M32m22j67
4781F06k13r92j95k99N35M58M73M84K70m38o52p20j89j84K34N55O88M27J23J6
4801I87n88q52m80J15o5O94N31K50N58j46p98l54n61l71L25K08Q84L14K75J29
4821A055o10q22o6l12L1K75M70M50P08k80j16n76q33n15J34L81J76J048K10M07
4841A215l76q05o27j93k20L85N22O42N46l6r5p27o52k78o07P37K81O89L51M7j55
4862F44j94o40o29j87J37M09O79K42M57k0o45m47o21j51j06O00P35L58J97Q8m04
4883E02n46m42l60k97O93N23O36N23l95l23l17q24l25K36%N14P09L95qm75l09
4904A10l79l73m4J6M10Q00L93J49n65n93l78l11j20L05K92N07M53R1n8k83o61
$$ plain form
4760 702 331 -194 -682 -1080 -872 -531 236 734 1071 1063 559 -443 -613 -1028 -994 -504 41 763 1195 773 606
4781 606 393 -599 -794 -1093 -558 -100 373 857 1127 689 37 -683 -872 -1056 -822 -267 421 848 971 987
4801 987 399 -453 -933 -818 -883 -189 342 592 1150 1004 206 -148 -709 -1080 -755 -547 337 651 926 1055
4821 1055 445 -377 -443 -755 -724 -449 21 471 1179 899 783 207 -626 -1141 -1007 -626 -450 598 808 1215
4841 1215 839 34 -593 -786 -1006 -621 -99 543 1089 1053 958 231 -421 -699 -1306 -569 -288 401 752 799 644
4862 644 450 -190 -819 -1006 -869 -460 219 461 918 898 253 -194 -815 -966 -1072 -472 263 621 818 906 502
4883 502 -44 -486 -846 -1143 -450 73 709 1232 837 514 197 -627 -952 -716 -716 -202 507 902 894 419 110
4904 110 -269 -642 -686 -670 -260 540 933 1082 517 -76 -454 -765 -885 -580 -288 219 672 763 705 422 -239
4925b39l37m84M77P2Q08N24N5k39l09m87o45j01p6P58N39K86L43p9L8p79q84N0
4947g09o3N8M83O35N40j06l34l95o10l67JK66N24L64P38q6k95n06o74m56K31Q2
4969f79K87J062L5P5m2o90k86n01j39K07L82M63L40Q32n25n93n30l08k90k1M63
4990d58P50L57L78k99j86n05p00P4j05M91RJ036R3mk29p15m10j91j97O20J42O77
5012F28J80N1k54n49l21p39J89K57N04N24K87J63l36j63n26p70J3K10K54N69N62
5033G33K96k43m19n77l33k84k19O41P45L93K57l01k9n84p63m22K49J17R15N70
5053G42J60q0k38o84n18j72j29M31O06O47l5O6l57j89p85R5m74K57O44N25L34
5074H46p0k7m30m73o94J68Q8N55K83N20M59m57o79n01k70j89K32M63K64N51J53
$$ plain form
4925 -239 -576 -1060 -583 -511 297 821 876 637 328 -159 -804 -905 -981 -223 316 602 945 866 904 125 -759 -709
4947 -709 -772 -714 -231 404 944 838 504 109 -501 -868 -867 -601 -77 287 1025 939 644 138 -536 -992 -761 -679
4969 -679 -392 670 705 780 738 48 -238 -739 -878 -671 -289 174 514 1346 821 228 -302 -610 -900 -921 -458
4990 -458 292 649 1027 728 542 37 -663 -589 -694 -203 -194 842 935 931 702 -13 -423 -614 -811 -191 -49 628
5012 628 808 859 605 56 -265 -1004 -815 -558 -54 470 757 920 584 421 -105 -875 -862 -652 -398 171 733
5033 733 1029 786 367 -210 -543 -827 -1046 -405 340 733 990 689 660 76 -687 -1109 -860 -743 172 742
5053 742 902 822 584 -100 -618 -790 -919 -488 118 765 730 796 439 250 -535 -440 -914 -657 -13 512 846
5074 846 776 749 319 -154 -848 -680 -592 -37 246 766 1225 768 89 -412 -682 -871 -639 -176 88 639 792
5095G92J5o82m64m73j72J16N75N34M33L01Ol75n52o48j95m2K40P12K82N39K81
5116A223n27n35p02l52j2L07L97O91P8J43k24m2j333j39P2K79L60M87N37J58l99
5137D67l47n40n75j8L01N20L53N41O3N1m98m83q49K41J0J90L84J104O5j33k34
5158F13m87o61n47J85L17O19N70K72j39k32q83o8Q3n97L53N00P71O5L55k29o24
5179B36p29m27P2L57L93L49M26J73j00q62l66n18om6Q31P70K93j79Jn44k14n21
5201f11j14k69L78Q26L60J33P2l48o46k80p09O39k02R28L98L32j5m0r98n24m42
5222a132oP12N40M32K61j94k10l50k32n47n36P53K04P86K54K75j68n37o19m99
5242h13J93P7L54N81L17K8j25n3o00n34m29K96O76M59L47J91R3o73o02k90n42
$$ plain form
5095 792 807 125 -339 -812 -984 -868 -293 241 674 975 981 606 54 -594 -789 -831 -591 121 403 942 1223
5116 1223 696 161 -541 -893 -905 -598 -201 490 568 711 487 445 -888 -1027 -955 -676 -316 171 708 866 467
5137 467 120 -420 -995 -1013 -712 -192 161 702 765 816 318 -165 -1014 -773 -763 -573 -189 915 980 847 613
5158 613 126 -535 -1082 -897 -580 39 609 881 742 510 -373 -441 -358 -955 -602 -102 669 734 1089 860 236
5179 236 -493 -920 -848 -491 -98 251 677 850 750 -112 -478 -996 -1002 -1048 -217 553 846 667 668 124 -90 -611
5201 -611 -725 -994 -616 210 570 703 775 427 -219 -499 -1208 -569 -771 157 555 887 872 832 -166 -690 -1132
5222 -1132 -1138 -426 114 546 807 613 403 53 -179 -726 -1262 -509 -305 481 735 1010 842 305 -314 -813
5242 -813 -620 -543 -189 392 709 737 612 559 -41 -575 -1004 -708 -32 427 774 965 1058 385 -217 -507 -1049
5263a049J08M91O71L92J69P6n40m26m68m15L20J32M94P28L3K80n44l69k64o03
5283g84j22M20M70M43N09j77k55m83o66J1l26N04L49M22M87m0j39m01o17n66K01
5304g60J52M22L70P94L1l64j17j036j23k15J35L93L38O62R0j38j90o24n22J16
5324e86j07L44K91N61L90j35o51l4n98p1k72K60O62K99O24k86O1r65l86J9l40
5345i20K10N56M64M61J03l81k38o89m79j62M78K99P48K58J29j47l04n69l07l54
5365h44K15L15N54N55K24l24k70o13n26l74M05K79L50P84J00j59o8n76m46m95
5385i14k47L65O97N75J62J45k18n73m52k17M1R5M94P78L02k44j34n15l47o22o5
5406h94O1P79M15N57k27nk47q31j81Lk16O17L66N78j37J04l85n59o88J16J15J56
$$ plain form
5263 -1049 -941 -450 221 613 782 858 318 -108 -576 -991 -671 -539 -45 683 716 996 452 83 -181 -784
5283 -784 -906 -486 -16 427 936 759 504 21 -645 -634 -960 -456 -107 315 802 762 623 222 -395 -961 -760
5304 -760 -608 -186 184 978 1009 645 528 -508 -631 -846 -711 -318 20 682 772 634 444 -180 -702 -586
5324 -586 -693 -349 -58 503 893 758 107 73 -525 -596 -868 -608 54 353 977 691 752 -213 -599 -580 -920
5345 -920 -710 -154 310 771 874 493 255 -434 -913 -1075 -597 -298 450 708 837 690 386 -183 -490 -844
5365 -844 -629 -314 240 795 1019 695 425 -188 -714 -1088 -683 -404 -54 730 830 671 603 27 -419 -914
5385 -914 -1161 -796 -99 476 638 783 565 -8 -460 -677 -636 -541 -47 731 1033 789 655 140 -207 -829 -894
5406 -894 -833 -54 361 918 691 686 439 -392 -573 -570 -786 -169 197 775 638 742 357 -202 -890 -774 -659 -503
5428e03O13M72M67l46n34l80n62R6q5P38L39K37J40j4k21l70o09l87NJ05J065
5449B66L67K84j99m3m65o69j43r7K75L64M86M15j3m87k39n50k98O2J59L67O39
5470D81K6J37J53l61p62o17L07m9O74K68J05L59l53p9o07o3n44j9M67P07K27L32
5492G89J18o58l13m47k31N6M69L42K89M74n0n16l5p14l95k02M91L92K90O41J55
5513I45n03k78j33q67J20Q9M86Q64L2J15j29n32n99k92j95K38R6P92O14o7j50
5534F46l91l06p32p1M1M17P13L73Q5j9l70o45r0m71J08K18O15M48M81k82l24k72
5556A72q09r7N2J6M30O67M70j7o11r1n75m36k37L38O77K34O51R3l08l45p04l36
5578g66j07K57M34N63M14J10k15o51k46m34k37R1L19Q62K28L37p2m62o28m50j5
$$ plain form
5428 -503 110 582 1049 703 169 -211 -773 -677 -762 -24 315 552 692 678 457 87 -522 -909 -904 -799 266
5449 266 633 917 718 675 210 -459 -602 -699 -424 -60 426 841 828 341 102 -448 -746 -684 -525 -158 481
5470 481 507 644 797 436 -326 -943 -636 -685 -11 257 362 721 368 289 -318 -381 -925 -944 -477 230 457 789
5492 789 907 249 -64 -511 -742 -686 -217 125 414 888 838 322 287 -427 -822 -1024 -533 -141 149 790 945
5513 945 442 164 31 -836 -716 -627 -141 723 755 870 741 209 -390 -682 -877 -639 -543 249 863 796 646
5534 646 255 -51 -783 -854 -813 -396 317 690 775 756 386 -259 -349 -820 -712 -494 121 569 1050 768 444 172
5556 172 -637 -734 -682 -666 -236 431 901 884 273 182 -393 -829 -1066 -728 -51 183 834 927 619 274 -430 -766
5578 -766 -873 -616 -182 381 795 905 690 39 -207 -641 -878 -787 -468 394 622 959 887 425 -203 -653 -668
5599f68k6M98O2Q09N2l3m53l58l93k79o4M59L69M41M74j92j47l95o60k94j56L37
5621f17O13J71N24J83l04n65n70l82P9L14N06K98N67K6l1o13o32k32k31L88M39
5642f9K33L91K69l40l37m00k80l21N2M83K85P63P9j84p2o75l00n31K84N75M8O46
5664E99L18k60l42j89p76l10M84R2L41N71M27k80n4m45o38l51j14L16O29N03K48
5685G69K67o29k88p48r0k00L17M72M52L55J62l65q7o00m96L9j67L93P75M88K8
5706H47k87k07p02l30j6Q6L60N91K43L01o9j96o54m17j93J18L6N90J74K55L20
5727H50n57k36k59o21k8K83O12M51M04j93Qn89n24l02k16K63O77N24L01n5k62
5748E31j13p87m4k79L86j5N70K96L32l33k62n55n67j66J35P75L26L57Q8p6k37
$$ plain form
5599 -668 -694 -196 -134 675 727 694 241 -117 -510 -789 -853 -394 -25 416 890 698 551 156 -504 -798 -954 -617
5621 -617 -4 167 691 874 570 5 -565 -947 -868 -554 -48 250 817 843 812 199 -433 -665 -896 -508 -69
5642 -69 164 555 824 484 147 -253 -533 -854 -802 -319 -34 729 808 624 552 -123 -423 -954 -670 -95 -47 599
5664 599 917 657 315 126 -650 -960 -476 -384 -43 528 955 675 621 176 -462 -813 -927 -611 18 521 769
5685 769 1036 407 119 -629 -719 -919 -602 -130 322 677 839 474 387 -213 -709 -670 -837 -444 331 819 847
5706 847 560 353 -349 -679 -695 -609 -249 342 585 886 817 621 -33 -450 -643 -525 -489 101 275 530 850
5727 850 293 57 -202 -823 -851 -568 44 495 899 706 714 125 -399 -701 -917 -654 23 547 848 793 531
5748 531 418 -369 -413 -692 -306 -321 249 545 877 544 282 -273 -840 -1006 -871 -96 230 587 675 599 362
5769C62n42n62l18L47M54L88N88J29l6m44n30l18l09r1L78P15K82M03q7k33l98
5790A78m83m24j03J51Q30M18K88Kl73l63o22l64j2J60M29O29M39k55J89l44p14
5811c44l52m5J78L03O00L46J07J83p34o95l74k44M08J26P10L78K5K32n50l66n48
5832f56l50M45J23L40L94M16j2k68p08R0n06j0K41K56Q75n6J94n11p4n99n15L15
5854e76J8M57N57M32k76J00n65p26j57J4J79J33P32M24L33m19l83n10l74q9n1
5875g47N03N68N35l7j62l06l96p71O7K29J4N53K87O22k23n33j80l91n76J43N73
5896b28P07K93j28K46m70m60l98n38K89N7M97Q68P2M6m44m25k28o58K85O9P84
5917B36J80O15k73Ro26n89k42J6j26N93P18K44j33k5m12l97j92n13N34O4M90L15
$$ plain form
5769 362 -180 -742 -1060 -713 -259 129 717 846 810 366 -164 -482 -791 -882 -504 211 493 896 809 576 178
5790 178 -305 -729 -832 -681 149 567 855 857 484 121 -501 -865 -877 -717 -288 341 780 525 714 370 -344
5811 -344 -696 -741 -563 -260 340 686 793 976 242 -453 -827 -1071 -663 -537 173 551 576 808 258 -108 -656
5832 -656 -1006 -561 -438 -98 296 712 700 432 -276 -186 -692 -702 -461 -205 670 614 808 297 223 -376 -891 -576
5854 -576 -558 -101 456 888 612 712 147 -579 -736 -722 -543 -410 322 746 1079 660 277 -233 -607 -696 -747
5875 -747 -244 324 859 822 660 354 -42 -813 -746 -517 -503 50 337 959 736 203 23 -368 -944 -801 -228
5896 -228 479 772 644 890 420 -40 -438 -976 -687 -630 -133 735 807 853 409 -16 -244 -902 -617 -548 236
5917 236 416 1031 758 767 141 -448 -690 -674 -800 -207 511 755 622 597 185 -212 -404 -917 -383 -319 171 486
5939D86K52j31m60j62m37l19J60L20L71N62J91k37j16m22m18l13q6J75P97J70
5959C83N62L6k23p96n50k83n6N02M42J52O01j00m3n61o05k87j8K1P11N16M83j32
5981G55j40j24o56m83j50K3N75M42M49%j00m88l84m04l64K86N22M53O71K25l85
6002G23l62l72l76k83R7J82O08L48K15J07n22n51m72k47J68J97M82O59K24j31
6022F94k39m66k78l90L9o7M92P83J88J34m56l99m91j22k99L09K00Q72J48l5K57
6043H74m35r99N4j91J53N42K41Q12j95j44m43n63m71r7P2M56M20O20K60o1o26
6064B79l40o09j95J27L16N04M32K38k7k46n75n24m45L13L56M44L52L21j15k52
6084C54k26p56k13J57p3O32M43%P23n00m83l27l37P9k11P12K69K66L92j31o76
$$ plain form
5939 486 738 607 147 -15 -452 -771 -611 -291 80 642 833 596 480 58 -360 -673 -759 -584 213 383
5959 383 945 981 758 -38 -588 -871 -927 -425 17 169 770 670 627 66 -539 -826 -844 -823 -112 404 887 755
5981 755 615 491 -165 -648 -798 -775 -200 242 691 691 591 103 -281 -685 -1049 -763 -241 212 883 1108 723
6002 723 361 -11 -387 -670 -573 -391 217 565 780 887 365 -186 -658 -905 -737 -540 -58 601 825 694
6022 694 455 -11 -289 -679 -640 -707 -215 568 756 890 434 35 -456 -578 -877 -568 -368 504 652 617 874
6043 874 439 -560 -506 -697 -544 -2 239 1051 856 712 269 -294 -765 -862 -790 -334 86 706 966 905 279
6064 279 -61 -670 -865 -738 -422 82 514 752 725 479 -96 -620 -1065 -752 -396 48 400 721 606 354
6084 354 128 -628 -841 -684 -757 -125 318 318 1041 541 58 -269 -606 -527 -738 -26 243 509 901 770 94
6105I4n55J3n01N09N8P55K38j0J33n44j54n77k02K20K41N87K19J5K01k29k11o21
6127c21o96J24M75M50M39M57j94j76n40q00m6M5O7O99M20M59m5k16m97l81l16
6148e93KR5J41M54O87j07l09k55n04m02r7L45M63K76O55R7l89l61j01o14k67K04
6170e80K05O70K51M3K55p88j19o44M4o8M53M60L73N88l70l58l31p85m9M2P3N06
6192a29N29L92k9k36o12l64r2oqM43N52J38Q3j69l03n06m37J47j69N34M66N58
6214G82M4j18p24j93m28j00K48J87M96N99lM9m63o91k89l2M4O6Q55K27K39J1n87
6237B19n51l7k02j22K69N41M15K36qk88m06l32n08J26K72K80K60N80m7l57l5m16
6259a11p26K34P9L66R1Q55l7j53k67n56k87j14M6M64M22M45j71P4l64o17q9m90
$$ plain form
6105 94 -461 -448 -949 -440 -382 373 611 601 734 190 36 -541 -743 -523 -282 305 524 539 740 511 300 -321
6127 -321 -1017 -893 -418 32 471 928 734 558 18 -782 -828 -783 -716 -17 403 862 817 601 104 -277 -593
6148 -593 -591 -496 -355 99 786 679 370 115 -389 -791 -888 -543 -80 196 851 948 559 198 97 -517 -784 -580
6170 -580 -375 295 546 589 844 56 -63 -707 -663 -731 -278 182 555 1143 773 415 84 -701 -750 -708 -635 -129
6192 -129 400 792 763 527 -85 -449 -541 -547 -555 -112 440 578 661 492 189 -317 -754 -607 -776 -242 224 782
6214 782 826 708 -16 -209 -637 -737 -489 -302 194 793 790 839 376 -315 -604 -636 -592 -526 329 556 795 806 219
6237 219 -332 -369 -571 -693 -424 117 532 768 760 472 66 -266 -774 -648 -376 -96 164 744 697 340 305 -111
6259 -111 -837 -603 -524 -158 -67 788 751 598 331 -225 -512 -626 -580 -116 306 751 580 654 290 -327 -416 -906
6281i06N49J2L62N28K86j86m39j99q48J29k13M42P71L09K35r4m47k95o73j23J12
6302f88K63N41L76K48P0l33n52p01J75j90K04M14K74N66o1p9o45j14Ko78M56J79
6324b73P93J63q3L8l33n10l38l00L16Q9O91J93K82k83m68j90k82P9j48K13N05
6345A54M58J00l0k26p03m26p7j85L32Q95L43J47p0k92n58l49j21qK02M09K07N17
6367G19N0k15n98l64j75k2k2O78J36O33k37q1j77m91n40k38M10N85K67L00R5k14
6389D99m06l38L5n71O8M87K98M92L19j94o34j12m60j95k1M42L19K80L94p8m99
6410A25Q4q05p2N3Q5L98M43M10l87K8n20k10k34J54J98J01N37N58k56l34l75k25
6432b44p66K10K72N71M23M80k5m41l25n89j18o9K0N48J86M52K01r0n36l79k71
$$ plain form
6281 -906 -357 -345 17 545 831 645 206 7 -841 -712 -925 -483 288 597 832 738 291 -4 -677 -800 -688
6302 -688 -425 116 492 740 810 477 -75 -776 -601 -791 -587 -173 101 667 606 527 -118 -232 -230 -908 -452 -273
6324 -273 520 683 600 638 305 -205 -543 -843 -527 -438 253 446 728 445 -23 -213 -495 -416 -564 -351 154
6345 154 612 712 682 456 -247 -673 -750 -935 -603 292 635 782 712 420 -138 -487 -608 -616 -414 -5 202 719
6367 719 769 554 -44 -408 -583 -605 -627 51 187 820 583 502 325 -166 -706 -944 -534 51 318 618 713 499
6389 499 93 -245 -210 -781 -713 -226 72 564 883 689 55 -57 -517 -712 -733 -291 28 308 702 624 125
6410 125 209 -596 -668 -615 -530 -132 311 721 334 362 -158 -368 -602 -448 -250 -149 388 946 690 356 -19 -244
6432 -244 -1010 -800 -528 43 466 946 921 480 155 -434 -552 -621 -601 -53 133 585 786 696 160 -219 -490
6453d90m4l8L77J79P12K8j32n04k78l02m21L15K39M62N54J14j14j62m93o69P4
6474e93o6K92O10J44J98Kn09p1m66j08m4J01O87K03K84J17l85k25o39k57M8j4
6496f91N31K66M17K44j16l57m84j38l43J81N13L36J98M79l40m71o09l0k04K1L86
6517b11N84K31R5J49n82l20k77l15M3L34L54P25k99K88k96o88l09k87M1L64M11
6538C5O03Lj92O9n11l66o5j82J34N29k7N65J17j98n09l16o05J25K32O74P6M71
6560F62Q1n79rk87l65R1j13J71P19K7QN0k10p03n2o5k6L51L67L81P0M1k17o44
6584b51k35p7k17M69O53J99p8J20m95k61R1o78L05K00L60K79P1L15m30l47k16
6605b23n14N9M89O9J43N67K44p15k21j58k07j61K0M50K97O60m5l21l32l12n13
$$ plain form
6453 -490 -534 -572 -195 -16 696 724 592 88 -190 -492 -913 -598 -359 103 657 771 657 495 2 -667 -593
6474 -593 -659 -367 243 387 585 587 78 7 -459 -567 -611 -510 177 380 664 781 396 171 -468 -725 -677 -691
6496 -691 -160 106 523 767 651 294 -190 -328 -671 -490 23 359 557 1036 696 225 -384 -414 -618 -597 -211
6517 -211 373 604 699 848 266 -54 -331 -646 -603 -269 85 810 511 799 503 -185 -494 -781 -740 -376 35
6538 35 638 641 449 518 7 -359 -424 -606 -472 57 30 595 712 514 5 -311 -916 -791 -559 115 191 662
6560 662 743 164 155 -132 -497 -406 -519 -348 371 398 406 456 246 -457 -509 -574 -600 -249 118 499 569 610 393 -251
6584 -251 -486 -563 -780 -311 342 541 463 583 88 -173 -82 -760 -455 -255 105 384 455 770 340 -7 -223
6605 -223 -737 -678 -189 -120 23 590 834 119 -102 -260 -467 -628 -608 -158 139 799 754 433 101 -211 -724
6626g24K13j47M18L90J67M63j00o50j93n52J11M2L16M16L06M73l35l10l63k81
6646c40l55J1M50K50M53N17m87j54k44m03k82J75k65N90N64K60j88j36n71O6o16
6667g05P3M3O86P2N58j17k03k46l55j25l32J91J97L63P30k1m86K75r09j50k23
6688f84J84J03M77K73J51J09j57n60k38j72O8M8K86M82K10N5k29m31m50j21L0
6709e66J66M16L26M67l63j4m91m43r7k21N45L80q7P45j04k62k65m22l30K16j80
6730e84K52N23L29L70l36j03p86j01M5j97P42J53O2K14l54o5k6n88m62N11M20
6751A9K62K34j3k50J3k49o99P6O3m5R04J24J47km09k2p43L61m97M68J41M40J97
6774E20M54m91m08j35n34O2L8l6P81N59j53m41j95k97k15m9J61K08P44J64k69
$$ plain form
6626 -724 -511 -658 -240 150 317 780 680 30 -163 -715 -604 -562 -246 170 476 949 614 304 -59 -340
6646 -340 -695 -684 -234 16 469 986 499 345 101 -302 -584 -409 -674 -84 480 740 552 416 -155 -89 -705
6667 -705 -632 -589 97 169 727 610 407 161 -194 -319 -651 -460 -263 100 830 809 323 598 -311 -461 -684
6688 -684 -500 -397 80 353 504 613 456 -104 -342 -514 -446 -398 -112 370 580 635 406 -25 -475 -596 -566
6709 -566 -400 16 342 809 446 432 -59 -502 -599 -820 -275 105 18 763 659 397 132 -290 -620 -404 -584
6730 -584 -332 191 520 890 554 451 -335 -436 -391 -588 154 307 369 583 229 164 138 -450 -912 -401 19
6751 19 281 515 502 252 265 16 -683 -607 -544 -589 315 439 586 584 175 153 -590 -229 -726 -258 -117 323 520
6774 520 974 483 75 -60 -594 -532 -494 -530 251 810 657 216 21 -276 -491 -540 -379 -171 573 737 468
6795D68M0k03n34l26m2J62Q9N09N39k74N7k38l94mm08J08K97M72K00l0J86k95
6817C79k65m93k74J3J71N70N73o7o1j61k91m31n2J37j15K62N39O2No1k29n02m38
6840g29N8K70J90O34J77q0j67l08l75n60M65n2L72Q7N46n8k6k54l58l88J44j23
6862e35L98N48p2K0p2k24q3l29l05j5L58K99K52M84j92m7n09k23m13K25K02M44
6884B11J40K12P6k73n97j41Q7m49N41K10N47j98K35Lm36k91l91j39L12J53K30
6905D2K77J20j17m46L3l84l87M63L98M6L73K56N1n59j82j67l75J82L01L5N83L34
6927H77o06k43k90j52l19K56J0N84O1J30L64j34p12p1k02J7j45M10P31J14n6n45
6949G9k07j58j81p4J35L45N48k23J88j19j60m07k42l38M58K48J84L36L36l48L5
$$ plain form
6795 468 508 305 -229 -555 -597 -435 -346 163 702 428 485 247 -147 -151 -559 -451 -154 318 518 488 674 379
6817 379 114 -379 -653 -640 -469 101 674 607 546 385 94 -337 -389 -252 -367 -105 434 496 501 440 211 -291 -729
6840 -729 -671 -401 -211 423 600 520 353 45 -330 -890 -425 -477 -105 -18 528 470 444 190 -168 -556 -412 -535
6862 -535 -137 411 339 359 287 63 -20 -349 -654 -669 -311 -12 240 724 532 485 -24 -247 -660 -435 -233 211
6884 211 351 563 639 366 -231 -372 -285 -734 -193 17 564 366 601 604 168 -123 -514 -653 -341 -188 42
6905 42 319 439 322 -124 -91 -475 -862 -399 -1 45 418 674 725 166 -16 -183 -558 -376 -75 -40 543 877
6927 877 271 28 -262 -414 -733 -477 -467 117 178 308 672 538 -174 -245 -447 -430 -575 -165 566 680 624 79
6949 79 -128 -286 -467 -541 -406 -61 487 264 452 333 173 -234 -476 -814 -356 -108 76 412 748 400 435
6970D35m49n07l3L81o1K65L31L85o5n52m14K29o93M37j34O98m7L33j23O7n70j77
6992b64n1k96K59N88K31K38J60k57n65l06j36m8L7J18N83J8L59o07K2m60o0O7
7014c70k57M32M00L28J39j86n71r2j92k44L33K68K62K74j54R8k00n75l94N0L63
7035b88k1N19K1M09j34k47l54k20k24j9M53K72M46o9j33k20k63m57J46j95L25
7056b53L19J60K16r0j11rn39m62L31Q5L96J90K20J63r1l97l65p5j54J00J05N24
7078B63J94J14j83l9m79m51P5J13N1M64M03o5O3m09j47k13k50J08K19M47K44k37
7100B85O08p85k14l81P7k11J97M38K30J58M7k66k95p7l36P7J21K86L36J32L8j83
7122B82l85j82j13k9j75N09M08L03ql19k00l30m1j83J28J30K51K44o2pj67m4m50
$$ plain form
6970 435 -14 -521 -554 -173 -234 31 362 747 682 130 -284 -55 -748 -311 -445 253 206 539 416 483 -87 -264
6992 -264 -315 -611 -352 236 467 705 865 608 43 -263 -399 -447 -410 -292 291 309 668 61 83 -377 -437 -370
7014 -370 -627 -195 205 533 672 486 -85 -177 -369 -613 -280 -12 250 524 370 468 268 -307 -701 -651 -288
7035 -288 -309 210 231 640 506 259 -95 -315 -539 -558 -105 167 613 544 411 191 -72 -529 -383 -578 -253
7056 -253 66 226 442 352 241 232 -307 -769 -438 -353 43 233 453 616 525 128 -237 -312 -466 -366 -261 263
7078 263 457 571 388 349 -130 -581 -506 -393 -342 122 525 460 523 114 -33 -246 -496 -388 -169 278 522 285
7100 285 893 108 -106 -487 -410 -621 -424 14 244 402 449 183 -112 -189 -525 -448 -327 -41 295 427 465 282
7122 282 -103 -285 -398 -427 -602 -93 315 618 610 291 91 -239 -280 -463 -335 -205 46 290 228 221 54 10 -440
7145d40k02lO16P5L17K34j79k34k24l67O6R9M1L68M68j39J75m26n36J08l50q6
7167f19M96k35P52N2r9j67p2l69J59l78J66K97L54J83o2J77m68k76l78l7Q1M20
7189b3L24L72m36L99m85m58m9k86J52L70P6M21O6j12q7j45m11j16K92j16N11j00
7211A59J20L01k06l78k27m5k30K11M92Q1K72q8k42j41k54k54J7J08L65L86O9j53
7233C63r7k14J80p30l5K22K93J25M22l2k80j03k92r8l52J94L38L97K80j01Q3m05
7255A58k18l03m4J58K6J74O51n2k07k39j66m59J92n9J23K27M91J9J64m99l19l03
7277d85p1R5K46K23J58J52K25m21j26k42k1j91nL60M15k17M53j72p4m14m15l9
7299e66L17j7M29K90J33k70l36j67q7k94K15J20L98J86K11l40J91n02l53J30m6
$$ plain form
7145 -440 -642 -645 -29 46 363 597 418 184 -40 -407 -341 -242 -201 167 635 496 671 245 -291 -183 -533 -619
7167 -619 -123 -358 394 446 347 180 108 -261 -102 -480 -314 -17 337 520 458 635 167 -109 -487 -524 -443 -23
7189 -23 301 673 237 636 151 -307 -356 -642 -490 -120 -44 377 443 331 244 99 -312 -428 -136 -252 259 159
7211 159 279 580 374 -4 -231 -276 -506 -295 197 278 550 462 220 79 -175 -429 -412 -304 61 447 516 363
7233 363 266 52 232 -498 -533 -311 -18 107 529 497 217 114 -178 -276 -628 -434 -96 301 581 480 563 158
7255 158 -60 -363 -407 -249 -223 -49 602 550 343 104 -62 -521 -329 -388 -265 -38 453 472 636 137 -182 -485
7277 -485 -556 -461 -215 8 166 318 543 122 -4 -246 -267 -458 -463 -103 312 95 548 376 302 -112 -527 -566
7299 -566 -249 -266 163 453 586 316 -20 -187 -274 -568 -353 -233 165 351 562 222 413 -89 -442 -312 -358
7320c58J01J50M49N9j04k7j05l14j54j47M7L06K75K21J11j90l63k23l12J44K41
7341a93n0L73K8L52k58j53k40j31k66M36J9L11K38N5j64l47j30l37P0K8K30M00
7363B71J22J7J16m17l90j88J3J68K94O5K88R9m2j91l33Om58J76O6M49J91Q7ml44
7387F1q0M9m20K1K36J31L85j19L1nn05L1l87J76J91K33K97M51l02p4l32j50k54
7410c35l36L25Q9M71J37p4J04k77k21l41L34l48M27K81K89M4m61J70m59j1l76
7431e68J84K04M41jK81k09k02l27J6j28j03K55M50K6K31k13k02l10k06k5K63k06
7453c49M37J86J98J39l35j91m52k1r9M23j08K62M40k36Q7r5j54l37k46Q1L67K65
7475B62j01J35j82K4p9n34K34l01P10o1r7M88k35N1j98n35l64M08K84K6M83P0
$$ plain form
7320 -358 -257 -107 342 401 297 270 165 -149 -303 -450 -403 -97 178 399 510 320 -43 -266 -578 -434 -193
7341 -193 -243 130 158 510 252 99 -141 -272 -538 -102 -83 228 466 521 357 10 -120 -457 -387 -359 -129 271
7363 271 393 410 526 109 -281 -469 -456 -288 6 71 359 458 416 225 -108 -102 -560 -384 -318 131 322 409 405 61
7387 61 -19 30 -390 -369 -133 -2 383 264 295 290 -215 -184 -571 -395 -204 29 326 777 475 401 69 -81 -335
7410 -335 -671 -346 -257 214 351 277 381 104 -117 -458 -124 -472 -45 236 525 569 108 278 -181 -192 -568
7431 -568 -384 -180 261 260 541 332 130 -197 -181 -309 -412 -157 293 319 550 337 135 -175 -381 -406 -143 -349
7453 -349 88 274 472 611 276 85 -367 -388 -487 -64 -172 90 530 294 381 286 132 -205 -451 -370 -3 262
7475 262 161 296 114 138 59 -475 -241 -542 168 107 10 498 263 314 116 -419 -783 -375 -91 -65 418 488
7497D88j25l48k90j17Oj08K63K05L35R2k9k53j14n09O8J22R8J41K85J29n4n1j54
7520H0m42m4J66J12N3K76K95J03j23m02l95k4p9J65J50J73K36R8l11l7j33L3k39
7543b89k2J20K19K67q2o8k55Q4j68j46P5O9J74L82P3k68J95k38l34q9l24M36Q0
7566a09M77O8l1J11p75M5k27J58P0J23N10n6j75j19q7k48k63M20r5J57KM95q7
7589C64k2k62k39M8k01r2N19r8J94L37k37l32pl46l0L63Q3ML45J1j2l75k41k26
7613d52L8n6J08N88J28rl32L55n30J58l05k6O6K05J23N07l07O9l21k95R8p2o6
7636c28J22N29K4q4K16l60k10l24j30M46J42R8N14j90n03J44k75j17r9J73L88
7657A76N9J00L24k22j10o05m9p4q6K38L25K94j59L07m8o58k90M2J37J36K63K20
$$ plain form
7497 488 363 15 -275 -392 -386 -494 -231 -26 309 401 372 119 5 -504 -436 -314 -216 -75 210 339 285 234 80
7520 80 -362 -406 -240 -128 -75 201 496 599 476 74 -321 -345 -424 -259 -109 64 300 398 87 50 -83 -50 -289
7543 -289 -311 -191 28 295 213 145 -110 -26 -194 -340 -265 -196 -22 360 433 165 360 122 -212 -301 -625 -189 -109
7566 -109 368 436 405 516 -259 -214 -441 -283 -213 -90 420 364 189 70 -17 -265 -528 -108 -203 -46 -44 451 364
7589 364 342 80 -159 -111 -312 -404 115 17 211 548 311 -21 -28 -374 -404 -41 42 46 391 402 390 15 -226 -452
7613 -452 -414 -470 -362 226 354 345 13 368 -162 -4 -309 -335 -269 -64 59 566 259 328 7 -288 -190 -262 -328
7636 -328 -206 323 347 263 479 119 -91 -415 -545 -99 43 141 655 465 -38 106 -169 -286 -385 -212 176
7657 176 235 335 659 437 327 -278 -327 -401 -487 -249 76 370 211 518 470 -188 -478 -436 -299 -163 100 320
7679C20j09K07Ml51j75k98o4K16L03L5L16O8k00n1l28m1j2k83M12L88M3J59j59
7702D00k90l30r8j62L10K72J00J24J81pn33j33n9q3j05K32N33N0Q0n10Jo3N4k64
7726c00O4j06M95p0L25Oj06j13o37J89j65M01J6j43M47M0j42j10k01j53m1n8M12
7749E0J18L16k48R6k60j92k30k04N76JR5J51J41k49k3m8j83q0l06N16m2K43J71
7772D09r5m18o9j53P7J97k74J78L34pK33j90j46k77j54LK13L13k12L52l2n9l46
7795a23Q7l77J21R8J62M21Mj72j53P8l05j87j72J88L07Q2L41j79N6j06L6n62J4
7818c41L56j04Q8K35K92j37m07K4n90N25l74K35M55K15k65K60j77m27l26N8k8
7839d33L89l8J92J57O1M4q25N96l22k2RQ6K83j10L26l14j3j61l53j0L45J00M37
$$ plain form
7679 320 211 418 422 71 -104 -402 -466 -250 53 88 404 472 272 221 -107 -148 -160 -443 -31 357 400 559 400
7702 400 110 -220 -318 -480 -170 102 202 326 507 500 -33 -166 -225 -308 -413 -181 352 402 482 -28 -27 -90 -36 -300
7726 -300 -236 -342 153 83 408 414 308 195 -442 -253 -418 -17 -1 -144 303 343 201 91 -110 -263 -304 -362 50
7749 50 168 484 236 332 72 -120 -350 -554 22 23 118 269 410 161 138 90 -93 -173 -479 37 -5 238 409
7772 409 314 -104 -173 -326 -249 -52 -326 -148 186 179 412 222 76 -201 -355 -352 -139 174 -38 314 282 223 -123
7795 -123 -36 -413 -292 -194 -32 389 393 221 68 146 -159 -346 -518 -330 -23 59 400 221 277 171 207 -355 -341
7818 -341 15 -89 -1 234 526 389 -18 6 -584 -59 -433 -198 257 472 207 467 290 -137 -463 -405 -433
7839 -433 -44 -82 110 267 328 372 -453 143 -179 -201 -192 -106 177 67 393 79 66 -95 -448 -458 -113 -13 424
7862D24j40J5k47P7j19l87J12J26R2N6J54L48k95j76l65J89J8j42J17K63J03K66
7884D89m7l95j09n9k2P6j42K12L75q8J17k45l15j26o0J21J30L63J16o9J22k57
7906A87J57o23J4j54O0L17J12L32j42j42q0j88j21p2R3K32L81k49K22k75kj44
7928h5k41J16L4J45M0L18r1k01O4l85J56ok54N24k40M05J01k61J13j99l24r3J60
7951b04N2J28J71K47j8k84k95j36J01j34J62L98K0P6J61k10j56k30j27j8k7O04
7973B81j38J92k81J55l05k44L5OK57J20J4J27L0j14j77k73k41M1K14J11o3P24
7995D71j17k65k69J57l68M0J26K1M14J9n5N1m5l20l04j24J96J52M63N1j29J26
8017B91j36j58n7m82J44L98K24k2O7j01j32Lj98r7n1K58J59K57k27qOk25q5j77
$$ plain form
7862 424 284 299 52 129 10 -377 -265 -139 -47 9 163 511 216 40 -325 -136 -118 -260 -143 120 223 489
7884 489 442 47 -62 -121 -143 -67 -209 3 378 290 407 162 -153 -279 -339 -218 -88 275 391 322 444 187
7906 187 344 -279 -265 -419 -359 -42 70 402 260 118 38 -150 -271 -343 -250 -18 363 114 336 61 59 -85
7928 -85 -326 -210 -176 -31 9 327 236 35 99 -286 -130 -136 -390 134 -106 299 400 139 252 53 -271 -364 -204
7951 -204 -152 -24 147 394 376 92 -203 -339 -238 -372 -210 188 208 284 445 235 79 -151 -278 -296 -323 281
7973 281 143 335 54 209 -96 -340 -305 -299 -42 78 92 219 249 135 -42 -315 -556 -515 -301 -190 -253 471
7995 471 354 89 -180 -23 -391 -351 -225 -204 210 229 174 225 180 -140 -444 -568 -372 -220 243 294 165 291
8017 291 155 -3 -60 -542 -398 0 224 202 269 168 36 39 -159 -256 -307 -49 110 367 140 132 138 -87 -172 -349
8041c49L3K13L54J84K0j35k7p3j98k18j16j3K58N1J48L25k05m71J2K00n7k29K45
8064d8M73j59O2r2j62j67l69R7J40K99O3Q9J94j42M1o47L83j93k23K90J01J37
8086A67R0M8k05j6k63k87M90Q2k87M06k0M02m01l52K6k9J20R0k99L36K9M21m73
8109G5l9l75j74L18J72L3M2K29j08J17ol34k19k18K87k00N52J50J64r5m7l66j85
8132b27K6j72L88K8L33J7K47p29l7O9l25J23k38K04O55o1N3l35J40l93j49K28
8154a55K48J7J22L26j19k86J03k21j27j93J3k4N05K6J47j49m08L0j38j13J98j4
8176b12L41K0K1j37K59k38l06J09J2P3J55J09N9J74m00
$$ plain form
8041 -349 -316 -103 251 435 455 320 293 220 22 -196 -312 -325 -67 -16 132 457 252 -219 -207 -7 -64 -293 -48
8064 -48 425 266 328 236 74 -93 -462 -365 -225 74 137 226 420 278 319 -328 55 -138 -361 -71 30 167
8086 167 257 305 100 84 -179 -466 24 106 -181 225 205 607 206 -146 -120 -149 -29 61 -238 98 127 548 75
8109 75 36 -339 -513 -195 -23 10 52 281 173 290 284 -50 -269 -487 -200 -400 152 302 466 371 324 -42 -227
8132 -227 -201 -373 15 43 376 393 640 -89 -126 -57 -382 -259 -497 -293 362 301 354 19 159 -234 -383 -155
8154 -155 93 110 232 558 439 153 256 35 -92 -285 -272 -296 209 235 382 233 -175 -145 -283 -396 -198 -212
8176 -212 129 149 170 33 292 54 -252 -143 -131 -58 97 206 265 439 39
8191C9
$$ Imaginary data points
##PAGE= N=2
##DATA TABLE= (X++(I..I)), XYDATA
0@%%%%%%%%%%%%%qJ6j6J6j7K5l2L4m2N1o0P3q5R8j14J33j53J73j99K27k57K90
35A53l26L68m14M63n17N75o39P11p87Q71r64J064j174J295j425J567j727J904
53I98k100K320k565K844l164L532l965M481n106N886o890Q238j0152J3107j8332
68a0868L0338j13725k2309J46318L310M7914N9889q792j19713p5283j8158m202
80h5281j6037M7278J04205Q0584k0930m8433k3055n0025j04720l2262P0079N9515
92a9082J3517N9407P6268j1003q2076n5381k7419l7102k2834M5999Q7896N2153
104H0343m380m750k049n9917r2381k7500L0957J6423K7346Q4252O8261j3524m9400
117E3681l4336m1233n5493k3880L5825O1767M2120K3599K7483k203p0091q1225
$$ plain form
0 0 0 0 0 0 0 0 0 0 0 0 0 0 0 -8 8 -8 8 -9 16 -16 18 -24 27 -33 40 -45 53 -61 72 -81 92 -107 120 -137 153
35 153 -173 195 -219 244 -273 302 -337 374 -413 458 -506 558 -616 679 -746 821 -906 998
53 998 -1102 1218 -1347 1497 -1667 1865 -2100 2381 -2725 3161 -3729 4509 -5643 7464 -10868
68 -10868 19470 -94255 -116564 29754 33064 80978 140867 132075 12362 -62921 -81079 -85281
80 -85281 -101318 -54040 50165 130749 109819 61386 38331 -11694 -116414 -148676 -78597 -19082
92 -19082 -5565 53842 130110 119107 37031 -18350 -45769 -82871 -105705 -59706 28190 80343
104 80343 75963 71213 69164 9247 -83134 -110634 -79677 -63254 -35908 48344 116605 103081 53681
117 53681 19345 -21888 -77381 -101261 -65436 -3669 38451 62050 89533 87330 17239 -63986
129f3986k1146M736l556M0453Q7343M8321j1728j4420j8123n7528o4336j6770
141i0740K7642L9441L9033M2200L1415j3520o0157n1860j8662j9366j3010M3138
153d4446P3195L4051M213J1387j6994o5469n6948r446J3217J6247L5220N0600
165D4827L1135j1095l6769l1953l1556l9704j3143M2218N6295K8813K1794K1885
177H2747j8649n8624m4975j3982o489L649L5642N4210L2663n301k1974k4637l9574
190b5294m6520q544L6444L7202K5117L6476K8628j8849m9211l6087k2906k1303
202f4847K50L7878N0467K9095K625q321j9215m3544m6354q641K3052K2976K8305
215C726M7216L0449j7970l8334k8501k9878l2187j469L5262M1216K5898J5969
$$ plain form
129 -63986 -85132 -80396 -83952 -43499 43844 92165 80437 66017 47894 -9634 -73970 -90740
141 -90740 -63098 -23657 15376 57576 88991 75471 15314 -36546 -55208 -74574 -87584 -44446
153 -44446 28749 62800 67013 78400 61406 -4063 -61011 -70457 -57240 -40993 -5773 44827
165 44827 75962 64867 28098 -3855 -35411 -75115 -88258 -46040 10255 39068 60862 82747
177 82747 64098 5474 -39501 -53483 -59972 -56323 -20681 33529 66192 60891 38917 14280 -25294
190 -25294 -71814 -80358 -43914 -6712 18405 54881 83509 64660 15449 -20638 -43544 -64847
202 -64847 -64597 -26719 23748 52843 55468 47147 27932 -15612 -61966 -70607 -47555 -24579 3726
215 3726 50942 81391 63421 25087 -3414 -33292 -65479 -66948 -31686 9530 35428 51397
227E1397N677j8689m5604m1740j2351P835J4961L3352M9726K7463j0892k4278
239C6857k4928l7995l7008l764K8204L3119K8165K6881J3193j8720m2184l6218
251c4398j6901o466Q054L5809M7913K6502k17j0900k3723m3250l9185p635J8627
264d5770K4314K9524L6165K0308j6012l5247l0281k3487k0350K248L6409M4168
276B1989K4355J0563L319k2124m7645l8435q919O220J3370L2598M3962K2206j2112
289D9347k4546k3501l1739l1202K6L3936L5061K3426K3308J3887k1812m6602l4358
302c4769j3355q023M799L5670M6494K2120m448j0324j9561l9497l6567k545K4917
315c5089K4903K5617L4352K0001j8588l9920k9171k1038k0578p47L5158M4093
$$ plain form
227 51397 57074 38385 -7219 -48959 -61310 -53475 -38514 -5162 44564 72027 61135 36857
239 36857 11929 -26066 -63074 -66838 -38634 -5515 22650 49531 62724 44004 1820 -34398
251 -34398 -51299 -57765 -49711 -13902 34011 60513 60296 49396 25673 -17577 -56762 -64397 -45770
264 -45770 -21456 8068 44233 64541 48529 13282 -16999 -40486 -60836 -58588 -22179 21989
276 21989 46344 56907 60226 38102 -9543 -47978 -56897 -50677 -37307 -4709 39253 61459 49347
289 49347 24801 1300 -30439 -61641 -61615 -27679 7382 30808 54116 68003 46191 -411 -34769
302 -34769 -48124 -56147 -51348 -15678 30816 52936 48488 38164 18603 -20894 -57461 -60006 -35089
315 -35089 -10186 15431 49783 69784 51196 11276 -17895 -38933 -59511 -60258 -25100 18993
327A8993K1809N797K320j6957m3419l7995m373J3293J4353K7823M2736K2929j5991
340E1318k9256k2472k8695l2133l049L4134L5830J9510J8580J4675j7675m4287
352c520l2309p571k163M632L1988M5929K1057r567j3993j7318l7654l7708k628
365f0825K6016K3093K0797L1841K0344j7060l7490k4816j4425j7342R5L4093M1766
378B6087J7202J709J055j7226m2687l6159k939J2644J2578K5701L9380K1006j4178
391D4173k6164j9550k2843k6463k081L1626L4199J6160J2744J1534j6617m3625
403f907l1286n219j624M233L0114M2129J7774p498j1470j5968l1342l0623k206
416d9893K3838K2995J7965K4480J6380j7556l7435k3201j1304j5114L93L2828
$$ plain form
327 18993 40802 46599 48919 31962 -11457 -49452 -53825 -40532 -26179 1644 44380 67309 51318
340 51318 22062 -410 -29105 -61238 -64287 -30153 5677 25187 43767 58442 40767 -3520
352 -3520 -35829 -43400 -45563 -40931 -8943 36986 58043 48476 34483 17165 -20489 -58197 -60825
365 -60825 -34809 -11716 9081 40922 61266 44206 6716 -18100 -32525 -49867 -49772 -15679 26087
378 26087 43289 44998 46053 28827 -13860 -50019 -52958 -40314 -27736 -2035 37345 58351 44173
391 44173 18009 -1541 -24384 -50847 -52928 -21302 12897 29057 41801 53335 36718 -6907
403 -6907 -38193 -43412 -45036 -40803 -10689 31440 49214 41716 30246 14278 -17064 -47687 -49893
416 -49893 -26055 -3060 14905 39385 55765 38209 774 -22427 -33731 -48845 -48452 -15624
428a5624L7859J5020L030J000j6732l7202k9027j673J3163J3080K1959L1899J5935
441E2687j6031k5836j6856k1825k4452K671L1354K8438J5387J4942O768j8839
453B8408l4241k4099o089M83O817K5297L5263J4630j1532j3855j4803l0026k6925
466e0672N581K4805J6949J7351K5702J0212j9348k8118j9716j4493q951N758K7627
479g313L2570J2406m726m516j2811l3885k7413M834J5434Q280K3316L4510R782
492E0468j9384k1556j5865k0850j6301O310K5826K5125J2130P173N253j5469l6954
505a4094k3972J788M445N763K8657L4337O969j3604j0422j4412k7110k1363L152
518c9866K1386K1493J5805J6342Q342j8312l4869j8719k367o357M346L0529L1731
$$ plain form
428 -15624 22235 37255 40285 41285 24553 -12649 -41676 -43349 -30186 -17106 4853 36752 52687
441 52687 36656 10820 -6036 -27861 -52313 -49642 -18288 10150 25537 40479 47247 28408
453 28408 -5833 -29932 -36021 -35538 -28721 -3424 31839 46469 34937 21082 6279 -23747 -50672
466 -50672 -45091 -20286 -3337 14014 39716 49928 30580 2462 -17254 -31747 -40698 -34940 -7313
479 -7313 25257 37663 32937 28421 15610 -18275 -45688 -40854 -25420 -17140 6176 40686 50468
492 50468 31084 9528 -6337 -27187 -43488 -37178 -11352 13773 25903 33076 38329 22860 -14094
505 -14094 -38066 -36278 -31833 -26070 2587 36924 43893 30289 19867 5455 -21655 -43018 -39866
518 -39866 -18480 3013 18818 35160 43502 25190 -9679 -28398 -30765 -37122 -32776 -2247 29484
531B9484P784j745m210k0039l1975k1018J459J6685J9496J7574J8823J0804j5722
544B7400k7925j5555j0384j6092L781L2101K8953R101O019j83k2426l0262j7172
557c2644k693N730J3403K0177K4438J3978j0550k2040j6070j8417j9847N738K9097
570i700K0617J0579J5363N342k0568k7332j7650j1505l905J2395K5607K6761J3139
583C9143n668j4114j5962k3997k0804L038J9027J5790J8807K4646O791j9493k4761
596B443j9999j7098o492J1027K3668K4475J3944J205m699j4756k8616k3283O54
609c7527J1833J2539K4407K6884M832j5514j6536j7665k1600j2123N724J8985
621a5761K3344J8533R033M68j5229l0151k2147p43L548O499K5207K8483O492o916
$$ plain form
531 29484 37268 35523 31313 11274 -20701 -41719 -40260 -23575 -4079 13495 32318 43122 27400
544 27400 -525 -16080 -26464 -42556 -38775 -6674 22279 31380 37399 37216 14790 -15472 -32644
557 -32644 -35337 -29607 -16204 3973 28411 42389 31839 9799 -6271 -24688 -44535 -38797 -9700
570 -9700 10917 21496 36859 42201 21633 -5699 -23349 -34854 -38759 -26364 -757 26004 39143
583 39143 33475 19361 3399 -20598 -41402 -38364 -19337 -3547 15260 39906 46697 27204 2443
596 2443 -17556 -34654 -41146 -30119 -6451 18024 31968 33173 28474 13718 -14898 -38181 -37527
609 -37527 -25694 -13155 11252 38136 42968 27454 10918 -6747 -28347 -40470 -34746 -15761
621 -15761 7583 26116 35149 35617 20388 -9763 -31910 -32653 -29105 -22606 2601 31084 37576 30660
635C0660p576j8520k8792j7177M559J5026K0125K0306J5128M255j3696k4667j8668
648a9037r324o951M295K6192K8109J0058O58l480k0098k9726j6467P92Q112J4625
662a2242K1507K0913Q378r808j9952j7728j6784j2960N047K5405K2782J0636Q791
675C3985J425j8828k7193j6725n991J91J1483K3346K4696J0590o604j3780j5690
688I05k0497j7878L674J9759J6432J3698J7785N649j8021k4784j5227j1623o892
701c7020R951K4142K2294J0660M13n990j4734k4113j8759J038J2530J1634J7829
714I875K2724N434j5602j7999j3486j6503j2404P528K1966J8925J1787R296K93
727C1834j6460k5375j6417j612K694Q553K1268K3299O068r639j0233j3921k1928
$$ plain form
635 30660 23084 4564 -24228 -41405 -36846 -21820 -1695 18611 33739 37994 24298 -369 -19037
648 -19037 -28361 -35312 -31017 -4825 23284 33342 34000 30520 10422 -19304 -35771 -34979 -26867 -12242
662 -12242 9265 30178 38556 28748 8796 -8932 -25716 -38676 -33629 -8224 14558 25194 33985
675 33985 35410 16582 -10611 -27336 -33327 -33136 -21653 1693 26389 36979 30375 16595 905
688 905 -19592 -37470 -33796 -14037 2395 16093 33878 39527 21506 -3278 -18505 -30128 -37020
701 -37020 -27069 -2927 19367 30027 30440 24450 9716 -14397 -33156 -32118 -19588 -7954 9875
714 9875 32599 38033 22431 4432 -9054 -25557 -37961 -30433 -8467 10458 22245 31541 31834
727 31834 15374 -10001 -26418 -28030 -25336 -16783 4485 27784 33852 24213 13980 59 -21869
740b1869j5374O004J7419J5418J3913J4880M059j5853k2248j3647o667n162O272
753b2855K2627K2230N643k707l692j4995k4958j4780M525J0812J0775J7049J9704
766B9378M591j3475j7022j1662j2831j0838O036K2235J7648O668N387R53j6202
779A0866k5121j3067J146K769P642K1468K1844L640r524j0073j1615j9286j3419
792c2730P377J7733J2707R989J2942K162j7711k2105j0374m601l573Q361K3349
805C526J9899L517m038m533j3937k2241j2472O343J2306R268J3924J6625J394
818B9581j6447j6529r447j0052p897Q722K2232J6308N173L129n64j5656k2779
831a4226j1089L106M476P008J8471J8456J378j1904j0881j0450j6302j0671R099
$$ plain form
740 -21869 -37243 -31239 -13820 1598 15511 30391 34450 18597 -3651 -17298 -23965 -29127 -22855
753 -22855 -228 22002 27645 24938 21246 6251 -18707 -33487 -28962 -18150 -7375 9674 29378
766 29378 33969 20494 3472 -8190 -21021 -31859 -25823 -3588 14060 20728 26115 27068 10866
779 10866 -14255 -27322 -26176 -23407 -15765 5703 27547 31187 21663 11590 -25 -19311 -32730
792 -32730 -25353 -7620 5087 15076 28018 30180 12469 -9636 -20010 -24611 -28184 -19823 3526
805 3526 23425 26942 22904 18371 4434 -17807 -30279 -23936 -11630 -2362 11562 28187 29581
818 29581 13134 -3395 -12842 -22894 -30791 -22069 163 16471 21644 24773 24209 8553 -14226
831 -14226 -25315 -22209 -17733 -10725 7746 26202 27580 15676 4795 -5655 -21957 -32628 -23529
844b3529J9573J2711Q893J0751P25j7666k1577r213k947k192Q354K1871J8010
857B3764J434o189o055j4144k0964r869Q694J3766J1211J4466J4427k75j6690
870A3576j7473r947r114n516R450K1574J5493L557K88l037j6405k1268q331M681
884b2472O718J0323J8477J5812j65j2285j1892j2000j4612p919Q878J7702J3130
897I695P933P281j148j6890j9868q806j041M52J0060K1462J6269J345n650p942
911A3152j5171j9710q343P135J2749J1336J3744J2383q42j5699j6606r393q060
924b3325m151J1290K1680J4653L844J015n318j7973k0065q218L132O981J0550
937e905J7132J5160k5j2433j1735j1111j4075o220J1498J8047J1560Q268P322
$$ plain form
844 -23529 -3956 8755 17648 28399 29124 11458 -10119 -19332 -22279 -24471 -16117 5754 23764
857 23764 25198 19009 12954 -1190 -22154 -32023 -23329 -9563 1648 16114 30541 30266 13576
870 13576 -3897 -13844 -22958 -28474 -19024 2550 18043 21600 21888 18851 2446 -18822 -27153 -22472
884 -22472 -15754 -5431 13046 28858 28693 16408 4516 -7484 -22096 -30015 -21137 -3435 9695
897 9695 17628 24909 23761 6871 -12997 -21803 -22844 -22392 -12332 9130 25399 26744 21094 13152
911 13152 -2019 -21729 -30072 -22937 -10188 1148 14892 27275 26433 10734 -5872 -15265 -23325
924 -23325 -27476 -16186 5494 20147 23991 25006 19688 1715 -18350 -26568 -23436 -16455 -5905
937 -5905 11227 26387 26362 13929 2194 -8917 -22992 -29212 -17714 333 11893 20161 27483
950B7483m556j7129j7897r330l011K210J0435J9172J5703J632p435p812j2678
963c213j7339p638R437J2338R555J3653J2121l182j5883j4991j0957q432j674
976b6205J0815J7998J4516M589j018m548j3631j9232q627M927P758R361J7429
989A4132J3607k929j2332j0912j1570j3094m028Q926J5066J3225Q796M812l051
1002B0648j4951j8785p122O61J990R269J8688J2691j064n095p505j4563j6100
1015b1238n521O089J2744J2610J1185P859j470j3668j4851p586m657l510R232
1028a2782J8748J1953K212K87o684j6610j5410m693K823P717J1526J2443R973
1041B1503J437j0096j3354q743r266n988R662J8027R844M031M462m526j6216j3998
$$ plain form
950 27483 22927 5798 -12099 -21429 -24440 -22230 -11795 7377 23080 24712 17277 9465 -3213
963 -3213 -20552 -28190 -18753 -6415 3140 16793 28914 25732 9849 -5142 -16099 -24531 -26205
976 -26205 -15390 2608 17124 21713 20695 16147 2516 -16716 -25343 -20416 -12658 -3297 14132
989 14132 27739 24810 12478 1566 -10004 -23098 -27126 -18200 -3134 10091 18887 23699 20648
1002 20648 5697 -13088 -20210 -19549 -17559 -8290 10398 23089 22025 16930 9425 -5138 -21238
1015 -21238 -26759 -20670 -7926 4684 15869 23728 22258 8590 -6261 -13847 -18504 -22014 -12782
1028 -12782 5966 17919 20131 20418 13734 -2876 -18286 -22979 -20156 -12439 -913 11530 21503
1041 21503 22940 12844 -510 -9253 -18519 -24507 -14845 3182 13026 17057 21519 16993 777 -13221
1055a3221n737j724K845J1397J5648J1442K038p599j0492j0195j1703n864Q639
1068a4526J2300P558Q203R294l174j4946j2859p425n981J063J1675J5082J0474
1081A6738L275l618o329j0370j4188p250N562Q328P983J3145J0501m361j3044
1094F372r650q689q799j20R363J2645J0865O352J009m029j2174j6436o814M038
1108a6067N044P107J4591J0567l703q040o084j0686j2994j892Q281J1306J0956
1121H386Q594L933l955j2536j3784o101O3J41O841J6389J0339j476l191n416j3688
1136e461j4381j609P384P884R673J1234O339k484j0822j1692p706n934k228R030
1150a0773J6372R520J024p2m817j4423j3085k619K829M925J0271J3336Q902j346
$$ plain form
1055 -13221 -18958 -20682 -17837 -6440 9208 20650 22688 15089 4597 -5598 -17301 -23165 -14526
1068 -14526 -2226 5332 13535 22829 19655 4709 -8150 -15575 -21556 -20493 -8818 6264 16738
1081 16738 20013 16395 10066 -304 -14492 -21742 -16180 -7852 131 13276 23777 19416 6372
1094 6372 -3278 -11967 -20766 -20886 -11523 1122 11987 18339 19348 15319 3145 -13291 -20105 -16067
1108 -16067 -11023 -3916 10675 21242 17539 9499 3415 -7271 -20265 -22157 -13876 -2570 8386
1121 8386 16980 20913 16958 4422 -9362 -15463 -15400 -15259 -8418 7971 18310 16834 13643 8227 -5461
1136 -5461 -19842 -21451 -14067 -6183 3490 14724 21063 18579 7757 -3935 -11641 -17575 -19803 -10773
1150 -10773 5599 15119 16143 16071 11254 -3169 -16254 -18873 -16044 -11119 -848 12488 21390 20044
1164B0044r538j0600q970r252k525R093J3730P545M357M971m186j4819j1964m393
1178a6507j827L098J1583J4135Q710k27n778p812j0348j1653m613P425J0360P418
1192C964Q980Q402m785j3940r876n842n671N47J1414J3797P912L124k64o650j3157
1207b045j3230m519M332O144Q573J2704R122m743r513p634q848j0093p56J1098
1221i408J1932Q452O624L430o949j4100j2293m640J06K629R801J4497Q478k495
1235A6064n266o106j1955j2018n59Q730R178P886J0243N517n688j2491j0330o390
1249a3185n548L71J0653J4349P771O21k09n150j3830j2111j241M642M813R433
1263A379J2822O956m208j0047p782r306q741r14R922J2286P120N172K971n116
$$ plain form
1164 20044 10506 -94 -9064 -18316 -20841 -11748 1982 9527 13884 18855 14669 -150 -12114 -16507
1178 -16507 -18334 -15236 -3653 10482 19192 18965 13187 5375 -4973 -16626 -21239 -13814 -3454 3964
1192 3964 12944 21346 16561 2621 -7255 -13097 -18768 -18221 -6807 6990 14902 18026 17762 11112 -2045
1207 -2045 -15275 -19794 -15462 -9318 -745 11959 21081 16338 6825 -809 -9657 -19750 -20506 -9408
1221 -9408 2524 10976 17600 21030 14081 -19 -12312 -16952 -16846 -14217 -4416 10081 18559 16064
1235 16064 10798 4692 -7263 -19281 -19840 -11110 -1932 5954 16197 21714 16026 3535 -6795 -13185
1249 -13185 -18733 -18362 -7709 6640 14411 15032 14823 9673 -4157 -16268 -17509 -12867 -8054 1379
1263 1379 14201 21157 16949 6902 -880 -10186 -18927 -19841 -9919 2367 9487 14659 17630 12514
1277A2514j3813j0750l011J00K820J0291J3644O666k199n216o730j1630j0764
1290a8078j126P505Q598P682R292N282n683j1071q958n349m612J465J0911J2345
1304H203O130J210j039o696j2660j0854j483M022N141Q780J1613N829m084q582
1318E530p250p469p631Q63R778J0292O232M511J887o813j2591r577l065K23L641
1333a1439R706J2165N710k454m723o279r701q887L97P613P609O939P350L296o126
1348A1176j1206q009m619l430K085J0017J1857N350M59j354n591j1491q626r70
$$ plain form
1277 12514 -1299 -12049 -15060 -14960 -12140 -1849 11795 18461 16262 11046 4316 -7314 -18078
1290 -18078 -19204 -11699 -3101 4581 13873 19155 13472 2401 -6557 -11906 -16518 -15053 -4142 8203
1304 8203 14333 15543 14504 7808 -4852 -15706 -17189 -13167 -8026 754 12367 18196 14112 5530
1318 5530 -1720 -9189 -16820 -15957 -6179 4113 10345 14856 16743 9930 -2661 -12238 -15303 -15080 -11439
1333 -11439 -1733 10432 16142 13688 8965 2686 -7015 -15902 -15505 -7892 -283 6656 14006 17302 11176
1348 11176 -30 -8039 -12658 -16088 -14003 -3986 7871 13221 13680 12326 6735 -4756 -13382 -14352
$$ [...]
8191b78
##END NTUPLES=NMR FID
##END=
