##TITLE=1H_DE-26k
 DMSO-d6
 64 sc, 
 8.2.2024
##JCAMPDX= 6.0         $$ Bruker NMR JCAMP-DX V2.0
##DATA TYPE= NMR FID
##DATA CLASS= NTUPLES
##ORIGIN= UXNMR, Bruker Analytische Messtechnik GmbH
##OWNER= root
$$ XWIN-NMR		Version 3.5
$$ Thu Feb  8 16:15:56 2024 Russian Standard Time (UT+4h)  she@DPX200
##.OBSERVE FREQUENCY= 200.1313
##.OBSERVE NUCLEUS= ^1H
##.DELAY= (6, 6)
##.ACQUISITION MODE= SIMULTANEOUS
##.ACQUISITION SCHEME= undefined
##.AVERAGES= 64
##.DIGITISER RES= 18
##SPECTROMETER/DATA SYSTEM= spect
##.PULSE SEQUENCE= zg30
##.SOLVENT NAME= DMSO
##.SHIFT REFERENCE= (INTERNAL, DMSO, 0, 15.7039)
##AUDIT TRAIL= $$ (NUMBER, WHEN, WHO, WHERE, WHAT)
$$ ##TITLE= Audit trail, XWIN-NMR		Version 3.5
$$ ##JCAMPDX= 5.01
$$ ##ORIGIN= Bruker BioSpin GmbH
$$ ##OWNER= she
$$ F:/spectra/data/she/nmr/H-F/1/audita.txt
$$ ##AUDIT TRAIL=  $$ (NUMBER, WHEN, WHO, WHERE, WHAT)
(   1,<2024-02-08 16:15:09.09 +0400>,<she>,<DPX200>,
      <continue with go, POWCHK disabled, PULCHK disabled
       configuration hash MD5:
       00 E9 B6 7A A2 85 ED C7 34 08 36 98 17 FE 4E 26
       data hash MD5: 16K
       C1 B8 C0 D6 1A 94 A0 00 B0 D3 9F D0 2F CE CE 45>)
$$ ##END=
$$ 
$$ hash MD5
$$ D4 57 EA 19 34 22 FC 62 23 CC CD 72 90 D3 D0 C5
##$RELAX= 
##$RELAX= 
##$RELAX= 
##$RELAX= 
##$RELAX= 
##$RELAX= 
$$ Bruker specific parameters
$$ --------------------------
##$DU= <F:/spectra>
##$EXPNO= 1
##$NAME= <H-F>
##$PROCNO= 1
##$TYPE= <nmr>
##$USER= <she>
##$AMP= (0..31)
100 100 100 100 100 100 100 100 100 100 100 100 100 100 100 100 100 100 
100 100 100 100 100 100 100 100 100 100 100 100 100 100 
##$AQSEQ= 0
##$AQ_mod= 1
##$AUNM= <au_zg>
##$AUTOPOS= <>
##$BF1= 200.13
##$BF2= 200.13
##$BF3= 200.13
##$BF4= 200.13
##$BF5= 200.13
##$BF6= 200.13
##$BF7= 200.13
##$BF8= 200.13
##$BYTORDA= 1
##$CFDGTYP= 0
##$CFRGTYP= 5
##$CHEMSTR= <none>
##$CNST= (0..31)
1 1 145 1 1 1 1 1 1 1 1 1 1 1 1 1 1 1 1 1 1 1 1 1 1 1 1 1 1 1 1 1 
##$CPDPRG= <>
##$CPDPRG1= <>
##$CPDPRG2= <>
##$CPDPRG3= <>
##$CPDPRG4= <mlev>
##$CPDPRG5= <mlev>
##$CPDPRG6= <mlev>
##$CPDPRG7= <mlev>
##$CPDPRG8= <mlev>
##$CPDPRGB= <>
##$CPDPRGT= <>
##$D= (0..31)
0 1.2 0 0 0 0 0 0 0 0.06 0 0.03 0 0 0 0 0.0002 0 0 0 0 0 0 0 0 0 0 0 0 
0 0 0 
##$DATE= 1707394289
##$DBL= (0..7)
120 120 120 120 120 120 120 120 
##$DBP= (0..7)
150 150 150 150 150 150 150 150 
##$DBP07= 0
##$DBPNAM0= <>
##$DBPNAM1= <>
##$DBPNAM2= <>
##$DBPNAM3= <>
##$DBPNAM4= <>
##$DBPNAM5= <>
##$DBPNAM6= <>
##$DBPNAM7= <>
##$DBPOAL= (0..7)
0.5 0.5 0.5 0.5 0.5 0.5 0.5 0.5 
##$DBPOFFS= (0..7)
0 0 0 0 0 0 0 0 
##$DE= 6
##$DECBNUC= <off>
##$DECIM= 32
##$DECNUC= <off>
##$DECSTAT= 4
##$DIGMOD= 1
##$DIGTYP= 9
##$DL= (0..7)
0 120 120 120 120 120 120 120 
##$DP= (0..7)
150 150 150 150 150 150 150 150 
##$DP07= 0
##$DPNAME0= <>
##$DPNAME1= <>
##$DPNAME2= <>
##$DPNAME3= <>
##$DPNAME4= <>
##$DPNAME5= <>
##$DPNAME6= <>
##$DPNAME7= <>
##$DPOAL= (0..7)
0.5 0.5 0.5 0.5 0.5 0.5 0.5 0.5 
##$DPOFFS= (0..7)
0 0 0 0 0 0 0 0 
##$DQDMODE= 0
##$DR= 18
##$DS= 0
##$DSLIST= <SSSSSSSSSSSSSSS>
$$ [...]
##$SUBNAM2= <"">
##$SUBNAM3= <"">
##$SUBNAM4= <"">
##$SUBNAM5= <"">
##$SUBNAM6= <"">
##$SUBNAM7= <"">
##$SUBNAM8= <"">
##$SUBNAM9= <"">
##$SW= 18.0517328524113
##$SWIBOX= (0..15)
0 0 2 0 0 0 0 0 0 0 0 0 0 0 0 0 
##$SW_h= 3612.71676300578
##$TD= 16384
##$TD0= 1
##$TE= 0
##$TE2= 300
##$TE3= 300
##$TEG= 300
##$TL= (0..7)
0 120 120 120 120 120 120 120 
##$TP= (0..7)
150 150 150 150 150 150 150 150 
##$TP07= 0
##$TPNAME0= <>
##$TPNAME1= <>
##$TPNAME2= <>
##$TPNAME3= <>
##$TPNAME4= <>
##$TPNAME5= <>
##$TPNAME6= <>
##$TPNAME7= <>
##$TPOAL= (0..7)
0.5 0.5 0.5 0.5 0.5 0.5 0.5 0.5 
##$TPOFFS= (0..7)
0 0 0 0 0 0 0 0 
##$TUNHIN= 0
##$TUNHOUT= 0
##$TUNXOUT= 0
##$USERA1= <user>
##$USERA2= <user>
##$USERA3= <user>
##$USERA4= <user>
##$USERA5= <user>
##$V9= 5
##$VALIST= <valist>
##$VCLIST= <CCCCCCCCCCCCCCC>
##$VD= 0
##$VDLIST= <DDDDDDDDDDDDDDD>
##$VPLIST= <PPPPPPPPPPPPPPP>
##$VTLIST= <TTTTTTTTTTTTTTT>
##$WBST= 1024
##$WBSW= 4
##$XGAIN= (0..3)
0 0 0 0 
##$XL= 0
##$YL= 0
##$YMAX_a= 323365
##$YMIN_a= -386375
##$ZGOPTNS= <>
##$ZL1= 120
##$ZL2= 120
##$ZL3= 120
##$ZL4= 120
##$ABSF1= 10
##$ABSF2= 0
##$ABSG= 5
##$ABSL= 3
##$ALPHA= 0
##$AQORDER= 0
##$ASSFAC= 0
##$ASSFACI= 0
##$ASSFACX= 0
##$ASSWID= 0
##$AUNMP= <proc_1d>
##$AZFE= 0.1
##$AZFW= 0.1
##$BCFW= 1
##$BC_mod= 2
##$BYTORDP= 1
##$COROFFS= 0
##$CY= 11.3945322036743
##$DATMOD= 1
##$DC= 2
##$DFILT= <>
##$DTYPP= 0
##$F1P= 15.7292609196834
##$F2P= 12.9074282941183
##$FCOR= 0.5
##$FTSIZE= 0
##$FT_mod= 4
##$GAMMA= 1
##$GB= 0.15
##$INTBC= 1
##$INTSCL= 1
##$ISEN= 128
##$LB= 0.24
##$LEV0= 0
##$LPBIN= 0
##$MAXI= 10000
##$MC2= 0
##$MEAN= 0
##$ME_mod= 0
##$MI= 1.114404
##$NCOEF= 0
##$NC_proc= 0
##$NLEV= 6
##$NOISF1= 3.799351
##$NOISF2= 2.8
##$NSP= 1
##$NTH_PI= 0
##$NZP= 0
##$OFFSET= 15.70392
##$PC= 1
##$PHC0= -24594.53
##$PHC1= 20.45267
##$PH_mod= 1
##$PKNL= yes
##$PPARMOD= 0
##$PSCAL= 0
##$PSIGN= 0
##$REVERSE= no
##$SF= 200.130013532006
##$SI= 16384
##$SIGF1= 3
##$SIGF2= 2
##$SINO= 400
##$SIOLD= 16384
##$SREGLST= <1H.CDCl3>
##$SSB= 0
##$STSI= 0
##$STSR= 0
##$SW_p= 3612.71676300578
##$SYMM= 0
##$S_DEV= 0
##$TDeff= 0
##$TDoff= 0
##$TI= <>
##$TILT= no
##$TM1= 0
##$TM2= 0
##$TOPLEV= 0
##$USERP1= <user>
##$USERP2= <user>
##$USERP3= <user>
##$USERP4= <user>
##$USERP5= <user>
##$WDW= 1
##$XDIM= 8192
##$YMAX_p= 0
##$YMIN_p= 0
$$ End of Bruker specific parameters
$$ ---------------------------------
##NTUPLES= NMR FID
##VAR_NAME=  TIME,          FID/REAL,        FID/IMAG
##SYMBOL=    X,             R,               I
##VAR_TYPE=  INDEPENDENT,   DEPENDENT,       DEPENDENT
##VAR_FORM=  AFFN,          ASDF,            ASDF
##VAR_DIM=   8192,          8192,            8192
##UNITS=     SECONDS,       ARBITRARY UNITS, ARBITRARY UNITS
##FACTOR=    0.0002768,     1,               1
##FIRST=     0,             0,               0
##LAST=      2.2672688,     0,               0
##MIN=       0,             -386375,         0
##MAX=       2.2672688,     323365,          0
$$ Real data points
##PAGE= N=1
##DATA TABLE= (X++(R..R)), XYDATA
0 0 0 0 0 0 0 0 0 0 0 0 0 0 0 0 0 0 0 0 0 0 0 0 1 -2 18 -39 55 -59 60 -61 63 -65 78 -99 113 -124 134 -156 172
39 172 -190 213 -234 259 -285 313 -354 384 -427 470 -519 569 -627 694 -766 847 -940 1044
57 1044 -1169 1313 -1489 1696 -1964 2304 -2769 3424 -4431 6147 -9643 19557 -104773 -386375
71 -386375 -55590 323365 261304 24772 35418 203057 282482 133974 -54439 -11115 154139
82 154139 66606 -183623 -227334 -60785 19582 -87332 -206027 -140731 54546 102079 -71832
93 -71832 -162712 13729 191896 105664 -60511 -16863 176611 190734 8843 -73959 44096
104 44096 127278 19863 -138250 -148973 -11814 58439 -57446 -160741 -54488 92372 42631
115 42631 -84505 -71165 51775 113155 34308 -69939 -17943 132970 114144 -56523 -82777
126 -82777 61125 106170 -20634 -121914 -67578 55599 54601 -70797 -117946 6588 101461
137 101461 22156 -86185 -47422 69944 83774 -19794 -78135 11662 103121 45145 -63399
148 -63399 -44097 57174 74216 -30661 -104247 -37350 57239 20998 -82327 -66843 47292
159 47292 78651 -4757 -59178 -9676 74974 59351 -40202 -64081 31311 86336 6968 -64707
171 -64707 -20969 57741 43314 -45145 -81382 -6332 53735 -2319 -79915 -45550 46274 51642
183 51642 -24682 -51167 16940 73309 30562 -43926 -26587 51646 63372 -9022 -50465 160
195 160 59793 26209 -56326 -55754 16069 34955 -29933 -70656 -20232 42275 26776 -32196 -36051
208 -36051 32162 65427 7657 -48993 -11477 53482 37671 -21323 -33785 19206 53598 8737
220 8737 -50482 -30590 28843 21987 -42004 -57463 -302 39688 7304 -40708 -23227 38164
232 38164 44308 -13011 -38385 6903 48616 20295 -30345 -22278 26756 41763 -10142 -42830
244 -42830 -6898 35280 10549 -40984 -38830 13067 32714 -5562 -38558 -7349 38483 27096
256 27096 -22044 -25491 16467 37532 1013 -30512 -9642 35196 28764 -17916 -29474 10123
268 10123 29903 -1275 -40172 -24204 17834 20316 -15374 -30370 5195 35368 12163 -25078
280 -25078 -16981 22489 26655 -9267 -25940 2361 33475 15533 -21206 -18118 16288 21061 -12814
293 -12814 -33887 -10717 21857 9171 -23324 -21194 14004 27169 -1636 -23047 -2777 25047
305 25047 18451 -15988 -20983 10449 26225 3683 -22770 -7932 21403 18252 -17489 -24723 -653
318 -653 16147 -463 -25136 -12049 16415 19983 -6334 -19131 3610 23887 7554 -17940 -10557
331 -10557 14046 19974 -3458 -17804 2796 18882 8906 -17751 -16685 4904 13784 -5098 -19471
344 -19471 -5380 18003 11025 -11735 -13293 6576 17504 -2414 -16867 -6127 14086 14482 -7525
357 -7525 -12529 7391 16940 621 -14926 -7060 9666 9029 -9800 -15831 1851 13656 2772
370 2772 -10788 -6623 11419 12630 -4791 -13841 358 13312 4417 -10485 -8054 8302 13253
383 13253 -2825 -12874 -1579 10105 2294 -11779 -10644 5326 10332 -2605 -10114 -2010 9631
396 9631 7913 -6414 -9124 2616 11494 1583 -8083 -1214 9919 7615 -5488 -8123 114 7938
410 7938 -955 -11781 -7421 6625 7485 -5128 -8019 2277 9735 2205 -7239 -4893 6205 8266
424 8266 -2595 -8014 578 9958 4646 -5146 -6234 4598 6751 -4577 -9094 -3333 3871 2759
438 2759 -7208 -6027 5015 8323 1944 -5709 -1308 8565 5690 -3761 -3726 1710 7668 1840 -7390
453 -7390 -4655 2362 3077 -4043 -7382 -2372 3292 -150 -6640 -2306 4906 6641 -2323 -5972 2402
468 2402 7291 2318 -3857 -1479 3812 4523 385 -4057 424 5147 1054 -7048 -4339 1354 1862 -2822
484 -2822 -6477 -1727 4258 3689 -1811 -3102 2090 4876 489 -3720 -1012 4148 3831 -1157 -2844 1684
500 1684 4580 -306 -3118 -2418 1619 625 -4282 -4010 -38 1810 866 -1059 -612 2492 2922 -601 -2315
517 -2315 -761 2019 1810 -1506 1163 3215 2053 -2823 -1305 -1762 1120 1516 -3676 -3255 2581 3106
533 3106 -793 -2607 2041 2307 3397 -564 -1524 2260 2236 667 -1228 57 4090 2455 -1191 -1558
549 -1558 -1154 916 -588 -3570 -3328 796 927 -409 -1494 588 2247 1696 -1280 -729 1260 945 -118
566 -118 -288 1391 1760 -198 -1299 -1520 -1131 776 -1048 -1314 -1235 968 1617 1855 -510 331 1447 6
584 6 257 942 1907 161 -2008 1668 -58 1786 842 -1255 -232 702 1627 -1788 -1969 -1132 -492 -1263
602 -1263 -449 -1059 813 1575 914 -1221 1001 259 1100 -78 -115 86 1380 663 -1383 -1103 648 577
620 577 -1720 -1315 -737 790 -1049 1204 364 -936 1813 1663 -1369 215 347 -491 -1156 1287 466
637 466 929 -153 -3332 -233 1204 -415 -2200 -1219 -9 343 -1595 1259 821 -30 664 1719 -317
654 -317 1598 700 2332 206 943 728 512 -598 -1845 -197 -1699 699 -703 1036 -1904 -736
670 -736 -1971 -367 831 -927 -318 412 -37 -1252 669 2031 -688 152 319 780 300 -1121 -754
687 -754 -1076 -731 791 -983 1098 -1033 815 -602 878 1049 2392 -413 -534 1011 -2205 1259
703 1259 854 -605 234 -319 229 -642 -445 -201 240 -520 282 -344 -721 -241 1317 -312 -240 -887 231
722 231 282 1191 460 -195 328 -102 -121 -460 -1222 -1073 169 -1321 499 -1418 -1035 -286 483 -46 -590 200
742 200 -745 2478 -392 344 346 -852 -946 1000 -635 -195 269 909 -170 -561 -383 -1958 -1691 -1507 -2068
761 -2068 -2555 311 613 -75 1103 -1479 455 2384 -597 -456 -384 -153 -1359 -447 -805 -2242 -679
778 -679 172 -441 -436 -481 715 -368 -810 -803 -891 1207 317 2458 -1131 -922 99 -339 -198 -994 -2225 729
798 729 1134 -863 -926 -535 -1582 748 -2240 242 -626 -817 82 384 -157 -684 1155 424 1539 -354
816 -354 -579 -548 -405 -39 949 -902 -1283 -717 472 -779 -424 68 383 -391 467 -241 -267 -447 1091 -253
836 -253 960 -369 -1576 762 -776 -386 52 -646 231 -1179 -219 -1664 796 1420 -5 -1902 84
853 84 -809 -235 -114 711 -402 837 705 160 685 940 1474 3 -692 -1653 -713 129 891 659 -1423
872 -1423 615 -1176 135 -779 324 -1265 1097 617 -287 152 -501 -223 134 332 78 -470 8 -910
890 -910 1171 858 1283 -1891 -32 850 -496 903 366 815 561 -1236 -1025 463 304 -1517 871
907 871 -20 172 1406 751 759 -630 -2205 -655 7 -485 201 -1560 648 2019 -1473 -229 209 -826
925 -826 -1168 747 -59 -996 -605 -967 1871 -59 -806 657 343 420 -407 -634 299 395 140 115 1404 303
945 303 175 2074 -1096 616 340 135 794 -812 -454 -269 227 -934 -118 485 290 -73 779 -541
963 -541 336 -465 -505 -153 -215 -54 -297 592 550 -814 587 -415 422 -1109 -747 970 -585 408 2013
982 2013 -1228 659 -996 -1065 456 149 -306 1317 -1123 -1090 841 -770 -2155 543 377 333 -193 939
1000 939 216 -64 -759 -1474 967 1762 -77 134 -217 -37 565 252 209 -386 54 -250 -648 -455 617
1019 617 1235 -250 -283 76 165 -599 -1496 -1303 406 -1081 -387 436 405 -253 -817 353 485 34 -1079
1038 -1079 853 562 -212 -771 -207 -1048 652 -247 -365 -342 511 1157 1756 208 -498 1435 281 -107
1056 -107 -289 -1287 -214 -353 439 135 -1412 812 572 645 921 -561 -793 -134 957 1050 -638 211 -179
1075 -179 -99 -3088 -1021 -1171 437 -2024 566 631 -2441 -578 722 -143 -1420 -648 248 -68 -75 482
1093 482 143 813 -143 62 220 -1418 1563 -489 -586 357 373 424 1905 319 522 -45 295 -352 -686
1112 -686 -635 -2141 -1239 -1702 232 -529 -8 -428 -21 -1313 -581 -2124 115 -514 -791 994 841 45
1130 45 -456 81 -672 -1788 -898 1010 702 2208 -1772 -1197 298 680 -517 -1061 853 -312 -1712
1147 -1712 -1185 -146 -557 -591 906 1697 271 -1201 -500 184 -852 361 -1660 -651 -1101 236 -1163
1164 -1163 -304 42 443 -395 1246 461 1666 1875 -731 1339 -1996 294 709 -275 -362 -1887 955
1181 955 -571 32 -1621 -889 -334 -1108 -649 -129 -874 -157 -121 2382 -2608 331 -1003 975 -629 457
1199 457 -437 634 -41 -258 -507 -1229 2748 -632 -319 -138 176 25 665 -1037 -1311 367 111 422
1217 422 1559 4003 299 743 -599 -1328 -1529 385 598 361 -1780 317 -546 -624 792 -1248 -1311 -218
1235 -218 -1065 2165 800 1014 1685 1017 848 -517 75 239 518 170 859 -501 1609 226 643 852
1253 852 -215 -1297 235 -663 314 369 -130 -1299 -289 -29 -790 -377 -334 1682 2289 -271 2207 -243
1271 -243 2315 883 -760 2601 932 -1041 -1063 1771 -625 790 -592 763 1939 -1172 -1059 -308
1287 -308 -511 1395 -74 25 -91 612 -855 -232 -399 -693 -597 -1515 482 814 244 1531 -467 1383
1305 1383 -27 -395 -52 -1689 -1349 1271 322 709 125 316 -767 931 -555 516 416 -328 -911
1322 -911 15 -5 -97 -465 -1004 1593 60 51 -427 408 -915 650 1455 -638 1229 -681 -87 -44 418
1341 418 21 427 122 -338 -287 -1658 338 -449 -67 1983 -146 6 1349 256 900 886 -239 561
1359 561 -1251 -664 1394 1612 2402 886 43 1048 324 -1286 -763 -125 -47 666 -186 -375 478 -1319
1377 -1319 924 735 -164 791 16 -377 -849 -295 1352 -998 975 -1755 -689 -537 -1023 19 -148
1394 -148 1086 1375 852 -877 627 -125 -661 1441 -579 607 128 1971 -653 -147 2070 1026 -145
1411 -145 -628 1801 1106 -118 1530 1698 -719 -358 -1140 1313 554 -783 796 802 1017 -913 202 1765
1429 1765 -76 -380 -1106 -228 -1016 293 -97 -1735 -545 917 747 -555 1320 945 614 1044 913
1446 913 1133 -1414 378 503 918 -299 137 -790 769 -1286 -84 28 319 1243 2037 -667 -1109 -452
1464 -452 -1433 -845 -297 -1426 181 1621 -439 -1513 -1064 127 -1344 3137 1962 584 -26 -1198
1480 -1198 -456 -1213 -249 1327 329 930 -1736 -421 -482 79 1258 382 565 1767 142 -1266 -1222 1000
1498 1000 613 -129 1243 -298 1426 266 -1913 -897 -884 -445 31 404 -1298 86 359 -915 1363
1515 1363 -2424 862 1308 -1345 94 2060 170 1001 -753 -553 760 -458 1495 1993 2684 1009
1531 1009 -205 362 -1991 -612 436 -204 43 915 1787 -713 -1078 1180 -107 860 1895 1058 845
1548 845 -301 135 158 -606 1132 -355 705 1982 678 237 -1558 -362 -2078 385 -604 -279 1161
1565 1161 -1322 164 49 -39 -1228 803 -197 71 2104 1895 301 -2825 -105 1376 188 73
1581 73 -1858 738 587 1498 531 169 1949 495 -3555 -228 -2112 779 229 -559 -1663 -31 -197
1598 -197 7 -90 -1105 1112 -657 -420 -545 362 -1020 -1558 370 2554 682 -436 478 1284 -636
1615 -636 452 -1242 380 707 -42 258 246 -221 662 1090 393 -1014 -139 1063 -299 632 -1980 -352
1633 -352 -1496 136 264 -128 -1044 293 -792 -2773 1172 -98 1567 -830 -619 1025 -1491 1547
1649 1547 -2 1790 1954 581 -78 -565 1234 909 -730 -491 -622 -817 2769 1232 1050 -580 -2834
1666 -2834 1149 1159 945 3128 -271 -405 -431 -515 307 2456 -1865 -633 -963 203 -1183 1711 28
1683 28 956 565 -455 2975 97 -498 -1310 -169 173 763 684 485 547 -863 -294 664 -406 -1515 1307
1702 1307 -320 -1256 -737 -474 -1020 690 1177 -215 -1568 1011 -482 1889 14 -1505 95 775
1718 775 626 1385 -1764 -444 1071 2911 1850 -1093 -510 -1305 -2916 -586 184 312 -643 -321 1418
1735 1418 644 1915 -2003 1863 -1129 -1586 275 477 -1029 1558 -1059 552 21 1405 1564 -534
1751 -534 1549 -1148 -559 -1643 -17 -1688 -458 -237 -424 -26 -144 1055 -1138 -362 530 -416 15
1768 15 1837 892 -47 968 -1642 -184 -154 -805 175 -597 783 894 -704 -951 -386 1844 -113 364
1786 364 -1294 75 -898 1201 957 253 990 326 701 -38 1289 -927 -290 -930 201 938 516 303
1804 303 769 -113 -483 259 -32 1791 -973 -1214 -1190 -280 -297 -441 -184 -233 -447 363 436 1009 -775 338
1824 338 717 2020 180 -333 -1022 -1100 1662 14 -1083 195 230 610 -563 -98 -297 -756 878 -958
1842 -958 954 1024 1551 -381 1128 -245 -363 -20 -429 171 -772 888 -181 -1436 2037 1066 651 280
1860 280 667 1164 -930 -36 424 77 19 1129 -1048 -466 645 -76 1032 -260 -1812 -260 766
1877 766 -554 87 -68 176 -393 -1298 393 164 -1522 543 -1100 -84 1327 -1761 851 1711 531
1894 531 172 134 -842 185 55 -1082 -404 888 39 -564 641 372 396 -875 186 -758 -880 199
1912 199 -500 -1987 545 121 -1328 -859 -84 279 -325 -891 401 -901 5 350 -1504 543 464 678
1930 678 -262 259 1921 -265 316 391 483 867 -354 -291 -159 474 1316 15 -1099 -923 -273 -13 619
1949 619 -685 -288 -484 -32 -2070 1043 132 69 -197 983 -43 -301 -1221 -1004 -470 -790 -348 506 -975
1968 -975 -736 278 1477 672 -989 -1226 -630 -498 1819 1441 1095 -961 -144 -802 -551 46 938 820
1986 820 1040 -177 1163 1460 -2024 -1339 -630 1336 -7 -1217 -505 900 -1598 -750 722 -1304 1876
2003 1876 487 1041 -1787 1380 1253 -257 1218 -78 -15 -1105 -76 551 -635 -304 -1436 -38
2019 -38 1990 -443 -330 -104 562 -1390 -624 387 -233 -731 -424 17 -344 154 -165 -326 -459 372 -114
2038 -114 7 31 -633 334 1296 298 -12 -1073 -108 291 64 486 582 282 -349 -1260 114 -41 -269 584
2058 584 -85 715 920 -648 901 149 -277 52 200 -415 -852 513 187 48 1000 -985 130 -443
2076 -443 -147 712 -163 1328 -108 -636 1562 387 -99 1992 123 256 -613 133 148 -482 848 -469
2094 -469 -91 555 -442 1285 1102 -78 773 -705 848 324 819 -1838 -557 -389 -746 -835 -669 -145
2112 -145 331 167 1045 -16 -391 499 553 408 561 857 722 258 -785 -1170 -714 -443 478 -197 -241 524
2132 524 238 1229 -1379 654 1793 -2102 -355 2379 516 -244 -632 -974 5 -28 418 1044 -305 562
2150 562 1598 852 1031 -179 3189 1166 -705 150 -258 -625 1306 993 70 -93 -1428 814 -1064
2167 -1064 767 -262 -344 -48 -1684 182 39 343 57 694 -424 256 -1061 1102 1451 107 -797
2184 -797 -1175 550 -1427 -616 1165 -97 1604 -242 -197 8 -452 -547 661 -513 -164 -313 257 -381
2202 -381 -141 958 -1105 -112 -989 -215 -25 103 -1962 786 -365 -566 493 -802 -314 251 577 -36
2220 -36 -936 1092 1011 26 96 835 -1533 -625 300 1613 614 233 682 -759 713 -290 -157 -707 -1230
2239 -1230 502 1265 1092 1717 -72 -944 269 806 -784 -1267 -1230 477 -189 -580 183 95 -1396 625
2257 625 813 -1758 -467 1165 1040 1060 973 661 -1160 967 308 -1030 1007 324 -700 -110 1236 -153
2275 -153 -498 -665 -216 -792 712 468 209 -1641 1306 1087 962 548 36 634 -125 -111 473 402 -454 -1981
2295 -1981 909 101 -1594 1309 -11 14 719 -80 2042 -1021 -58 -105 254 1385 -636 -245 213 -1244
2313 -1244 1343 743 866 -207 1013 -1901 605 -60 472 -564 886 -68 -680 294 177 -591 397
2330 397 -496 -846 -1773 -1626 -1303 -592 -221 807 136 111 1809 1440 1910 -705 -981 793 -1201 1642
2348 1642 1144 2952 -280 -1148 1221 -935 1403 -879 497 796 1081 538 205 -98 -136 1786 734
2365 734 -855 -84 860 28 -115 1541 341 2064 -1005 234 -506 -1147 -468 -1297 361 -869 996
2382 996 -268 1856 828 1396 300 600 1993 232 -318 -1002 612 -1212 1494 -14 22 1343 315
2399 315 -788 -126 190 -33 -1054 -806 1761 500 -379 -110 337 791 1042 -592 256 2585 -408 844
2417 844 -263 435 256 11 568 -28 -111 2916 -852 733 1268 723 -1044 1760 542 -1390 -859 1650
2435 1650 1583 -31 1267 235 912 471 660 -534 -161 -462 1157 643 489 816 1578 -883 -554 375
2453 375 -110 1049 1904 180 1247 -670 947 -705 982 -318 189 823 2033 900 -800 292
2469 292 -226 1308 -574 372 193 436 1536 -329 -1496 75 1432 822 -847 -574 -763 0 635
2486 635 946 955 -33 1074 87 1264 1558 1245 1980 575 66 -251 -497 -1081 -3084 -439 378 614 1828
2505 1828 228 -301 -38 -1108 1078 2024 -7 181 931 -860 -24 -799 846 -290 -78 -279 -156
2522 -156 -141 -247 -320 -1051 -537 -84 974 -823 755 -1045 -1492 -396 -237 536 1353 -466 683 265
2540 265 1288 -365 -446 30 -202 -406 2337 1051 -523 143 -640 1230 -625 236 -1373 -158 46
2557 46 286 59 133 1236 -401 394 -717 -1732 297 473 1398 418 66 315 -852 -587 -270 -931 474
2576 474 -759 -2229 -1395 -1502 2008 -468 -201 192 -1246 -777 -1312 -65 -169 544 614 -252 -1241 -697
2594 -697 -2048 545 933 717 -2415 -947 -422 1106 826 289 -132 -699 -291 -495 654 -850 -2308
2611 -2308 -2809 -870 933 439 638 -765 663 -333 329 522 991 865 1020 1144 -999 343 807 -67
2629 -67 -140 99 191 201 -157 216 -899 -561 -1457 2616 -302 -372 233 644 -61 187 308 -414 -2041 1144
2649 1144 1708 -458 478 727 329 -219 567 308 -67 300 -216 -648 -1571 748 744 691 -1428 772 -52
2668 -52 -862 21 -417 348 -1683 644 -13 -73 -1362 1347 -896 -324 195 -2535 60 -155 -267 1815
2686 1815 -1292 -256 -168 -143 -174 -102 148 249 253 349 1040 77 -12 -649 1703 700 -74 392 565 -493 -216
2707 -216 932 -171 -637 -298 -1179 -32 -346 -1529 107 566 -1757 -754 241 258 -954 2265 -455
2724 -455 -429 -659 443 -1347 -151 -286 553 32 -279 1155 -520 -565 -294 -1627 -677 1507 -667 -65
2742 -65 -775 481 -875 1000 399 220 958 1737 -1195 -156 -1668 791 -226 -43 -626 -900 720
2759 720 -585 672 163 -42 855 189 -710 -721 -472 105 105 758 -260 -834 863 1038 -92 2361 -247
2778 -247 558 586 63 76 -524 -11 -378 9 -833 -282 23 -603 -103 -1101 -738 495 -149 -502 118 -805
2798 -805 -44 -193 -401 934 -240 625 -640 -1109 329 1603 85 -380 -75 -901 122 -958 -733
2815 -733 -275 -696 -487 -931 727 -98 -670 -90 405 -336 272 302 -902 -499 -1261 65 454 801 -984
2834 -984 -695 -1003 -284 -1044 -1144 544 -604 -298 -143 -189 -105 317 100 715 -435 -721 421 -1587 1180
2853 1180 608 -639 -589 1228 3028 915 -187 -692 -160 -110 -124 1344 384 58 1106 333 232 575
2871 575 431 51 607 -387 977 -719 69 944 579 666 784 559 100 -221 -356 -823 -675 -986 115
2890 115 -127 214 799 -355 -732 -234 -463 507 334 -1692 -321 307 433 -1265 -45 636 -1059 -742
2908 -742 134 -634 -597 57 682 -1603 786 218 1028 115 -388 -378 -814 -404 1052 -412 1496 599 -298
2927 -298 -560 -536 -513 -589 -603 -255 -985 1932 72 -155 -704 168 898 1033 1209 109 986 41 204 -83
2947 -83 489 327 -29 826 -1456 -857 398 -570 925 -1472 814 199 -923 -349 627 -37 1501 -543
2965 -543 645 707 1064 12 -609 -485 -485 77 1227 -30 338 -661 -98 307 1197 1422 -324 117 -540
2984 -540 -782 -287 854 -229 -971 -229 -1436 3 1278 -1108 1381 -560 -180 332 210 51 1861
3001 1861 941 600 812 1128 1784 1397 -1365 659 723 -244 -528 701 559 -1062 -735 417 -140 293
3019 293 531 440 -58 231 -301 291 94 1720 795 -692 -476 249 -441 243 -255 -1180 536 -194 1235
3038 1235 -915 -1692 389 -164 1250 381 1506 534 -173 51 -54 244 103 -520 -150 432 -295 711
3056 711 -997 -468 41 -1349 -61 722 -1119 967 115 -1332 732 287 417 572 -96 -1136 1109
3073 1109 -645 266 219 -1766 341 -199 -799 612 -1077 -340 598 -944 -409 157 -301 -118 -1054 490
3091 490 -358 -138 -525 -220 -168 1192 479 991 573 -266 -23 360 -384 149 -316 -128 -522 -619 -548 -169 -885
3112 -885 208 1492 -322 496 -714 25 221 503 409 -169 179 792 49 -1055 81 359 -836 747
3130 747 -146 126 -12 -1031 -278 -143 312 733 -153 650 -724 1240 953 -561 303 1037 -636 292
3148 292 611 454 437 81 537 39 -384 1174 -57 -683 1345 -829 -113 -321 -499 -368 311 -813 550
3167 550 -8 382 723 431 -1379 -1017 683 1035 456 -1008 -81 -192 915 170 -429 1078 507 889
3185 889 287 -931 -803 -292 -69 1146 -286 -7 1686 1553 459 412 -1042 358 1002 149 -145 852
3203 852 -656 -375 384 -64 -94 977 326 -340 1849 2556 -144 -1291 1407 1048 880 -1171 1034 -1292
3221 -1292 -1218 545 -346 -652 266 -345 539 -1643 -209 651 22 951 -1383 -993 474 -126 1973 -536
3239 -536 -1280 907 1183 666 155 -391 -562 342 -268 795 991 -236 -1423 2041 -316 -124 491 867
3257 867 -692 653 1561 480 876 -161 296 91 -104 263 -461 -709 -375 -1918 950 78 1094 900
3275 900 683 1675 128 471 341 -996 619 1571 -429 -1516 240 739 -1270 438 -506 -628 940
3292 940 3 207 163 342 -46 40 -692 297 -776 -139 536 251 559 974 2138 49 705 -1353 128
3311 128 -593 -413 241 798 -394 616 204 -717 -812 -1386 1508 1051 1126 811 1269 2071 775 22 1126
3330 1126 157 -783 1433 -863 -293 -547 -878 1205 671 704 342 899 -498 -1403 91 -1311 -138 239
3348 239 1598 -156 -56 -190 -530 -328 -864 -1542 -196 -731 -177 600 -40 -79 826 1466 -732 1239 -431
3367 -431 706 931 -863 -508 975 -749 -289 -757 252 516 -1593 362 -489 -694 -1168 -287 -984 310
3385 310 1056 897 684 -773 367 156 -192 1295 959 -1001 118 1429 -437 -735 198 -63 -1000 1257
3403 1257 1847 -190 196 83 -238 -196 464 -525 615 214 587 -201 -1433 -27 -28 -541 -86 -514 -172
3422 -172 361 20 623 563 635 -424 -151 1344 586 299 -844 -424 -737 674 470 24 -345 580 796
3441 796 -26 -488 -570 -224 1371 -221 312 1199 640 -672 477 -41 61 -92 275 -592 1299 -157
3459 -157 100 1510 1241 231 401 -1396 655 105 1002 -1077 942 -180 -115 1348 521 851 747 -552
3477 -552 838 363 -708 907 448 -853 66 -163 -799 456 -605 873 -16 -677 -27 -218 -52 989
3495 989 -415 31 1285 -1644 1071 -38 353 -370 -922 -865 1711 629 1193 -857 1781 224 651
3512 651 -828 390 58 -254 1670 -1529 628 -311 -63 -834 358 -27 -1837 -1304 1189 -421 -577
3529 -577 -882 -32 -304 -564 -1442 -1767 1116 18 570 802 -738 2077 -26 -823 49 -1225 1712 -912
3547 -912 -1260 -978 -190 -780 -332 689 -124 310 -699 -117 880 274 -851 1004 171 -1103 163 -784
3565 -784 274 49 -500 580 -458 -859 96 269 1206 871 3 -1087 -497 -654 1527 683 315 -1105
3583 -1105 1761 328 1890 -605 353 633 402 1163 1361 -269 -1307 337 -216 57 591 -632 1210
3600 1210 -1263 -375 1322 -2522 642 2177 109 -1333 -1124 -980 1023 891 2600 1244 838 327
3616 327 672 1505 652 2013 -234 1831 -225 330 -525 1232 1361 -430 670 774 1798 -370 455
3633 455 -573 -1588 -28 442 -1114 -861 18 -474 1431 -1411 1195 -1015 7 1202 -223 1199
3649 1199 -1294 263 -1398 -796 -288 215 -11 77 421 -1443 -135 -1331 936 895 724 -732 -345 -7
3667 -7 -940 651 -270 1351 1733 -801 1492 1255 -1006 -1795 718 -126 350 1029 -152 1221 481 671
3685 671 261 918 -668 743 -34 -1413 1016 -391 212 182 954 366 -51 -137 1010 76 229 118 -445
3704 -445 -727 -3377 1158 661 -865 685 86 -610 -49 410 -791 1746 882 1497 1717 802 540 1812
3722 1812 701 -915 -449 689 -1191 -356 1413 715 479 -167 393 1675 -1029 -429 1879 -2058 802
3739 802 1636 -415 886 -664 707 153 -331 1496 419 510 902 -974 -1553 -112 -737 -1176 -1443 -567
3757 -567 856 718 886 -761 1119 -265 92 148 -681 513 -674 568 156 516 -513 -957 -1109 841
3775 841 -1486 655 840 181 -611 -112 -824 -425 271 2742 785 2006 23 55 1108 -991 -1413 -397
3793 -397 -391 897 -1339 1020 -696 -1803 -304 -350 -154 756 1050 -1037 203 145 56 -1151 516 79
3811 79 -121 2111 1008 242 -482 1043 727 943 -982 -847 -4 -245 561 755 -274 -55 50 1338
3829 1338 -1645 -633 -857 1294 1171 -10 1424 46 -18 451 335 -1408 380 549 575 759 -608
3846 -608 218 423 824 390 659 -72 422 -781 932 918 -742 173 -150 -245 102 -59 1079 -22 -302
3865 -302 158 160 1153 -299 629 -401 1190 551 -560 458 -221 -986 157 -1000 -279 -23 -822 170
3883 170 529 -61 931 -997 776 -925 761 -446 254 17 -955 -52 1210 92 83 -1727 -397 371
3901 371 -203 393 -117 -1434 772 922 -31 -1060 377 -515 -277 -635 -481 1293 498 452 -743 785
3919 785 2 -74 509 1013 -164 428 -90 444 -1013 1413 -700 -219 -144 -2031 750 -457 -239 -133
3937 -133 168 -464 -611 1023 1148 809 2132 -1334 -1297 587 1142 -73 223 290 -102 1329 26 285
3955 285 161 406 761 1477 664 -221 -1294 574 -662 263 -301 597 1252 1289 -713 -368 -30 -968 191
3974 191 515 323 -288 -1131 362 -398 233 166 236 82 372 258 2557 1790 -145 1021 632 -416 1304
3993 1304 248 220 1305 -259 42 528 -51 169 714 900 9 -347 342 -402 851 1003 -86 1239
4011 1239 2020 563 -759 -794 -500 -871 -90 -257 -71 1629 1803 -725 494 -900 -650 1475 482 -802
4029 -802 372 -1401 1283 972 -1465 491 -326 1898 -164 -231 -273 974 -1239 335 1324 -167 628
4046 628 -712 -242 -341 -765 -273 -157 -828 984 -690 609 -53 -923 754 250 -1306 307 1062 892
4064 892 46 -1452 1176 -351 -32 -129 262 -435 -497 198 -1359 743 -1176 546 -1403 497 -36 -1199
4082 -1199 911 2158 -1078 -120 -57 -967 222 -970 -1144 -153 1316 -1641 -1840 586 -2113 -438 1471
4099 1471 1240 1685 260 -285 -569 543 -1262 -78 -1094 1186 -1183 -1371 -674 -557 -647 1078 413
4116 413 205 3123 432 1586 324 335 -1111 952 -1455 665 -515 -726 522 1819 1929 344
4132 344 310 475 925 332 -440 1727 -309 -576 1917 -708 -1409 616 -1290 160 -803 1187 -220
4149 -220 -236 -1038 1463 -755 1733 675 -1351 -649 -1095 -2992 -195 -157 -396 678 427 1512 2436 1012
4167 1012 139 366 -292 -1997 -354 86 311 972 -442 319 -589 -2058 -754 -661 1335 -1149 -1105 -1053
4185 -1053 2079 2201 -1298 2192 -714 -50 165 -1395 -302 1130 -168 -1007 -327 -520 -692 -923 1397
4202 1397 -2023 -2599 108 1296 1959 259 279 1993 -386 1683 -155 1996 428 1819 991 575
4218 575 -1446 66 1461 -934 -2314 -2325 1400 205 -948 309 -2882 450 -35 -990 -76 -128 1335
4235 1335 457 999 -687 -595 948 2101 -322 722 426 981 -1056 799 1377 -428 -297 -70 -177
4252 -177 -681 -466 84 382 4302 343 -428 -823 -216 -992 -319 597 -663 -40 877 -2301 1067 -532
4270 -532 -139 -564 719 1677 -667 409 1933 986 985 -341 31 1638 -377 1038 687 1211 1377 1471
4288 1471 -354 653 758 -906 950 2461 506 1383 1781 -799 -195 -690 313 1078 1316 199 742
4305 742 1031 -1514 1553 1129 -696 -221 239 -1751 -239 -981 978 2266 661 3509 -122 -30 471
4322 471 1737 -1320 1134 -984 -1519 -1374 338 -246 296 682 735 1792 122 -543 774 633 -27 1850
4340 1850 259 701 385 1023 -161 418 1154 -144 -209 -106 -1372 1096 -1668 206 -53 -805 2504
4357 2504 1862 -768 484 313 1249 -92 115 -19 -1504 -142 -856 -194 1074 155 -1936 -530 -558
4374 -558 250 -820 -1716 -1863 570 -15 -916 -345 -2260 -649 823 -423 -334 -1695 -1259 677 -1527
4391 -1527 -289 2189 481 -903 585 -394 -379 794 -178 1569 -1280 185 -2054 264 931 921 -702
4408 -702 146 -522 1145 1407 -215 -989 928 216 -1498 -425 -885 701 -1152 1445 431 699 1265
4425 1265 -1016 631 1154 1408 2451 -979 515 -63 208 178 -575 -1360 -469 -1518 377 -985 -35
4442 -35 158 269 1040 1170 684 248 78 -17 1219 367 818 893 -294 1263 43 1133 32 1523 891
4461 891 -58 1612 -425 258 635 701 1250 849 161 232 1564 699 -650 459 -1356 -232 -2 134
4479 134 1228 -2480 -665 903 -86 2375 877 557 -658 824 582 3 -1068 -649 -1130 687 3343
4496 3343 -1366 460 1913 465 -864 1994 -617 -770 655 1623 132 -1062 288 782 515 -315
4512 -315 2271 -550 624 2183 -1311 -752 -1418 1117 386 -584 -1960 -1456 -909 127 -193 -108 1526
4529 1526 1629 -319 -706 -240 -1472 -1728 1860 55 1295 3 -384 51 -1742 -221 954 554 -568
4546 -568 154 1511 1631 1040 -699 883 -1091 -1765 883 805 -66 -375 -297 83 1534 -36 -121 -315 1046
4565 1046 1638 1570 1608 -1329 131 569 600 -278 485 -2318 176 1637 -1787 -723 -500 -150 357 20
4583 20 1009 587 1134 2334 1333 -127 1046 53 -984 -1428 -11 1680 -423 1629 141 -766 375
4600 375 1685 -702 951 363 1144 2015 -23 -1157 1814 -733 -82 1061 766 521 -754 744 -524
4617 -524 735 -45 1390 52 -131 -1420 -460 -1787 -2419 -1203 -1262 242 1271 -809 2705 298 712
4634 712 -122 878 -834 -1660 -43 -322 1405 735 1014 650 2262 -1908 1322 70 498 602 -1476
4651 -1476 427 -2196 -254 1092 194 -360 243 2493 -918 -729 -242 1026 1211 -1371 742 3 -1011
4668 -1011 938 -751 2591 1136 336 -1651 -1249 2197 301 1092 -1178 -2 94 505 54 -551 1409
4685 1409 1466 -1131 -122 145 1310 -347 1497 -685 136 1208 559 -365 360 83 1474 -851 -51
4702 -51 1471 -361 2041 300 -267 32 641 -812 16 -955 410 333 56 222 1594 -704 480 -1775
4720 -1775 743 218 77 823 -2009 244 104 -462 315 -113 586 1396 236 690 119 -958 713 -348
4738 -348 -106 1316 518 839 -1011 1529 -1422 -1482 -526 715 414 -464 1344 273 -66 765 -1062 -412
4756 -412 851 167 -139 1136 -440 -556 -153 1968 551 317 625 -1088 532 1325 944 117 768 -288
4774 -288 -727 194 1192 341 884 665 1449 873 940 595 -36 350 512 482 -1117 -721 495 1158 1024 187
4794 187 1718 -567 -493 561 -92 515 571 1386 946 1002 1458 -2066 894 -219 -499 248 -553 243 429
4813 429 -1113 -342 587 -988 98 698 321 -598 416 -11 157 2392 -933 792 911 280 -598 182
4831 182 2293 -242 -313 363 -530 99 342 -506 -524 1175 -461 1127 -1048 -1044 261 -142 835 678 -737
4850 -737 318 -87 -1330 -141 -1249 -313 78 -1002 107 100 32 573 512 191 1586 -122 1950 -1024
4868 -1024 -1113 376 180 696 238 370 -246 -1050 -30 -1088 -265 -713 -1019 -1789 -1051 231 498 680 -133
4887 -133 2076 1767 91 -1060 -1304 -155 1775 297 110 -2386 -1705 -1719 -929 687 -233 -177 -200 -1068
4905 -1068 409 1379 1164 686 -367 267 29 -1081 1331 852 -25 -1721 2338 572 1152 423 263
4922 263 -18 -665 649 531 -1338 -286 -1145 -914 65 -106 347 -26 320 1278 271 -742 339 229
4940 229 -1354 -315 -481 1154 1236 -585 232 -82 -32 909 -506 -576 827 -205 200 -442 1635 -1392
4958 -1392 1241 -1013 4 -493 -73 -158 -529 2754 -352 -2087 -1108 1310 991 682 882 438 -389 825
4976 825 518 -2559 -174 774 1875 437 310 764 1482 509 -405 250 -1558 1098 380 198 -237 314
4994 314 505 1535 -1346 -1586 -1365 51 145 -1233 1079 859 1364 183 -90 -1603 1255 -1071 40
5011 40 62 2051 -1095 -400 1594 -1472 -268 49 -1283 1323 1565 -1 497 -391 -75 -392 1346 2452
5029 2452 1024 -380 53 -2241 608 454 1909 1069 999 1345 632 626 305 319 1777 -1056 -1008 1277 -33
5048 -33 1709 1232 225 -1144 -1413 -1302 -1217 274 -212 1541 -408 727 -361 -578 2274 3313 1531
5065 1531 -1517 -1475 -1629 -270 2165 -1558 24 1927 430 -403 -705 -2078 1195 650 -425 1177
5081 1177 911 695 414 879 249 -1238 515 632 45 308 573 -270 2510 418 2332 -292 -1355
5098 -1355 -832 1619 438 2074 -722 -2280 -564 -182 292 -972 -4 -789 1420 27 -554 360 2342
5115 2342 22 648 1341 486 1468 105 53 -1664 1305 2359 -844 -111 19 71 751 -878 112 2
5133 2 875 -91 923 1473 1069 906 -1076 -230 1330 -1194 -1478 784 475 1814 -45 -356 -467 190
5151 190 -14 -180 -248 269 -464 -2363 -3 1262 -565 205 -9 511 -1116 1221 1190 -1271 506 -951
5169 -951 -805 459 -1499 196 1530 1467 -1058 -536 -870 -1350 -578 -1719 -585 385 1354 -69 449 -532
5187 -532 1051 -511 -1542 -498 1156 -415 -125 890 387 -40 -488 -650 557 814 975 164 -328
5204 -328 57 -353 57 -1046 38 -2179 825 1449 914 397 -438 52 792 -615 81 1559 -1439 205
5222 205 -1167 -254 365 339 73 640 -179 -429 1470 2070 -768 250 -268 -413 368 1110 1058 -2006 -877
5241 -877 191 449 -975 744 -649 -1007 493 159 -83 -12 799 162 258 728 -32 54 -811 2449 1071
5260 1071 1429 734 -695 -927 -638 523 1116 746 -177 667 239 -144 1354 1959 176 -376 -1160 -586
5278 -586 -1005 -11 581 -600 -854 -1236 58 879 33 -1242 2754 -675 -138 -231 -33 -1259 707 -1176
5296 -1176 -120 -789 1499 671 567 -452 820 58 -661 598 -872 332 -811 -131 -817 636 -72
5313 -72 -752 2079 649 -532 681 301 212 -694 237 75 -1552 -155 -323 -1266 155 2353 -403 262
5331 262 614 1542 -954 -343 97 -570 -351 208 -585 -164 1465 -514 -658 421 1569 214 10 -1000
5349 -1000 1263 -100 469 1215 -694 -1427 -1691 -182 -1131 2481 387 449 37 -292 506 1997 773
5366 773 -391 -193 -398 691 328 -759 -1762 59 -1387 1218 -71 -1411 12 2048 630 732
5382 732 476 -332 -1842 338 21 1381 -274 264 1212 872 614 1451 824 268 865 -1562 380 88
5400 88 -907 468 -637 146 -731 485 808 252 1117 -245 1545 1082 115 -926 -1189 -2286 -95 1296
5418 1296 -1158 -54 768 440 591 125 -448 709 -31 588 980 562 -2052 -357 530 1158 -369 -401
5436 -401 -653 -968 620 -2883 613 -792 1843 -243 -1155 719 -1201 1148 474 1939 -269 950
5452 950 285 -260 105 -729 345 1096 147 -3084 -953 -504 -581 1342 1279 -592 1994 -49 -389 -1492
5470 -1492 220 441 -2336 -590 -743 -370 794 228 -1604 593 370 609 -509 -421 492 -736 -2374
5487 -2374 -744 13 933 316 -2696 -1351 -209 -195 211 1428 86 -512 261 546 -528 -65 1207
5504 1207 476 -472 1359 977 -547 -609 -326 298 -200 -475 1558 -2873 1242 1409 493 -401 -1045 -1817
5522 -1817 -621 124 94 -1633 -478 502 -1143 -816 1002 -1274 -1000 1922 1435 625 -1339 242 -508
5539 -508 -883 -601 443 687 -1721 103 -1768 56 -2169 1219 1352 467 246 -192 -306 295 -116 51
5557 51 1347 517 -883 430 -249 1469 -967 -1009 1293 156 -862 199 264 193 146 626 -877 -92
5575 -92 505 -357 418 -1109 1952 -3328 -644 141 2320 19 -1842 -500 -469 -457 214 -37 1379 651
5593 651 1880 -1593 786 213 -2171 248 88 -645 42 455 -2514 359 -1820 186 1748 -1561
5609 -1561 -28 -241 -481 -1546 -822 -1472 -303 -470 959 -117 -1343 -781 -1371 1172 -21 -131 2045
5626 2045 -1247 1057 686 699 148 -254 1749 -2212 1017 -1975 1199 1192 141 -1283 599 -1083 35
5643 35 -283 -616 -1707 395 -300 740 -319 -711 1445 -1399 752 279 -657 -1972 -988 -1568 1413
5660 1413 1196 683 392 -804 -1213 -247 -1102 829 1623 1269 197 -388 934 288 -1911 -670 917
5677 917 863 -1720 -898 -113 125 -58 609 -13 162 1686 -633 1557 820 312 571 1297 -803 -2675
5695 -2675 180 1134 -19 322 674 96 4 95 -777 438 -409 652 -943 909 124 -278 1562 -255
5713 -255 1013 846 965 -2468 2792 -712 -6 -603 -777 1016 -2027 1262 822 -558 1137 -552 1821
5730 1821 667 111 82 -275 -1420 -318 -688 295 -1244 1072 -736 54 337 173 1516 1032 1543 -487
5748 -487 295 1566 2293 221 877 532 -733 -401 -1392 328 584 643 -488 705 -335 -379 1334 207
5766 207 1595 -318 -219 1099 1606 655 1241 884 1061 1359 -278 2143 -880 -582 -267 -494 447 -227
5784 -227 379 1010 805 -705 -356 -52 752 -534 27 -2501 815 -108 1120 682 159 -319 311 -122
5802 -122 1269 -1524 1307 508 377 -2203 -426 1737 934 -440 24 675 -67 1170 -602 -745 -265
5819 -265 675 -99 527 -792 222 -967 -1053 -125 70 -429 -952 -409 112 -2051 125 -1524 -348 684
5837 684 -1208 1502 -1196 267 617 -104 535 -156 -1631 36 325 -1301 -151 1422 21 -1356
5853 -1356 285 -88 -657 418 501 299 265 1346 62 -161 1455 -827 -350 1161 763 -80 -278 1033
5871 1033 89 -624 1062 -1009 90 1330 -1147 -342 -129 73 -397 198 913 -463 -326 -741 -387 1904
5889 1904 -803 -513 291 27 -111 622 2286 -351 -695 -1170 -476 -609 1693 34 904 94 1452 -418
5907 -418 -1110 -201 387 -737 -261 -491 98 -367 335 -264 -141 503 -1102 -303 -2254 799 -195 -76 533
5926 533 -5 -161 78 -1106 -2124 -904 210 349 960 964 -280 -654 901 -709 2731 603 -396 -57
5944 -57 -854 -944 417 1075 73 1506 374 -317 1000 1490 1982 -1322 190 -1220 -836 -1359 -1050 -1571
5962 -1571 -1548 -115 1306 -549 392 822 -2471 93 331 -1350 -660 573 857 -69 -542 172 -880
5979 -880 -2878 -372 261 -839 -364 -220 1991 114 271 544 601 -1459 558 -573 259 -1762 -788
5996 -788 75 -213 1315 -452 775 -266 -209 257 1188 1755 -102 -267 -651 -1305 -944 474 961 590
6014 590 -543 611 -304 -1266 -800 -1271 -1345 -151 620 67 133 58 -548 -194 -329 -384 1207 1436 -962 -1047
6034 -1047 -230 255 -836 458 128 2028 -206 -570 808 1669 1413 58 -586 821 2361 -324 -1515
6051 -1515 -406 700 413 680 -572 2065 -1367 -1074 -187 472 1997 -522 465 1998 387 -282 783
6068 783 -67 -1914 -954 626 -1754 834 177 -584 -734 470 352 165 67 -782 -1050 -1338 -3058 1144
6086 1144 -760 71 1069 1080 963 2055 -50 1026 -2346 -1214 -768 -1087 -705 968 931 -389 -924 -2555
6104 -2555 -939 -1526 1496 36 477 -557 977 1505 1242 1412 -1489 -1138 -407 -1006 973 -767 -764 -34
6122 -34 970 -703 -610 -531 900 313 608 626 -920 225 -621 2178 2040 675 368 -874 1084 -931
6140 -931 929 47 -245 818 2 314 262 502 -439 581 710 -666 1154 341 966 -185 375 654
6158 654 85 1497 1162 543 71 -96 -327 108 778 93 -808 -868 -435 911 1319 -468 -1353 -1349 1434 843
6178 843 654 -953 -999 -31 876 -1016 -2487 1136 -1176 -793 156 -152 -162 -862 187 -462 105 1033 -923
6197 -923 -520 334 -880 -2147 -977 -1401 -37 649 1898 -289 586 1021 -162 -537 -868 312 970
6214 970 615 -144 -774 529 -2317 1008 784 -528 143 1857 1838 -97 -1411 1066 -81 219 171 667
6232 667 -173 -262 -114 531 -627 -437 -522 -98 -385 -772 -1086 -263 -1170 -606 -564 1060 988 -1757 -401 -823
6252 -823 -466 234 -242 71 837 -301 -3 1075 -313 -15 -67 -1931 -943 -963 910 1196 981 9 -1087
6271 -1087 906 963 732 1608 435 -108 -804 -107 207 -1538 -892 -995 2147 451 901 142 671 877
6289 877 330 1003 923 600 131 241 -832 1093 -825 67 -865 -920 274 -368 595 -424 -277 651 -500
6308 -500 608 -406 2715 -1369 540 1350 934 -686 -411 1536 -1082 -134 1376 1305 -615 -563 -50
6325 -50 201 -417 1132 647 -186 36 968 -12 -231 190 624 -760 -394 700 37 1022 536 -228 -329
6344 -329 -912 -1670 977 -183 1104 1186 23 398 -186 -768 8 -467 675 1215 140 -575 -352 -274 241
6363 241 -320 17 1223 90 -725 833 1226 227 -1298 914 265 223 42 -3 793 960 214 1781 -827
6382 -827 -576 440 41 -1457 -1244 1442 202 665 320 976 504 570 -776 59 561 -640 -13 -1430
6400 -1430 -442 1047 -1987 2125 585 625 1539 782 290 -1263 -502 -879 -1474 3054 -217 1145 -18
6417 -18 -2097 278 -1624 1021 -146 1773 502 -2271 -810 2138 12 219 -509 -370 800 495
6433 495 737 1206 -903 -832 475 -58 227 197 262 -846 -385 67 1864 -22 -2457 512 -2052 -1374
6451 -1374 690 74 227 486 778 220 753 672 1589 -375 990 -275 1640 -1183 -28 2334 -1212
6468 -1212 -797 -794 -229 -1104 445 974 232 1123 963 905 -484 -633 -668 489 67 2479 -1895 -676 523
6487 523 117 403 1941 -875 1161 16 -38 1613 -2057 454 585 1212 -1001 342 764 1255 1068
6504 1068 29 621 -587 14 771 1602 177 -428 -312 -622 -919 912 116 -688 1223 616 3170 1286
6522 1286 682 -872 51 -394 -1418 -331 1658 -782 -348 -836 1559 2517 -293 -1057 -254 -1201 522
6539 522 1055 660 2174 1127 -623 806 -536 1012 -233 1466 -1341 -630 624 -393 -1721 -690
6555 -690 -814 -132 -2133 254 -670 -1777 -1297 623 1878 -1326 668 915 -393 -354 -464 628 597 -1067
6573 -1067 -2027 -1201 1533 622 2641 1221 1810 -258 1538 388 -559 -1329 410 1227 1194 -1693 -1163
6590 -1163 -164 183 -1467 -254 14 -619 65 388 1648 -643 2579 -3844 -167 1177 -577 -327 49
6607 49 288 1476 938 -296 99 138 -758 1272 -2632 1115 -2727 1377 86 5 1833 -1015 -677 -379
6625 -379 1070 274 -446 -1342 -1169 -1653 1307 -459 458 -376 -416 -397 557 1367 -527 1040 324 -162 -1214
6644 -1214 900 -1432 216 374 393 141 163 -1049 397 196 -959 128 -305 1692 1542 380 173
6661 173 -706 864 677 2804 -100 -285 -1163 323 -804 -400 373 -56 -1307 1189 -1828 470 965
6678 965 1501 -277 812 676 2329 -1806 552 255 -1897 141 -645 181 -1052 -563 307 398 148 201
6696 201 103 941 -1032 -3402 691 -590 1084 480 -804 224 1429 593 1524 1842 -1165 -782 60
6713 60 426 169 523 -188 350 -1210 730 1209 1725 2565 2301 -833 -1742 1310 609 955 -1144 -178 -1522
6732 -1522 -561 1452 1108 1384 -608 -80 761 -1760 -773 -441 -2044 -953 -645 38 -1893 -684 160
6749 160 -146 227 -1126 1114 114 -295 864 553 -1392 -513 -993 69 368 936 232 -1594 717
6766 717 219 -38 -315 17 -896 2376 -370 -1361 -682 -283 78 1315 -2045 922 -1111 -91 -1167
6783 -1167 -324 638 -1109 153 29 416 -813 -266 -463 -825 -357 -951 477 -81 -640 -227 1150 541
6801 541 -321 93 202 -616 99 -381 407 -1628 -378 1091 -105 -79 -510 -145 634 -51 57 -938 393
6820 393 -804 390 -230 163 987 -391 669 1236 -263 515 -727 656 1743 93 449 138 -471
6837 -471 -947 109 -958 35 -756 -376 -857 -351 226 -605 -27 367 198 -1527 478 -517 154 610 100
6856 100 -87 84 -536 -214 -232 554 53 -777 653 826 -855 167 -613 314 341 225 1020 312 -668 -300
6876 -300 51 54 -1534 -56 -618 382 723 -504 -2669 -250 758 125 -460 476 787 222 -1057 -1041
6894 -1041 336 -481 564 -262 1421 1029 -261 -504 775 -1067 517 -434 360 1165 651 267 -826
6911 -826 121 -1692 -753 -1043 -441 -342 -1034 603 -749 -621 671 1014 284 -471 -1230 182 -725 -167 56
6930 56 863 -1891 852 -761 -429 -152 -377 966 -575 -1109 -25 111 -600 176 115 881 41 -2445
6948 -2445 -656 -356 -500 -650 655 -344 174 113 -287 840 -493 -772 338 1174 -1344 -176 917
6965 917 664 392 -74 1152 -37 649 1378 -1101 -486 -1085 1683 -814 1395 713 405 20 -359 -98
6983 -98 -272 -261 -43 158 -1299 440 -105 -442 1272 966 -909 -896 -1139 -191 233 1530 426 69 752
7002 752 -1023 -1531 164 -1981 602 -1079 -1012 -923 -302 -2757 311 700 -821 -993 -1255 -1776 1608 -7
7020 -7 -536 -1071 -1052 -156 1994 66 -3311 173 200 -373 -2007 -53 578 -765 156 -839 -476 -204 -491
7039 -491 -1393 1045 -1088 -616 253 -546 -207 -16 485 -380 1339 1271 -2205 -1194 -798 1091 505 933
7057 933 -1088 -1113 -940 -56 916 225 597 -2092 -1058 -1346 -91 -483 603 -524 -194 655 79 1139
7075 1139 1944 -242 -49 638 -474 1431 228 -150 1111 311 -15 -315 669 -657 -1383 -471 -939 -544
7093 -544 732 -573 670 595 566 -479 -1297 646 2874 -40 1634 -260 1841 1507 1437 888 1106 998
7111 998 -1361 468 -2034 -1886 -156 697 279 -1640 637 -1472 -1531 -1065 -888 752 -1265 -374 193
7128 193 493 -992 179 -559 -954 203 -134 892 -1669 -884 -1147 -1439 -1206 -1045 -66 -1315 128 650
7146 650 -981 -583 1629 145 1487 969 1113 -1805 -604 383 -1106 -1128 -755 781 -635 -144 -1379
7163 -1379 214 -19 503 -831 279 145 -1233 -854 358 -581 -116 911 -201 -39 1705 -1321 -1484
7180 -1484 529 800 302 0 -258 -294 -78 1501 -409 -1102 -106 -181 392 1783 -1861 -219 251 -1571
7198 -1571 -324 227 -1111 -942 713 -1886 279 -925 -216 561 -149 1302 -102 638 1913 -322
7214 -322 -47 -896 -129 799 -5 -1386 366 -139 436 -449 711 -1541 -471 107 -452 -301 -772 416
7232 416 381 -364 837 -889 917 -778 586 -212 1308 1722 -587 53 -53 1465 -673 650 307
7249 307 134 748 1877 418 -584 692 1609 443 1504 343 -1260 -896 -309 -937 -774 -128 546
7266 546 -436 2194 -774 -793 -831 -1594 -345 -878 692 795 511 -640 688 -87 235 152 1454 1395 1032
7285 1032 1442 -710 386 -1287 -76 661 137 349 -675 -1444 824 -843 582 -423 943 819
7301 819 88 -1016 2312 108 -715 149 -307 -2515 -1498 577 -1547 435 -624 -1054 -187 -889 -1727
7318 -1727 839 1556 -211 -1988 893 715 -1014 -1172 1385 78 613 45 452 -1759 903 -68 -620
7335 -620 -371 936 213 354 -572 -1016 1174 -555 1437 467 885 141 -42 -1430 690 174 1804 -2353
7353 -2353 -801 -146 -307 89 55 1403 -1676 810 -739 -618 1008 -112 -288 960 1724 1305 2044
7370 2044 163 914 -578 709 531 -552 523 590 655 1472 727 -16 297 1679 410 805 1018 -562
7388 -562 -445 -209 487 -255 -1224 792 -86 1518 -754 -346 65 -747 393 -592 160 700 -747 -721 187
7407 187 240 -1040 145 197 841 -1162 294 -1274 -55 -433 -284 672 265 15 -475 -745 302 -754
7425 -754 781 -906 -759 506 -1432 151 -426 -670 -1203 695 -700 68 546 1358 170 -1038 -1331
7442 -1331 68 -1366 -52 -681 448 109 214 -769 -901 -1849 -2356 -214 -1418 -512 106 132 264 -954
7460 -954 982 1424 -519 -894 1624 -214 -823 -431 -993 -852 -142 -974 735 2212 171 -1233 897
7477 897 544 216 562 -534 -824 -98 1376 609 -1158 1411 -117 -1214 96 -273 473 1126 -1256
7494 -1256 -608 205 314 -290 -1239 -563 523 988 1794 -242 351 -647 -628 1626 -1210 112 742 367
7512 367 897 212 171 545 -673 -691 392 29 -385 1708 -1127 -1944 -348 939 1072 -154 621 51
7530 51 -312 276 -614 -706 -489 -649 302 -1948 626 -1654 -749 605 1012 458 -1597 137 2329 -1450
7548 -1450 1048 1253 -1495 -106 -794 345 1211 1157 1001 1724 -557 595 -1063 1606 102 831 -1193
7565 -1193 -2107 -942 541 731 -298 1384 203 -380 -452 -235 -303 284 -1386 -210 1236 1188 -261 -223
7583 -223 478 -805 -583 -882 -19 -1031 804 -892 -810 -2058 -237 373 -2238 -409 319 -1184 529
7600 529 1018 -705 1566 507 -165 -542 -698 61 591 -50 -184 190 136 -224 -1075 -386 -1846 -622 -638
7619 -638 -603 -350 -774 -345 -1597 757 1000 424 -317 -804 582 281 349 -208 -164 -686 -849 -181 -1806 -617
7639 -617 -1248 -1713 521 546 1181 -203 720 -766 -752 -642 290 -19 -1710 -182 390 -13 -970 -560 -256
7658 -256 290 890 -765 189 -1067 397 2732 -104 598 1189 -114 -252 -199 525 -424 720 279 720
7676 720 -36 -354 -739 1130 180 -744 -182 -546 555 -676 728 -366 -647 -688 -78 228 935 227 451
7695 451 -234 2 -1175 -391 -398 -707 233 658 -370 278 -127 -1105 327 209 -18 -512 -890 -119 -274 1474
7715 1474 -996 1407 -630 -373 -1029 -285 291 -126 -233 -1145 247 -1550 223 -486 1347 -166 -549
7732 -549 804 -148 48 661 358 717 -1587 1002 240 459 785 93 1092 387 1919 1372 -1006 106
7750 106 1252 -842 -236 -276 -902 206 2115 -1445 -541 -378 345 -1083 363 1334 -130 302 94 2086
7768 2086 -672 -293 1318 -501 -601 -357 -827 -801 -859 1065 54 -625 1660 -788 -1919 -1410 737
7785 737 -413 -1797 -870 351 -1183 -1365 -389 1437 264 581 -319 -755 103 -2144 589 1273 1839
7802 1839 469 -1250 275 496 816 -419 -714 319 -1415 2285 -389 -1482 1319 -1156 -167 -213
7818 -213 867 1475 -445 91 99 -3437 -802 630 396 -59 -75 -1431 -706 -836 -434 -735 -593 303 -598
7837 -598 508 588 890 -521 -512 652 701 2897 266 81 666 485 1219 -616 -1398 -1429 858 1358 606
7856 606 926 -368 1503 2270 455 -1011 -1195 13 -228 -1154 433 -871 -589 593 1697 1866 -1413
7873 -1413 -638 1 1452 762 639 -159 873 1071 -601 358 2252 951 120 -559 -3 228 1711 -600
7891 -600 -1251 944 1199 1639 1806 1329 1217 542 272 -1543 -289 -1051 1037 1014 -68 -370 -1483 294
7909 294 971 107 -475 -327 985 -443 -775 1536 1712 621 -218 -191 290 -896 568 50 791 -1870
7927 -1870 875 847 -821 -1138 -205 985 261 327 282 584 1163 1013 -1297 331 1662 205 179 980 -1992
7946 -1992 588 214 484 -1588 -2233 -129 -494 -315 -106 -770 -1592 -818 782 -430 2068 598 -443
7963 -443 -1362 180 1492 491 -1989 -403 930 511 2189 585 1002 -936 -2266 706 -652 -60
7979 -60 2237 325 170 1525 744 -268 836 -252 303 -605 -47 -2446 606 -715 252 -1422 -446
7996 -446 761 1622 -1521 -768 107 -1324 709 947 2053 20 486 -1671 -703 -64 411 -231 -755 -3
8014 -3 187 758 -1101 2122 -1099 716 567 1074 142 -1355 -1810 -341 612 -960 213 226 944 -708
8032 -708 -55 -751 -546 881 -1003 -1089 450 -216 1003 52 -505 2130 178 -543 -1644 -955 -9 -96
8050 -96 -307 671 149 -253 -797 26 -1061 998 -1189 -157 -1865 1657 249 -547 862 -7 -486 -130
8068 -130 335 102 205 -155 193 -593 127 -323 1517 -372 -2033 1452 -318 -1418 -1239 -617 700 571
8086 571 1292 -927 -916 1619 136 -937 296 270 -201 -216 971 -233 30 689 -1574 -567 606 -597
8104 -597 -435 562 1097 2250 202 -2022 -106 -539 671 -27 729 629 410 285 195 -666 198 306 -352
8123 -352 668 -1204 1262 -202 -1659 1061 209 296 582 212 1665 185 -590 -65 621 457 -75 -48
8141 -48 -1248 -816 -855 -703 480 1547 -1163 177 1673 -1056 663 2165 662 152 -1632 -177 1387
8158 1387 88 -1835 52 329 -1689 854 1168 38 -420 -787 -1193 -557 -954 -222 937 643 -611
8175 -611 -990 1180 -1343 998 -1379 -443 -1130 -1749 -335 -131 -339 -2097 -1601 -1020 -608 -204
8191b04
$$ Imaginary data points
##PAGE= N=2
##DATA TABLE= (X++(I..I)), XYDATA
0 0 0 0 0 0 0 0 0 0 0 0 0 0 0 0 0 0 61 -64 64 -64 64 -86 127 -128 132 -190 192 -251 264 -318 376 -422 475
33 475 -535 610 -690 763 -858 953 -1072 1192 -1322 1470 -1624 1800 -1988 2192 -2415 2664
49 2664 -2933 3232 -3558 3927 -4328 4780 -5297 5879 -6550 7322 -8243 9343 -10693 12387
63 12387 -14609 17641 -22051 29123 -42226 75134 -373473 -337330 218534 -42484 -249994
74 -249994 -176042 101813 148970 72594 -53791 69394 247705 198643 -37902 -21096 162337
85 162337 205433 21538 -105009 -60292 71020 30672 -173693 -258470 -69116 74313 -38268
96 -38268 -193652 -99700 105144 119690 -42054 -65900 98503 186595 70745 -59088 -23382
107 -23382 113513 137624 -8356 -118805 -20448 90769 -1184 -147612 -114748 15995 49094
118 49094 -41841 -115643 -33793 108893 85038 -70513 -70546 91002 125436 -13941 -92862 -761
130 -761 107876 77060 -54705 -87238 31622 94800 -17954 -126136 -65779 50288 46592
141 46592 -58749 -89339 19303 101807 31845 -66880 -24829 78852 75647 -29346 -78622
152 -78622 3124 88864 31642 -76359 -54527 51595 54979 -43723 -87916 -20156 52288 22716
164 22716 -65000 -65200 41708 86859 3057 -58207 6341 82443 45968 -41523 -56807 23015
176 23015 68643 2060 -72974 -28310 55325 36386 -52635 -68668 2300 44564 -9143 -73346
188 -73346 -35694 51666 54986 -14740 -37010 25602 74048 29159 -40822 -30250 43448 50609
200 50609 -25200 -57309 -74 47098 12582 -53135 -50575 13319 36216 -23034 -66781 -11450
212 -11450 50997 27218 -31220 -26147 33491 57442 7470 -40608 -9861 48840 30666 -34062
224 -34062 -41470 16203 43513 -3708 -49767 -23378 28770 21557 -37596 -49342 5739 41407
236 41407 6446 -35533 -13367 39783 42601 -9382 -35033 6283 45758 13286 -36379 -23787
248 -23787 26707 33252 -10782 -38659 -6901 33384 7944 -40794 -33596 14953 29484 -8493
260 -8493 -32662 292 38030 26345 -20676 -22529 20396 36796 -627 -32664 -10020 30684
272 30684 22491 -19980 -31294 7010 28391 -3166 -36430 -18827 19708 18703 -15415 -29190
284 -29190 6285 34481 13168 -21457 -11524 25219 23139 -10213 -26983 -393 28655 8498
296 8498 -21930 -17751 15277 23250 -12000 -30121 -7882 19957 8455 -20511 -18405 12840 26341
309 26341 2065 -20826 -3738 25095 15813 -16915 -20864 8708 21962 -257 -21182 -7838
321 -7838 18145 12575 -15562 -25103 578 18339 -543 -21842 -10286 17446 19226 -6758 -14118
334 -14118 7309 22482 8201 -16879 -12512 11502 15773 -6914 -18703 -1631 17964 7808
346 7808 -15364 -17742 7743 13760 -7468 -20958 -5361 14257 9341 -10767 -10274 10199 17447
359 17447 -158 -13564 -4569 13847 8699 -10061 -11778 5970 15249 -308 -14960 -7437 8299
372 8299 7902 -9435 -14921 1644 14919 3253 -12211 -6128 9020 11922 -5883 -10829 551
385 551 13054 3871 -10562 -5585 6793 12971 -3177 -12003 -2177 9479 1785 -11082 -10386 4210
399 4210 9938 -2517 -9376 -1948 13763 7934 -4805 -7397 3501 10102 125 -11055 -2363 10144
413 10144 7651 -5072 -7671 2178 8660 44 -11045 -5597 4061 5734 -2224 -6475 3595 10124
427 10124 4013 -5726 -2929 7082 6341 -3109 -8119 1638 7688 1517 -5894 -6009 2235 4409 -4190
442 -4190 -10446 -1768 6247 1967 -4384 -3482 4803 7834 1534 -4065 65 7585 3195 -5589 -6385 2096
458 2096 4791 -676 -6830 -2419 4999 2022 -6269 -6960 -517 4392 -1534 -7372 -1540 5754 4974 164
474 164 -2228 79 7149 1056 -3622 -2620 2453 3839 -1087 -3401 71 2325 -499 -5777 -5045 230
490 230 3654 -2373 -4066 350 5746 2377 -742 -1384 2212 3324 1169 -3769 -1058 3501 1779 -1782
506 -1782 -1815 1494 2245 1741 -2326 -2734 -439 2223 -1341 -3144 522 3253 624 -2235 425 3802
522 3802 3344 -1199 -646 -69 3259 998 -1435 56 3115 2538 -1746 -2339 -28 -347 -573 -1097 -2380
539 -2380 644 2880 530 -1834 350 2866 -586 -1797 -946 389 1191 -847 -841 -1519 2315 870 -1322
556 -1322 -3067 -1441 710 -1112 -1904 -3504 1654 1921 1167 -463 1290 1970 1196 112 557 855 809
573 809 266 -853 244 820 872 200 324 -19 989 202 15 -2985 718 71 -930 -730 2690 3931
591 3931 -1685 -29 784 57 678 -1248 -1377 -454 -1073 270 -1541 -2004 99 -941 -1778 -2451 -1220
608 -1220 417 137 -944 1442 2392 907 472 -536 1758 1393 -636 -1083 -1001 1214 -770 -244 790
625 790 -1371 476 -518 -56 -949 -222 -610 -512 -1043 173 407 594 1470 1042 416 897 2019 -706 -1103
644 -1103 1633 438 -59 -232 396 1189 1784 -2438 -811 -788 859 -21 539 1338 1298 2651 1090 1314
662 1314 1598 -1354 835 320 -1599 348 -218 -435 -2329 649 2404 -109 -2438 118 1434 -92
678 -92 1002 1155 134 1045 164 1620 1021 1608 -175 406 1328 -1305 -1763 433 -545 -1020 -741 -904 -1024
697 -1024 -1114 1605 94 603 -318 1365 67 409 703 1239 1011 1225 37 41 -909 -494 -1744 -817 -2551
716 -2551 -1273 -317 -311 197 -370 181 -1046 681 74 207 789 668 833 1455 -22 1478 -735 1006
734 1006 -867 868 569 -443 309 335 -715 155 -703 220 1258 -682 708 1548 201 942 -221
751 -221 443 -637 -960 963 -79 748 360 1048 -1070 -1103 54 -1357 -560 395 -899 821 767 -830
769 -830 564 653 -34 11 447 -504 -510 1953 1978 -806 197 -766 187 494 -905 -690 -65 -537 -741 615
789 615 -470 841 -1976 574 1295 755 -732 -1458 -41 886 -172 1235 14 176 -717 -822 -1588
806 -1588 -262 -1720 917 -1474 586 903 -223 -1223 937 48 -877 607 678 998 1330 1042 -275
823 -275 1012 -1336 -898 1402 2297 -1360 -515 -1166 -317 -1135 -184 693 -595 -645 797 511 -1595 1248
841 1248 -526 -1058 94 -79 -1169 361 -1116 369 -1292 937 475 1462 -673 142 358 163 -896
858 -896 55 249 -814 -70 1336 2245 638 744 -111 1115 305 118 74 -400 1618 -2518 -141 26
876 26 107 1960 -2251 -195 517 -346 1097 -995 -21 -362 351 -604 -888 302 1033 678 -74 -143 -1076
895 -1076 -309 -214 -677 711 320 79 -1730 296 318 -57 -527 1791 -76 -138 945 539 -1099 183
913 183 -63 710 493 1555 -1236 -408 273 -980 -58 491 1033 -549 -245 1371 -306 -246 632 118 515
932 515 63 -815 -865 -89 68 349 -886 543 20 -327 -304 -1165 -925 1961 -729 -1512 -733 -304 1178
951 1178 -268 2379 -192 -2283 -1522 684 -1074 510 94 1246 405 -244 1571 -202 1181 184
967 184 -327 53 706 6 253 721 -260 439 786 -481 602 -785 256 207 173 -536 740 450 -771
986 -771 -828 -404 -1391 -208 -431 356 -21 536 -793 147 -1089 -403 387 342 1021 -1320 -563 718 364
1005 364 957 -2542 2026 521 408 -1120 881 83 -654 810 1217 37 -1622 77 -592 175 1330
1022 1330 -45 -613 -789 507 122 -942 -670 518 -761 623 982 208 -43 -31 -1423 -621 -1468 -437
1040 -437 890 1578 -1028 236 128 -1486 -869 -657 573 -526 -131 -227 1515 1982 1468 -282 -807 1199
1058 1199 1311 133 918 -1541 404 -300 1601 -58 -47 829 963 799 -392 1373 2130 149 584
1075 584 988 2273 -633 -384 988 -1329 859 688 276 942 315 60 -656 289 -674 -1484 -62 -1797
1093 -1797 -256 457 330 -683 -403 403 -160 -532 1067 415 617 1118 898 -809 -678 572 922 959
1111 959 -199 165 -851 -2738 203 262 -3128 -562 -170 -432 -1930 1686 21 -936 318 -1767 1209
1128 1209 650 -191 -194 -783 -947 -118 -324 -712 -1914 -32 1221 1430 -1591 -263 -1990 -199 819 1468
1146 1468 -1065 -2890 699 -987 381 -702 -864 1406 -938 555 -263 -1072 -891 -324 -990 -392 1466
1163 1466 -1346 429 -1364 365 -1155 -1580 28 -1144 2098 -2184 876 1751 -1089 797 -673
1178 -673 -273 -851 90 -1791 264 -416 467 1325 -1080 -859 1123 1976 73 -29 1402 584 555 1064
1196 1064 155 -327 520 1692 1266 -305 768 -723 1983 1857 316 250 268 -325 1096 -246 653 -605
1214 -605 -1194 1944 -600 -1362 -48 1454 990 -357 -489 1859 1337 646 2820 -1847 733 1707 -1368
1231 -1368 -351 -605 -992 497 182 -1554 662 -223 309 -1115 -224 366 1874 2392 -845 1495 -720
1248 -720 -2082 -1621 1722 -2075 -614 -2334 1997 376 -707 -1487 1562 -251 -1187 1411 -338 1675
1264 1675 -1578 1225 638 541 -678 401 -380 1561 914 -562 136 158 909 581 -1706 535 25 1312
1282 1312 378 -51 -1489 2575 794 -871 1434 71 -439 221 163 270 -1813 -1522 660 -940 1080
1299 1080 -1169 -509 -945 -189 279 -875 1004 334 61 1472 555 -597 435 56 -901 952 -423
1316 -423 -1786 -814 -280 1952 201 1148 -2553 998 -668 462 -641 -346 66 549 -36 -392 -685
1333 -685 -720 -1609 -1095 -1169 -518 417 594 -408 -419 -1037 -862 188 -504 -494 302 45 -289 -70 384 207 393
1354 393 1365 -138 662 346 357 -902 758 507 -1133 886 -861 -64 -304 321 320 -1363 -810 -74 -654
1373 -654 135 715 -576 1461 -119 1115 -652 155 -1543 -874 -1185 -78 988 -958 -193 -702 492
1390 492 484 -1877 -527 22 2138 -372 -1786 -84 -1302 544 343 143 712 1629 1290 1090 -203 2318
1408 2318 -61 -56 37 -2323 1529 809 171 257 316 606 -1017 1063 2506 -587 1403 -830 679 1239
1426 1239 795 -2106 -1812 -279 -804 -1402 88 -549 -559 -724 -341 -1148 -360 -1052 2690 189 152 -720 -558
1445 -558 1223 -383 -759 321 -839 189 395 -379 1835 -728 -297 -677 263 1516 299 -241 -1327
1462 -1327 780 -61 -205 1233 1390 -2008 706 498 562 -2255 -1661 1663 383 -863 25 -333 -336 -1546
1480 -1546 -1499 430 534 617 704 594 238 -1157 303 -319 1433 -758 267 479 739 359 -1974 216
1498 216 -737 -1259 -533 -1033 -569 -852 -605 -968 -415 -512 1223 -330 -1281 -1264 -658 -1345 702 958 1156 512
1518 512 -1750 741 -832 -1553 -313 1950 117 -1124 -341 -1340 -373 892 -666 -2091 -589 679
1534 679 -368 1241 -26 -1067 -2101 -157 1755 360 -1780 -1182 -1148 1220 1984 -11 928 -597
1550 -597 962 -55 -2021 -1154 -659 -930 399 267 -159 -513 -965 -1532 106 -28 -302 -9 -84 -109 -155
1569 -155 -362 -1046 439 -1387 -1123 514 -59 409 1306 -1230 -1310 -653 119 -716 -2402 -177 112 -1698
1587 -1698 -1165 1354 451 281 509 100 445 -868 1827 -212 -908 233 -1096 452 803 -573 407
1604 407 1102 -90 -1020 -558 578 -367 814 1152 -524 2137 773 -1110 -432 -605 468 252 1742
1621 1742 -305 -371 384 -41 1018 -861 2642 -106 -1434 -2082 -568 -407 -733 -385 -831 -686 1040
1638 1040 -559 750 867 1715 601 -1955 -155 -225 1076 -394 221 -1093 -861 -1359 980 1089 1346
1655 1346 1196 100 -327 -16 2191 -1045 20 1469 -1561 -344 -34 39 177 854 2044 -936 -971
1672 -971 -829 955 982 -905 130 543 657 -529 96 -815 -896 294 -1377 989 99 339 407 730 -1419
1691 -1419 -238 1490 -162 -573 48 -400 -712 1015 -625 893 659 -2356 1355 1000 1007 583 1804
1708 1804 806 92 1080 -1056 1068 927 396 -795 62 -967 2016 -342 -1130 1205 1108 1777 -58
1725 -58 1062 1222 750 1872 1648 -2718 -94 1205 62 1723 -1409 1458 399 1715 1022 -447
1741 -447 1507 -302 -1712 53 -100 959 -1023 1971 615 -839 289 1021 414 -1305 2038 1146
1757 1146 1457 1795 -1407 -963 -906 727 -818 -1240 189 -307 -1600 -315 254 807 562 -264 250 -1242
1775 -1242 150 -295 801 1658 -1474 -279 -30 835 -207 635 -195 -196 248 -729 1409 -730 150 913
1793 913 -259 -573 -521 1945 385 1 499 418 -2 1165 6 1022 779 2273 -3 135 547 902
1811 902 -244 -991 -867 651 -922 -40 -586 677 618 -848 -1273 913 1443 1237 746 -1289 7 782
1829 782 -1173 -1291 345 -1231 150 0 -56 -804 -303 819 160 197 -259 -54 -1167 935 -698 1466
1847 1466 1207 -287 -54 1231 839 -1648 68 -227 1492 606 865 -538 59 441 13 -430 404 -908
1865 -908 332 902 377 -492 -239 -2290 2505 -581 139 -164 1410 -915 -491 542 1366 -1211 548
1882 548 -263 322 -2088 -174 681 -2899 -760 -670 -88 -1186 -888 59 201 -546 -563 -1359 112 2610
1900 2610 -1167 367 1877 542 1692 218 1272 237 1766 -68 -674 -8 824 -804 -1576 -901
1916 -901 1844 -228 -744 879 629 -924 -882 69 543 521 518 393 1331 -5 -883 -1105 -3301 -499 -1256
1935 -1256 -629 -599 2031 -431 2034 -644 135 1036 802 -853 -166 -1523 -243 50 -1143 -1566 -1685
1952 -1685 -37 -865 1642 761 -506 -1141 -125 1085 -1264 -370 742 453 858 134 719 -871 -186
1969 -186 -312 -1095 714 -719 -71 -886 678 465 85 -1469 399 177 -318 -63 853 209 90 795
1987 795 3 298 -563 -662 -352 -1352 -21 1556 66 71 -710 -508 402 -118 -505 1037 537 -751 -399
2006 -399 -169 87 -273 536 1674 -661 -474 -430 856 634 284 -783 322 710 437 367 -1668 -1479 150
2025 150 -1040 20 -221 280 858 -334 177 -671 -69 -530 -86 1109 1153 -169 806 288 967 215 -124
2044 -124 588 916 183 -875 -859 -170 856 -590 -1343 919 -321 -401 1808 793 1129 222 -558 -666
2062 -666 -2 313 334 -301 -754 143 -1454 85 334 516 -454 743 -506 1019 -481 849 1269 -501
2080 -501 -944 1046 -5 479 244 22 451 -109 759 717 394 178 797 656 -862 -315 -40 -222 -671
2099 -671 -426 994 -1239 255 537 426 -331 1182 1970 496 133 -1000 734 -211 -714 -1024 511
2116 511 -429 256 245 246 -428 896 -82 -1073 348 720 -715 185 -1006 -457 210 -971 -965 771 42 155
2136 155 -164 -991 -719 -1312 -221 -444 -679 1133 -89 -568 419 -1339 812 1220 1608 -297 1229 -395
2154 -395 -149 394 25 -799 -278 207 -175 -1148 497 -867 1035 -433 -1784 -598 1312 442 1267 1585
2172 1585 1281 -1541 -205 431 824 296 972 263 1548 412 -155 -1560 184 1518 -1178 160 1795
2189 1795 -155 -361 1531 -1135 -610 -304 -202 389 -627 -509 -383 618 -866 -375 837 -1020 -793
2206 -793 -837 -201 -949 -40 -1098 -36 -831 -1301 -192 -466 -820 -21 -652 1630 -113 919 168 -635
2224 -635 -176 -616 -152 -929 220 475 -565 -841 688 1335 -661 -300 -39 -53 127 -730 1404 1168 -310
2243 -310 -190 138 -950 -1479 1784 715 -152 -790 385 139 -629 -767 -358 702 307 -130 569 -796
2261 -796 2203 141 -92 -1099 263 -1646 1536 637 -1202 328 19 1266 -148 984 1424 -1430
2277 -1430 296 -943 -48 1639 356 -108 -221 1301 2376 -411 604 394 -1029 367 -92 -715
2293 -715 469 -492 513 -102 -368 -598 -591 -215 1509 1102 995 -363 -1195 4 699 -321 -697 847
2311 847 -230 -97 -1509 177 582 -1691 1313 -645 769 -602 -1727 524 -585 -997 1394 -377
2327 -377 874 128 82 -370 -666 -76 77 246 -547 -2808 -1482 -1336 1049 473 -551 -158 -765 -125 229
2346 229 -756 1259 956 -689 1711 -1280 51 -391 1610 -291 -179 217 -137 1545 760 -775 1185
2363 1185 455 1077 -1116 -599 831 -79 191 -778 1810 -286 -1082 -441 331 450 817 442 935 -491
2381 -491 -284 -104 1741 154 -885 1253 -700 1 444 1186 532 2451 357 710 -380 -741 -1676
2398 -1676 -477 1036 1315 200 1995 256 -28 -205 -443 -524 2523 -806 -1124 851 1490 -359 1061
2415 1061 -3 739 -1595 -741 741 890 -219 -88 -1492 332 1442 -1912 1004 713 -49 -134 800
2432 800 -407 -656 -1572 904 604 915 -552 337 28 -1595 -96 632 -70 1571 1354 1537 -313 -833
2450 -833 -1306 -1668 674 1263 -106 1334 846 -446 -547 -985 1036 -640 1129 -373 -560 232 -983
2467 -983 376 -918 -489 39 -462 1365 -555 -290 711 -999 658 -688 -13 -194 537 579 132 733
2485 733 -765 -725 -139 -224 1044 -1685 586 1610 45 256 329 415 43 451 -109 878 -138 430 -47
2504 -47 -1629 -451 46 -292 -486 -359 520 751 849 -1100 124 -764 1820 -1016 742 1054 103 1093
2522 1093 -1930 -179 -892 -1428 580 257 -24 -412 81 21 -45 840 1384 839 -916 426 -55 -1898
2540 -1898 994 700 -270 -2111 -493 768 -471 640 1602 125 1349 495 482 233 459 -18 -2096
2557 -2096 -2233 -823 1075 332 -345 1153 -307 1953 661 3105 -54 695 -642 -1255 -436 -599 -1362
2574 -1362 -21 1209 35 283 941 1197 -1547 -611 576 620 -737 819 -1640 988 -853 -140 -456
2591 -456 -447 203 -1585 -1483 854 2237 -719 -505 -776 -343 865 1804 -487 605 24 -671 269 -321
2609 -321 534 250 -802 1125 539 -1042 977 459 -436 805 1023 214 2168 -536 -641 473 400 464
2627 464 -1026 1777 344 1480 -966 1143 685 -566 912 -113 -484 -105 966 671 -589 656
2643 656 246 -205 2590 -1489 -69 841 -819 677 -327 1030 -671 1008 -1391 -516 -354 -1229 -565
2660 -565 262 -763 309 1759 -1853 1102 1006 -968 1339 566 155 -42 -101 259 -545 272 388 280
2678 280 -2046 -2087 -1662 152 1423 -458 265 -398 -710 257 -542 -522 1468 2179 184 2174 -89 1350
2696 1350 918 1090 -1124 203 -220 -1077 448 305 -203 878 953 1840 265 -525 -138 -1334 152 720
2714 720 1542 -469 405 -1883 -261 784 644 552 -1239 -732 -1354 2025 205 -1076 -1039 61 -782 1023
2732 1023 -100 -247 -136 -958 592 1374 -637 761 93 1856 -688 -1159 269 915 696 442 -718
2749 -718 -804 1690 -985 1298 361 822 183 1797 -41 725 -1448 -615 779 254 -1090 1057 142
2766 142 -270 -359 -425 494 -70 16 1074 -1985 233 -737 1443 -995 -239 1237 -1119 217 -479 1172
2784 1172 -304 661 -547 -400 664 -219 -452 637 -1726 -618 960 1323 202 390 -580 1686 -489
2801 -489 -635 298 -1674 -467 -742 -897 800 -93 -1144 319 -91 1606 360 -627 -37 69 1219
2818 1219 944 546 -477 -875 521 6 39 -648 -842 526 17 -926 -399 176 -148 -58 11 -478 1092
2837 1092 874 845 1011 994 -473 -1357 53 192 -1204 585 1388 -1424 -759 -301 936 1632 787 -931
2855 -931 1505 -267 331 -560 1364 -113 982 -27 781 1289 -127 -385 -645 -177 -1414 671 -302
2872 -302 -158 274 -514 -264 1420 235 910 -35 260 -870 34 402 459 1388 232 715 229 533 5
2891 5 760 -280 394 505 -968 1390 -1237 793 572 1352 -429 -887 163 -71 1389 -385 600 -663
2909 -663 -1202 -62 406 2684 -69 692 68 39 453 -241 -562 683 -703 217 432 -805 1136 -711
2927 -711 217 933 -850 -427 230 1548 344 -835 -80 1443 852 352 -238 146 -1723 407 646 683
2945 683 701 -400 1025 -1530 1791 1452 -1823 788 -1022 795 663 43 596 613 394 348 647 704 -183
2964 -183 -401 1110 616 258 323 1002 -243 -824 236 527 -149 836 14 -624 14 884 389 -525 124
2983 124 -573 -2135 233 1187 1739 630 -291 312 362 1429 49 -589 -765 -212 949 -668 -257 109
3001 109 -290 626 724 -294 464 497 -583 486 129 -1229 -1503 545 -374 527 706 56 1181 686 1776
3020 1776 -18 275 45 357 -65 -805 920 -1179 -1421 536 -137 1270 822 175 -458 313 3 -15
3038 -15 775 -813 -1000 1025 239 529 -796 498 -533 469 -41 492 -630 -343 92 -445 956 -475
3056 -475 670 -231 1065 -271 191 -686 1109 77 438 452 -93 1326 837 -1774 680 896 630 -502
3074 -502 750 -430 158 947 -1023 616 285 102 -720 -400 120 -1210 -65 -334 -243 338 -427 -910
3092 -910 -444 692 727 -378 -818 744 -1064 -80 1306 -1117 201 -25 -145 93 625 -1596 226
3109 226 -72 213 -549 -490 995 -1526 343 123 -839 333 475 -555 1121 -1508 -687 -42 327 -996
3127 -996 -990 -578 254 757 -1873 9 540 -525 129 -113 217 -653 -573 -505 787 -1172 915 1347 355
3146 355 754 -586 -65 723 -196 83 1250 -367 337 203 -35 -202 895 -1532 -540 -454 -742 223 540
3165 540 736 358 -636 674 11 201 59 374 -234 1813 205 1594 216 -1978 -491 -861 940
3182 940 866 -699 -140 648 -968 355 -694 589 -733 649 -211 25 -1467 -30 -937 -716 -555
3199 -555 939 -1218 1471 240 1587 -988 1393 -1114 18 779 773 -408 -1628 -727 866 -468
3215 -468 -829 297 80 745 -1299 -711 943 1735 -108 1783 -1580 259 -135 -869 818 1614 361
3232 361 -1179 469 527 1187 -530 -2249 495 29 41 -134 615 267 -875 -19 930 -198 -1509 171
3250 171 -333 1259 -550 2314 -278 53 -870 -747 884 -632 510 431 1507 -2 574 1005 107
3267 107 227 1321 -413 -1515 2 -801 807 977 -353 -925 -413 322 479 739 -525 -565 -1152 712
3285 712 -382 322 556 -596 -95 835 -754 -299 374 256 632 450 -798 903 426 -108 -506 847
3303 847 -469 -2452 227 1132 -977 655 -575 -1956 869 1445 -752 15 681 169 -2219 269
3319 269 1357 827 -355 565 1068 563 -521 927 829 -367 927 -469 62 1069 1183 787 0 1109
3337 1109 -250 1965 -297 -734 -855 -5 -446 1276 -349 15 732 493 507 477 -234 -1289 355 -327
3355 -327 -349 823 316 290 77 -1409 186 -395 526 909 -906 350 -220 1011 -1 -93 1260 -352
3373 -352 784 -76 -804 922 736 1364 1365 469 914 -353 -1229 176 -174 -1056 -176 407 316 -617 185 491
3393 491 1134 752 506 -31 1369 689 -987 1926 867 374 -28 360 -893 1131 291 763 -184 -1224
3411 -1224 -299 -402 301 -238 833 -7 -1083 497 794 -806 -105 -641 -395 -460 -1241 58 -461 -24
3429 -24 199 503 176 -920 -1737 -122 -268 -396 273 -422 -213 -160 112 743 270 502 655 682 53 -27 181
3450 181 466 547 668 -333 1076 -866 -252 -545 72 -403 -225 1243 1090 1109 -87 205 442 128 733
3469 733 232 590 -46 673 -579 295 -112 -808 -519 695 -314 618 -7 246 299 -659 -78 -1840 161
3488 161 893 604 -1798 -448 134 662 -392 -817 406 -433 -314 354 -1053 542 988 -1524 318
3505 318 -299 159 -631 -875 489 587 -236 -360 -613 -276 -1303 989 370 821 -1586 -1607 1394 46 -39
3524 -39 867 -706 -36 1496 58 -273 -1113 -1798 1053 -31 608 380 839 -188 -638 -1498 -143 -833
3542 -833 1164 1193 274 -712 8 -523 -1057 -891 4 -1075 1311 -1235 -32 1536 249 -145 401 -776
3560 -776 -1328 625 -456 -305 836 380 1454 1257 -1014 -185 -340 -138 -744 1011 -247 -138 1326
3577 1326 -918 -324 -597 -1022 -2760 -1040 124 1282 -304 -466 91 468 1512 -1005 41 22 87
3594 87 -1339 -739 531 -1906 -1586 -1036 -318 376 140 -1127 -491 -423 -104 -715 1099 313 456 -1546 1990
3613 1990 206 -2109 -175 342 472 -305 1713 1855 1386 -836 -84 246 801 -1186 -34 -90 -600 -524
3631 -524 625 724 795 -1226 221 -102 -203 570 -381 302 168 2370 -124 45 -632 21 -306 -1105 1458
3650 1458 659 -276 2688 -24 792 310 -797 -260 -205 -440 -1374 -1038 -654 -839 -873 -426 216 840 280
3669 280 101 -1502 -1960 714 2410 -516 406 890 376 -1720 1424 816 878 483 -707 -801 -386 126
3687 126 -1312 486 -34 -1681 -204 1342 543 654 417 -1052 -521 -793 -1378 -1199 -493 -659 620 953
3705 953 1577 2728 -910 630 -241 -2923 2097 1868 -719 985 3409 -460 -882 -138 -819 -840 -1262
3722 -1262 -1616 1954 -536 551 -954 211 987 2517 474 -1141 1166 -930 147 1402 596 1243
3738 1243 1309 -997 1270 35 407 -342 1419 -492 341 346 -608 278 -900 -294 361 -336 272 131 384
3757 384 1058 -123 -346 -1433 497 -2244 -216 -314 -331 1614 -1534 147 644 44 886 1076 -1719 -970
3775 -970 -2651 563 -228 993 308 -978 278 -1246 527 100 -256 -751 339 -764 1027 -988
3791 -988 -2252 -36 -657 792 139 365 592 282 -90 837 949 -108 -309 -748 -549 -802 -1409 -491 2153
3810 2153 71 95 417 -1087 -756 -371 -682 10 -37 702 1 942 -602 662 2027 -1533 1543 315
3828 315 563 -1312 -673 1917 -5 -265 -557 -517 -919 -619 270 105 472 -233 1312 747 1014 -146 -1149
3847 -1149 152 -419 -182 1469 1141 210 8 95 -495 472 349 -219 576 -630 356 246 1789 -456
3865 -456 1249 44 -260 379 -796 193 670 -188 294 236 -488 631 -385 -400 1686 1391 121 -665
3883 -665 -155 -431 -947 171 -871 483 -282 446 -52 213 -909 482 698 595 419 -1527 670 478
3901 478 -681 -1573 -295 152 -499 -975 715 -374 -539 -324 -781 -1007 -1319 102 -961 -642 1373 -461
3919 -461 1557 -917 144 104 2 1715 -967 -765 -838 -1738 -26 969 -417 -465 -2174 817 -169 -91
3937 -91 643 73 1331 -369 -65 518 -249 -167 825 200 174 466 -651 -1274 131 -1375 -136 396 2169
3956 2169 258 628 49 -1382 -1327 -854 -1091 -776 -744 -1473 -1226 -1332 1210 -915 977 478 -1245 -1780
3974 -1780 -179 -487 -194 -400 -1469 -785 -348 326 -485 -507 -586 -48 -1444 -446 2223 -1186 -958 -935 -630
3993 -630 -268 556 -421 -722 -393 170 -1112 -174 -950 -1533 1186 1506 68 578 -1626 146 381 1016
4011 1016 -61 -174 -1152 707 -951 814 635 -163 -161 -1182 -913 364 458 -366 -874 592 -1241 -804
4029 -804 -1663 -2354 288 -1166 179 -470 609 -147 -485 298 -612 -1079 601 456 -731 1236 -1180
4046 -1180 -1022 363 1743 -620 325 1655 -914 271 1175 940 -1369 623 1515 935 -969 -523 -194
4063 -194 648 -696 744 -499 -100 -309 -699 -1619 1507 1698 596 313 400 1203 -1962 1113 195 -839
4081 -839 -867 -121 -758 -114 958 -479 -741 992 2163 951 1079 -742 -662 2110 872 -1987 -675
4098 -675 630 299 832 2724 -345 -236 -116 -1230 -604 -343 -1945 -349 355 -535 2449 1139 681
4115 681 -990 -1881 59 -199 2134 -763 1656 -922 762 798 3281 100 -273 -848 -450 -2553 -671
4132 -671 377 -464 -371 -97 148 514 1224 738 -910 699 137 980 94 1599 221 101 -90 0 735
4151 735 1170 -317 586 -154 1627 486 577 -910 368 -2724 1064 -437 -531 -92 597 -873 897
4168 897 1045 -259 1425 -701 -533 -699 -1061 -1571 -774 171 2229 552 -1353 192 2685 -1103 2528
4185 2528 706 567 988 551 615 -325 1583 297 952 -871 564 1126 -2185 141 1824 134 308
4202 308 1590 -841 -1204 883 2252 -573 -699 -158 -954 -552 -985 55 -585 -197 -819 -41 -1149 -715
4220 -715 -869 944 -705 -1131 -84 1549 867 1105 1036 -83 131 239 572 388 1088 22 -1072 -289
4238 -289 1448 1840 390 -520 -1446 -35 -1650 -65 -33 743 223 1365 -297 1604 864 -919 -2276
4255 -2276 -1026 -2006 1101 -2197 -307 755 -1238 562 -641 514 -67 1796 -2571 1428 431 882
4271 882 -664 -861 719 -217 290 263 1470 303 434 -1152 878 -1482 -149 -166 578 -539 1191
4288 1191 627 736 1966 131 1618 528 788 -1268 -1219 -755 -515 233 453 290 -1227 1059 593 1044
4306 1044 583 904 -1744 -1809 -347 900 -2215 -1424 721 414 686 243 944 133 -794 670 882 -370
4324 -370 -203 -312 137 758 -481 666 -1809 -27 -705 289 2038 -894 -2299 -359 1071 -100 2067
4341 2067 -526 -161 48 -1410 -156 132 1615 -167 -1396 -266 -364 765 790 -762 -842 239 -393
4358 -393 1254 -142 -2047 682 -174 50 -2000 -184 292 11 1157 354 769 -1417 653 -1239 78
4375 78 400 882 1043 489 214 -2313 -2035 347 270 -373 -1427 1419 -201 364 965 194 634 -707 -991
4394 -991 -1731 -437 1291 158 -223 -633 -547 143 938 -1427 -743 1646 -870 -2450 509 135 768 -1708
4412 -1708 -79 -666 1220 -356 -1917 1801 -1411 -613 -70 -422 1177 -101 -946 1111 1730 127
4428 127 -252 -1540 -341 -31 211 -2022 -248 633 -1098 1258 -1553 -1211 -1847 -1455 790 835 -526
4445 -526 1512 1149 297 -279 -1958 1131 -1040 -148 -355 423 1207 2165 -352 981 735 -483 -1019 -529
4463 -529 -1250 -337 1510 262 946 -620 323 -58 -884 330 -2131 -236 1473 700 1754 1488 -934
4480 -934 99 464 -1033 -2488 -1104 -143 611 -730 -241 1334 -2661 -80 850 -1509 -965 1838 -3026
4497 -3026 -762 105 -77 -595 1258 345 -1131 1451 -1171 766 -66 -1393 -1557 -1921 351 -1137 2264
4514 2264 -799 -77 311 -978 -941 -77 1763 -1256 -900 -2010 125 -1319 -246 -39 -1177 653 592
4531 592 -1384 -338 106 1907 -442 1955 374 -1213 513 -922 493 552 1100 -2827 82 -1089
4547 -1089 -1307 831 -149 1331 1454 686 -345 -1413 461 -877 -2451 1680 535 -526 -79 -329
4563 -329 496 -947 -109 -1290 -607 -969 -2105 -1485 -1203 -241 718 -2659 -1272 -1838 354 892 405 -880
4581 -880 -1101 -457 -530 1133 384 -1385 -2296 -1268 1057 234 -1451 -1630 752 -460 1651 -272 -196 -93
4599 -93 -1011 643 -48 976 -19 -1016 -338 -902 2079 394 -1288 -354 -38 -1421 -400 950 -941
4616 -941 -573 -652 -673 478 900 -426 617 1216 1542 914 -913 302 -432 -1535 1641 -1671 -1059 444
4634 444 -1424 -1841 74 326 1034 324 -542 831 -2370 -395 -741 130 -730 544 1106 548 205 816
4652 816 -1754 -428 -522 -710 -355 -1605 581 -1196 1751 -1154 -1428 -1495 174 1072 -618 1092 -226
4669 -226 -785 -614 -300 -67 -571 191 -424 54 -422 -1643 396 171 -1562 -910 671 -664 -1884 101
4687 101 -815 1687 -190 -679 1136 -888 673 -211 -703 1081 1008 -1070 -157 -1270 350 -358 -328 -258
4705 -258 -1015 215 1534 1631 -459 -336 1052 -793 -546 -2032 1739 490 -902 1580 82 -4 458
4722 458 -386 -586 -1209 -678 -244 -362 -2828 916 1256 -672 858 678 110 -2084 -317 -1235 206 -622
4740 -622 633 -993 525 709 1573 447 823 -705 405 -3168 -2147 -758 -11 -1458 -1180 831
4756 831 -674 -1486 -309 -1289 -2917 -1472 310 764 -201 -268 512 -133 -930 -2235 653 -951 297
4773 297 315 -556 344 -465 562 1285 414 742 985 1639 -609 -1844 -876 -299 603 956 -694 -506 724
4792 724 1780 -574 -420 1201 961 -105 -684 168 177 916 -560 -1676 1280 34 1333 -91 -33 -2362
4810 -2362 1443 634 -833 -378 811 351 402 704 328 390 2269 -1080 -589 -181 -565 -127 -517 148 1205
4829 1205 -606 -1628 -81 128 1077 -394 -2131 387 631 68 632 -536 770 577 593 -1446 -440
4846 -440 -617 -1478 290 866 -1022 -704 -892 -744 1145 1446 -60 -139 -358 -257 1301 139 -1290 984
4864 984 321 728 -593 -449 -163 -1278 -872 630 70 -186 -1108 240 -813 -26 -2018 -1229 -446 298
4882 298 -297 484 -320 -570 1183 876 39 2580 -698 1067 -1992 -1532 914 -1045 454 552 719 -749
4900 -749 1530 -95 -302 -91 53 -2542 1098 1005 1333 -2076 504 -341 -78 -125 221 -452 2067 541
4918 541 259 -699 597 342 408 -44 -1013 -1228 -558 -1321 -384 337 -2422 224 85 70 1525 -678 -1920
4937 -1920 367 483 734 -292 737 -1939 -932 -829 670 848 -751 353 760 284 -1198 637
4953 637 488 -21 340 1675 279 -634 228 -528 -1132 824 1028 -905 55 -534 1757 -1234 634 -1433
4971 -1433 -33 -29 1158 -785 2212 646 -142 482 -1507 -560 -1070 1012 -1139 -574 1302 1023 219
4988 219 -1204 1316 -1025 1479 -4 -752 166 -175 107 634 -1735 -497 -2032 1053 266 704 119
5005 119 -751 2177 1140 856 -2489 -509 -79 1084 744 -20 188 327 295 988 247 -1956 3378 77
5023 77 -993 -1579 -68 1644 -1156 -885 47 -1093 -740 -57 -699 604 119 -399 -448 95 1782 1561
5041 1561 850 -1178 -1786 -275 -448 -1855 -187 2282 109 62 -248 -1883 -194 52 -40 -1627 223
5058 223 741 -586 -1279 349 3070 796 264 -568 814 -2049 264 -1007 -298 304 137 -980 -3602
5075 -3602 -201 -1112 -127 1160 256 862 651 177 153 546 -474 -1107 923 -432 -311 975 426 -900
5093 -900 -1152 -116 -1356 832 505 -675 -2022 -360 422 -1259 -493 -384 -532 1099 -756 613 -392
5110 -392 -1060 429 1808 -857 -1439 -156 2029 730 -2760 1082 114 -1350 301 -57 -378 1336
5126 1336 -2677 366 340 313 -1044 1713 -802 235 -1359 -1317 -760 -243 970 1038 -2015 291 585 295
5144 295 1830 -85 -784 18 782 -1321 1956 2100 727 896 1373 159 492 748 -471 606 -354
5161 -354 1639 -878 -19 1826 -345 -753 -116 -207 -674 -1585 36 998 -547 -1349 1155 339 353 9
5179 9 2747 -171 -1719 -354 145 1045 -295 -841 -2581 -1189 299 362 -1148 1258 -796 -659 -1237
5196 -1237 -2093 1194 237 -764 -864 611 -1397 -1414 36 -1162 -435 8 18 1163 120 -601 1212
5213 1212 -534 467 1505 -1001 -372 367 -2087 -1017 -1278 254 303 -1094 -347 -47 942 233 -226
5230 -226 281 -73 1290 947 -681 -162 1605 -1528 923 31 1242 -1044 -1 -1332 813 -470
5246 -470 -1048 -459 -559 -161 1296 334 -381 -4 -1269 -563 -328 1335 -23 530 569 -1350 418 -869
5264 -869 136 71 -499 1811 179 1022 -621 -583 -2025 -134 -1829 694 549 -878 -35 1265 -567
5281 -567 -11 -264 -545 1825 466 488 -1460 288 1027 1753 -549 299 397 -671 -1507 -722 849 -1483
5299 -1483 244 1192 -43 542 -420 1402 -230 -620 417 -492 -1435 -1939 -234 1242 -1387 -102 1048
5316 1048 229 312 427 82 645 -2359 -493 1027 -966 -340 -90 -2190 217 967 -462 769 -529
5333 -529 2179 406 3093 -1419 -68 628 1479 -675 1224 837 1256 220 -584 1050 1593 1276 -115
5350 -115 1932 -87 30 429 0 200 -98 -161 935 -1058 250 -264 1010 240 452 -160 -314 -104
5368 -104 878 -41 2331 -458 -945 395 -537 1723 -1309 68 1600 -85 -156 189 -848 1336 683
5385 683 674 -331 227 304 440 -709 966 352 -1173 1011 -374 -1399 942 -165 1095 81 -329
5402 -329 801 -72 354 -1062 151 1211 396 740 947 386 194 -215 -179 -813 -810 441 -683 1544 -98
5421 -98 -130 -1222 520 -1354 -1195 97 1164 -886 -838 1004 -796 -273 -2000 223 -1023 1289 -544
5438 -544 -498 -2391 807 -87 -341 -684 -1539 562 -1140 831 -1122 -1036 -830 455 382 1687 1084 -1721
5456 -1721 343 696 1148 1507 -43 545 -956 150 1072 531 571 111 406 320 -1662 -172 1784 696
5474 696 419 849 2464 -947 -1216 -658 -133 -1295 924 1122 -651 773 1963 11 -2683 -259 -1568
5491 -1568 -718 538 -964 1282 -892 -29 -1292 300 -574 55 -113 -1220 -918 -1252 1529 -172 1945
5508 1945 -1047 164 406 -252 -730 213 -614 -1087 1156 493 -28 -1209 246 -329 -248 312 1022 -431
5526 -431 -953 566 312 -355 1297 -1717 -197 1312 -676 2058 821 -350 -525 -342 -601 -372 60
5543 60 -641 65 -1600 895 -144 -1425 34 -468 1236 -1364 -554 -612 26 45 -1737 -46 -146 -1191
5561 -1191 -233 -1512 52 984 -269 -579 1320 -602 1772 -1778 -1867 67 -1247 2152 -284 636
5577 636 -2871 1384 50 1119 999 34 -188 476 -242 1382 410 -854 1386 560 -337 -841 552
5594 552 -847 -162 -1176 246 -268 445 -2465 -2454 776 -358 691 -846 -521 992 -1479 365 805
5611 805 -966 -849 358 1738 -105 -329 -132 -655 -626 -207 1631 1537 -1208 -1404 -528 -1023 158 8
5629 8 1284 -182 -482 -1192 290 -775 -1377 56 1 934 -262 -414 -1564 -1087 642 993 -312 -208
5647 -208 -608 -1103 469 -769 -1348 977 1647 94 -1382 -491 -1033 -357 203 -1495 -1351 -156 188 -62
5665 -62 -262 -7 -561 -544 -114 32 709 -165 512 -731 -443 -675 528 -830 649 855 -235 -19 -336
5684 -336 1033 -1031 -1924 -1088 79 -1766 301 -2200 107 336 -961 -311 -451 2123 129 439 966
5701 966 1066 -377 1108 1084 -684 1137 -908 -1037 -275 357 -1323 -726 22 767 -125 1495 -636 1106
5719 1106 -812 719 146 -604 1517 678 -621 -1003 1484 -301 -269 855 2198 378 141 1676 -57
5736 -57 430 124 1657 -22 1858 -562 -1054 -130 -2013 -651 -730 903 -1005 1803 -1498 658 231
5753 231 456 1409 -842 -235 -646 782 -1035 -1345 -334 580 -426 -1385 -2051 393 -1825 -1286 -1482 61
5771 61 705 339 1789 619 -240 106 -1147 465 -2995 -360 1052 -299 1151 -1542 -1245 -2108 178
5788 178 -705 -953 -592 1570 487 -334 -12 57 -512 827 1783 -1092 -1184 366 518 612 -1312 -31 -1988
5807 -1988 1152 -337 541 242 199 -463 311 -2041 78 194 205 92 27 -598 -744 823 457 1228 84
5826 84 -938 -1126 -1050 -340 81 1702 -194 204 802 78 -144 2541 1160 -207 790 -430 -1225 -1892
5844 -1892 708 272 51 998 -1206 326 678 67 -133 754 969 242 1645 -264 -834 -114 -1129 -226
5862 -226 170 72 321 -647 -82 -1465 -391 9 -3 673 -660 -506 661 -7 1135 -338 -536 -397 374
5881 374 844 1019 -479 24 -1237 329 474 -375 -658 163 -207 -49 -331 -1663 1238 293 -1593 269
5899 269 -914 377 -246 -881 -171 -293 -353 -162 -334 -862 1223 1098 -338 -51 -659 -1032 -303 1201 1432
5918 1432 164 725 -69 531 -11 -360 -216 172 431 962 -236 358 -359 -1695 38 416 240 -109
5936 -109 -208 -769 362 -1638 484 -920 156 360 321 501 -172 730 979 938 -1026 295 1378 742
5954 742 -1945 76 524 -446 132 1710 -129 -30 729 -540 -1249 -695 -450 737 -111 -803 98 405
5972 405 -1129 1364 390 258 51 -2373 -878 -1357 664 441 1122 -626 -926 -468 442 -847 81 -484
5990 -484 456 1030 432 314 1013 2034 -1269 -387 -822 -404 153 -553 14 -832 508 -223 -325 -421 -653
6009 -653 50 897 746 -1065 -27 340 -571 1191 -634 850 540 75 492 294 292 1794 1961 -2312
6027 -2312 17 1755 -300 -469 -303 606 1162 -470 -899 186 -1686 394 -733 -391 -1452 1410
6043 1410 605 -1519 2522 -505 225 -538 -1190 951 -454 1542 850 1873 -526 1454 1976 1478 -346
6060 -346 574 -537 -505 885 1116 558 168 -49 163 -214 -663 -743 -123 -2377 -61 -831 1168 75 1237
6079 1237 829 1173 -1243 -752 -92 1093 595 -681 -526 -662 -1414 218 2900 1583 716 1627 1160 -1458
6097 -1458 -639 210 -904 314 -337 -74 -506 -862 303 -381 -1950 -582 -73 1000 -811 -286 -98
6114 -98 -1000 -72 -1374 -269 -151 318 337 197 922 2517 1160 236 220 -2042 147 -1289 211 -942
6132 -942 580 1129 516 -381 211 1065 -1387 -1088 -504 -133 -248 800 -262 2010 -599 1466 176
6149 176 -2245 -464 -710 250 -1521 725 -819 -1364 -1003 12 -996 641 -1663 910 420 -908
6165 -908 -1062 -722 577 912 1052 967 864 1056 -483 11 -115 934 619 104 -871 1750 1359 -1243 881
6184 881 -2701 317 519 791 -875 21 -867 -880 374 78 235 -1501 211 -74 -1015 -1442 158 -498
6202 -498 -36 -1561 -921 -82 -152 712 327 280 -820 1364 -786 -1444 657 793 74 -46 -1115 -549 471
6221 471 -921 1092 1330 1029 1860 512 719 -744 1298 2217 -690 -39 -616 -524 629 715 458 506 -182
6240 -182 -30 -288 -1 -1129 107 46 614 -569 794 -177 342 677 459 482 -289 1304 443 -257 568
6259 568 708 1217 -101 1571 912 -937 344 38 302 -887 -1082 -864 -1439 34 -66 -1374 1888
6276 1888 -573 78 3044 669 10 -1046 -949 -291 -1142 -132 864 -1268 87 -1405 -178 -740 533
6293 533 -280 41 -2352 316 -407 -1197 635 -1267 -4 -690 1067 1797 1128 -1398 -246 -1258 -938
6310 -938 -351 286 15 -1406 -1303 -940 885 493 -1424 1475 -125 404 -854 -94 20 453 1129 93
6328 93 1508 397 -701 -997 813 402 506 -183 176 -735 1075 495 265 316 807 1139 133 129 -1066
6347 -1066 -373 459 864 521 104 -9 86 256 682 -1313 244 409 -368 1042 736 -597 -402 1690
6365 1690 -50 677 806 905 1734 878 -580 546 -1277 -2046 513 -85 433 779 644 58 574 -1896
6383 -1896 1313 1417 -731 -1547 1253 -205 745 738 577 -618 -252 201 -1471 -43 -1022 783 -170 357
6401 357 -570 689 -480 -1256 231 187 -419 -523 1726 80 -488 -569 201 -828 -1019 -369 382 -267 628
6420 628 -1096 -813 -1009 677 -425 -1862 -343 -1525 -410 -1011 564 -481 -1529 -2339 481 1557
6436 1557 848 1086 193 -328 260 -1942 1146 -1178 -2184 -154 -1840 -263 798 -658 1002 1394
6452 1394 -1555 437 365 -196 -914 -414 81 -213 -189 1740 -537 -705 982 145 2029 -518 555 -1483
6470 -1483 1738 1018 926 -230 1249 -612 -1107 606 -186 -390 20 48 248 -515 -2366 687 -1572 -771
6488 -771 416 -88 -1642 -768 -285 -1368 -258 1043 -174 -1961 2302 -346 324 -321 -756 -1953 1478
6505 1478 383 -1798 3228 1642 -248 399 -2368 838 -1194 -1800 743 -536 641 -348 -47 -828
6521 -828 -1243 -2111 544 -1004 -282 -128 981 -841 -1509 -345 1095 569 47 -105 320 107 423 -1870
6539 -1870 1545 -323 1145 -861 1753 -2684 572 -938 -1402 909 -1652 -981 -769 -643 -216 32
6555 32 1141 -162 101 -84 1785 -1184 -428 -1133 -1361 -438 997 -572 -73 -4 996 -2771 99 605
6573 605 -1125 -1637 -1477 -1290 1461 -1150 268 -341 -1571 1892 118 256 286 -832 794 3417 137
6590 137 -601 -508 1451 318 971 369 409 324 1719 1919 -399 1086 1534 52 -732 -425 367 273 -1290
6609 -1290 -1069 -218 -606 -53 -916 -103 345 -639 -6 1684 647 1853 -950 -1004 961 -1768 151 -676
6627 -676 1100 396 -2034 470 366 571 276 732 679 1696 -362 -946 813 1505 -1133 173 -113 294
6645 294 -43 -536 -351 570 1195 1417 -1070 831 1784 125 15 1966 219 56 -38 -218 -1226 -1204 1483
6664 1483 -587 967 -2349 -900 877 753 798 -386 26 235 3176 637 -526 2120 -507 286
6680 286 927 -1327 -1188 667 -224 -1135 -132 -1257 462 -1871 1020 1082 -309 -2797 -2171 -578 -796
6697 -796 -180 -1234 352 -1221 371 -962 -825 -278 -404 128 953 -157 -836 -621 -2086 166 924
6714 924 -275 1111 52 791 -734 -987 -361 -327 2589 -691 1426 -1579 -2493 629 782 -865 -1358
6731 -1358 -332 -419 -281 700 -234 804 2009 1344 450 -748 784 -407 -1009 846 -1117 268 1315
6748 1315 1212 2394 81 -1569 1470 -570 1215 1551 -824 -2020 -333 -1305 1045 59 -790 461
6764 461 362 223 185 2010 1052 -924 -590 97 1328 -128 206 -1044 -1310 1103 724 384 488 -1762
6782 -1762 -800 79 -641 -936 1260 -554 368 -800 -663 542 408 70 -340 -614 1361 915 -171 -521
6800 -521 -10 933 229 126 -359 -143 1139 902 -1262 136 -366 187 -936 -936 1014 725 -509 -1128 -764
6819 -764 -106 552 -886 569 1149 -7 -173 695 69 -58 338 -1891 353 246 417 755 -110 -1303
6837 -1303 1174 833 -702 497 61 479 344 612 5 1022 -516 -716 131 1618 787 -286 18
6854 18 347 -872 -767 -490 1100 -160 555 -1361 -197 237 -899 -41 1381 -1579 -7 1410 -701
6871 -701 144 -133 -203 -1211 -658 -176 69 -276 -911 1447 -47 -500 335 -14 176 -725 -635 -117 -54 680
6891 680 -461 -854 -226 -528 646 211 758 -810 -137 -17 -478 -1705 -196 187 -808 -520 -607 145 1563
6910 1563 -707 145 -299 -1178 634 376 -182 -116 236 326 823 528 -194 -193 -828 21 88 44 -773 -25 142
6931 142 411 -127 -119 686 -614 1176 -423 314 467 -894 -884 3069 809 132 -171 22 1088 1769 796
6950 796 -221 682 1666 146 -1210 242 -937 -182 92 -310 316 143 409 -294 325 -65 -294 121
6968 121 -67 -310 -1080 1298 1404 -664 -1627 166 1242 -1044 -893 -765 -1083 53 1075 -1672 -293
6985 -293 1131 3332 -823 107 1142 -970 782 70 1024 1387 -464 60 -1135 1457 -186 -603 -282
7002 -282 777 319 -84 1220 773 -242 283 249 1020 -39 2563 414 -1391 2568 710 1432 346
7019 346 -132 -501 74 -615 2559 1362 -399 1442 2499 -562 570 -785 -538 81 523 -164 369
7036 369 563 1541 -1566 523 -525 -519 196 1430 -483 -1126 -413 -335 849 -210 -485 765 -412 1538
7054 1538 986 642 269 3800 720 514 348 236 1593 -281 1472 1841 1189 -453 187 547 323 -925
7072 -925 -249 1034 608 -280 156 -190 1202 1169 1329 822 -311 -136 586 -395 -1701 -522 -324 261 221
7091 221 229 -217 -674 297 2 1157 187 -798 -179 -803 -1181 1015 -1083 1129 -820 -464 -340 -1739 527
7110 527 -1156 86 -1228 -476 479 -653 -479 -499 778 -2514 2202 -712 -13 291 -1303 528 -367
7127 -367 175 465 -492 -1265 -226 -153 -278 1347 -1455 -484 -1964 -1653 1841 -320 -775 -559 -1476 291
7145 291 52 432 -726 -323 -1916 -644 1153 -685 1806 -72 -171 -2212 -1321 -586 188 217 -2185 143
7163 143 813 -558 261 1022 -1360 -1741 940 647 1554 169 -824 -351 -347 894 -84 -255 1825 316
7181 316 731 -822 -526 416 1060 816 -507 -1992 -80 1821 -357 -1195 940 -650 440 760 -453
7198 -453 -1127 191 -1132 -1048 631 -202 269 1030 -293 -559 227 -147 -1370 1747 34 -325 589 336
7216 336 68 -71 -1150 203 517 2572 -545 -823 55 1205 1059 -1444 -147 -735 737 518 1629
7233 1629 1454 447 -18 1825 -535 289 -586 -1730 -1809 -12 -888 489 -1106 -1156 -761 -1645 99 -249
7251 -249 -959 -1515 -399 322 -1399 9 636 -87 1116 509 1648 -1053 1721 1372 -1622 1863 916
7268 916 -129 -1754 226 508 809 -1621 -2045 -153 -657 443 1139 485 619 -1599 -235 -1288 66
7285 66 -757 804 -454 -1273 2299 -863 -1312 115 1446 1050 564 -1009 -660 -381 660 -2059 -1634
7302 -1634 1847 798 520 439 551 -240 877 442 -1877 -1355 1033 787 -1887 1766 965 1334 -302
7319 -302 -1223 -1176 -525 800 539 -208 -1292 -1346 -701 -1075 -334 604 -433 -414 28 811 -153 -74 1470 -1570
7339 -1570 -1835 -346 -1159 880 -330 94 -581 305 -42 -1194 1632 1012 -109 -469 1006 -1286 842
7356 842 -121 419 -448 -688 370 189 1787 -117 396 -1006 -111 -1211 -2801 618 -193 -1361 241
7373 241 45 104 -603 1287 -1605 -240 -462 -1641 796 1067 -2068 851 -526 801 1180 -1168 1453
7390 1453 -879 -333 -267 -123 -1358 36 -652 -874 529 907 86 -442 390 -551 657 682 -454 293
7408 293 -1413 -35 -1010 274 241 273 -622 478 -16 -251 238 919 -1614 1177 1280 -1132 -617 -433
7426 -433 -33 706 -1112 -485 -853 -78 -195 -1690 30 -59 1207 1506 529 231 939 -222 658 -1523
7444 -1523 -695 -737 67 -1187 569 -1091 -81 -1828 143 -97 65 -494 -1482 -285 240 -501 -811 -96
7462 -96 1040 1252 -240 374 -127 -885 -215 -457 662 761 -1295 -103 -498 -1853 -364 -161 934 19
7480 19 -1764 -406 -419 -1857 -98 1245 911 -378 -3054 -880 757 -1065 654 -1443 1377 -1001
7496 -1001 -937 -1122 -872 869 405 -426 -563 2915 724 238 43 2060 973 -2488 -50 338 151 710
7514 710 389 -1573 -632 -132 357 -532 -683 -520 -1626 2012 337 139 144 1245 -1935 -1159 -1089 655 1231
7533 1231 897 1510 1376 -492 -1839 -440 320 1574 -1225 -853 -138 6 1847 -166 1816 1434 636
7550 636 2161 -1283 419 -1165 104 -501 1399 1508 -1541 -995 1792 516 -223 -739 729 -677
7566 -677 -2166 -1645 -381 -626 2111 -1203 553 -179 -502 -320 -1537 -1111 95 -353 -1084 -808 -1538 -964
7584 -964 1558 -936 464 1143 -1628 2554 549 834 608 309 1427 16 -1064 -719 43 -645 -409
7601 -409 564 646 -646 721 -101 -1716 -420 -664 1128 -1066 -967 407 -135 1770 747 -1728 641
7618 641 -73 664 48 762 -624 -1193 -27 582 -246 -1048 1357 924 -196 -807 -251 552 1569 -276
7636 -276 -45 -584 -11 19 -292 1377 -224 -1529 -72 748 -92 268 -41 -428 -2373 -1956 -1007 400
7654 400 890 -741 133 1934 1677 -80 1563 466 -84 816 -1054 -306 110 -360 -395 458 -292 -1009
7672 -1009 82 -995 -373 -244 84 -582 -645 -317 -1465 -1143 -201 750 -556 -1087 238 81 -187 -2324
7690 -2324 402 -868 -446 -9 -498 -230 -1280 -2267 -21 549 355 1320 329 -186 -531 -174 231 807
7708 807 706 443 217 -955 368 -841 -421 67 -754 241 -447 118 408 175 488 264 770 868 -878
7727 -878 -334 285 -168 2162 773 320 -1397 120 361 857 541 379 200 94 731 114 813 845 -460
7746 -460 1007 505 -621 1344 1178 411 1526 223 -1333 1594 914 412 -877 -37 2418 495 426
7763 426 151 1126 -561 1417 1823 -593 -128 -189 -674 405 -2148 -807 -817 -379 109 185 -144 968 -321
7782 -321 -920 2073 116 870 939 -1724 942 -415 323 -334 -791 -1027 143 287 -490 1466 -232 -2134
7800 -2134 -134 2122 -175 -260 484 -2103 -238 880 -416 -684 -570 -38 -611 -76 -1327 -1023 -57
7817 -57 -2103 587 -1642 -342 -1849 -247 723 -144 315 96 951 -69 -21 -483 -1019 -326 -852 -1168
7835 -1168 463 -692 114 1265 254 800 1740 1130 1371 -2061 945 -617 2036 -42 393 326 -1390
7852 -1390 570 -64 722 -871 1958 -1458 -458 240 -745 542 -644 -1233 -2055 -693 -953 1848 1562
7869 1562 -223 506 119 1224 151 1403 -845 1573 -946 -324 -706 -1788 354 666 -588 -703
7885 -703 1695 355 655 -1547 1081 735 860 319 -1375 -599 1104 1009 -77 1097 586 3 -513 1262
7903 1262 316 -860 -828 276 1116 1120 1168 40 1736 -635 113 129 54 -125 -252 -1362 1718 -498 -862
7922 -862 424 -2498 -222 358 -769 -356 1555 -437 -800 -431 -1832 2467 286 1426 -959 -918 424
7939 424 -1601 440 -1009 -1012 698 -1009 -149 972 242 -875 957 933 -773 -1232 -482 -707 -517 -1172
7957 -1172 189 823 -76 497 -276 2328 -507 -1403 91 961 578 -75 130 965 -1104 22 238 559
7975 559 -409 384 101 -147 166 999 383 1006 967 -242 43 658 563 199 529 77 -1102 66 449 -477
7995 -477 842 768 868 -726 1271 -563 1141 348 281 -838 -1851 -20 249 -819 -11 -163 -3194
8012 -3194 -95 592 873 -567 -242 261 15 518 475 -324 -495 -1578 -624 64 656 346 1057 344 845
8031 845 1180 -1826 185 1120 1119 734 568 -408 2 595 456 -462 1519 1473 -1838 564 245 -1475 -981
8050 -981 -794 -409 1115 -296 943 508 -154 212 -546 854 2608 -1897 241 -1183 569 98 1914
8067 1914 -60 -1063 -582 -41 276 -684 529 1010 416 -198 -90 -854 262 -937 -1399 1187 -34
8084 -34 -892 560 -9 1247 89 -602 -110 359 192 778 -848 82 -1347 -139 758 667 1237 57
8102 57 555 -340 2889 1349 -53 -880 -699 1135 10 -451 944 -529 858 -1783 2133 120 175
8119 175 404 136 1672 13 -345 2180 1122 -296 1526 1337 1474 351 -371 -388 417 1953 -557
8136 -557 -280 -111 -1287 629 -442 -764 -300 -867 -659 251 1721 996 -783 467 -1232 67 1081
8153 1081 -1859 -335 942 -1541 -313 -908 -600 1954 -3068 824 901 1289 945 -1269 2282 -664
8169 -664 665 81 -374 -735 -767 -95 -1067 412 155 -677 60 -1143 603 -880 690 -692 306 721
8187 721 167 1385 512 826
8191H26
##END NTUPLES=NMR FID
##END=
