##TITLE=1H_DE-26b_TFA
 DMSO-d6
 64 sc, 
 12.1.2024
##JCAMPDX= 6.0         $$ Bruker NMR JCAMP-DX V2.0
##DATA TYPE= NMR FID
##DATA CLASS= NTUPLES
##ORIGIN= UXNMR, Bruker Analytische Messtechnik GmbH
##OWNER= root
$$ XWIN-NMR		Version 3.5
$$ Fri Jan 12 14:46:57 2024 Russian Standard Time (UT+4h)  she@DPX200
##.OBSERVE FREQUENCY= 200.1313
##.OBSERVE NUCLEUS= ^1H
##.DELAY= (6, 6)
##.ACQUISITION MODE= SIMULTANEOUS
##.ACQUISITION SCHEME= undefined
##.AVERAGES= 64
##.DIGITISER RES= 18
##SPECTROMETER/DATA SYSTEM= spect
##.PULSE SEQUENCE= zg30
##.SOLVENT NAME= D2O
##.SHIFT REFERENCE= (INTERNAL, D2O, 0, 15.7039)
##AUDIT TRAIL= $$ (NUMBER, WHEN, WHO, WHERE, WHAT)
$$ ##TITLE= Audit trail, XWIN-NMR		Version 3.5
$$ ##JCAMPDX= 5.01
$$ ##ORIGIN= Bruker BioSpin GmbH
$$ ##OWNER= she
$$ F:/spectra/data/she/nmr/H-F/1/audita.txt
$$ ##AUDIT TRAIL=  $$ (NUMBER, WHEN, WHO, WHERE, WHAT)
(   1,<2024-01-12 14:45:45.42 +0400>,<she>,<DPX200>,
      <continue with go, POWCHK disabled, PULCHK disabled
       configuration hash MD5:
       00 E9 B6 7A A2 85 ED C7 34 08 36 98 17 FE 4E 26
       data hash MD5: 16K
       19 49 D6 E8 4A A8 AE C9 4A 81 D1 26 65 1A 2F 14>)
$$ ##END=
$$ 
$$ hash MD5
$$ 6D 2A D4 27 01 CB 76 26 6D 2D 0C A2 5E A3 6C BB
##$RELAX= 
##$RELAX= 
##$RELAX= 
##$RELAX= 
##$RELAX= 
##$RELAX= 
$$ Bruker specific parameters
$$ --------------------------
##$DU= <F:/spectra>
##$EXPNO= 1
##$NAME= <H-F>
##$PROCNO= 1
##$TYPE= <nmr>
##$USER= <she>
##$AMP= (0..31)
100 100 100 100 100 100 100 100 100 100 100 100 100 100 100 100 100 100 
100 100 100 100 100 100 100 100 100 100 100 100 100 100 
##$AQSEQ= 0
##$AQ_mod= 1
##$AUNM= <au_zg>
##$AUTOPOS= <>
##$BF1= 200.13
##$BF2= 200.13
##$BF3= 200.13
##$BF4= 200.13
##$BF5= 200.13
##$BF6= 200.13
##$BF7= 200.13
##$BF8= 200.13
##$BYTORDA= 1
##$CFDGTYP= 0
##$CFRGTYP= 5
##$CHEMSTR= <none>
##$CNST= (0..31)
1 1 145 1 1 1 1 1 1 1 1 1 1 1 1 1 1 1 1 1 1 1 1 1 1 1 1 1 1 1 1 1 
##$CPDPRG= <>
##$CPDPRG1= <>
##$CPDPRG2= <>
##$CPDPRG3= <>
##$CPDPRG4= <mlev>
##$CPDPRG5= <mlev>
##$CPDPRG6= <mlev>
##$CPDPRG7= <mlev>
##$CPDPRG8= <mlev>
##$CPDPRGB= <>
##$CPDPRGT= <>
##$D= (0..31)
0 1.2 0 0 0 0 0 0 0 0.06 0 0.03 0 0 0 0 0.0002 0 0 0 0 0 0 0 0 0 0 0 0 
0 0 0 
##$DATE= 1705056115
##$DBL= (0..7)
120 120 120 120 120 120 120 120 
##$DBP= (0..7)
150 150 150 150 150 150 150 150 
##$DBP07= 0
##$DBPNAM0= <>
##$DBPNAM1= <>
##$DBPNAM2= <>
##$DBPNAM3= <>
##$DBPNAM4= <>
##$DBPNAM5= <>
##$DBPNAM6= <>
##$DBPNAM7= <>
##$DBPOAL= (0..7)
0.5 0.5 0.5 0.5 0.5 0.5 0.5 0.5 
##$DBPOFFS= (0..7)
0 0 0 0 0 0 0 0 
##$DE= 6
##$DECBNUC= <off>
##$DECIM= 32
##$DECNUC= <off>
##$DECSTAT= 4
##$DIGMOD= 1
##$DIGTYP= 9
##$DL= (0..7)
0 120 120 120 120 120 120 120 
##$DP= (0..7)
150 150 150 150 150 150 150 150 
##$DP07= 0
##$DPNAME0= <>
##$DPNAME1= <>
##$DPNAME2= <>
##$DPNAME3= <>
##$DPNAME4= <>
##$DPNAME5= <>
##$DPNAME6= <>
##$DPNAME7= <>
##$DPOAL= (0..7)
0.5 0.5 0.5 0.5 0.5 0.5 0.5 0.5 
##$DPOFFS= (0..7)
0 0 0 0 0 0 0 0 
##$DQDMODE= 0
##$DR= 18
##$DS= 0
##$DSLIST= <SSSSSSSSSSSSSSS>
$$ [...]
##$SUBNAM2= <"">
##$SUBNAM3= <"">
##$SUBNAM4= <"">
##$SUBNAM5= <"">
##$SUBNAM6= <"">
##$SUBNAM7= <"">
##$SUBNAM8= <"">
##$SUBNAM9= <"">
##$SW= 18.0517328524113
##$SWIBOX= (0..15)
0 0 2 0 0 0 0 0 0 0 0 0 0 0 0 0 
##$SW_h= 3612.71676300578
##$TD= 16384
##$TD0= 1
##$TE= 0
##$TE2= 300
##$TE3= 300
##$TEG= 300
##$TL= (0..7)
0 120 120 120 120 120 120 120 
##$TP= (0..7)
150 150 150 150 150 150 150 150 
##$TP07= 0
##$TPNAME0= <>
##$TPNAME1= <>
##$TPNAME2= <>
##$TPNAME3= <>
##$TPNAME4= <>
##$TPNAME5= <>
##$TPNAME6= <>
##$TPNAME7= <>
##$TPOAL= (0..7)
0.5 0.5 0.5 0.5 0.5 0.5 0.5 0.5 
##$TPOFFS= (0..7)
0 0 0 0 0 0 0 0 
##$TUNHIN= 0
##$TUNHOUT= 0
##$TUNXOUT= 0
##$USERA1= <user>
##$USERA2= <user>
##$USERA3= <user>
##$USERA4= <user>
##$USERA5= <user>
##$V9= 5
##$VALIST= <valist>
##$VCLIST= <CCCCCCCCCCCCCCC>
##$VD= 0
##$VDLIST= <DDDDDDDDDDDDDDD>
##$VPLIST= <PPPPPPPPPPPPPPP>
##$VTLIST= <TTTTTTTTTTTTTTT>
##$WBST= 1024
##$WBSW= 4
##$XGAIN= (0..3)
0 0 0 0 
##$XL= 0
##$YL= 0
##$YMAX_a= 106526
##$YMIN_a= -131595
##$ZGOPTNS= <>
##$ZL1= 120
##$ZL2= 120
##$ZL3= 120
##$ZL4= 120
##$ABSF1= 10
##$ABSF2= 0
##$ABSG= 5
##$ABSL= 3
##$ALPHA= 0
##$AQORDER= 0
##$ASSFAC= 0
##$ASSFACI= 0
##$ASSFACX= 0
##$ASSWID= 0
##$AUNMP= <proc_1d>
##$AZFE= 0.1
##$AZFW= 0.1
##$BCFW= 1
##$BC_mod= 2
##$BYTORDP= 1
##$COROFFS= 0
##$CY= 11.3945322036743
##$DATMOD= 1
##$DC= 2
##$DFILT= <>
##$DTYPP= 0
##$F1P= 15.7292609196834
##$F2P= 12.9074282941183
##$FCOR= 0.5
##$FTSIZE= 0
##$FT_mod= 4
##$GAMMA= 1
##$GB= 0.15
##$INTBC= 1
##$INTSCL= 1
##$ISEN= 128
##$LB= 0.24
##$LEV0= 0
##$LPBIN= 0
##$MAXI= 10000
##$MC2= 0
##$MEAN= 0
##$ME_mod= 0
##$MI= 1.114404
##$NCOEF= 0
##$NC_proc= 0
##$NLEV= 6
##$NOISF1= 3.799351
##$NOISF2= 2.8
##$NSP= 1
##$NTH_PI= 0
##$NZP= 0
##$OFFSET= 15.70392
##$PC= 1
##$PHC0= -24737.44
##$PHC1= 12.05268
##$PH_mod= 1
##$PKNL= yes
##$PPARMOD= 0
##$PSCAL= 0
##$PSIGN= 0
##$REVERSE= no
##$SF= 200.130013532006
##$SI= 16384
##$SIGF1= 3
##$SIGF2= 2
##$SINO= 400
##$SIOLD= 16384
##$SREGLST= <1H.CDCl3>
##$SSB= 0
##$STSI= 0
##$STSR= 0
##$SW_p= 3612.71676300578
##$SYMM= 0
##$S_DEV= 0
##$TDeff= 0
##$TDoff= 0
##$TI= <>
##$TILT= no
##$TM1= 0
##$TM2= 0
##$TOPLEV= 0
##$USERP1= <user>
##$USERP2= <user>
##$USERP3= <user>
##$USERP4= <user>
##$USERP5= <user>
##$WDW= 1
##$XDIM= 8192
##$YMAX_p= 0
##$YMIN_p= 0
$$ End of Bruker specific parameters
$$ ---------------------------------
##NTUPLES= NMR FID
##VAR_NAME=  TIME,          FID/REAL,        FID/IMAG
##SYMBOL=    X,             R,               I
##VAR_TYPE=  INDEPENDENT,   DEPENDENT,       DEPENDENT
##VAR_FORM=  AFFN,          ASDF,            ASDF
##VAR_DIM=   8192,          8192,            8192
##UNITS=     SECONDS,       ARBITRARY UNITS, ARBITRARY UNITS
##FACTOR=    0.0002768,     1,               1
##FIRST=     0,             0,               0
##LAST=      2.2672688,     0,               0
##MIN=       0,             -131595,         0
##MAX=       2.2672688,     106526,          0
$$ Real data points
##PAGE= N=1
##DATA TABLE= (X++(R..R)), XYDATA
0@%%%%%%%%%%%%%%%%%%%%%%%%%%J7q1J28j28J28j28J28j28J30j82K44k56K56k82
40a54L44l82L97m53N06n53O15o76P42q17R07r96J092j203J333j480J640j822K035
59A075k286K588k960L412l994M790n915P631j0654J7398o2897L9735P5920j82760
73a18917j2678J35198k3741l4231L8179l9801N2554Q0867p9879l1287J00199J514
85F7977l7440R549j9386k010K7316m9748m6183L2918K2734k4686k7754k755M1341
98h127K3536l6380j6917L5911K7381n175k7831j0567M3634L0527l7963l0100K2090
111A0019J9307j0377k9819k0609K4077K8419k7535l5213J7647L4809J266k5108
123a3117j3691K2048K7833j3100l0514R240L4935K586k8868j0101K1611J3079
$$ plain form
0 0 0 0 0 0 0 0 0 0 0 0 0 0 0 0 0 0 0 0 0 0 0 0 0 0 0 0 17 -64 64 -64 64 -64 64 -64 66 -116 128 -128 128 -154
40 -154 190 -192 205 -248 258 -295 320 -356 386 -431 476 -520 572 -631 702 -778 862 -960 1075
59 1075 -1211 1377 -1583 1829 -2165 2625 -3290 4341 -6313 11085 -51812 -12077 63843 -118917
73 -118917 -131595 3603 -20138 -54369 -16190 -55991 -3437 77430 -2449 -33736 66463 67977
85 67977 30537 40086 20700 18690 46006 -3742 -49925 -17007 5727 -18959 -46713 -49468 -8127
98 -8127 15409 -20971 -37888 -1977 25404 20229 -7602 -18169 25465 55992 18029 -12071 10019
111 10019 29326 18949 -10870 -31479 -7402 21017 -6518 -41731 -24084 10725 11991 -13117
123 -13117 -26808 -4760 23073 9973 -20541 -11301 23634 26220 -2648 -12749 8862 21941
135B1941j5418k1544L57K0616R464k1754j7401K1237K3634j4221k2988M600J9045
148G568O725j4063j8284Q477K8107L36k8442n248K4456Q937j8806j5606O403J6503
162G063L610j7603j1610J7659J9114j3299k0793Q003J8489k128j5990n210J2263
175d32J4035n743j7684J860K0975K581j9672q739J3499J0173q472j3828L71J4982
189C906P070j3236j1865J0960J5193n630j5281l84J4367P659r680j1681N731J4770
203A1899j033j6332n013J2270P062r647j1359M223J2860J487j2360n321J1781
216E17R314q271j0522M982J1569P25j0395m632R152R301o317j2867J846J1840
230F242P08j1444n322P477Q855k780j0168j260J1017N237r199p755O671R067k558
$$ plain form
135 21941 6523 -15021 -14664 5952 15416 -6338 -23739 -2502 21132 6911 -16077 -11477 7568
148 7568 14293 230 -18054 -9577 18530 18866 -9576 -14824 9632 18569 -237 -15843 -9440 7063
162 7063 10673 -6930 -18540 -881 18233 4934 -15859 -7856 10633 8505 -7485 -12695 -432
175 -432 13603 7860 -9824 -7964 13011 15592 -4080 -12819 680 10853 2381 -11447 -11076 3906
189 3906 10976 -2260 -14125 -3165 12028 6398 -8883 -9267 5100 12759 3079 -8602 -2871 11899
203 11899 10866 -5466 -10479 1791 8853 -794 -12153 -7930 4930 6417 -5943 -11264 517
216 517 9831 1560 -8962 -3980 7589 8314 -2081 -6713 2439 11740 5423 -7444 -5598 6242
230 6242 6950 -4494 -9816 -2339 6516 3736 -6432 -7692 3325 8562 -637 -8392 -1721 7346 4788
245D788q532j633P758N706n579q977K839R426q61r959k270Q059M738n451o517
260f465K957Q394N11q469l658P486N758n427p013K754Q078R68p341l752N907N861
276F549l783p745L73P352K015o133m332M338O313j893o832o58O563K825n251m517
292d816L448N861q49o319j336N347L177m503n053K748N414p30n492j268M894L692
308D215l412n008J805O022J40n378k168M970L565k947n007J228M831O00n015k780
324d339L324M145j989m166L55M455J375l503k646K452L552q31m046n79L803K002
340C364l125k927J713L263q64l740r43L380K186k532l034J642M180k6l812j206
356b481L366K399k579l325J247L391L93l145j563K511K527j793l219O83K916N71
$$ plain form
245 4788 -3744 -5377 2381 8087 2508 -6469 -3630 5796 4935 -5024 -7294 765 5503 52 -6465
260 -6465 -3508 4886 5397 -3072 -6730 756 6514 1087 -5926 -3172 4906 5874 -1467 -5219 688 6549
276 6549 2766 -4979 -4606 2746 4761 -1372 -5704 -1366 4947 3054 -3778 -4436 2127 4952 -299 -4816
292 -4816 -1368 4493 3644 -2675 -4011 1336 4513 10 -5043 -2295 3119 2389 -3103 -4371 523 4215
308 4215 803 -4205 -2400 3622 3762 -1616 -3784 1186 4751 1804 -3203 -1975 2856 3456 -1559 -4339
324 -4339 -1015 3130 1141 -3025 -2670 1785 3160 -343 -2989 -537 3015 2184 -1862 -2441 1362 3364
340 3364 239 -2688 -975 2288 1424 -2316 -3259 121 2307 -225 -3259 -1617 2563 2537 -1275 -2481
356 -2481 885 3284 705 -2620 -1373 2018 2411 -734 -2297 214 2741 948 -2271 -1588 1328 1899
372A899k803j369K008K367r77k558p5K558Q56k329j781J604K206p66k439j80K399
389F20J104j565k149J198K435k10k647m59K396J307j591k154P55K221j89k108
405a036r88J963J654j133k030P56K294J68k077p23J359J279j068j573L82J653
421H80L15j382j051J028J371r63j593J27J445P28j119q55Q95J552k23j574l61
438g80J352P75j362j410N57J612q2j335n66J390J039q07j261L52J479Qj228n25
456g92J148Q78o47j172K81Q49N0j260n90P96Q98n04q68L76R65K19o26l61M31Q52
476I23l54j049J6P33M87o86p43K84P83j67r23l28Q75N30l86o69L21J114Pp54m12
497c98P00M71o21l67J82L84K55n75n94L95O32m73q44L51O35j58m11j23N82L44
$$ plain form
372 1899 -904 -2273 -265 2102 1125 -1433 -1508 1050 1906 -423 -2204 -600 1606 840 -1599 -1779 620
389 620 1724 159 -1990 -792 1643 1433 -1214 -1673 723 2030 439 -1715 -960 1261 1072 -1036
405 -1036 -2024 -61 1593 460 -1570 -814 1480 1648 -429 -1152 207 1486 418 -1155 -773 880
421 880 1195 -187 -1238 -210 1161 198 -1395 -1268 177 905 -214 -1069 -174 1378 1155 -419 -780
438 -780 572 1347 -15 -1425 -868 744 662 -673 -1239 151 1190 383 -878 -526 953 961 -267 -792
456 -792 356 1234 587 -585 -304 545 595 -665 -1255 -459 439 -65 -933 -557 408 627 1 -360 71 923
476 923 569 -480 -464 269 756 70 -673 -389 394 227 -696 -1024 -149 381 -5 -674 -353 761 768 14 -398
497 -398 302 773 152 -215 -33 351 606 31 -563 -168 464 -9 -853 -502 133 -25 -436 -559 23 367
517C67J38n24J17L11M9n86l88M33L74j18k18k86K92L67k14l82j62O21q4m16qL28
539A1M22r3m42J05L17J32o37l78M67K51k13j82J31L65n3k56p3K25J83k76j90j42
561c26L34J37l42q0J19L16j27j87J09K5J19Rj45J04R6J88k77k41L24n1k19L2J02
584A9J15m7j79j14N1L29j27k71Q9K88j30J1r2J17R8P0l00k1K87m8l80j58M26P9
608A12k87N1jJ14J51j7k4j58J63k0j5l68L98K1M0j34m2J3O4J05k85O9k7m5M8K9
634d5l6J05k9PJ55Nk27M7n2J4J67j72N9o5J73j41j20J25j00J01K7p5Jl2l3L6P7
661b8J56j50J31K7r7J23j69j53J74N8k8O1q3j9j1J95k96O5p6J86M1m1j47R2Q7
686I8j29n3J39P8j73N8j38Q5l7Kk9Q1P6l3k30P1P9k4p3J79r4K1R1NM7j24O6r9
$$ plain form
517 367 505 -19 98 409 458 -128 -516 -83 291 173 -45 -331 -39 328 114 -268 -430 191 107 -309 -317 11
539 11 433 340 -102 3 320 452 -185 -563 -96 155 -58 -240 -109 256 203 -53 -126 99 282 6 -184 -326
561 -326 8 145 -197 -277 -158 158 31 -156 -47 -22 97 106 -39 65 161 349 72 -169 155 104 -115 -83 19
584 19 134 87 -92 -206 -155 174 47 -224 -135 153 23 34 -58 59 157 227 -73 -94 193 145 -235 -393 33 112
608 112 -175 -124 -125 -11 140 123 99 -59 104 84 69 -299 99 120 160 26 -16 -3 61 166 -119 -50 -77 -122 -74 -45
634 -45 -81 24 -5 2 157 162 -65 -18 -70 -56 111 -61 -2 -67 106 -35 -155 -30 -130 -29 -2 -77 -76 -108 -141 -105 -28
661 -28 128 -22 109 136 39 162 -7 -160 14 72 44 105 22 3 -8 187 -109 -44 -120 66 107 66 -81 11 98
686 98 -31 -84 55 133 -40 18 -120 -35 -72 -70 -99 -18 58 25 -205 -134 -55 -79 -152 27 -67 -46 45 50 97 -27 39 -60
714f0J0l7J12j05N3J46l9k55J97o0j1M9q4R7N6r3J37M2j31l5q1J19m7J6J32j07
740B1N7j21J17k0M1j55%J41l5K03j66P5j09j15J34l8n3R0j07N6R4m4r4j04J73
765D1q5j1K39j41j04K05p1k5N7j59J26K2P2j50k9N7p0Q2J8q2N0q7J18j12J47q6
791B2p1L38k53r0k4K01j53P2j18qm8j6K59k03K18j88J67o3J30k29J70j63ro8K10
816H3k0o0L5j58J42O2j59J33k5j21J06J3K9j05P4j59J33P9j34J03r8l1J05K5j95
841a43J03L0Ml3P3j21KJ42o9J08k3m6P5r2J61r5q5M8o9J47q8j5o4o5R9L3R5j86
869g4J42j40O8p7P4J03l2O6j86N2L4P7n6Mj16J72j24J5M4o4qK07k59J46N3k55
895a34J20J1m8J11j6p2j5o9P9O5jj11J69m6m1Qp6K1J09j13q0J12K6l3O3j31J38
$$ plain form
714 -60 -50 -87 25 -80 -27 119 80 -175 22 -38 -49 0 -84 13 69 -24 113 155 24 -11 -92 27 -20 -4 128 21
740 21 78 -43 74 54 95 -60 -60 81 46 249 83 158 49 -66 68 30 -23 67 -40 16 110 66 -28 -132 41
765 41 -44 -55 184 43 -61 144 73 48 105 -54 72 94 166 16 -13 44 -26 56 74 -8 42 -45 73 -39 108 22
791 22 -49 289 36 -54 -78 123 -30 42 -76 -84 -132 -148 111 -92 126 -62 105 42 172 -57 113 -50 -59 -127 83
816 83 63 3 38 -120 22 84 -75 58 33 -88 18 31 60 -45 29 -130 3 82 -52 51 -47 -78 27 52 -143
841 -143 -40 -10 -6 -39 34 -87 -85 57 -12 96 73 27 102 10 171 76 -9 39 -30 117 29 14 -50 -115 -16 17 112 -74
869 -74 68 -72 -4 -81 -7 96 64 130 -56 -4 30 107 51 55 -61 111 -13 2 46 -18 -26 181 -78 68 121 -134
895 -134 -14 -3 -51 60 44 -28 -43 -112 -33 32 31 -80 89 43 2 10 -66 -45 64 -49 -129 -17 9 -24 39 -92 46
922D6k4j42J45J83l56J67J76k48Q5kn4p7J81K7r1J6K6o9N9j73J35p9J19j00J24
947G4m1m6k1J4J10j45Q6l9J5O8%l2n7k5rk2Ok0k1J57j9M3r0L4J04k6j89L8J65
976A12j04o9M6J28j5j17J9r0m0J04K3JJ56r0M2k4j28K13m9p7j8K4P2j40Pj1j39
1003a64J13J9n9n3K08j01J12R3o9k52L00j43P4K6r3P5l52K57J48j29j89K22n1
1026hM6n9J13rM9o0K8p6J70k83J48Kj41R4qm5N7q4J05M8j4pj99M7o2J70LJ8o6
1055b3J83r0l8r0J0Q7j76K96j69j6J07j59P5J59j61J16j52j5n1L9r9J03J79l0
1079H5k8j7j09o7P6k9J68Rj39J44o9k6N7j41j4J74j73J72O7j54R7j41J40j93J48
1104C7O2q5m7l9K04j33o3o9R5q2J23P6j6J2l1M9j29l3K3RL0J3O1o9K20j65K4m2
$$ plain form
922 46 22 -120 25 208 -148 19 195 -53 32 30 -24 -101 80 107 16 32 58 -11 48 -125 10 -69 50 -50 74
947 74 33 -13 -34 -20 90 -55 31 -8 7 75 75 43 -14 -39 -48 -70 -64 -84 -105 52 33 76 -14 20 124 98 -91 -53 112
976 112 8 -61 -15 113 98 -19 0 -90 -130 -26 -3 -2 154 64 106 82 -46 167 118 41 23 47 119 -21 -14 -25 -164
1003 -164 -51 -32 -91 -144 64 -37 75 168 99 -153 147 4 78 104 11 86 -266 -9 139 10 -179 43 -8
1026 -8 38 -21 92 83 132 72 100 24 194 -89 59 61 -80 14 6 -39 18 -66 39 87 73 66 -133 -86 -148 22 25 43 -23
1055 -23 160 70 32 -58 -48 39 -137 159 -10 -26 81 -78 -3 156 -5 111 -41 -56 -107 -68 -167 -64 115 85
1079 85 57 40 -69 -136 -60 -89 79 88 -51 93 24 -2 55 -86 -100 74 -99 73 140 -14 83 -58 82 -111 37
1104 37 99 14 -33 -72 132 -1 -64 -133 -38 -120 3 79 63 75 44 93 -36 -69 -46 -37 -7 6 67 -2 218 53 77 35
1132C5j01K3L5j36M6J14L7q1j38J84Q5k01R9J60j98L5J14j57K7j06J79n1j53J76
1156B7O8Jj59R8M4j85K15p4r2M6Q4j5j57r1O7L6N5K1m5k7Q6L7j32L6LJO0R5J4
1185A17j13R4k9k8j20L7p0q6J68l4M2k7R7RRJ17k12R8j79J36n8m3l0M6N0P1om8
1213HQ6k3j52O5J37j80K1J7Q3O5j97N6m4N4J23j50R7j50K13j8j42L13j58k02O2
1238a6N3M0j02L2j4P6j27O1M3%r6m9J19P7qj46K0k5j07K66m4J29k13K7k9Q9N9
1265A15l20K41o9m4j6J45O0j17J5nm0r7R0p7J05l4J12j31J21LM2k35J62j1l5j33
1291a53J53J43j93J03Q8j12j00j27J31J41r3O4M3j68N5J61qm2j93N7P6J9k0j20
1315i5Q2O8K4O6j39q8J30j04N3j1j5r9J71K3k69L6K9J79j18m5J31l1N4l8K4j8
$$ plain form
1132 35 -66 -43 -8 -144 -98 16 53 -28 -166 18 103 -98 1 161 -37 -2 112 -45 -18 -124 55 4 -149 27
1156 27 95 96 -63 35 79 -106 109 35 -57 -11 73 58 -99 -190 -123 -87 -32 -11 -56 -83 3 40 -92 -56 -53 -52 8 103 117
1185 117 4 98 69 41 -79 -42 -112 -198 -30 -64 -22 -49 48 57 66 183 -29 69 -110 26 -32 -75 -105 -59 -9 62 56 8
1213 8 94 71 -81 -16 121 -59 -38 -21 62 127 -70 -14 -58 -4 119 -31 66 -84 129 111 -31 282 124 -78 -16
1238 -16 37 77 -25 7 -7 69 -58 3 46 46 -50 -99 20 97 89 -57 -37 -62 -169 97 53 182 -31 -4 -33 56 115
1265 115 -205 36 -33 -77 -93 52 112 -5 10 5 -35 -132 -42 -119 -14 -48 64 -67 54 57 99 -136 26 15 -20 -153
1291 -153 0 143 -50 53 141 29 -71 -198 -67 74 -19 45 88 -80 -25 136 128 86 -107 -50 26 45 25 -95
1315 -95 -13 55 79 145 6 -82 48 -56 -3 -14 -29 -128 43 66 -203 -167 -138 41 -77 -122 9 -22 32 -6 18 0
1341@j2j46J04R1Mk5q1P0O2j47J72o8p0l8Q8J3k8l3J41M8n9Mj68J00j25K69k62
1368i6L1J30kpjp4R1m3j7m7p5L8O3P1j05j09J36n3Q3J22j33N1LKk48L10k15j0
1396a04R4J4K7P1Jj01QK0j7j58J28k3P3J02j21L8j25j7J12j00K42j93J60L8j87
1421a8L4m6N5P5j4q1p4J03j14K7K0J29L3j35j0O7N3m7K1j57K8K04j86K15l09J17
1447a0l3N2Pkk6q7J59L5n2l2j03J32l7M7r3N9q2j07P0J51j80P6J38m0n3P7j35
1474f9p3N3L8J27n3k0Q3k20K2J83m2R1k10R5j13k7K09p1n5qJ92j55o1j2J59j06
1500d3o7%K8lQ9R0j71Ll5oJ22Rq0M7p7J4J84kp2j19P0P6m9p8o5J65P7m4mM1j70
1531g0N5L3K07k30J13n0o0l2l4J35r8m6J57l7j35J43j60K37j25n2K0L3L0j32J12
$$ plain form
1341 0 -12 -158 -54 37 41 16 -65 5 67 -80 92 24 -46 -84 4 17 -11 -44 97 145 86 90 -78 22 -103 166 -96
1368 -96 -65 65 63 56 55 -19 72 29 12 -35 -110 -72 -9 62 -43 -152 -16 -69 14 136 3 54 57 59 -189 121 -94 -104
1396 -104 -10 4 31 102 103 2 10 30 13 -145 -17 -40 33 135 14 52 -73 -90 22 -78 164 -29 131 169 -18
1421 -18 16 -30 25 100 86 5 -69 34 -80 -53 -33 96 129 -6 -16 51 104 57 78 -79 -51 153 -33 182 -127 -10
1447 -10 -43 9 16 14 -12 -99 60 95 43 11 -92 40 3 50 -43 16 -66 -173 -103 48 -132 -56 82 42 -11 66 -69
1474 -69 -142 -89 -51 76 23 3 86 -134 -112 71 29 120 -90 5 -108 -135 74 3 -52 -60 132 -23 -84 -96 63 -43
1500 -43 -110 -110 -82 -85 4 94 -77 -74 -109 -115 7 16 -64 -17 -94 -80 104 102 30 -89 -19 57 8 -70 -135 30 107 63 59 100 -70
1531 -70 -15 18 225 -5 108 58 -2 -34 -68 67 -31 -77 80 43 -92 51 -109 128 3 -49 -29 4 34 -98 14
1556A4k89K61o9J20J9p0O9j32J29j82J13m2O7O4k70J93j69J20J30j19o2k2J48
1579B1J10j21J3j39R7K2N5K7j08O6j14J86j39R2j54l%m3J03p1Q8P0Pp9L4k6M8
1606D2L8p0mJ5j35O9O3j09P8K6j2o1k3O7J69j23K2r1M8L5r4J13k7kN0j11j06P3
1634f0J99k22M6M0J6j5l9J32qj51L1J34ok21R3L9J00j90m3J31j9j11K89k07J29
1659H7L9o6j6j21J43j73J22J06k38K08o6j68J07J5r1J62N0j7Nq2l4j78K58k2P
1684C7j5l8j8N2N7r8K9m2l2L4O3K07k36R3L3j3p3j01J25j45J82l9j28K06k03O8
1710ELj31L9P6O9n8k02K23l0j40R5J07j82k0P1oJ46n5M2j18J8J08l6j78J48j6
1736b2j09K20j13N3j35J11L0K8j87K08j12J21j5ML9j45n7K46p8j72J04l8l7J12
$$ plain form
1556 14 -275 -14 -83 37 56 -14 55 -77 52 -130 -17 -59 8 72 -198 -5 -174 -54 76 -43 -105 -127 21
1579 21 131 10 23 -116 -19 3 58 85 -23 43 -71 115 -24 68 -86 -89 -89 -132 -29 -100 -12 58 65 -14 20 -6 42
1606 42 80 10 6 21 -114 -45 18 -91 -13 13 1 -60 -83 -16 153 30 52 -39 9 44 -50 63 36 34 84 -27 -133 -60
1634 -60 139 -83 -37 3 19 4 -35 97 89 -62 -31 103 97 -124 -31 8 108 -82 -125 6 -13 -124 165 -42 87
1659 87 126 60 44 -77 66 -107 15 121 -117 91 25 -143 -36 -21 -112 50 100 83 88 6 -28 -206 52 30 37
1684 37 22 -16 -34 18 75 -23 6 -36 -68 -34 29 236 0 93 126 113 40 -61 64 -81 101 62 -66 140 -63 5
1710 5 8 -123 -84 -8 61 3 -199 24 -6 -146 -51 56 -126 -146 -75 -81 65 10 52 -66 -48 60 24 -154 -6 -22
1736 -22 -131 89 -24 29 -106 5 35 63 -124 84 -28 93 78 82 121 -24 -81 165 87 -85 19 -19 -56 56
1760E6o3M9P3j23p7J10J61k56L7j1M7J61l15K76m4j80J92M2o5r8K7j1o4K3J11
1785E8Jr6p2M8J38j54M6L4O7L3k07J41j8j17J98p1J19k38J09j29K34q3j41R8o6
1810f8J35K3r4j54J88j29J81j71J93k62J56K2q0r1J19K9KJ07j48J01o8r0J43o5
1834b1J48l4K2k13Q7J0M5q5lL5kkNl1J10k6j59J09N4q0M9Q4o9n0J06pl1K1j8o7
1864a3OL8O9p8r7J42o8nK7N6j02p2J00o4J15k60L77j17r2qK4J24k46J39O9qj4
1891D2m6Q5j98R3J19o7k1n0N4K6j15J98j36Q4k9M0J4J8O1k07N1n9J9p6P7L9k0
1918dj16n4K19J02j56K8P2p0p2k9J16R5j98lJ00J25p5j47K72j48m8J53j23L2o
1943F5J19k41O2J38j05m9K0K6J5k41K32l2Q2k3k2O2j20R0j81r9K94P2j08p8j8
$$ plain form
1760 56 -7 42 115 -8 -85 25 186 -70 -33 -44 3 164 -151 125 81 -99 93 135 70 -28 -1 -12 -76 -53 58
1785 58 59 -37 -109 -61 77 -77 -31 3 70 103 -104 37 19 -98 100 29 148 -90 19 -110 124 41 -100 -2 -68
1810 -68 67 90 -4 -158 30 -99 82 -89 104 -158 -2 20 -60 -151 -32 -3 -1 106 -42 59 -9 -99 44 -21
1834 -21 127 93 115 -98 -11 -1 44 -41 -44 -9 -11 -13 -8 -39 71 45 -114 -5 49 -31 18 102 33 -17 89 82 51 72 54 -13
1864 -13 -7 31 100 22 -75 67 -1 -6 21 77 -25 -97 3 -61 54 -206 171 54 -38 -46 -22 102 -144 -5 64 56 42
1891 42 -4 81 -117 -24 95 28 7 -43 11 37 -78 120 -16 68 39 79 93 111 172 -35 16 -43 -24 -100 -23 16 -4
1918 -4 -120 -174 45 147 -9 19 91 21 -51 -80 36 131 -67 -70 30 155 80 -67 205 57 9 162 39 71 65
1943 65 184 -57 5 143 38 -11 9 35 50 -191 41 9 91 68 46 108 -12 78 -103 -202 92 164 56 -22 -40
1968d0J46k5q7J32j47Ok1k8R0K5o2Q2m7k2p9R4J61m4j88K04k19K2J04N3o0k6L7
1995F1m6l3J09nj34J65j69M5q8L6O5M6J0M7j26k1j1l2P2l3M2o1J26r5N2Rr2J45
2023H4L1j74J43rj11J50j49q7O2P2Q3j18J0Q0L4o7j20L3l0J73l9J74k26nL2j02
2049g6k5J85j46n4rK55q2p2L0R4m6p2L6L4n9m9J29q1Q2j05KJ06j1j03J13k00K13
2076H9j08K20j83k3K0j51LJ97o6r9Q0m1qq2K21j81J93k46J07J40j67J33k6j39
2100a17J51J6k6k2j01J03K0q4Q0j32Q6J04q6N4l1q2N2O0M1K3j45J41j13j95K28
2125B5m4qqP7j47M8Q0l0K0j72J33R3j52J73N6k20J95o9Q2j64P8p1O8q1J18j36
2151e6J23N0n3n3Ql1r6J15j36K30k29K09K9q2k8R2p9q4kL4Q7q1j1J16J8j0j02
$$ plain form
1968 -40 106 81 -6 126 -21 -15 -36 -64 26 51 -11 71 24 2 -77 17 178 134 -54 150 -69 -47 57 110 50 24 61
1995 61 15 -18 91 86 -48 117 -52 -7 -95 -59 6 52 62 109 -17 -38 -49 -81 -9 -42 0 -61 65 -30 22 31 -61 84
2023 84 115 -59 84 75 -36 114 -35 -122 -60 12 95 -23 -13 67 101 34 -86 -53 -83 90 51 225 -1 -6 26 -76
2049 -76 -101 84 -62 -116 -125 130 48 -24 6 100 54 -18 18 52 -7 -56 73 -8 74 -31 -29 77 66 -37 76 -124 89
2076 89 -19 201 18 -5 15 -136 -133 64 -2 -101 -21 -62 -70 -152 69 -112 81 -165 -58 82 -85 48 22 -117
2100 -117 34 50 24 2 -99 4 24 -60 20 -112 -26 78 -8 46 15 -67 -15 45 86 109 -36 105 -8 -203 25
2125 25 -19 -27 -35 42 -105 -57 23 -7 13 -159 -26 67 -85 88 144 -76 119 50 132 -32 46 -25 43 -38 80 -56
2151 -56 67 117 64 11 19 -12 -108 7 -129 101 -128 81 110 28 0 92 13 -71 -73 -39 48 -33 -44 72 90 80 -22
2178b2N2J19q8j38J24J15k16R6Nj32J54M3M6k78K39k01J2R9m5P0M7m1r6J25J5
2203A04l4m6j46J29m9J8J38n6P4j00o8J40o6q9K1J2Q3p9N7j3J61k79N3J3Jq4M4
2230f1J82j29j11J98j47J87J2M0q0j35M3k11L32l9k09K00l3Jj71m0J47k6J52j32
2254c0J87j23Jj6l0J0J71j41jr9K08j43l0j8Q8K3j06R7m7nO5kj33R5l6k5R6l2
2282B4m8J38j36k3J0P0n3J73l01K42j65Oj1l4J23k5Ok3M5p6N8j19J81n2N0l5n7
2309c2m6k06L03J03k37K8L8M1J96n0k18K2J35j03PJ7J24j43j19K21j28O5P2k8
2333F2K3o1j38M7K03k07O5p7k0M4j8P1l1k7P9J1r3qo2mJ58l5K2l4MM2M2j77J92
2362G3q0P4L2Mj41J79n7l3j0kk24K15J70k19L0n8J65j14L8j45m4J81q5R3l1q5
$$ plain form
2178 -22 30 149 61 -77 47 162 -54 42 47 -85 69 112 158 -120 119 -82 -70 29 -16 54 101 60 -36 89 104
2203 104 70 24 -122 7 -42 -24 114 58 132 32 -36 104 38 -51 -30 -18 65 -14 43 30 191 -88 -35 -22 -21 -105 -61
2230 -61 121 -8 -119 79 -68 119 131 171 91 -44 -1 -212 120 81 -128 72 39 40 -131 -171 -24 -50 102 -30
2254 -30 157 34 35 19 -11 -1 170 29 28 -71 137 -6 -36 -54 34 57 -49 48 1 -4 61 59 -74 21 -15 -40 56 24
2282 24 -24 114 -22 -45 -35 35 -18 155 -146 96 -69 -63 -74 -108 15 -10 -4 -27 18 -58 0 -119 62 10 60 25 -32
2309 -32 -78 -284 19 122 -115 -87 -49 -8 188 138 -80 -58 77 -26 -19 -2 122 -21 -140 81 -47 18 90 62
2333 62 85 24 -114 -67 136 -71 -6 -83 -103 -59 -77 -6 -37 -64 15 26 -67 -75 -137 -141 17 -18 4 -30 -26 16 58 -119 73
2362 73 -7 67 99 103 -38 141 84 51 41 39 -185 30 200 -19 11 -47 118 4 42 -103 -147 34 -51 42 11 -74
2388g4l0j7J9L7m6R1R2k07K03k03K19k02K54j56l1l8N9Q7j11k0J40l7j11L3L0
2413a9P1rr0r4lJ51L4j62J86j1N3k43J67p7O7q8J11m2L3j61K12k24K90m2j21J57
2439A46k72J46k6j26J40lJ65p1k03K69j14k11K09n5K4m8J40j06Lq9j18J55n3P3
2463b5%k9RJ11j37Q7q8j06J93K6k05J72Q9j33O8j11J38K5mk50J94J33k07K14j46
2488A8J4m5P6j16K8O7jk0k4J7o5L34l51j08J21N0r4P5P5j87Q0M0M1j00R7p4K18
2515A66j41L8q2l0k0O5J07k83L04j06km1nl8M6J15q6P9r3Q9n4Rk2P6j54M2K1l8
2543c8k3PL3K6L5j02Q6P6j00PL1j26K22j25J10k16q8J44n2J11k2M1j12J22n8m0
2569e1M3J61k27m8J20O9j46j7J06J37K0k67J03K9j01r4J62l2N0LQ2k57M2jJ88
$$ plain form
2388 -74 -104 -121 -102 -65 -111 -20 72 -135 68 -135 84 -118 136 -20 -51 -89 -30 57 -54 -74 66 29 -82 -49 -19
2413 -19 52 43 -47 -141 -144 7 41 -121 65 54 107 -136 31 -46 21 -67 44 2 35 -126 86 -138 152 110 -11 146
2439 146 -126 20 -6 -132 8 5 170 99 -104 165 51 -160 49 -6 18 -30 110 4 7 -82 -200 -45 -98 -25
2463 -25 -25 -54 -45 66 -71 16 -72 -178 15 41 -164 8 97 -36 32 -79 59 84 80 -170 24 157 -50 164 18
2488 18 32 -13 63 -53 -25 42 41 21 -3 14 -51 283 -68 -176 -55 -5 -99 -24 51 -136 -56 -16 25 -75 22 -52 166
2515 166 25 63 -19 -49 -69 -4 103 -180 124 18 16 -25 -30 -68 -22 93 7 86 -7 82 28 37 15 91 -63 -21 0 -38
2543 -38 -61 -54 -21 5 40 -62 24 100 0 7 38 -88 134 9 119 -97 -185 -41 -93 18 -4 37 -75 47 -11 -51
2569 -51 -8 153 -74 -122 -2 67 -79 -96 10 147 167 -100 3 32 -69 -163 -1 -33 17 20 102 -155 -113 -114 74
2594G4m1j4p2P8p1J15j9j8L1j92J44l2Q2J2r4J16M5k18J27j88J37N4k31O6L12
2619B03j67l3K40l75O5L1m8J74N7k56J76k20J97M6j73ql1Q4k8M7M2p7j0J11l0
2644A7n6P0k6N5OK3k31J60j04J08m8m8J37j11j1R8j91J26O4j3j51R1K18j96J06
2669I3j53J09N6j29Q1M6j43K8J59j95m6J13k4p6K37j50Po2K43o2k08J56j56Q2
2693Fj4R3m0j88K76k47K97j17n3mj44J94m4J2m0l9o3K50p9o4J8j3J6l6L5p1J3
2720d6K7%k5Q1n2j8J34N8j13j45J34m0J02j88J12Mq0l9M7K29m2j89J87j47p3J05
2746B3J9m2k4p6J18l2K2J2j35J26L9o2OpJ8L4j55K18j22k2n2m0N5J7J07N2l0p9
2774a2J0R7j42P9m5J1J22j31J33j76N9o6qL2J58j90J97j76l4J89j47L3oJ00j06
$$ plain form
2594 74 33 19 -53 25 -46 69 50 32 63 -129 15 -17 65 77 -17 99 144 -74 53 -135 2 56 -175 -109 203
2619 203 36 3 243 -132 -67 -36 -84 90 147 -109 67 -153 44 90 -83 -91 -122 -38 -66 -19 23 -54 -64 47 17
2644 17 -39 31 5 60 66 89 -142 18 -86 22 -26 -74 63 -48 -59 39 -152 -26 38 25 -126 -35 183 -13 93
2669 93 -60 49 105 -24 57 103 -40 -12 147 -48 -94 19 -5 -81 156 6 13 -49 194 132 -76 80 -76 6
2693 6 -8 85 45 -143 133 -114 183 66 13 9 -135 59 15 27 -13 -52 -115 135 56 -8 10 -3 13 -23 12 -59 -46
2720 -46 -19 -19 -44 37 -15 -33 101 159 46 -99 35 -5 97 -91 21 25 -55 -94 -47 182 140 -49 138 -9 -82 23
2746 23 42 0 -24 -100 18 -14 8 20 -115 11 50 -12 -6 -13 5 39 -116 102 -20 -42 -94 -134 -79 -62 45 97 67 -12
2774 -12 -2 95 -47 32 -13 -2 120 -11 122 -54 5 -61 -69 -37 121 -69 128 -48 -82 107 -40 -7 -13 87 -19
2799a9k2J48j76N8L3Q5j2j03J7M2J6k24K39n7K1j31o1K72j56qO4l7Lj1L9j5J12
2826A17k02J35K3l1r8P5q2J17j56N8J01j47J46p9k7O5j09n5J78o7P5q4J50k45
2850a42J17P5J0j3j4m1o7J05m1P4j20J39p3k5J54j94rR4j72J27L8j7K9k6lQ7o5
2877B7j3j65J47n6K54j10j46R8j57M3M2j06J01j7k5J0J88j88l7P0j18K23J5j17
2901c7J70p7j68J53n2p1J0J00q2N1R1j36O6n5k6o2J12MO3J8o4Pp1M0mO8j27R1
2929A2j27J94j46o8M9M9k9P8j8j04M1O6N7Qj32O9O2o3Q6R8j54j34J09J20j11K5
2955C7j9o8J09p8J1L6n9j1M3j47r2K76j6j85J29J57o5Lr5J2K8j8P5p6l0K6m4J16
2983E5l1r7J32n4j30N7j9K37p8j05O4j16N0P7J9J41k17r6J71rl8r4J30m9Q8j65
$$ plain form
2799 -19 -41 107 -69 -11 22 107 95 -8 9 51 67 -157 82 25 46 -85 -146 126 -30 -38 26 -11 -8 -19 20 5 117
2826 117 -85 50 73 42 -56 19 -63 54 -102 -44 57 -90 56 -23 -50 15 -94 -149 29 -38 37 -47 103 -142
2850 -142 -25 50 60 47 33 -8 -75 30 -11 63 -57 82 9 -16 138 -56 -65 29 -143 -16 22 5 34 8 5 92 27
2877 27 14 -151 -4 -60 194 84 -62 36 -121 -78 -36 -142 -41 -58 -83 -73 115 -73 -110 -40 -158 65 80 -37
2901 -37 133 56 -112 41 -11 -82 -72 28 -54 -3 88 -48 18 -37 -63 -125 -13 -9 54 72 8 15 -56 -16 -20 48 -79 12
2929 12 -115 79 -67 -135 -86 -37 -66 12 -6 -110 -69 -3 54 62 -70 -1 61 -2 84 182 28 -106 3 123 12 37
2955 37 18 -50 59 -19 -8 28 -31 -42 1 -146 -238 38 22 -163 -34 123 58 61 -34 -22 6 -12 63 -13 -43 -17 -61 55
2983 55 24 -73 59 5 -125 -68 -87 150 72 -33 31 -85 -35 42 61 202 -15 -111 60 51 13 -81 49 0 88 -77
3009g7jO0K2J29l4q1j71P2J84j29RJ47j81J08J29l29J39k8J3n0Q6o9j6J97j91
3034f2J58rj35l5m5J68K2j39L7J1o5o0K09j03K8j78K23R1l3m6n2N7q5L6M5O0K4
3061A22k03j6K58j81J66r3o3P2q0J19j00o5K3K19j67l8k3j3J12j13R9k6m9J67
3085A27k98J02J9L1P0pN0m7j00k1L3q3J6M8K6M6q9j18J13l6J23o3O8k3K7m4pj65
3113b02R9P9n8J06j24K01j06L3J06K8j42J9j10Q0lj53J84m6J36k38K02q7k1J1
3137fl0J07r2m3N5Pp5n2N6kQ3M5j82J65j02K29j96j86K52Oj18k5O7J72k16j6J0
3164h7J15j55J75j23K5Jm8J60j78J36q7j07R4J61j6R3j74m2M2j18J74j4k40K64
3188E1j07N4N6r9p8K09n7o0K55l47J0P5m4J58Q8j50Q8O0j01j30L7q3J92N6j00
$$ plain form
3009 -77 -78 -18 4 133 99 18 -153 -81 103 -26 -17 130 -51 57 186 -143 -4 -32 -19 -69 17 -52 -68 129 -62
3034 -62 96 87 -48 -83 -128 40 62 -77 -40 -29 -94 -154 55 -48 -20 -198 25 116 83 37 -15 42 -43 -7 38 98 122
3061 122 -81 -97 161 -20 146 53 -10 62 -18 101 1 -64 -41 178 11 -27 -50 -63 49 -64 35 9 -40 127
3085 127 -171 -69 -50 -19 51 44 94 47 -53 -74 -41 -124 -108 -60 -34 12 -77 -195 -82 -118 5 -58 10 -13 14 -30 -37 -202
3113 -202 -103 -24 -82 24 -100 101 -5 28 134 162 20 39 -71 9 6 -147 37 -9 127 -111 91 4 -17 -6
3137 -6 -36 71 -21 -64 -9 -2 -77 -129 -73 -75 8 53 -129 36 -66 163 -33 -219 33 39 -79 -104 -37 135 -81 -97 -87
3164 -87 28 -127 48 -75 -50 -49 -97 63 -115 21 -66 -173 -79 82 66 159 -15 -57 -15 -133 41 27 -213 51
3188 51 -56 -2 54 -45 -123 86 29 -31 224 -123 -113 -38 -82 76 164 14 102 162 61 -69 -32 -115 77 133 33
3213C3r5R5j2J12j34l4J24j63J10K0p0Lr4J6rL4J51nj1j12NM8r3K8J3L4R2j71
3241h5N7k0O9j67J74j7jl9L7l0Q2j00M5j5j29OL32j08j12R1Jj31j6P0L1j64K90
3268A51o2n2rP7j52o8J82j81kJ28n2N2k4K4j96J51l9J26j21j48J67l7K56j52k7
3293hL3j4n3O3L9q4p0Kj7P0%Q2q5n9K1J94Jj14p8J17j6j2j0P1j16J01M5j03J30
3322A30j23J20k38K33k9k12O5k2J25j1j43R9J1j34JPM8N6j21J79No8jN6l6l2J43
3349A08j37p2NJ54o0K9n9P9n4M9o5m7J73j93K24j18n1J98j27O1j44K0R4k7j69
3374a29L1N3Q3N7j14l2O7O1p7j3J7k18K33l5P3j36OJ13kl9q2J32m8l4o8J21k9
3401io9N3n1J93Pj57K5R1k17J97r8R3o7p2O0J16o9J27r9NR9j96J3J13k09K41j14
$$ plain form
3213 33 -62 33 21 133 -1 -35 89 -74 36 56 -14 -11 -105 -89 -98 -64 87 82 71 -41 -36 12 -81 -53 -40 -6 86 -85
3241 -85 -28 -48 21 -146 28 11 10 -29 8 -22 60 -40 5 -10 -139 -133 199 91 -21 70 71 -60 -76 -6 25 -139 151
3268 151 89 37 28 105 -47 -115 67 -114 -116 12 -40 12 -12 12 -184 -33 -72 54 -67 -215 -48 -85 171 19 -8
3293 -8 25 11 -42 21 60 -24 -94 -92 -109 -39 -39 43 -42 -101 -80 114 115 1 -77 40 24 12 2 73 -43 58 103 0 130
3322 130 7 127 -111 122 93 -119 -54 -76 49 38 -105 -6 5 -129 -128 -121 -73 -17 -138 41 46 -22 -23 33 -3 -35 108
3349 108 -29 -101 -96 58 -2 27 -32 47 -7 42 -23 -70 103 -90 134 16 -35 163 36 97 -47 -27 67 40 -129
3374 -129 -98 -45 38 95 -19 -51 16 77 0 -13 4 -214 19 -16 57 -79 -73 40 38 -1 -83 49 1 -33 -101 20 -9
3401 -9 -78 -25 -76 117 124 -33 -8 83 -134 63 -35 58 -9 -81 -21 95 26 153 54 59 158 -38 -25 88 -121 120 6
3428Fk3r1K35j46L7J58j27j56J89L2j24on3M5R1p2M8j23Q8q8J53j02P2j23j5J62
3454F7j00j4k3j24K62l2P2k00K51k00J27p0n8R5l7m0j51J57R5j20M8O7Q0j50R
3479A1N8j29k7J8J80j31p6J34m2j27P5r6P7P0j54j7O9K6J39k01K62m5j54J40R3
3504A53k05P8M6k46K15k54J50M9J1J10k16P8n5R4l1R9q2J12o1r5O0j1m2l7J22
3529D2L6j07J51n1m2q2J43ko0q4J72j0n0K0o1M8J60l89J36n1j6NQ5K7q8n9J89
3556F2j21J15O3k55N2P6l4R5k6lp0J51j56K2K21k07pK6P3j17j0mk9Q2RM4k0q2
3584e0M2M1J46k45J6N4o7l8J75p8j12J24l7Q4j40P3K4n5j3lJ15k2K1K5p6p0L3
3611c3O6j13N8l5J56l0j14P3J5l0j37J03KM0n3J54k50J7K34j28M0o5n5Q1J01j53
$$ plain form
3428 6 -17 -108 127 -19 18 176 49 -107 82 114 -10 -16 -69 -24 67 -5 43 -80 8 -80 73 -29 43 -80 -95 67
3454 67 -33 -47 -70 -194 68 36 108 -92 159 -41 86 16 -42 53 16 -24 -175 -18 77 -43 5 72 152 2 11
3479 11 69 -60 -87 -69 111 -20 -96 38 -4 -131 -56 -152 -75 -5 -159 -176 -107 -81 58 -143 119 74 -80 60 153
3504 153 -52 26 72 -174 41 -213 -63 -14 -3 107 -109 -31 -86 8 -23 76 -6 106 45 -50 10 -1 -43 -80 42
3529 42 78 -29 122 71 29 -53 90 88 28 -56 116 106 56 76 15 63 223 -166 -30 -81 -97 -92 -7 20 -68 -127 62
3556 62 -59 56 119 -136 -84 -8 -42 53 27 24 -46 105 -51 -29 192 -15 -22 4 77 -40 -50 -54 -83 -1 8 52 32 -50
3584 -50 -8 33 179 -66 -50 4 -63 -101 74 -4 -116 8 -29 55 -85 -12 12 -43 -56 -59 56 34 55 80 4 -66 -33
3611 -33 33 -80 -22 -57 99 69 -45 28 43 13 -124 -21 -19 21 -32 122 -128 -111 123 -5 35 -30 -85 -4 97 -56
3637e6K2M0P0m7J5j42J68j80N9K0n8N5Q6r2m8J71o0o3K1J69j29L4j89K55n5J5
3663H1m1J1j08N0p5P1J3j33K44j74K06k09O6l9J09rl9m5m8m5J13J9p0J4J7l7L3
3690b5K24l15J21K2N9q4J0K3lk2l4K4J32R6j46j78K60k8o1j54O2L1j1o6J9rL9
3717a4j49R6K27j14r8J13L9j74J91k04R0K2Q3k58K30j35JJ1j1J03r6O9p7R1jn6
3743b1M7j53J80n2j04J79j1%o7l5R1J03j31j2M9J2j44J68qO0o3l8j20J19j47J45
3769D7n4k6kJ1O1J67j22r9j7J2R7j34Q6Op0K1J29k6m8O3o5j0l1J54j35m6p2J63
3797F0k6L2M2k8o2P8j4K3p7j71N4J90l0l4r3R2k9n8o3L6R4p0J5j91J77L2R1r6
3825b6J33r9n8k2Q1o5p6O2n9J3J28q6J02L6j51R9j1q4K7J3J48k95K55On6r1J3
$$ plain form
3637 -56 -34 6 76 29 44 -98 70 -110 -51 -31 -89 -34 52 -40 -88 83 23 -40 -19 150 21 55 -134 121 66 81
3663 81 40 51 -57 -7 -82 -11 2 -131 113 -61 145 -64 2 -37 72 63 24 -21 -69 -114 -1 18 -52 -38 -21 -58 -25
3690 -25 199 -116 5 27 86 2 12 35 32 10 -24 0 132 228 82 -96 164 136 75 -79 -17 14 3 -63 -44 -53 -14
3717 -14 -163 -67 160 46 -52 61 100 -74 117 -87 3 25 108 -150 80 -55 -54 -43 -54 49 -47 22 -55 36 35 -21
3743 -21 26 -127 53 1 -103 76 65 65 -2 -37 54 157 26 14 63 75 -69 99 91 151 88 50 -70 49 -98 47
3769 47 -7 -33 -35 -24 37 204 82 -17 -34 -22 75 -59 27 33 -37 -16 113 87 39 102 37 27 -4 150 15 -31 -103 60
3797 60 34 66 108 80 18 96 82 105 28 -143 -89 101 71 37 -56 36 7 -51 -114 -78 16 -54 -39 -230 -53 -21 70 -26
3825 -26 107 8 -50 -72 9 -56 -132 -70 -129 -116 12 -74 28 64 -87 12 1 -83 -56 -43 105 -190 65 71 15 -76 -63
3852f3R2j24J59k3J42k88P4J30j82N7J24p2R7M5l5k41N8N5Q8j41J15q1M1j93J80
3877A4o0M9O2m4J07j56J65j04j0n5J54r7K05j93N7r4j9J60p0n6r3Q3n5Q2j01J62
3903I3k5K8N8j43m5O2J29j9j45j40K21j51J57k5k1o8M3k1J7j30J48rn1l3J42m7
3929B5n7k8Q3j61J29J37j31M3LJ22j35p6L1N4P2j92J09O3q9M8NP8q4p5j6K7O0
3956D5j40J19k7P5j36M4Ql6M5l9L3K9j15J30P3J6j05l9M0j77K41k1p1j3j4p6J05
3983fj2p4P6j24P2K9J08r2j08J84rJ2Qp1N6O4j08O2j64J78p8J4ok7J48j26k8O
4011a6P5q2l2o4J00k5M6l6N0p8p0P6P7l5K1O2R2k36J60%o2N3r9n3J32j49N9J49
4039A15n5j15R3J00j72j3Q4K7Po1M7n9J14l4j03j6n1J25J2l9o4P3j03R8j0P9K2
$$ plain form
3852 -63 29 -95 64 41 183 -105 -31 99 -83 -26 98 26 123 168 133 -108 -50 5 93 -48 67 -14 27 -166 14
3877 14 -46 3 65 21 128 -28 137 33 23 -32 122 25 230 37 94 0 -19 141 71 15 -78 5 -50 32 -69 93
3903 93 68 96 154 11 -34 28 157 138 -7 -147 74 -77 80 55 34 -34 9 -12 5 -125 23 14 -37 -70 72 25
3929 25 -32 -60 23 -138 -9 128 -3 40 43 165 30 -46 -15 39 111 -81 28 91 2 50 55 133 49 -26 -42 -15 45
3956 45 -95 24 -3 72 -64 -20 -12 -48 -3 -42 -9 20 -95 35 108 124 19 -20 20 -157 84 63 -8 -21 -35 -111 -6
3983 -6 -18 -92 -16 -140 -68 -39 69 -23 -131 53 44 56 64 -7 49 113 5 67 -97 81 3 17 11 -16 132 6 -22 -16
4011 -16 59 -23 -55 -119 -19 -44 2 -34 16 -62 -132 -56 21 -14 7 69 161 -75 85 85 23 76 -23 -76 56 -93 -34 115
4039 115 60 -55 38 138 -34 -47 37 64 71 10 57 -2 112 78 -25 -41 -92 33 45 6 -58 15 -88 10 0 79 101
4066A01l2j08N8l1J22n8n7N2r4J56j39KL6P6j01N4O5j32j7j3k4Q8M0m9j62K27
4092F0j4p3O2r4lJ23p6M7k8M6O1Qqj48Q5j05P4jK5l2po4O3N5j14k3j9K46l9o0
4122D7m9K6n2j1P5j5K3J2Jm9P5o5O3p1L2j48J5Q7o9N0q8K0J11J03j62P1O3j89
4150i4J58r6J45r5n8P3j20J90m9q4J47K9j6k16J60L6j20J23j54L3n7J4M4J5k0
4175a2m0K17j09p1k6J52l7l3J4Nj5r0Ql7J33j1j1J6%P3j31j10K0J96l8OK6j75
4203h0K24j16l4K2k5nO9K1q8Q2rr3r1J74M1q3m9J12K8m0K9j78K36j53q2J60j03
4230c1L7O6M6j47J57j81j29K75j2lj63j0M4K2J00r6M9R1j00rK1l5rK9R8m6m8O
4258B2rr6J19mm7J00q9r7J25j23K48j19J05q0p2qR7M5p1m8R4nj04P3rK7o0O7r4
$$ plain form
4066 101 69 -39 19 -12 110 52 -5 47 -47 109 -30 -28 8 84 -17 37 102 -30 -47 -60 -84 4 44 -5 -167 60
4092 60 46 -27 35 -59 -62 61 -15 32 4 50 111 119 111 -37 48 -57 17 16 41 9 2 -62 1 56 -58 -81 -100 146 107 47
4122 47 -2 24 -28 -39 36 21 44 56 57 8 83 18 81 10 42 -106 -91 -4 -73 -23 -111 -91 20 123 -39 32 95 -94
4150 -94 64 -32 113 18 -40 33 -87 103 54 -30 117 146 130 -86 74 110 -10 113 -41 -8 -65 -51 -7 8 -12
4175 -12 -52 165 56 -15 -41 111 74 41 55 60 45 -45 -37 -74 59 48 37 53 53 126 -5 -115 -95 101 63 69 95 -80
4203 -80 144 28 -6 16 -9 -14 55 76 -12 70 61 -32 -123 51 92 9 -40 72 100 60 89 -89 147 -6 -88 72 -31
4230 -31 6 72 118 -29 128 -53 -182 93 81 78 -85 -95 -51 -29 71 -25 24 115 15 6 27 -8 -17 12 110 64 16 22
4258 22 13 -83 36 32 -15 85 -4 -101 24 -99 149 30 135 55 -17 -25 72 117 46 -2 92 87 -17 56 47 74 14 81 -13
4287a3R5o4j38K30j25loN2O8k11K24j32K1qL3Kj7M9Rr1R9l9l6M0j26J56j16Q8
4315D1J47k23j0k3M9R9L1o5j12K27k40r8J74N7p0l6J79l40L41j19M8n4r7J59k30
4340a65K26L5k6oK9M7j10q1J40P7k85Q1K9m7R5j03J93k82J30Lj26R2K20q4qj13
4366c9p8J03m9k1R6O4N9Q2l05M6j5rR6n4N8R0n6J8j01l3j0K8K4J67j44r3J06p1
4394d1R3j30j10L34j15j11J45Q1j07Q5q0j33J41r5l0J4R2J4m1l0O2j5n0O8o9j00
4420a28O7M7J59Pj02o2Lp4J63j4j01P6K8j18k7J66j10M5kp8O4q6N0j1k3J97qm9
4448G9k75K15j70J78K4N2l5j91M7KK3Q3Oq8P5k7j94P1J6%J52JQ8j45j15K19J5
4475A06K9j25K2j4j21J37j06N2P2o5Rq4J02j2L7M7j2j9L7m8j0j9q4J25jk1j56
$$ plain form
4287 -13 82 18 -120 110 -15 -18 -24 28 96 -115 109 -23 -2 -10 23 25 8 57 66 -25 74 35 -1 39 -87 69 -47 41
4315 41 188 -35 -45 -68 -19 80 111 46 -66 161 -79 -177 -3 54 -16 -52 127 -213 128 9 57 3 -94 65 -165
4340 -165 61 96 70 64 93 140 30 -51 89 166 -119 -38 -9 -56 39 -64 129 -153 -23 -20 -146 -54 166 82 74 -39
4366 -39 -117 -14 -63 -84 12 76 135 217 -88 -42 -57 -66 30 -24 34 124 68 86 -15 -48 -58 -30 -6 161 17 -76 30 -41
4394 -41 52 -78 -188 146 31 -80 65 146 39 124 44 -89 52 -43 -73 -59 33 47 6 -24 38 23 -27 41 -28 -128
4420 -128 -61 -14 145 152 50 -12 -9 -83 80 66 -35 41 69 -49 -76 90 -20 25 23 -55 9 -77 -27 -38 -61 136 128 79
4448 79 -196 19 -151 27 51 103 68 -123 -76 -74 -51 32 38 -50 25 -2 -196 -125 -109 -109 43 44 132 -13 -128 91 106
4475 106 135 10 32 18 -103 34 -72 -20 52 -13 -4 -88 14 2 39 86 74 55 92 44 34 15 -69 56 55 34 -122
4502a22J05R0J07k08L5J3kqp4L2P7q2J90k31O5m9R2P1P2k27J23j70J02O6L7r8
4528Fl2J8J28j00j6j5m3J69L2j01j2L4j27J63r5j2j32J24J4j35J69M8o5K1r3J25
4554G3j90J38L8q4j49K57m9jn7Q0j08J89j0k66R4J4N5m7jN5q0J47j35j01N1J67
4580H0M3m4M2l5j33K20j86j01J35J18r8Q9J23l31O9j10K04m5jl1j5m9J83j42q1
4605i6J22p5L1k2J38j15j14L3K1J57j04K3J69r1q5K0n5p2J10m0l8P0J52l22K24
4630D1L9j22J17m1NL7l5O6j50O8K8n2l0L8O9n2Qk15J47Q6JQ9j90L1j3J60j46k
4658a8M9j11J95m0P2k29J78q0l4LJ08j82L3krM3o1K8J05M8j36J6J00j15J3P2j70
4685a24J71O5j41J36j27%O8m4N2J8k1p4N7l9M7L9P2k10J57m5q3L7k3P5q1%N4q6
$$ plain form
4502 -122 -17 73 180 -28 7 20 18 10 -64 -32 45 -37 153 -78 -13 -62 30 101 173 -54 69 -101 1 67 104 6
4528 6 -26 -8 120 20 4 -11 -54 115 147 46 34 68 -59 104 9 -3 -135 -11 3 -132 37 85 20 41 -52 73
4554 73 -117 21 59 -25 -174 83 34 33 -24 56 -52 137 127 -139 -45 -31 24 -23 -24 31 -49 98 -37 -138 -87 80
4580 80 123 79 121 86 -47 173 -13 -114 21 139 41 130 253 -78 -9 -119 85 40 39 8 -7 -56 127 -15 -96
4605 -96 26 -49 -18 -40 98 -17 -131 -98 -77 80 -24 -1 168 77 -8 12 -43 -115 -5 -45 -83 -13 139 -183 41
4630 41 80 -42 75 34 39 76 41 107 -43 25 53 1 -29 9 78 26 34 -181 -34 52 53 142 -48 -17 -30 130 -16 -18
4658 -18 31 -80 115 75 147 -82 96 16 -18 -15 93 -89 -56 -58 -67 -24 -85 -57 48 96 -40 -24 76 -39 -26 46 -124
4685 -124 47 112 -29 107 -20 -20 48 4 56 74 53 -21 36 -3 44 83 155 -55 102 57 -26 11 -12 63 -18 -18 36 -50
4713e0J86j22k38J53K57o3j92J06k8j29jJ67O1j13P2r9N9K6j11KJ03k4l7L9j29
4738a05m4J31J14J8j00K4J13j40J03j32L4O3r0n2p4%J37po4M4R7j25J95k44N9
4763d5K01r9M1j44n5Q2Q1J1l7j6j22J19J27k81K20m8N1o6m0m9j1N4R6j11j02J26
4789a7J4O1r7R1rq6Q5o6L4M4R8k72N4R3l9m2J65m3j3j29J12mp8J29j35O5o0J25
4817H0L3N9n7l7j8J28k46J06j6j76J40O3q4J6J03j06L5m5n0R8j23J60j88J03J08
4842H6m9K3L9j36j23K07M6r3j39J38Q2l7n4M2j60L7O2K22j5l03M6J5Q1p7P0n0
4868d0J48K4q1M8l8j89K37j25j37J76L2j13J27oj70P3j14K25m8k5rO4o5P1M4q4
4894B5p6k7O4J59r3j24R7r7J36j33l4J07J25j48M3q3J35J6q2L5j10K3p1J04NL5
$$ plain form
4713 -50 136 14 -224 -71 186 123 -69 37 9 -120 -121 46 107 -6 66 -33 26 52 -59 -57 46 22 -15 24 -105
4738 -105 -149 -18 96 114 14 38 151 11 114 -18 16 79 -11 -63 -137 -137 0 -7 -71 -27 70 -55 140 -104 -45
4763 -45 156 57 98 -46 -101 -19 62 73 36 20 -102 17 144 -137 83 35 86 20 -20 -69 -80 -26 70 -41 -143 -17
4789 -17 -3 58 -39 52 43 -43 42 -24 10 54 152 -120 -66 27 -12 -54 111 68 55 -74 38 34 -44 85 -50 15 -45 80
4817 80 113 172 115 78 60 188 -58 48 32 -144 -4 59 -25 -9 94 -12 23 -22 -72 26 -97 63 -125 -22 86
4842 86 37 60 99 -37 -160 47 93 0 -139 -1 81 44 -10 32 -128 -91 -29 193 178 -125 -79 -64 17 -60 10 -40
4868 -40 108 132 51 99 61 -128 109 -16 -153 23 55 -58 69 63 -107 -34 -148 77 29 4 -5 59 -6 65 109 25
4894 25 -51 -78 -14 145 52 -72 25 -72 64 -69 -103 4 129 -19 24 -59 76 92 10 45 -65 -42 -113 -9 -4 31
4920C1j56K00MM9J6j17l8J74k21L4J58j70J07k4l2p9j44K47p8Jl1P6R6j96J49
4945E6j30N2O9j52J06l7j2J91m4j39P6P4k0k83J56j3Q9o2J93j43r6J19j44J48
4969E4L5j54j7J80j0j51j68K26m5q6OJ38nO0r6Nj22K35j89L2l8m0K05m9r8J19
4995B7p5K0l9R9J15j34RL5J2K0j2k3K8o6n8MQ4M8M1j31n0p8J52K0Q6k91O5KJ18
5024B8K3r%k19P5K6N5j11L25k38J63j62J07J6J6k58J70j2J27p4%j24J66j09n3
5049g2L6k6J73k51K04r2N3K1Ok02J44O7r0j87K42%rr8M8k4M3J6n4J41l9L3j10
5076b7j10L3J10J72k78J28j53K06k2q6N4J2J30k09R0L3N8p6j54J89j50j03J55
5099BNl4J68j53r6J50j8q2J49j60P3j25J92K5j37n0J03L5p3L4L2k0Q2p5l3q4N3
$$ plain form
4920 31 -125 75 79 128 144 27 -11 163 -58 -24 134 -36 71 47 15 -64 -208 39 -39 -38 -69 7 103 -93 56
4945 56 -74 -22 47 -105 1 -36 -48 143 99 -40 36 110 90 -193 -37 -50 39 -23 170 27 -69 50 -94 54
4969 54 89 -65 -82 98 88 -63 -231 -5 -50 -136 -130 8 3 63 -33 -28 -150 85 -104 -72 -110 -150 55 6 -92 27
4995 27 -48 -28 -67 32 147 13 22 57 69 89 77 54 82 16 -42 -38 46 94 135 4 -46 -124 28 48 134 -157 -92 -90 28
5024 28 51 42 42 -177 -102 -76 -21 -132 193 -45 118 -44 63 79 95 -163 7 -5 122 48 48 -76 90 -19 -72
5049 -72 -36 -62 111 -140 64 -28 25 46 52 -150 -6 61 -29 -216 26 26 17 -81 -33 -57 -14 2 -52 89 50 83 -27
5076 -27 -137 -104 6 178 -100 28 -125 81 59 -27 27 39 169 -40 50 83 141 65 -89 100 -50 -153 2
5099 2 7 -27 141 -12 -108 42 24 -58 91 -69 4 -121 71 96 -41 -91 12 47 -26 8 40 20 102 27 -6 -90 -37
5126c7oJ23N6k92P3K2J02j28L3J29j55M8P7J4J1j75R3jJ0m2k03J59j5J20J15j61
5152c0K6k8J08p3N7l11K97J64j75L0M0j17mR0m1J52n2j79J61o3L4j15j1JL4K4
5178A9lp0N1j27J52L0o1K5O7K8j32P7P6k32O6lj8J18q2k6k5P2k5Q9n5J12m5l3
5206D5r3K12l2p9r0j0kj57K83K6rj09J33k10J78p9j8j0p4J41Kn1M2Rm3q8k9J52
5234D0l2j86J66l5k7O5k2k4J62J5j18j06P3N8j33J02k2M3r7J25R8o0oj88M6j9
5260h2J5O8l4J29j38o1J17q0P3J27j45m7J4N3j46K23nQj24kJ12r8J26q0J7j47
5286a07J82j13J47j11q1R2O9J16j29N2j78J25N9j24J50k05J27k1p6%pJ34Qj89
5310h0K53k26J69j14l9J06n4O3p5L2j86J55RK8o6J53pj44o7J06K1J06j06K8k34
$$ plain form
5126 -37 -43 80 136 -156 -83 -61 41 -87 -54 75 -80 -32 45 59 70 -105 -12 -13 -3 -45 -248 -89 -104 16 131 -30
5152 -30 -4 -32 76 3 60 -251 46 210 35 65 105 -12 -16 74 33 185 133 -46 115 52 86 -29 -40 -39 -5 19
5178 19 16 -54 -3 -130 22 52 -9 16 83 111 -21 56 132 -100 -34 -37 -55 63 -19 -45 -70 2 -23 66 11 123 78 45
5206 45 -48 164 132 53 -37 -47 -49 -206 77 103 94 -15 118 -92 86 7 -11 -21 -95 46 48 -3 39 48 5 -83 -112 40
5234 40 8 -178 -12 -47 -74 -9 -31 -55 107 122 4 -102 -29 29 -104 -2 -24 19 -78 47 145 85 79 -109 -63 -82
5260 -82 -67 1 -33 96 -42 -103 14 -66 7 134 -11 -58 -44 9 -137 86 81 89 -35 -37 75 -23 103 23 40 -107
5286 -107 75 -38 109 -2 -83 9 78 194 65 117 -61 64 123 -1 149 -56 71 50 -26 -26 -33 101 109 -80
5310 -80 173 -53 116 2 -37 69 15 78 3 35 -151 4 13 41 -25 128 121 -23 -90 16 37 143 37 65 -169
5335a69K82k06KJ53n4J07p4P1q2O5r9r1R7O4lp0p1rJ51jq7O2lR8j06Nj1j22Q6
5364a5rM6or4J8L6P6l8j01J99j70O5Q4o1m0n4Q0Q7K0j05p6O5J08j9j72kR3L4K2
5393G1r5k1K7j07K28j44N7j00L4J18k99K41mM7l8P1j74k1P6Q1M1J0j05J17j19
5418hl3J7J92p2r7K0j19MP9PN4o5j6rl0K33j56L0j19P1r2K50j11k4J11n9j03m5
5446i0L31k60R8j6N8r5J56j58j1jJ4Kl8J64k70J04M9j02j6J90k14J78lnj75J18
5472HR2j33L5o2J03q9Q0n0l2J43j89M0J0J26n7M6j01K2n1rM7J17j05M6m0N6o4
5499a1p4J49j12j1m8J85j37QJ16Rj35J03j35J0J08k0R0%j3J0k06L15l05J06J03
5524A05j9j08J07r7L8Q0k95K19M9q8J66j54P2m4j41K18n8o8n8J16j39N0K1j0J89
$$ plain form
5335 -169 113 -93 -91 62 8 115 41 112 30 95 -4 -95 2 66 63 -7 -78 -87 64 63 -24 38 35 133 27 32 21 -101 -15
5364 -15 -24 22 16 -78 -60 -24 52 14 -87 112 -58 7 91 30 -10 -64 16 103 123 18 -58 7 115 96 -76 -78 15 49 71
5393 71 -24 -45 -18 -125 103 -41 16 -84 -50 68 -231 10 6 53 15 86 -88 -109 -33 48 89 99 -6 111 -8
5418 -8 -41 -24 168 96 -1 19 -100 -96 -17 -10 44 -21 -37 -46 -76 157 1 31 -88 -17 -109 141 30 6 117 58 -45 -90
5446 -90 241 -19 79 63 121 26 182 24 13 12 26 28 -10 154 -116 -12 37 -65 -81 109 -105 73 70 65 -110 8
5472 8 100 -33 2 -60 43 -46 34 -16 -48 95 -94 -54 -44 82 25 71 -30 -8 -59 -68 -21 96 -9 37 -3 53 -11
5499 -11 -85 64 -48 -59 -107 78 -59 -51 65 74 -61 42 -93 -83 25 5 95 95 82 92 -114 201 -104 2 105
5524 105 86 -22 85 -12 26 106 -189 30 79 -9 157 3 75 31 -110 108 50 -18 -76 40 -99 -49 -28 -38 151
5549A51j72l2K22j16j14P9M5n1N0l5j1p9M4qJ21j44o2J42J6M1L2l07N6J55k0r9
5575i6J27j26J95j0l4j3m0K3m7L9j21J33l5Q5j30L5r4O9rQ6K5n4l0O0k20K58l5
5602D1j0j04J71J10k15M0j24q5K37j39L8J16o4n7N6j7L6Lj43K02r0j94J85K7Q
5627B8J6j08J04Q5n0N7j50M2J40k75J15N6L3n8L9q1kJ33k36m5P8OO0J33l3o6M6
5654F7k3j77j8J58r0K0J06j81P9j11K29pp9J63j32J08OJ3k13M9Q9n8Rl1Q2l6l4
5681a2Q0NkP4k12p3L34j09j46J59k28P9J31j65J50j7o2K5P7k2j06l3J43M5J56
5706B71l42J47k05N4J63l3J07j14j39Q4p4J30m9M2j85J67n1J02j15Q7j08oJ3P1
5730A7P1k1j33lJ8P6m8P3j92r2L19l9Q2J8j31l7J00r6R4l6Q5O0l6j77O6r6R8j06
$$ plain form
5549 151 -21 -53 169 53 -61 18 63 12 62 27 16 -63 -19 -27 94 -50 -112 30 46 87 119 -188 -132 23 3 -96
5575 -96 31 -95 100 90 56 43 3 26 -21 18 -103 30 -5 80 -50 -15 -109 -40 -49 37 62 8 -22 38 -182 76 41
5602 41 31 -73 98 208 -7 33 -91 -176 61 -78 -40 76 12 -45 11 -6 30 33 -110 92 2 -192 -7 20 28
5627 28 44 -64 40 125 75 132 -18 24 164 -111 4 60 93 35 74 -7 -9 124 -112 -157 -79 -73 -13 120 87 21 67
5654 67 44 -133 -151 7 -83 -63 43 -138 -59 -170 59 52 -27 136 4 112 118 131 -82 -33 56 -2 7 -24 58 22 -12
5681 -12 68 73 71 145 -67 -140 194 85 -61 98 -130 -51 80 -85 65 48 -14 11 88 66 -40 -73 70 115 271
5706 271 -71 76 -129 -75 88 55 162 48 -91 -7 -81 49 0 42 -143 24 -27 75 -40 47 -61 -67 -54 17
5730 17 88 67 -66 -69 -51 25 -23 50 -142 -234 85 46 128 146 15 -22 78 -18 76 40 125 185 149 -28 38 -58 40 -66
5758f6J10j97J69N7k9M5p1o2J23r2R2j38MK1R2j10R1N1k13O7J07m0k60L71j99
5783g7P2r8Nl5J33k27K61lj8R7p0o2N2p0k2rL3P7p3j22K12K3j37N7O5j64J11k2
5811a1J76j17j42J01m9J45j12Q5R8Mj40o9n2J15k10K04L5N1ml1J3k2o3r2K69k31
5837d9P0q2R5l5m4J21j43J16m1m4P7j6j52K53j92J18j30l1Q8j83K80r3N5R8j11
5862B5K6K1K4p8j1J0J66j96o8Q5Q1j19J9J11k7j39P5j21J54K1j30l1K38j00n7
5887b1l9J39M4q2j09J37m3j85J24m3K16r0K1Kj17K04k41J3J16R4k57R3j7J68j80
5912e3K16j76m5J23Q9n9r7LM0k2j42J82j32P7l6Lo4J85j45l9q7K87k08J26L2n2
5938Fn4J63Rp7p4J02j28K7m6Q9j80J50O1m8k0J68Qj94J06j57P5R3j77Q1R6q3M9
$$ plain form
5758 -66 44 -153 16 73 44 89 18 -44 79 -13 79 -59 -55 -34 58 -52 39 90 -123 -56 51 11 -249 122 -77
5783 -77 -5 -103 -98 -133 0 -227 34 31 13 110 40 -22 30 -40 -62 -71 -38 39 -34 -156 56 79 -58 -1 64 -100 11 -11
5811 -11 165 48 -94 7 -42 103 -9 76 174 178 38 -31 -83 32 -178 26 61 112 108 77 90 68 5 -87 182 -49
5837 -49 21 -61 34 -1 -45 76 -67 49 8 -36 41 25 -127 126 -66 52 -78 -109 -21 -204 76 -17 38 136 25
5862 25 51 72 96 18 7 17 183 -13 -81 4 85 -34 -15 96 69 -70 5 -116 38 59 -71 -102 136 36 -21
5887 -21 -60 79 123 41 -68 69 26 -159 -35 -78 138 48 69 71 -46 158 -83 -70 46 140 -117 -24 -41 127 -53
5912 -53 163 -13 -58 65 154 95 -2 1 41 19 -123 59 -73 4 -32 -29 -93 92 -53 -92 -179 108 -100 26 58 6
5938 6 -48 115 124 47 -27 75 -53 -26 -72 17 -163 -13 48 0 -20 148 156 -38 68 -89 -14 79 -98 -17 79 -4 45
5965D5o1j7n3J80j22j72J91R9j18M0K5p2K4J62L8l16J98Mj6K4j8j72M7P9j45j01
5991b27K29K3R1r5j31J43Q5k63J38O2j9r9L3J24j67J08j54J69j94r5J13J04m6
6014f8J08m7Q9p0m0O6j09k7J07Mm6k4j6L4o5L8R0k9J8N0q4j6L7n5kKM0J73j41
6043A7M5j38j4J74N2j24o4J4L7J73j59j84K28J3j61K48r5j16M6J36m0k2k32K23
6067E7l7j29M9K1K51k11n3q2M9J35n5j42J82j01K6Q1K1Rj27M3M6J27l29J13J4
6092d2O9q1o7J99k57K45M2r1o1O2l6m0kJ05Mp4R2l3j82K18m8Ro9m6J66l7q8Q8
6120D5j6o5J37O2k28K26k24J29R5p5Q4r9j68k2K45l1j10OoJ2n3J34j14qP6J5k0
6147B7R2o2N9j28J80l75J72l9N7Q2k4qj3l1K9J6k1O5k31K72j84M2l2Q5p8j42J52
$$ plain form
5965 45 -16 -33 -86 94 -28 -200 -9 90 -28 12 37 -35 -11 151 189 -127 71 75 59 83 65 -107 -60 19 -126 -227
5991 -227 2 25 116 21 -110 33 118 -145 -7 55 36 -63 -30 94 -73 35 -119 50 -144 -239 -126 -22 -68
6014 -68 40 -7 82 12 -28 38 -71 -98 9 13 -33 -57 -73 -39 -104 -66 24 -5 13 63 -21 -37 0 -55 -57 -55 -15 158 17
6043 17 62 -76 -90 84 136 12 -52 -38 -1 172 13 -171 57 70 -91 157 62 -54 -8 128 88 66 -166 57
6067 57 20 -109 -60 -39 212 1 -52 -134 -85 50 -5 -147 35 -66 -40 41 62 71 -56 -13 33 160 -169 -56 -42
6092 -42 27 -54 -121 78 -179 66 108 17 -44 18 -18 -58 -60 45 49 -25 67 34 -148 70 22 31 -38 -84 82 45 -43 45
6120 45 29 -36 101 163 -65 161 -63 66 161 86 170 71 -97 -119 126 95 -15 -9 -15 -3 -56 78 -36 -44 32 47 27
6147 27 119 57 116 -12 168 -207 -35 -74 -17 65 41 33 20 -11 18 34 13 78 -153 119 -65 -23 -55 30 -48 -190 -38
6174c8k8N2J32k14J63j93J04K2M8j20K08j43J69q7j83L7K39k04M1p3P5rRJL8j51
6200a05J72K3p8L9n3m5N7n2K8R1j74K66k12J33j9k9J7m1k5n5J02J11k86L71k92
6225e6P0K12l48N7J3J1l8J17k27L05p9M5n4o5L9p5N2M3k6O6N2M2j85K1kJ38k55
6252a27J58K2n3Rk5J6j29K7M0J6K6J19j77J26j29J33j14J66l57L15J5L2l5j7M8
6277A05j22L4m6J22j98J53r4J26J7j34P6j09J13J29k52L9pQ6nJ1j42J10O0j34
6301f2N0J2j1k6J44m1jp3k1n9R5mj8l5R8k7P5m7p8N2M7j46j11K30j24P4j51J69
6329A1N9n1N9q2P6O9k99J51N0k3l5k4K57l24J20q1R8J9P0j88p9J15J9J01p6k36
6355b24L72j23m7J69j64l7J24j02J0r3J63O6k1%j38l2J9l7j1J83p2L5J11j61M5
$$ plain form
6174 -38 -66 -14 118 -96 67 -126 -22 0 48 -72 136 -7 162 75 -108 -71 168 -36 5 -68 7 -2 7 8 46 -105
6200 -105 67 90 12 51 -2 -47 10 -42 -14 77 -97 169 -43 90 71 42 59 18 -7 -62 40 151 -135 236 -56
6225 -56 14 226 -122 -65 -52 -41 -79 38 -189 116 37 82 28 -37 2 -73 -21 22 -4 62 114 156 -29 -8 -10 128 -127
6252 -127 31 53 0 9 -16 0 -129 -102 -62 -46 -20 99 -78 48 -81 52 -62 104 -253 62 77 109 74 57 105
6277 105 -17 17 -29 93 -105 48 -46 80 97 -37 39 -70 43 172 -80 -41 -48 38 33 44 -98 12 72 -62
6301 -62 -12 0 -11 -37 107 66 65 -8 -29 -88 7 3 -15 -50 48 21 96 49 -29 23 70 -76 -187 43 -81 -7 -158 11
6329 11 70 19 78 -4 72 141 -158 -7 43 20 -15 -39 218 -106 14 -67 31 50 120 -68 -147 -32 -13 88 12 -224
6355 -224 148 25 -22 147 -17 -54 70 -32 -22 -115 48 114 93 93 -45 -77 -58 -95 -106 77 5 40 151 -10 35
6380C5PJ6k05R8J42l2K9n4o4J10l3p9P2r1J0P0L1p8L5K7j81K41J1j26l6J16r6
6407b5N6P1j58J05K1p9o1O3r9K16p2m2q4m1J45p8k5J00J0k1K2P5j3l1j85K80j57
6434gl4Q1p3J8m3l9J76m6j1j08J31L2j22J9k3P8K0k5O3j2j52O1l1J06L6k22o0
6461a87K09q3JR5j40R4J4o5J5N2m7O5j14P8M5RP6j16LNl4l3k6J27L8q9J53j80
6489c5J7R0l0j53J02O2j74K2K9k0J52n5r1p5J43R0j6j20M0K9K2j57O0J6J05q8
6515c5J26n6j41J16LK25j70j79J15j02J1J31j22J14o5Q5o8J1Q7j15J30j72J76
6538A05q7mK8l5m2J8Pk9l8J39k9j72J65qj3j73K6J28Oj10mO8J21p3J4J14j36n1
6566f5J07k1m4j04J58l9J8q7O8nK5K1j51J57lj48J68k22Q3J22q6J23j9Q2k41J81
$$ plain form
6380 35 42 58 -147 -49 93 61 90 36 -28 82 49 -30 42 -49 -39 31 62 -16 19 46 -135 106 117 -9 -45 71 -25
6407 -25 31 102 -56 49 70 -9 -70 -7 -106 110 38 -4 -88 -129 16 -62 -87 13 23 2 24 99 86 55 -130 150 -7
6434 -7 -41 40 -33 -15 -58 -97 79 33 22 -86 45 77 -45 -26 -49 29 49 24 87 75 -77 -16 -47 59 95 -127 -187
6461 -187 22 -61 -60 35 -105 -11 3 -62 -47 5 -42 23 -91 -13 32 41 117 1 4 9 -25 -58 -84 43 81 -8 145 -35
6489 -35 -18 72 42 -111 -9 53 -121 -99 -70 -90 62 7 -84 -159 -16 74 58 -62 -22 7 29 -128 -68 -52 53 -35
6515 -35 91 35 -106 10 13 238 68 -111 4 -98 -87 44 -78 36 -29 56 -12 -1 86 -29 101 -71 105
6538 105 18 14 42 7 -35 -17 -10 -39 -77 62 33 -139 26 18 5 -168 -142 -14 -8 -118 -122 -54 67 -6 8 122 -14 -65
6566 -65 42 21 -23 -127 31 -8 10 -77 -9 -14 11 32 -119 38 35 -113 55 -167 -84 38 -48 75 56 138 -103 78
6592G8j47J42l6N0J0k24J39Q0j08R0Nj33j9m5j0J97j48O3k07K23r7J73Jo7j04
6617i4K40j03K9m8L6m0J0k2J2mLN7m7n5J99l23m8J25QM6M9q3N6k1J7k0j1l1Q7
6646B4p4J09P5j04j3l1R9j47R3k2MJ3j35j12J69J86k29K54j92J36R6j69mj08L0
6671e2O3k0J51j54J13j84o7J41RP1K7k34J23m7nN6o1jM6j39J43L5j2Nn1R2j19
6698g1J51K6n1J70l02J48n2J39k03l3J00J01j50J83n8k73J51M0m8k6M3P0L2J1
6722I8j8j5R6j60o8R0o7p2J76n3k7J1jL4L1j22K21k22k3m1K03j19K14k25l9j5
6748a13J61J1P5j11ml2k6l2n9J72p0L1J52k41J14K1Rk25J80M0j06J63k18K15j66
6773e9l4M6M3O1J11j12j01J81p9r4p8J74r6n3P3m7p7J67p5J13j9P2j87J86K3j90
$$ plain form
6592 78 -69 73 37 87 97 -127 12 92 -16 74 79 -54 -73 -118 -128 69 -79 -16 -223 0 -97 76 77 10 -94
6617 -94 146 43 72 24 60 20 30 8 20 16 19 76 29 -26 173 -150 -198 -73 -65 -19 30 -53 3 -18 -1 -21 -32 -63 24
6646 24 -50 59 134 30 17 -14 85 -62 31 9 13 26 -109 -221 -52 134 -95 159 -33 103 199 30 26 -82 -52
6671 -52 11 -9 142 -12 101 -83 -150 -9 0 71 98 -136 -13 -60 -65 -9 -70 -71 -25 -164 -21 14 2 7 -44 48 -71
6698 -71 80 106 55 225 -77 71 19 158 -45 -78 22 123 -27 156 98 -175 -24 16 -32 -58 -15 55 87 98
6722 98 80 65 161 1 -67 23 -44 -116 60 7 -20 -9 -10 24 55 -67 154 -68 -91 -132 71 -48 166 -59 -98 -113
6748 -113 48 59 134 23 19 -13 -39 -71 -130 42 -28 3 155 -86 28 49 58 -167 13 53 -53 110 -108 107 -59
6773 -59 -93 -47 -4 57 168 56 -45 136 57 -37 -115 59 -37 -90 -17 -64 -141 26 -49 64 45 117 -70 116 139 -51
6799e1M9r3O6R0M5j26M1m4j11J64O7O0j64j15J02j72J09oJ16r9J17j12K7n1j10
6824b01J78k8M9K01j44pm4P9Jj62m4J17q7K63o0j92J38k17J60M3j12O3P0j27R9
6849C6n7j11Q0M9J91j82r1P0N6j47J01J20n3j51J04J26k10J64j07q5O7l3J53o7
6873B3o1n2K49j18j85J63P6k13J12P4j27m9J20L8j12J34j38J1Q6k5mr9J17n2P7
6898D5j2l7o4R5j09M3J61r1r0oP6l2O8j21M9p7O5o9J66k31K61L5j99K57l10K66
6924A39j85J40m5n8J7J61j48m5J73Rj94P1j30Q6m1J65K6O1k02m2O0l9M4J11k16
6949h2m0K36r1k0l9P4J05n8n1o2J19o0l5j9k0N0J4N9k64K04LN8r5q1J07N2M1j10
6977ej3J04m9j85Q0J52j30J17j84J06r2L6L5k2N8o3k5L04k97J00J62k37R0Q2K5
$$ plain form
6799 -51 -2 -95 -29 61 106 -20 21 -23 -134 30 97 157 -7 -122 -20 -192 -83 -89 27 -72 45 -67 -40 -91 -201
6824 -201 -23 -51 -2 199 55 48 4 83 84 -78 -122 -5 -92 171 111 -81 57 -160 0 43 -69 -6 64 -63 36
6849 36 -21 -132 -52 -3 188 6 -85 -15 41 -106 -5 115 62 -89 15 141 -69 95 -12 -97 -30 -63 90 23
6873 23 -38 -90 159 41 -144 19 95 -118 -6 68 -59 -108 12 50 -62 72 -66 -55 31 6 2 -97 20 -32 45
6898 45 33 -4 -68 27 -82 -39 122 31 -59 -65 11 -21 47 -74 -25 -102 -37 -106 60 -171 90 125 -74 183 -127 139
6924 139 -46 94 49 -9 8 169 21 -24 149 158 -36 35 -95 -9 -50 115 141 202 0 -42 18 -21 23 134 -82
6949 -82 -122 114 23 3 -36 38 143 85 34 -28 91 31 -4 -23 -43 7 21 80 -184 20 23 81 -14 -95 12 64 105 -5
6977 -5 -18 86 37 -148 -68 84 -46 71 -113 -7 -99 -63 -28 -50 8 -55 -80 224 -73 27 189 -48 42 124 149
7002A49J8n5j9j11p1J11J85p1j98l0ql7J64j1R6j57M8L7R4j34J0J3j52n4M7J46
7028A0j86J75Pk3P5j5l8p1L5O5m1o0J45j22K9j03J22N4kj56K00l4j07l8m6J65
7054D0j39L0M2J16j36QJ55k41K05J2j46K9nJ15n2p2k2J7K5N4k86J51J28k3QM8
7080F1r6L0p5P0J11M%l0j85J34K17j36n7o2J31j38k32K18L2j11J30k9J95k67j8
7105a03M9N5J6m2J98n2j14O2q4M6Kj00J16k1p9O0K7q1J54J5%k43K16r7K0L5j56
7132a01k8M8j5J45q5mjm9J71J73k91l2%j7K49k22M4k7q5J47j87J65L4JM4J4J7
7159A08m5M1q4q5J3Q7o5j44K30r1q3K27j39L8q4J67j65J48j59M4R3k03K17M7r0
7184B3j11K02n9m9jKJ1q7J02rJ82j10p9j08J25k5l2J95j86o4o3P3J60O5k90K25
$$ plain form
7002 149 167 112 93 -18 -89 22 207 136 -62 -92 -100 -137 27 16 112 -45 3 40 134 0 10 23 -129 -183 -136 10
7028 10 -176 -1 6 -17 58 43 5 -66 -31 34 -7 -67 78 -44 -15 -118 4 58 56 -100 100 66 -41 -79 -125 40
7054 40 -99 -69 -27 89 -47 -39 116 -125 80 92 -54 -25 -30 85 33 -39 -61 -44 -19 35 -251 -100 28 5 13 61
7080 61 -35 -5 -80 -10 101 105 105 75 -110 24 241 105 48 -14 117 -21 -253 -35 -3 -114 16 -13 182 -85 -103
7105 -103 -54 1 17 -25 173 121 7 69 -15 31 33 -67 49 28 -51 9 36 -45 109 124 124 -119 97 0 20 55 -101
7132 -101 -129 -81 -96 49 -36 -40 -41 -90 81 254 -37 -69 -69 -86 163 -59 -15 -42 -127 20 -167 -2 32 33 77 91 108
7159 108 63 104 20 -65 -52 35 -30 -174 56 -35 -118 109 -30 8 -76 91 -74 74 -85 -41 52 -151 66 113 23
7184 23 -88 114 55 6 5 7 18 -69 33 24 206 96 17 -91 34 9 -23 172 -14 -78 -141 -68 92 157 -133 92
7210I2rj33m1J88k1j23N4k9Q9j17J2j3LR0m8n7J20Qp8q4K30n4Ok8o2J0l5J30j44
7239d4m0M5M2o2J38j07l5M0N8K6q1L7l6mN0L1q9m5J18M1O0k51J11r0J01k1J2Q4
7267H9r2L4q6O9J0j9j26K08m5o4R8l4m9J7k8R8j71M4Q6j0j3ON5j14NL6k3J39k19
7296i9J48r6M8L1q5J38m0q6P6k7lj39K8M9M2K77k73k6j55K02j9J05q1K3kr7P6
7323A5o4M8Rl3j7M7N1j52J19j20Q7j28J41QP2O4k47P7R2j88K59j33o0J90j72p1
7349a06J58P1j76M4j24M4O7K8j38J14n6J89l5l6j00J27m0K3p4K8M1j20J71n3N7
7374A04p7r8J74n6J07j09k6o9K9m5p1Q4Q6n5J50j9q8p8P6o6J44l2Q5j04J91l03
7400f6N4N8j42L5m3o0J58J10J5p3L5p8O3o4J0j4p1O5M1rr6J79j29L9K0nk1k4j26
$$ plain form
7210 92 83 -50 -91 97 76 -47 7 -22 67 -50 -38 -51 -48 42 -6 -63 57 65 -13 -97 133 79 85 57 -5 5 -30 100 -44
7239 -44 -84 -39 3 -59 79 -28 -63 -23 35 61 -20 17 -19 -23 27 58 -31 -76 42 83 143 -108 3 -87 14 -7 5 89
7267 89 -3 31 -55 14 24 5 -121 87 42 -22 76 42 -7 10 -18 80 -91 -47 39 29 16 22 77 -37 -32 4 -19 120 -99
7296 -99 49 -47 1 32 -53 85 45 -41 35 8 5 -134 -106 -57 -15 262 -11 -37 -192 10 -9 96 15 38 36 -61 15
7323 15 -49 -1 8 -25 -42 5 56 -96 23 -97 -10 -138 3 11 83 147 -100 -23 69 -119 140 7 -53 137 -35 -106
7349 -106 52 123 -53 -9 -133 -89 -22 6 -132 -18 -74 115 80 44 -56 71 31 54 -20 8 49 -71 100 47 104
7374 104 27 -71 103 47 154 45 19 -50 -21 -66 -137 -53 33 -22 128 109 21 -57 19 -47 97 65 150 46 237 -66
7400 -66 -12 46 -96 -61 -104 -164 -6 104 119 46 81 3 66 2 12 -2 -73 -8 33 24 -72 107 -22 17 37 32 11 -13 -139
7429a39J81j4J8n5O7J55m05OK33k6l0j81K29m2J60j24Kpp5R2k4P3m0Kq8r3K7J92
7457I4j30k4O7j38J07L1L2l1j1J44r2j1j41O6J14n7j18J11lq7K7L8L1J28j09p7
7483c9J71j16k0j06J8M9r3K09l8l0m8K09j18KN0j16j11J48J71o1q3P0j63k8J44
7508G1r0l4o9J51j73K18k03J40m8j1nK4lm7K09l8p5N8J8j17R8j85J14L6p1M1j01
7535i2J79j30r2K55j55Q9j33J61j55N0N9l8p4O3k0k1J66k11K58j53q4J64k51J44
7559b1J33j10N6j19K66j91r8J63q2Q3LRj87J87m3k6Rq2J56n0J2J2j90L09j63o1
7585b5J2Q2k31P7J67j22l9K24m6o9m6l2OJ16N7k04O9q5J14N8m0j68L03n3q2K5
7611F8N1K1j73L1L1j7k44L50n8o2K3mK2o8K04j12O1j2m1J12j43N1L2p2pj83R7
$$ plain form
7429 -139 42 28 46 -9 58 213 -192 -186 47 21 -9 -190 39 -3 157 33 35 28 -47 45 21 94 54 56 -32 -125 -98 94
7457 94 -36 -60 7 -131 -24 7 39 8 -3 141 49 38 -103 -37 77 20 -98 13 10 -77 -50 -12 19 147 38 -39
7483 -39 132 16 -4 -110 -92 -43 -136 73 35 5 -43 166 48 50 100 -16 -127 21 192 131 48 118 -45 -73 71
7508 71 -19 -53 -122 29 -144 74 -129 11 -37 -48 -53 -29 -32 -79 130 92 17 75 93 -24 74 -111 3 39 -32 9 -92
7535 -92 87 -43 -135 120 -35 54 -79 82 -73 -23 36 -2 -76 -13 -33 -54 112 -99 159 6 -78 86 -165 -21
7559 -21 112 2 58 -61 205 14 -84 79 -3 80 83 92 -95 92 49 23 32 -50 106 56 68 80 -110 199 36 -25
7585 -25 -13 69 -162 -85 82 -40 -79 145 99 30 -16 -48 -42 74 131 -73 -4 -89 25 83 43 -125 178 125 43 68
7611 68 119 140 -33 -2 29 12 -232 118 60 -2 21 17 39 -29 175 63 124 112 71 183 40 91 123 51 44 -139 -42
7638d2K03k00J09krM0j91J23n7K6On0k3J41j17J30n0r4L9%Mj6J09j86P7l1M9r4
7666a06J04J34k37J38k00K3J36Q5j02k2P3m6K3j8n1K5Kq6J36J77j31%n0r0R9N1
7692F7L2k05j1J58j26j0P5J74l15K25j58K03j08r5K01j3Pm5p1J12K1k80J53Q5
7716G6p1O5r8K5O5n7l6N2n5k7P9M9n2R5p0j65K44j12n8J08p1l0l8K30j44m2R5
7743E7l9M1j02L3k0n9J34m1J22j91nNQ9j24R2R5l9J0J7l7Q7j53K1J01j16o7O0
7770b9P8n2J00j41R8q7p1J03n9M8M9l5l7O4o1M6J4m5RN6m7M3r0l5J72m6k1n5j
7799c2J5P7M6j15L9k17K28l1lL9Pn8O3Qj18Q8p3R2Q6j38J39j38O2m4j31L1M0n3
7827i1J05p1m1J00R7o9q7O0o3J33j01j49N7K10j65J02N2j69J33j1O9k41J26J17
$$ plain form
7638 -42 161 -39 70 68 59 99 -92 31 -26 0 6 -44 -67 74 -43 87 37 -57 -18 -18 -14 -30 79 -107 -30 -61 -12 -106
7666 -106 -2 132 -105 33 -167 -144 -8 77 -25 -47 26 -20 3 -15 -66 -41 -39 -125 11 188 57 57 7 -83 16 67
7692 67 99 -106 -117 41 -85 -95 -20 154 -161 64 -94 109 1 -94 107 94 101 56 -15 97 118 -162 -9 76
7716 76 5 70 -28 -3 62 5 -31 21 -34 -61 18 67 15 110 40 -125 119 7 -51 57 -14 -44 -82 148 4 -38 57
7743 57 18 59 -43 -10 -30 -89 45 4 126 -65 -70 -65 24 -100 -8 87 48 58 75 38 125 -28 -7 94 -22 -89 -29
7770 -29 49 -3 97 -44 54 -33 -104 -1 -60 -12 37 2 -35 29 -32 14 28 -17 -8 48 1 44 -46 -81 91 45 24 -31 -32
7799 -32 -17 60 106 -9 30 -187 41 10 7 46 53 -5 58 66 -52 36 -37 55 141 3 142 4 66 22 -109 -78 -38 -91
7827 -91 14 -57 -98 2 99 30 -57 3 -60 73 -28 -177 -120 90 -75 27 79 -90 43 32 101 -140 -14 103
7851A03q1J5m9O8n2j36O7M7P9O5m5o6Q8j69L9M9o4K2q0J02O4m6j2j62J78J04j15
7878A3K4n9o9J96j06J2j14O8J30j43Q0k4j58J44J18j02n8%J2p5J85r1J75j67r
7903a8M1l2N3J1l8l9O8J40j72R2j52K6N8n9J39j18j32J85j68K3O3J07q2jn0J92
7929A37J8j39O9OPm7Jj8j0p2j7J16m0o1Pp9J5L7J20j11L2j8Q6l1n1M2j4J03j30
7958d2j97L24j39K02m8L6j04j02K55n9p1j4nl9O2o1l4j02K56n6j00O0m0j25J25
7983a8M4m4o7l7Q9O6N6J10j82l3M3n5m0R3j92J76L3n2J27r1j68J16M9P3j48R7
8009D5L2q6n1k0J10N2j14n7l5K4J95j71K4J12O5k89O6J17O6o1K1ooj18J23N9l7
8036F0j07J6J44k7j10K05m8j86K4R7Q6k69L4K40p9NR4j32J31j42N7j25L8j0q1
$$ plain form
7851 103 22 37 -12 56 4 -132 -65 -18 61 126 81 15 103 -66 -27 22 -42 -20 -100 2 66 20 8 -154 24 128 13
7878 13 37 -22 -91 105 -1 11 -103 -35 95 -48 32 8 -150 -6 112 10 -48 -48 -36 -111 74 -17 158 -9 -18
7903 -18 23 -9 44 55 17 -22 46 186 14 106 -46 -20 38 -21 118 0 -132 53 -115 -92 -29 78 -4 -5 -55 137
7929 137 155 16 85 91 98 51 52 34 24 -48 -65 51 11 -50 -43 -122 -107 -70 50 -61 -29 -47 39 8 -43 -1 -15 88 -42
7958 -42 -239 85 -54 148 100 136 32 -70 185 126 55 41 36 -3 59 -2 -36 -138 118 62 -38 22 -18 -143 -18
7983 -18 26 -18 -85 -122 -33 33 89 199 17 -16 27 -28 -68 25 -167 9 42 -10 117 26 -142 -26 23 96 -52 45
8009 45 77 -9 -60 -80 30 82 -32 -89 -124 -100 95 -76 -52 60 125 -164 -98 19 85 24 45 39 33 -85 38 97 60
8036 60 -47 -31 113 86 -24 181 133 -53 -29 68 154 -115 -81 159 80 85 179 47 178 36 93 -32 6 -4 -85
8061h5R5KM5j41J32Pj97Q0K6J31j18J00k8m8n3j51J29J16j01J24M9%J35k70J80
8086A59j52K9j14J79j38J23%r2K8P2k00K7L6J11q4Q5k29J83m3J19j37RR6J14j48
8111C3Ll9j22P9o8kL2J04M0l2J02j3j10J8m0R3j43P5jN8j13j23L5K9J80L3J9p9
8139D8q1j20J00J12j14Q0j15Q1J9l0M2p7J94j15l3l4J74j30Q5k10J25M2n8J26
8163A11k36J53J7j56R6J27p7j25L9k0M5O4m9J30K5j45N9p7j6K1pJ3R0j06J6O6
8189E8j72J2
$$ plain form
8061 -85 10 12 57 -84 48 55 -142 -62 -36 95 -23 77 49 1 -52 -203 -74 42 -59 65 114 114 249 -21 159
8086 159 7 36 -78 101 -37 86 86 -6 22 94 -106 -79 -43 68 -16 69 -160 23 -20 99 -38 -29 67 181 33
8111 33 36 -3 -125 -46 -114 -116 -84 20 60 28 130 117 7 25 -15 78 -65 10 9 67 -46 -169 -134 -105 75 108 127 48
8139 48 -33 -153 -53 59 -55 25 -90 -9 10 -20 22 -55 139 24 -9 -43 131 1 86 -124 1 43 -15 111
8163 111 -125 28 45 -111 -15 112 35 -90 -51 -71 -26 38 -11 119 144 -1 58 -19 -35 -14 -21 -8 82 -24 -8 58
8189 58 -114 -102
8191a02
$$ Imaginary data points
##PAGE= N=2
##DATA TABLE= (X++(I..I)), XYDATA
0@%%%%%%%%%%%%%%%%%%%%%M0j04J28j28J28j28J28j53K17k56K56l03L67l84M48
36B56n12N69o33P04p76Q40r60J083j194J310j448J593j739J915k115K328k567
53a346K832l126L459l837M263m755N333o025O860p897R235j1018J3529j7378K4067
68A4196l9004J31334k352j49819P2335m0317L0043j9168r6913J7515R3379m5723
80c4494k7950J2722K2060M5081j823n6438M1504M5613k0945n059M293p543M1825
93E8846r203p2127P906M9637k8826l9347m659J0057K6353p90m4508N503N4230
106A3072J0546l2977j3061K2060L1933k532l2267l549L3863J3034k8965l2137
118b0980J0385L2607n829l8724q539K7076J7072j6139k5043Q599L5480J698l4057
$$ plain form
0 0 0 0 0 0 0 0 0 0 0 0 0 0 0 0 0 0 0 0 0 0 0 40 -64 64 -64 64 -64 64 -89 128 -128 128 -175 192 -192 256
36 256 -256 313 -320 384 -392 448 -512 571 -623 687 -761 832 -907 1008 -1107 1221 -1346
53 -1346 1486 -1640 1819 -2018 2245 -2510 2823 -3202 3658 -4239 4996 -6022 7507 -9871 14196
68 14196 -24808 106526 104174 -45645 26690 -13627 16416 -2752 -99665 -82150 11229 -34494
80 -34494 -62444 -49722 -27662 17419 15596 -40842 662 46275 25330 20271 24564 17021 58846
93 58846 49643 -22484 -14578 35059 6233 -33114 -37773 -27716 -1363 -2153 -46661 -41158 13072
106 13072 23618 -9359 -22420 -360 31573 29041 -3226 -6775 27088 40122 11157 -20980
118 -20980 -10595 22012 16183 -22541 -31080 -4004 13068 -3071 -28114 -19515 15965 17663 -16394
131a6394n072K9724J1453j6477j4815O084K1387N717k5005j5667K2131J8746j9384
144B428k3602Q461K1860K256j7322j2578J2771K3601l651k7823k540K7962P730
157A9553k2998j2470J3138J5711j886j6847q091J7860J5500j6848k0575J0869
169g084J8935o068j7310j686J4366J0139q515j5264M664J9988O28k0290n042J7110
183D571R071j1192j1944M143J4216L294j4705j0501J1222J2724r013j5377K663
196a0828J5492M642j1070q978Q287J4207k363j5457k128J4602O051j1398r726
209h667O443J1518j811j3527m404J1757P192j0588j0457O472J1604j401j0345
222f214k073J0815P866p388j1207M495J2695m81j2340l646R679O853n605j0047
$$ plain form
131 -16394 -21466 8258 19711 3234 -11581 -5497 15890 21607 -3398 -19065 3066 21812 2428
144 2428 -21174 -12713 9147 11403 -5919 -18497 -5726 17875 14224 -13599 -16139 11823 19553
157 19553 -3445 -15915 -2777 12934 11048 -5799 -13890 3970 19470 2622 -17953 -7084
169 -7084 11851 5783 -11527 -13213 1153 11292 2777 -12487 -7823 12165 12793 -7497 -12539 4571
183 4571 13642 2450 -9494 -5351 8865 12159 -2546 -13047 -1825 10899 1886 -13491 -10828
196 -10828 4664 9306 -1764 -10742 -2455 11752 9389 -6068 -8196 6406 12457 1059 -8667
209 -8667 -2224 9294 7483 -6044 -10448 1309 8501 -2087 -12544 -6072 5532 4131 -6214
222 -6214 -8287 2528 10394 3006 -8201 -3706 8989 8508 -3832 -7478 2201 9054 3449 -6598
236f598J10J0512L022j0478o788Q492R101m527q807O96Q719L977o737p280M387
251b199R222k125j0084n68R350L217o999n698M056P246j547q752k027Q131M720
266E943o562o294M537P692q59p628k279O583N189m860p061K502P702O59o893l353
282d982N297N108l079o725K87O540J807n800l717M342N340j786n835j72N782K501
298D908n008m261L563N233j879n645n95N037K510m677m305K830N522o34n878p97
314d076N436L120l933m224K104M883m7n023j784M334L638k980m391P39M465L84
330B645m312k230L137L125j252l895M99M289J515l556k481K556L290j541l955
345b166j98L617J524l236k604K059L609r02m033p02L786J597k850k691K040L543
$$ plain form
236 -6598 -6488 4024 7046 -3432 -10220 -1728 7373 2846 -5961 -5265 3454 7431 694 -6586 -2199
251 -2199 7023 4898 -5186 -5754 3596 6813 -186 -5884 -1828 5418 3871 -4881 -6908 1223 5943
266 5943 -619 -6913 -2376 5316 4457 -3171 -5450 1133 6322 1462 -5599 -3097 4605 5264 -1629 -4982
282 -4982 315 5423 2344 -4381 -4094 2446 4253 -1547 -5264 -922 4418 2632 -3203 -3375 2407 4908
298 4908 -100 -4361 -798 4435 2556 -3089 -3684 1353 3863 -814 -5119 -2289 3233 2599 -3279 -4076
314 -4076 1360 4480 547 -3677 -1573 3310 3263 -1760 -3544 790 4428 1448 -2943 -2204 2261 2645
330 2645 -1667 -3897 -760 2365 1113 -2782 -2283 2006 3521 -35 -2516 40 3330 1789 -2166
345 -2166 -2364 1253 2777 -459 -3063 -1004 2605 1703 -2330 -3032 754 2351 -499 -3190 -1150 2393
361B393k32l391r75L184J964k378k813J124L116j43k948j116K408J844j408k418
377a789L96K761P16k477j456J820K029j049k550K69K365Q04k345j794J516K485
393A701n62k580j45K609J039j976k118J285K165l03k254n99K138J406j508k027
409a729Q74J989l08j913n32J952J242j305j280P19J702J15j786o32J424P81j347
426c4j342N56J406R5j112p44J013J243m06j699j22J439R27j311j063J176J415
443A437l33j530m62J213O64j334j312O35J555M3j418j01J378Q81q41q20K03J106
461I64r4j169m27J009M59o08q74K10R25j25q27k32M71N82k94o03K11R37N09p46
481B78p01L62R85l87r89j49P43N00p19n90J84Q02M2j056j84P28O74n34l42L73
$$ plain form
361 2393 2161 -1230 -2205 979 2943 565 -2248 -1124 1992 1849 -1099 -2215 193 2037 629 -1789
377 -1789 -1393 1368 2084 -393 -1849 -29 2000 951 -1599 -1330 1035 1839 -506 -2300 -784 1701
393 1701 1139 -1441 -1586 1023 2062 86 -2032 -747 1418 1115 -1139 -1738 400 1806 298 -1729
409 -1729 -855 1134 826 -1087 -1619 333 1575 270 -1010 -291 1411 1526 -260 -892 532 1313 -34
426 -34 -1376 -820 586 681 -431 -1175 -162 1081 675 -1024 -1146 293 1220 -91 -1154 22 1437
443 1437 1104 -426 -888 325 989 -345 -1657 -1022 533 576 -842 -943 435 1316 475 -345 -142 964
461 964 870 -299 -726 283 742 134 -740 -530 395 270 -557 -789 -318 264 -30 -633 -422 515 1024 278
481 278 -423 -61 924 537 -452 -601 142 642 -77 -667 -483 319 361 -695 -879 -151 523 -11 -353 20
501B0O72qn98j43L94N89p61p68K56P06k43o81K21L86K61l17m01O6M24K60n76n9
523c00N80K24j73p8l40K00J81k10n89J72L52N3n81Q9N86J35k83k21R1L42n4n14
545c38J3N28J32k64k72J64K92j38j95m1J84J12o7l29K09K32q5k8k62L67M5k09
567E0l72J17K19r9l7Q2j24K57J06k20j62K74J44j99r9J07Q2q0p1r3Q8K02l9k43
591a10q8L88j66k46P7K29O6k24J36j83L45j35k21n2L90J50l37J7J16j21P3j59
613e5n4j40L08j72k1L8K19o5O5q7j9r4K47Pk55P8O1r5n5M7J42m3j59P0o4J31j55
640a20K54l05L03%J2j44L64k38m5k46K92j51n1o0R3k3N2l2O0o9J28J5j17N1j9
665Dr4Q6M8N6j60L9J62j67q2J81M4j18o7pj47J36Rj04J30k3o6J57j6R1p0j16J20
$$ plain form
501 20 692 684 86 -57 337 926 165 -603 -347 359 116 -565 -344 42 303 -14 -415 -349 75 335 -241 -300
523 -300 280 504 331 253 -87 113 294 84 -505 -333 19 72 -509 -420 166 301 18 -203 -112 230 176 -338
545 -338 -325 203 335 71 -201 -37 255 117 -78 -119 65 177 110 -219 -10 222 137 109 -153 214 259 50
567 50 -322 -205 14 -85 -122 -40 -164 93 199 -21 -183 91 235 36 -63 44 126 46 -25 -118 -30 172 133 -110
591 -110 -198 190 24 -222 -145 84 150 -74 62 -121 224 89 -132 -184 206 356 19 36 152 31 104 -55
613 -55 -109 -249 59 -113 -134 -96 123 58 123 36 17 -77 170 177 -78 0 61 -34 -89 -42 100 57 -102 -32 -96 35 -120
640 -120 134 -171 132 132 144 0 364 126 81 -165 127 -24 -75 -135 -42 -65 -13 -45 15 -54 74 89 -28 23 4
665 4 -90 -4 44 100 -60 -21 141 -26 -108 73 117 -1 -68 -75 -222 -86 -77 -181 -51 -74 -140 17 1 92 22 -94 26
692B6J85j43n8L5Q2o6O0j46M8m9n3j81J98L5%j20P9%%J12j10k5jJ49pP0j48K0
720hm3k0k0K4k4k4K07j77L2R7o2n5Kq1O0R0j39K13j12k5J8P6J75m6j66q9P1N5
748B9j31R4Pj09K21n0L5j45n6Q5J25j96J11j60J53J04n8k6p3q3J31J08j33j32
772a49R0R0k0j8j33K17n6M3P9j96P5o8j11L48k19J57k26M6J60j19lj1J33r7O5
797G7j41kP3l1n4nJ66r1m5J37p5k9J34j34l9J5J7N5K0L6O5r9m3j8p6R4p4O4l4
826c7J34j07R2J4K9K8j44Q9j03J32n8j38J30M8o8k04O2m8J37K4r4P5k0jM8o1L1
853a0n2MJ38j65J56J0k06R6m2L01r9q9J04j09o7OK8j2j8J19j36R9Q4k6Mj96%K5
881e3k2NR9N0r6K2n6M5k5j8n9K68j49k62L65k88N8J06J16j59N1q6P0L7j4NM3j30
$$ plain form
692 26 211 68 10 45 127 61 121 -25 23 -26 -79 -260 -62 -27 -27 -147 -68 -68 -68 44 -66 -91 -92 57 50 120 -28 -8
720 -8 -51 -71 -91 -67 -91 -115 92 -85 -53 44 -18 -73 -71 -152 -92 -2 -141 72 -40 -65 -47 29 204 158 -8 -97 -26 29
748 29 -102 -8 -1 -110 111 61 96 -49 -105 -20 105 -91 20 -140 13 117 59 33 -40 -123 8 116 -17 -149
772 -149 -59 31 11 -7 -140 77 21 64 143 -53 22 -46 -157 191 -28 129 -97 -51 109 -10 -13 -24 109 12 77
797 77 -64 -66 7 -24 -78 -83 83 -8 -53 84 9 -20 114 -20 -59 -44 -27 28 48 84 149 50 7 -11 -87 7 -67 -3 -37
826 -37 97 -10 82 96 125 153 9 98 -5 127 69 -69 61 109 41 -163 -101 -149 -12 12 -82 -7 -27 -28 20 -41 -10
853 -10 -62 -58 80 -85 71 81 -125 -29 -71 230 131 42 146 37 -30 -24 4 -8 -26 93 -43 56 140 114 118 -78 -78 -53
881 -53 -75 -70 29 79 -17 5 -51 -6 -31 -49 -108 160 11 -251 114 -174 -116 -10 106 -53 -2 -88 -18 19 5 10 53 -77
909g7Q0Q4Q0k19Q6Rm0J3j7m4P1M9K8j4K6r2r4O4J05j46K8P4j92O1NK19j99k5J78
938A01r9n6Q8K6j26J19n1J3K0k4l7M6j8p8L0O0j18L25k32K5o3K6P3rM2m5J0n5
966gm0k2m2O2R5q3J1j05N5K59j48R6k41R2O3j65L5J24rJ8N0j7m8r0J01j03J65
993A06L9j43J89j06j49J29l0o9qM7L9j11j1J93k81Q6J43j37O3j79J68J72j64K9
1017A5j21J70O2j63L2J6K4p3j5P4k9K43j57J7mj19p3M3M9p5J67k14P8R1q5L5J2
1044@N6q5Lo9R7J85q3j94K6M5J86k37j19K05p1J93J1q2k08J47m5j7J56r9P9j7
1070F3Nm0%o9M4Q0M9r6j23O5rR1m9K5q2J24j55Q3n4J16R6k22N2l3N0J0No0M9k
1100A3o3qQ8j11J18j32R5Q3k58J50j0J03j87J87p0M5J05n7j53J63j7j41J10j1
$$ plain form
909 -77 3 87 167 -52 34 43 3 16 -1 -45 26 75 103 89 115 23 -71 -7 98 -48 -20 54 -138 -77 -72 147 -52 -77 101
938 101 2 -54 34 60 -66 53 2 15 35 11 -26 20 2 -76 -46 14 -104 221 -11 14 -49 -23 50 41 83 38 48 -7
966 -7 -47 -69 -111 -49 46 -37 -26 -131 -76 183 35 131 -110 -18 45 -120 -85 39 30 48 98 81 33 -57 44 -59 106
993 106 145 2 191 85 -64 65 35 -34 -42 5 44 -67 -78 115 -166 -80 63 -74 -11 -190 -22 150 -14 15
1017 15 -106 64 126 -37 -5 11 35 -38 -53 21 -8 235 78 95 91 -28 -101 -58 -9 -84 83 -131 -53 38 -47 -12 0
1044 0 56 -29 -26 -95 2 187 104 -90 -64 -19 167 -70 -189 16 -55 138 149 67 -141 6 -39 -56 100 1 80 63
1070 63 68 28 28 -41 3 83 132 36 -87 -22 -31 60 11 36 -46 78 -77 6 -48 68 164 -58 -6 -39 11 21 26 -34 15 13
1100 13 -50 -58 30 -81 37 -95 0 83 -175 -25 -35 68 -119 68 -2 43 148 91 -62 101 84 -57 53 42
1124D2j31J74q5k9j04J52J09l57K63l3j18K49j99O2j94K25rl2N0Q6q2J2O5p6j6
1149B4p3l2N9K5p5J45j12J53j32J42Oj64mR0K2KP9j72J33k47K01j25J97k07O0
1174eJ1ll9J27j35l3M2n3N9L8r4J4J13p1J76j77J52j2m6k9K3j22Q7o1L9J1p7J9
1202d6J79l2q3M7j15P0J7Q6L1j96M4j04K1O0om9L7N9j0rm0JN8j0j02J74%n3o5
1231c6O8j88oJ29O1jOj7M6n2O5mJ5n1M2p9k0M7k4J90k07j1J87j73M8n2j29L07
1259A61j72m3J94o9l4K1j79Q9k4q3J61m7R3r1l1j26K6K35m7K0J21k59J6O7n0Q2
1285C1K5p7L4j09O9Jj37K09n9J3L7k4jJ9j81K01j03O3o8K17j07j31n7O6J77J8
1311A26j57J34p9n7o4K26q8M7r8L9j0p1M9K8k0K1k7O4L7Q1n4q8M2N1j12J6K7j22
$$ plain form
1124 42 -89 85 0 -29 -133 19 128 -229 34 1 -117 132 -67 -5 -199 26 17 -15 35 121 39 51 116 40 24
1149 24 -49 -81 -22 3 -72 73 -39 114 -18 124 130 -34 -38 52 74 76 155 -17 116 -131 70 -55 142 -65 -5
1174 -5 6 3 -36 91 -44 -77 -35 -88 -29 9 -85 -71 42 -29 147 -30 122 110 64 35 58 -64 23 -38 1 12 -65 -46
1202 -46 133 101 18 65 -50 20 37 123 154 -42 2 -102 -81 -21 -27 -76 -39 20 10 1 -39 -38 20 10 -92 82 82 29 -36
1231 -36 32 -156 -162 -33 28 27 33 16 62 10 75 71 86 35 77 -2 -22 25 1 191 -16 -27 160 -13 35 -17 -146 161
1259 161 -11 -54 140 71 37 58 -121 -32 -56 -139 22 -25 68 -23 -54 -180 -154 81 34 54 175 -84 -68 -1 -51 31
1285 31 56 -21 13 -96 -27 -26 -163 46 -13 0 37 13 12 31 -150 51 -52 11 -57 160 53 -78 -135 -69 108 126
1311 126 -31 103 24 -33 -97 129 41 88 -10 29 19 -52 -3 25 5 26 -1 63 100 181 127 39 81 132 20 36 63 -59
1339e9O2J46k53J95p5j3j0K2l3J46k71M1J20j85K54k49J65k2K2P4n1N3N6j51n7
1364g3J5J79j13Pk3j61J30j96K63N9Q8j34K0j5n3q7P9L6o0Qj7KNN9j79J84j09
1391h6M2O9K5p4kj7n7K1Q0J03M0k03J15m4Q8k2j06L0K6N5k5m1j05J40j5kj1J10
1419A34j44l3pJ16N9j61o9N0j4Q1j03Q6o4J48j11M9j2J63n7r6J33n2p1j23M9Q3
1445C4j09P6j05q5K23J4R0j86J00j43M7J20l1L2j4k03J30J08k09K37j23n8R6Q9
1469A30j00n3j31J68j24L9J07N3j22P3j25J35j95K39j02J17J29l54J37j33Q2k9
1491e9R3o1R2j04J4K29k37J40j75K9M3J23p0r3p9J66L1n0L4l47M34j52PP1j96
1516a17L2QM7R3n3l3L2op6J61n5j53J77k13J22pQ0p6L4J22p6j7r2R3j2J67k65
$$ plain form
1339 -59 3 149 -104 91 16 3 -7 15 -18 128 -143 -102 18 -167 87 -162 3 -19 3 77 26 79 135 -16 -73
1364 -73 -58 121 8 15 -8 -169 -39 -235 28 87 175 41 61 46 -7 -94 -15 21 -39 -31 -48 -46 -41 18 -161 23 -86
1391 -86 -44 25 50 -24 -26 -43 -100 -79 1 104 144 -59 56 12 100 78 -28 2 28 83 58 17 -88 52 37 35 24 134
1419 134 -10 -43 -50 66 125 -36 -105 -55 -69 12 -91 -5 -69 79 -32 17 5 168 111 15 148 96 25 -98 -49 34
1445 34 -75 1 -104 -189 34 48 138 -48 52 -91 -44 76 45 77 63 -140 -10 98 -111 126 3 -55 41 130
1469 130 30 -23 -154 14 -110 -71 36 89 -33 40 -85 50 -145 94 -8 109 238 -116 21 -112 -30 -59
1491 -59 34 -27 65 -39 -25 204 -33 107 -68 -39 4 127 57 -36 -115 51 82 32 66 -281 153 1 8 79 -117
1516 -117 -85 -77 -30 63 10 -23 9 3 -73 88 33 -120 57 -156 -34 -41 39 -37 -3 119 43 26 -66 27 15 182 -83
1543h3J04p0LJ14j23L8j3m2J32k0j43P5J5M5Pk9N8j57P3r8NJ05m6K0lM4J03j14
1571@j09J38k02L54k06L8k1j10J79p4L9m1J92j49o7P2m3n9P6O7j10M5M6K9j49
1596f5M6K14l04J42N5j1j50lP6Q0j1n1k2Q9k17K32q5j81J37L3%J03k8j16K6m1
1622e2J55J23k58P2J51l51J23N6n0J8o8Q5L6j60J69j07J47p1J29j27k8P1j28o1
1646a26J30j30J96j14J52j72n2J21OJ6O7j91J20k6o1P7n9R4j45J52j00P8m5P4
1670F2j13J97l10J99M6L5k73J46J17j39m1R3q6JR2l6k6K0j02M1O5P1j44q3J99
1695C1j59J16l4J27mq5j0J15j3j85J78j5n3Q0j74K41j21qp5J2J23m6p0R3Ql6q1
1722d5q7J18Q3n3P3n1j48J33o6O3o3L6n9J19p2K2r2J13l2nnJ10m7k1qo6J10O6
$$ plain form
1543 -83 21 -49 -46 68 -55 -17 -30 -72 60 40 -103 -28 -13 32 39 10 68 -89 -16 -114 -109 -4 -50 -30 -33 11 114 0
1571 0 -109 29 -173 181 -25 13 -8 -118 61 -13 26 -15 177 28 -39 33 -10 -69 7 74 -36 9 55 84 -65
1596 -65 -19 195 -109 33 88 77 -73 -76 0 80 69 18 -4 85 -132 100 15 -166 -29 4 4 107 79 -37 -11 -52
1622 -52 103 226 -32 40 191 -160 -37 19 -31 -13 -81 4 40 -120 49 -58 89 18 147 20 -8 63 -65 -126
1646 -126 4 -126 70 -44 108 -64 -116 5 11 27 94 -97 23 -3 -64 13 -46 48 -97 55 -45 33 -12 62
1670 62 -51 146 -164 35 81 116 -157 -11 106 -33 -74 19 -67 -66 26 -10 -36 -16 -118 -77 -12 59 -85 -168 31
1695 31 -128 -12 -46 81 77 -8 -18 97 84 -101 77 62 9 89 -85 156 35 27 -48 -36 87 41 -29 64 72 36 -45
1722 -45 -132 -14 69 16 89 38 -110 23 -43 20 -43 -7 -66 53 -19 3 -89 24 -8 -13 -18 92 45 24 16 -50 60 126
1750A26q5l1J2K2m9J2N7l7j06J26J49k42L5m1mJ11o0q0N8Q4K3n9o3o6QJ51p6r5
1778a20J48j25J12J54k04k4J19m0l3J3k9j53K72o8N2j27Q6o0K32j26j78J47K6
1801G4r5j58J94j85K12L0k40K09j63R1L9j4l5j01J32J1m0K45j01r3l8J15J7m7
1825E9j16L7qJ40Nj41O9m8q4Q6j05J74k39J70o4J47o9JM3j30K9J76j43N5L5l0
1851D9j37P0L8p3n0O3kj0K02q3j40j2L0K0n5J12j1PL7n2l0NM2M9J4j33J73k26
1879a03J73j16m1J5K3n5O3l0J28lJ88j83k2j0p0n4l4L4P9P5j38Q0PJ6k3K8k00
1906a73J52j6N1M3m2J7Q0Rkm4k5L8L8L8j82P8j89P5J31rkr6K17j82N7o0j16J47
1934C3j46J99Q2j47j43L7J20j7L2pJj42J3j8Q1k1O7l7k9J65j8r0J8m4P4K8j07
$$ plain form
1750 126 41 10 22 44 -5 7 64 27 -79 47 196 -46 -11 -52 -56 55 -5 -85 -27 57 80 21 -42 -108 -100 51 -25 -120
1778 -120 28 -97 15 169 -35 -59 60 20 -13 0 -29 -182 90 22 74 -53 33 -27 205 79 -99 48 74
1801 74 -21 -179 15 -170 42 72 -168 41 -122 -31 8 -6 -41 -142 -10 1 -39 206 105 12 -26 89 106 59
1825 59 -57 -20 -28 112 117 -24 45 -3 -87 -1 -106 68 -171 -1 -65 82 13 14 57 -73 -44 132 -11 44 79 49
1851 49 -88 -18 20 -53 -103 -40 -42 -52 150 67 -73 -85 -55 -35 -90 22 11 18 55 3 -27 -22 20 69 83 -50 123 -103
1879 -103 70 -46 -87 -72 -49 -104 -41 -71 57 54 242 59 37 27 -43 -97 -131 -97 -18 57 -81 -1 6 22 -1 27 -173
1906 -173 -21 -37 14 57 15 32 112 121 119 75 50 88 126 164 -18 60 -129 -54 77 68 66 -30 187 5 62 2 -114 33
1934 33 -113 86 168 21 -122 -85 35 18 50 43 44 -98 -85 -103 -22 -43 24 -13 -42 123 105 15 33 -11 63 91 -16
1961a6o4J38j5J77l56J93M3j05p3L7N3q1k1k7J67%l0N5q7J76j86j32L82k77J19
1986G0K9nm6k8j64K00Q7j28n2J63K4k06K5J07j1j05L1J04j15n3J43p1J30j87K54
2011A96j17j61J03J6O2j46j0L4M0m0J32j60R4mqm1k9j15J89po0J22r3QL4Or8R0
2039C7j1qj81J08J24k7Rk1j40m4K20K5m9j13Q3J8mn9J15n8KJ31k70Q8K6j28J38
2066A1Q8n6q7N4O0l32K48N8P5r9p6K83k79P3J5m2j0R1j05L5l1k7O9J41k35P0l5
2093d3J10Kk0j28K9R2j0j70K3O2J25k01N4J20j27J58K4j74l5K14o0N3o7J8k0o5
2119c6R8k56J74J15j13O6k1K5q3p3M9M1J45l14L15m4j02l3N8m2Nn2J49j13q8M1
2145h9L6J28j33J21q8R5j18k5j43L43k45J64j30Q6O2k8K8j84J37O3m9p0m8j6J95
$$ plain form
1961 -16 -80 58 43 220 -136 57 100 -5 -78 -41 12 -69 -90 -117 50 50 20 75 -12 164 -22 -154 228 -49 70
1986 70 99 94 48 20 -144 56 143 15 -37 126 150 -56 -31 76 65 -40 -9 95 -20 -73 70 -1 129 -58 196
2011 196 79 -82 21 37 99 -47 -57 -23 17 -23 109 -51 43 39 31 -10 -39 -154 35 28 -32 90 -3 5 39 45 -53 37
2039 37 26 18 -163 -55 69 42 51 30 -110 -154 66 91 42 -71 12 30 26 -33 82 24 26 157 -113 -25 1 -127 11
2066 11 99 43 -44 10 70 -262 -14 44 119 20 -56 227 -52 21 36 -6 -16 75 -30 5 -26 -53 16 157 -78 -8 -43
2093 -43 67 69 49 -79 -50 42 32 -138 -115 -53 72 -129 -75 45 -82 76 100 -74 -109 105 45 98 31 49 29 -36
2119 -36 62 -194 -20 95 -18 48 27 52 -31 -104 -55 -14 131 -183 132 88 -14 -47 11 -31 -26 -78 71 -42 -130 -89
2145 -89 -53 75 -58 63 -25 70 -48 -73 -216 127 -118 46 -84 2 64 36 64 -120 17 80 31 -39 -87 -103 92
2170I2r1k5M9j20J34j0O9j03J43m9j19oJ71q2j94O7J07k30J84N2m1m5J51j32K22
2195A94l08J12O7k18P1j07J84R9j01J41j17o4l0j1J63j55R3q8J43j42j1K02L6
2218A53j05J01r9Q1j42j37J28J4QP2j40J44k36K82j74l0J38m2j43K34k66J46j1
2241b4j95K53L0q6j1M5l5L7k3N8r8O7J3r8J86p4N4m4j30M1Q4jM7k06n1P0J67j47
2269g1j20K00j02j8R2J9Q0j09M8R9n8k3m8J27j59J35p8J4j0O1K5j0l8m4j22J01
2295iN0o9K55m12K21J44k27j3O6K5n6J40j15%O1j83J22j52K13j17K3R0p1M4j0
2320B0n7K33k04LK7j44K32Okj16j18J84Ol7j22J57l8j89J22J3P3J0j75K33n7k09
2346a49J54m7L7q7J99j94L5J92j66J7q4j4JJ86Lj14P9Q8r3j05N6m0J13j18K10
$$ plain form
2170 92 1 -24 25 -95 39 29 98 -5 138 89 -30 -36 135 53 -141 -74 33 -197 -13 39 -2 -47 104 -28 194
2195 194 -114 -2 65 -153 -82 -189 -5 94 -7 134 17 -47 -77 -88 75 -80 13 -75 68 -74 -85 117 153
2218 153 48 149 50 131 -11 -148 -20 -6 2 74 -66 78 -158 124 -50 -80 58 16 -127 107 -159 -13 -24
2241 -24 -219 34 64 -22 -33 12 -23 14 -9 49 -49 18 31 -67 119 45 99 55 -75 -34 50 49 96 -110 -161 -91 76 -71
2269 -71 -191 9 -93 -111 -19 0 80 -29 19 118 60 37 -11 116 -43 92 14 28 18 79 104 94 56 12 -110 -9
2295 -9 41 -28 227 -185 36 180 -47 -60 6 31 -25 115 0 0 61 -122 0 -152 61 -56 -33 57 -14 30 20
2320 20 -37 196 -8 -5 22 -122 110 116 114 -2 -120 64 70 33 -89 68 30 -159 -37 -24 49 59 -116 117 60 -149
2346 -149 5 -42 -5 -92 107 -87 -52 140 -26 -9 -93 -107 -106 80 83 -31 48 136 43 -62 -6 -46 67 -51 159
2371A59k18R3L5k7N8j90J42j64J48j26J52j71K8J2jK07o2j47J2l0J82j64J09M
2395D1j94J20P5r1P1j90P1j0J44j0n0O7Mq0R4O0o3o9K4L8M4k4q0J08j61J58J9
2422A16Mj36j27J64J81k01N9n8J17k29J0M2L5m4O7o1J9j6J78j78N0nJ46n3j45
2447f5J27j41K04p0o5l6J31j68J62r8O3j4j59J34L9j55J12m7J49j6l8K8O6j33
2471A0n3J38j55JJ83j23J08q4n5k4j3N6o1j02R9%Q6J7N9k29K73j36j17J8J69O9
2497A34j57LN7L0j39K06j2j47j3Q5P7j79N4J99j77m3M5l4p1J2rQ5j09J22J96k14
2523Al4M1N3k4P8j48J5j20J96p2P3J5J2jl1M9n3j47J68o0R4K2j42J01PJ00k49
2550e6O8j62Q9P0j12J41q3R1k6l9o8J02R1j73J34K1j54J2Q7j78J00P1j87K79j6
$$ plain form
2371 159 -59 34 69 42 100 -90 52 -112 36 -90 62 -109 -81 -69 -70 137 75 -72 -60 -90 92 -72 37 41
2395 41 -153 -33 42 -49 22 -168 -97 -107 37 27 -23 44 48 -32 62 122 59 -10 14 52 96 72 -8 100 -61 97 116
2422 116 120 -16 -143 21 202 1 60 2 119 -110 -100 -58 -23 -67 0 -61 -42 -58 120 -58 -8 -13 133 80 -65
2447 -65 62 -79 125 55 -10 -46 85 -83 79 -19 44 30 -129 5 44 -111 1 -46 103 87 49 77 143 10
2471 10 -43 95 -60 -59 124 1 109 25 -30 -54 -67 -11 -72 -174 -75 -75 11 28 87 -142 131 -5 -122 -104 65 134
2497 134 -23 -20 37 67 -72 134 122 -25 -38 47 124 -55 -1 198 21 -22 23 -11 -82 -70 -79 6 -103 19 215 1
2523 1 -33 8 61 37 115 -33 -18 -138 58 -14 59 74 86 85 54 103 50 -97 71 11 105 127 -15 86 93 193 -56
2550 -56 12 -150 -61 9 -103 38 -45 46 20 -19 -87 15 106 -67 67 88 -66 -54 33 -145 -45 26 -161 118 102
2575A02n5r5j11J56j39J86L6j68J07qj88J92L3k7M0j19J61j15lK1n9P5Mjn9j06
2601a40J12L0R8J6j69J7k8K9M3n5j1M0J24j53R0j22p3J57J01r3P1p8Joo5L7o5
2628i2O8j07R2L7L8q8j7L07l45J80j06K3n8R5o9kO8r1r7K34p4m7J28p1k3N4j41
2655a04j30L39j92O0lM3k4o7%J17J29j68K1j4k6J67j91M7j7q8J24k7J09j15j4
2680b4J67j73J23Oj35P3J09k20r0J94j35O9j11J34p9K41j91m9J33K8p4K4o8LJ21
2705G6m8k0rPk3l5R1m7L2N0j69Q5MM4N6m3j61K27r4j2N0kp7O9J58j16j76l8J23
2734Br9N6J12o4j63R5L5PRk5L8K6m5p2J64j45J18m6o9P1j43J84j37RR1P6l7nO4
2763A07M8j89J31Rq2O8m4n9j0p8k4J29jK43k71q8K00j08kL9j6n9Q5j04J55j30
$$ plain form
2575 102 47 -48 -159 -3 -142 44 80 -88 19 11 -177 15 48 21 61 -58 103 -12 -15 6 -53 22 26 25 -34 -140
2601 -140 -28 2 100 116 -53 -36 -64 -35 8 -47 -58 -18 106 -47 43 -79 -152 5 106 13 84 6 7 1 -64 -27 -92
2628 -92 -24 -131 -39 -2 36 -52 -69 238 -107 73 -33 -10 -68 27 -42 -44 24 -67 -164 70 -4 -51 77 6 -17 37 -104
2655 -104 -234 105 -87 -27 -30 13 -11 -78 -78 39 168 0 21 7 -19 148 -43 4 -13 -101 23 -4 105 -10 -24
2680 -24 143 -30 93 99 -36 37 146 -74 -164 30 -105 -36 -147 -13 -92 149 -42 -91 42 70 -4 20 -48 -45 76
2705 76 28 8 -1 6 -17 -52 39 -8 24 74 -95 -10 -6 38 94 51 -110 117 23 11 61 59 -18 51 209 93 -83 -121 2
2734 2 -97 -41 71 7 -156 -61 -26 -19 -10 -35 3 29 -16 -88 76 -69 49 3 -66 5 -138 46 -91 -82 9 85 48 43 107
2763 107 155 -34 97 106 24 92 48 -11 -21 -99 -123 6 5 248 -23 -111 89 -19 -21 18 2 -57 28 -76 79 -51
2789e1J44mn6LJ47k03L0O5j63j1MJ9o5J10M6l0J62j68l0M1Q9j22R9O8k3l3rj3
2817D6oro1J06j49J42k37K23q1O0o3J49k23J64Q1J5q5j19k4J25o0j9j9J18j7P1
2843A28j75K00j72Q8m1%O3j44k2J14p9J97q2j14k6N5m3M2L4j54J57M8j68P9oQ2
2869F1l4j05J77k35O5K83l11J75j34J20P9n6p8p9m5M8O1m2N3o5M8L7N0O9j39j58
2895a55K18j49P8ojnm3K57j98p9J11j14K17j04J78k13rK7rL5p8J42JP9j26o7r0
2922a03J64m0R8j01l9jK0l9qJ3J9j0J27j48l8Q2N6J5r3j07K23Kp4J1j11O0p1J51
2950E8q7m6K1j7kQK31p9j83O2J18j95J42j73P6ORJ31PL0k77R6J84j89O4MNQ4j21
2979c3n9Q2J4q6J48o9j1M5j17q1K97q0J4%p1K3m3m0J1R1P0p5M2j49J5M2M5j0l
$$ plain form
2789 -51 93 89 33 36 183 -20 10 75 -88 -99 -95 -76 -141 -31 15 -15 147 -21 -51 -10 79 -43 56 124 101 68 59 46
2817 46 40 31 -30 76 -73 69 -168 55 -26 34 -29 120 -103 61 142 157 72 -47 -71 54 -6 -25 -44 74 57 128
2843 128 -47 153 -19 69 28 28 91 -53 -75 39 -40 157 75 -39 -65 -10 -53 -11 23 -131 26 74 -94 -15 -21 61
2869 61 27 -78 99 -136 -71 212 -99 76 -58 62 141 85 7 -72 -117 -69 -8 -50 3 -62 -14 23 73 142 3 -155
2895 -155 63 -86 -8 -14 -15 -20 -63 194 -4 -83 28 -86 131 27 205 -8 -17 10 1 36 -42 100 101 180 54 -13 -103
2922 -103 61 21 119 18 -21 -22 -2 -41 -49 -36 -17 -27 100 -48 -86 -4 52 67 -26 -133 90 92 18 29 -82 -22 -93 58
2950 58 -29 -75 -54 -71 -73 -65 166 87 -96 -34 84 -111 31 -142 -66 -60 -51 80 87 117 -160 -64 120 -69 -5 -1 4 88 -33
2979 -33 -92 -10 4 -82 66 -3 -14 31 -86 -167 130 50 64 64 -7 16 -27 -67 -56 35 105 30 72 -77 -62 -20 25 15 12
3008A2Q6j95K04m7k8K0q8k4r9Q9N2J0o8mJ93j28K5k4Rj90J03J8K16l09J59O8k31
3035a71J58L1n6J05l4l6J32j80jR1K5K0j05L5l7L1N9k79K73p0M6Q4k55P9J5j77
3061b17K06k7o1J29j10J09k3j38P9j9M1N5Q4rn9K1k9j16J01R3j17l9J29n1r2J78
3087A18M5j92o0O6q2M0J37j65Q5N8q8k6M9J50j09Lo7rQ4j03J12M0k11J54J07j41
3113eK5p3O7M4j2j39O4j11Q4J17J6J11j88K6m1k0k0P0J31j00m9L0K9k0j8j77J94
3140C5l5J29q8j77J58r8J06j08Q4J4M7j60m3J76q9M0n3j10J13J16r0J91j76kl6
3165e6J62j5m6p1J41J3Mj24q2j4Q2R9J6o9QQ4r9k7L3J4o8J19j95J03n9j03O9o0
3193a41J89qm3M2qn2m8k8K9O4l7J60j18j57L62j95r6R8Q1j40o7N1J86k52J43o2
$$ plain form
3008 12 98 -97 107 60 32 52 -36 -60 -159 -70 -18 -8 -76 -80 113 -15 10 -14 -5 -195 -92 -74 142 -167 -8 60 -171
3035 -171 -13 18 -38 67 33 -3 129 -51 -52 39 64 84 -21 14 -23 8 67 -212 61 -9 37 121 -134 -55 -40 -217
3061 -217 -11 -38 -99 30 -80 29 6 -132 -53 -72 -31 24 108 99 40 61 32 -84 17 110 -7 -46 83 32 -60 118
3087 118 163 -29 -89 -23 -105 -65 72 -93 -8 50 -38 -64 -15 135 26 29 -38 -47 37 -66 46 86 -125 29 136 -5
3113 -5 20 -53 14 58 46 -93 -29 -140 -56 61 77 188 0 26 -15 -35 -55 15 146 46 -3 27 56 36 18 -159 35
3140 35 0 129 41 -136 22 -76 30 -78 6 20 67 -93 -136 40 -49 -9 -62 -172 -59 57 -33 158 -18 -20 -56
3165 -56 106 91 45 -26 115 128 132 8 -74 -88 -6 93 109 40 48 132 33 6 39 53 -15 104 -91 12 -47 -150 -81 -141
3193 -141 48 40 -3 39 31 -21 -69 -97 -68 -4 -41 119 1 -156 206 11 -85 13 94 -46 -113 -62 124 -128 15 -47
3219d7J70j58N8o0j23K12j35K3J22r5J29j20k2jQ9M6j30j2O2q9J23j50Q5p4n0
3244a47K33n5j10m8P7J91l3k27K57j66R3j16J04Kq3O5n5J6Kj19Q8KKN3L7m4m4
3271b5J32k31J09K6o5J40j45l8J27L4j34Q5J07j07j05LJ42j33O5l0J6J37o9J12
3295A53j95%O1r0N6N7j4j0n0J45j66L1j8P9l0M1j34J53j16J56j70L3Qn0nl2P0
3322c7L8P8j30j33J65J08j56J5N8k8j0Q3n7j5k3J00j06j52K64j7j35J33l1M4L7
3347I3o1o2L2K9o3K4j65J78J00j16o7O5N5j45J95j12P1K7j81P9J03j02j41O4p2
3372a72J32M7kj47J27%o4J09J0k53J96j4m1J00L9j14P5j39R0n5N9m9nP9M5j00
3398d7NN2L2j18M1kn6Q0k8J3Q7p9Q5Q4j78nj3N6R7j0k3O0j21q4m1K11j3j24M0
$$ plain form
3219 -47 123 -35 23 -37 -160 52 -83 -60 62 -33 96 -24 -46 -47 42 88 -42 -54 8 -81 42 -108 -23 -97 -147
3244 -147 86 31 -79 -127 -50 141 108 -119 138 -28 65 -51 53 55 -28 37 -18 -2 0 -119 -31 -29 -27 26 63 19 -25
3271 -25 107 -124 -15 11 -54 86 -59 -97 30 64 -70 15 122 15 -90 -87 55 -78 -13 -43 -27 110 41 153
3295 153 -42 -42 19 -71 -15 42 28 18 -32 113 -53 -22 -40 39 9 50 -84 69 -47 109 -61 -28 -20 -70 -75 -107 -37
3322 -37 1 79 -51 -184 -19 89 -67 -52 6 -22 -32 51 -6 -21 -44 56 -50 -202 62 45 -90 43 12 56 93
3347 93 32 -30 2 31 -32 -8 -173 5 105 -11 -78 -13 42 -103 92 -20 51 78 -103 -24 79 -23 -164 -100 -172
3372 -172 -40 7 5 -142 -15 -15 -79 30 40 -213 -17 -31 -72 28 67 -47 28 -111 -21 -76 -17 -66 -71 8 53 -47
3398 -47 -42 10 42 -76 -35 -37 -93 -13 -41 -28 59 -20 65 149 -29 -34 -47 9 106 96 73 133 12 -72 -113 98 85 -39 1
3427Ar1J01M0j26k8K7K8O2n6q0P4n3J4L0P4p6P4O2Kj4m3l7KK6m7L4o7J05N5p4
3457A9K0j00J62p5K1J2o7jK5m7n5R3pj4j06M2J69j54l5rq6K06L0q2P0r3L3L7m
3486Do8R5l8J20r4j68PnJ08m1j4j49K31R0%J4k07R7j33N6j2J85m6j1P9M6O0j76
3514C0K3l9Mq6Q4J65p3Q9l07J21o9l7J40K4J0p7P7l6n5m3J32L0m6j36L6m1J9k0
3542h1J0l6J44J2o4Q7q6j25J12P3p4L7o4j0J13j15K7J29nj28M9p6J06j4j09R7
3568Ij01J00L9j19J02n2J43j69oOo2J07j03Q2n2j5R0L4k0K2l4r3Q0p0J55r2n6
3595g5J88p0k1m6p7nK29q2Qo9K42k21n8L4O1n6jK6K0j03J53j01qM3j2O0l0om4
3624b1K3k8R5r5J39j8o1k4q1J08N8o6J81k39J6M6P4k73K15M0j89R6J8M4j45J48
$$ plain form
3427 1 -90 11 51 -75 -103 -76 -48 14 -42 -122 -48 -101 -87 -57 17 -59 15 77 79 65 22 -15 -13 13 -34 0 -67 38 93 19
3457 19 39 -61 101 26 47 59 -8 -9 16 -31 -86 7 0 -14 -120 -78 91 -63 -98 -107 -193 13 43 -39 31 -62 -29 8 4
3486 4 -64 31 -7 113 19 -149 -142 -147 -39 -80 -94 -243 -12 78 78 92 -115 -18 -151 -95 -107 78 32 21 100 146 206 30
3514 30 53 14 18 -68 16 181 108 197 -110 11 -58 -95 45 69 79 2 79 43 -12 -55 77 107 61 -75 -39 -80 -61 -81
3542 -81 -71 -107 37 49 -15 72 -14 -139 -27 46 -28 9 -55 -65 48 -67 -40 89 84 -44 5 -71 35 21 -88 9
3568 9 -92 8 47 -72 30 -22 121 -48 -54 -48 -110 -3 -106 -24 -76 -91 -1 33 13 35 1 -92 -12 -82 73 -19 -75
3595 -75 113 43 22 -24 -101 -106 123 41 49 -20 222 1 -57 -23 38 -18 -19 7 27 -76 77 -24 -32 11 -1 59 29 23 -21
3624 -21 2 -26 69 -26 113 95 34 10 -71 37 95 29 210 -29 -13 33 107 -166 49 89 -100 -4 14 58 -87 61
3650F1J13k25%j71K16Jn3J41jK7j81KJ01M8q2k5L2J92q2n3q5O1o0n8mQJ97j21
3678aq6J63N6q0j26N1M5K1m9j2J64p9k77J24M2j4M0M1j39K58j82nlN3N2k3K6n
3706E5p5J32j50J8q6J39P3j70O5j00P0M8j6j13J30J25j38Ml5J99l6o5k33K22j80
3731a17M6J68k34K06l1%j6J6j05J15r6N3NK4j51J67lN3j95J38k7J39k5j13j14
3756i7P9pJ33j18K6Q8n4J48j73R7o6j44l3J23l7Q3l00L19Q6j95L6p1KJ02o3P2
3782C6r7J68ok04j9J8J18N2l0r2O1j7O8j2m9Q6p5j27K95j79N9j74J74q2M6L7r
3809D6l4j18R3O0j3o3r5K09Qn1j52j2J39j8j3Q6q1k7K12k21M2m0J87K0j65rQ3
3836G3Ok2J57j04j15m9K9P8j8j40N0K1Q8m4n1J18r3P4n7j08k7J49m2o6L1J56j51
$$ plain form
3650 61 174 -51 -51 -222 -6 -5 -58 83 82 109 -72 -70 31 79 -3 -28 4 196 114 61 -24 37 -23 -81 -85 -77 120 -1
3678 -1 -87 76 132 52 -74 -23 22 43 -6 -18 146 67 -210 -86 -44 -58 -18 23 -116 142 -40 -45 -48 5 57 34 60 55
3706 55 -20 112 -38 -20 -106 33 106 -64 1 -99 -29 19 3 -110 20 145 7 11 -24 175 139 74 -159 63 -117
3731 -117 -71 97 -137 69 38 38 22 38 -67 48 -48 5 10 34 -117 50 47 100 -95 43 16 155 130 17 -97
3756 -97 -18 -25 108 -10 16 104 50 198 25 122 56 -88 -121 2 -35 48 -252 67 153 -42 -6 -77 -75 27 -36 36
3782 36 -61 107 101 -103 -122 -104 14 66 36 -56 5 -12 56 44 -5 81 6 -121 174 -5 54 -120 54 -28 18 55 46
3809 46 12 -106 -13 47 34 -29 -124 85 93 42 -110 -122 17 -1 -14 72 -9 -36 176 -45 -3 -43 144 164 -1 -10 73
3836 73 79 57 214 110 -5 -54 -25 53 35 -105 -55 -34 54 10 -41 77 -16 58 1 -107 -134 15 -27 -93 -62 94 -57
3863e7J75Jj8j86l9M6Q1J30j18J38k03P9r2R4j37o0L33j25k14J51J06k12K44p
3887A10j90L4J83j28R1j95J00J61j71o7nJQ8K0nJ5p3L0n4k5J24n6N3l2r7j1J35
3914C6m0n9j23M7K48j8r0j13N6NO4K6l6k2R7Oo4Q1j42J46j27O5J7j05j9kM8O0
3942D2p2K35j35p4J48j60K3M5J1p3r9K26j32K4R2k01N8J16o8P9o1n9L6Q8k2o1
3968FK6j12Q8n9L0N8l0J74j69L3l8q8M2m5J4J66j74K5J02Ppj01p0J85j15R3j63
3995a22K36p2j06K56k60J59l6l5J6l1Q9o2l6j0J56k5j17Jj4j7L1j31J48k9J09
4020I8MJ8l7p6L5l7j05J16R0L5j14j01K18k03J14k1m9j43J26J81j81O9p4k8K0
4045d5J02n7p0P6q5J56k6j94L45j40o3q7PJ06J12R1k66m7R7J7J26k19M4M9k57
$$ plain form
3863 -57 118 119 101 -85 -124 -78 3 133 15 153 -50 29 -63 31 -106 -166 167 42 -172 -21 85 -127 117 110
3887 110 -80 -46 137 9 100 -95 5 166 -5 -72 -77 -76 12 32 27 42 -31 -1 -55 -80 44 -12 41 9 -88 -99 36
3914 36 -4 -63 -186 -139 109 91 1 -112 -56 -51 13 39 3 -19 78 84 20 101 -41 105 -22 43 60 -45 -64 -66 -18 42
3942 42 -30 205 70 -4 144 -16 7 52 63 -10 -109 117 -15 9 101 -100 -42 74 6 85 24 -35 1 89 67 6
3968 6 32 -80 8 -51 -21 37 7 181 12 45 7 -81 -39 -84 -70 96 -78 -53 49 56 49 -52 -122 63 -52 41 -122
3995 -122 114 42 -64 192 -68 91 55 20 36 5 94 32 -4 -14 142 117 0 1 -13 -30 1 -130 18 -11 98
4020 98 102 120 83 7 42 5 -100 16 106 141 27 -74 144 -59 55 34 -15 -158 -32 149 -32 37 -37 -65 -45
4045 -45 57 0 -70 6 -79 77 51 -143 202 62 -1 -88 -81 25 137 228 -38 -85 12 29 155 -64 -20 29 -228
4070b28K56k0jj74J79j3p2N2nl6J60k30J65r2N8j2M1o1N4mo8J5M5J22N6j23k6
4097C8l0P4q6J44j36J79j75j03M3p0NM8J6r2J81l4n5J8kP2r2J20j08J8J74p1p8
4124bj24J18j9J7M5j0k18L6J29r3R8N9j02K12j37p4l9J51L5q7K5Q9j52l3qk6J28
4151A8P0n1o6L1j36J28j95J51M1P5m0k24J91J3j62K46o3j7p8K63k12p0K62j84
4175iM6j12Q4n5J31k44P8m3K44m4k17RQ7P9j27K09j44lql1J8Q2l4O5l0j39LJ04
4203aP5p3M5r5k1k2K05k83J39O8J70j97j33J48L0n7J09j18O2O3j34K40k18P1j1
4228F2K2o2R8q5p3o5J91j16J30j42J33j05L3Q1LM2j37L7p0j01R8L4o6r7K99j21
4254B3p3P9l9JL9k14R5J68k7k41j11L19K0k5j11K7K1jj1J41k1j13N7j11K0J01
$$ plain form
4070 -228 28 8 7 -167 12 -1 -73 -21 -26 -62 98 -132 33 -59 -1 -13 28 -33 21 17 -51 -36 9 131 187 64 38
4097 38 8 82 -4 140 4 183 8 -95 -52 -122 -117 -69 -53 -145 36 2 -53 -35 -37 35 -57 63 -45 -27 147 76 -2
4124 -2 -126 -8 -27 -10 35 25 -193 -157 -28 -121 -23 36 -66 146 9 -65 -104 47 82 -5 20 109 -43 -76 -84 -110 18
4151 18 88 37 -29 2 -134 -6 -201 -50 -9 66 26 -198 -7 6 -156 90 27 10 -68 195 -17 -87 175 -9
4175 -9 37 -75 9 -46 85 -159 -81 -124 120 76 -141 -132 -45 34 -93 116 -28 -31 -39 -70 -52 30 -4 61 31 -108 -105 -1
4203 -1 74 1 46 -49 -70 -92 113 -170 -31 37 207 10 -123 25 55 -2 107 -11 51 114 -20 220 2 73 62
4228 62 84 22 120 35 -38 -103 88 -28 102 -40 93 -12 21 102 105 147 10 47 -23 -124 -26 8 -58 -155 144 23
4254 23 -50 29 -10 -9 30 -184 -89 79 52 -189 -300 19 39 14 -97 -70 -49 -50 -61 80 59 -54 3 -108 -88 13
4280A3o2J32j27J02jj3k5L1j45nP9l3J8Q5n1lm5k6rO1J44j9N7k96J71K2j48J77
4308H4r9r5J74n5n6M0j65J06J67L4j12M0L8Lj32R0L4k44J40qJ9n6R3j06J54j62
4334g4n3K19j10j11K80j55R8j54P6j25J58j43m1K25l9q5K3J14L6N5k28O8q1J76
4358A29j93K11k01J88m9j40J03j3j78O7N2o4l9NJ90k33J28K8l2Q4j00J41k9j41
4382h6J4Q6o2k0L1mrJJ04N3J4j34K3J02r9J02j87J19K9j49J50r7r5k0K13j53n
4409g9K19k62J71j40M1P4O0j66Q7j04R9Qr2J15j89J49qK4K03k35l6J06j23P2R
4434CJ57j46k11K39k%m1k6K31k78J02j73J63N8J9o6QJ35j91J15j96J47L4j69N0
4459c8J4q3J71q3l6P1n5j6JJ20j29lJ58o9l3J8J40o8J2j05P9j41J72r8r1J51j3
$$ plain form
4280 13 -49 83 -44 58 57 44 19 50 -95 -100 -21 -54 -36 49 -2 -5 -50 -76 -85 -24 120 101 158 -138 33 55 -93 84
4308 84 -15 -110 64 9 -47 -7 -172 -66 101 135 23 63 101 104 -28 62 96 -148 -8 -16 3 -53 40 -66 88 -74
4334 -74 -127 92 -18 -129 151 -4 94 -60 16 -109 49 -94 -135 90 51 -34 -11 103 139 194 -34 34 -47 129
4358 129 -64 147 -54 134 85 -55 48 35 -143 -76 -24 -88 -127 -122 68 -165 -37 -9 -41 43 -57 84 55 -86
4382 -86 -72 14 -48 -68 -37 -41 -50 -49 55 108 122 -12 11 113 14 116 -71 48 77 -72 78 -19 -114 -134 79 -74 -79
4409 -79 140 -122 49 -91 -50 24 84 -82 5 -99 0 8 -84 31 -158 -9 -17 7 210 -25 -61 45 -78 -6 3
4434 3 160 14 -197 42 40 40 -1 -27 204 -74 28 -145 18 76 95 29 37 172 -19 96 -100 47 81 -88 -38
4459 -38 -24 -107 64 -19 -55 16 -39 -55 -54 66 -63 -66 92 23 -10 8 148 80 92 -13 66 -75 97 -1 -92 59 46
4486D6j36N7J10m7k0J18j33r1J15l8n1o7J08O0K1l4j9l7O7k5J70p7l9k32L42K9
4512A97q6l72L54N9j32Q8j85M0J1N3j8o8J83j33m5l7J41k4k3O4j49O3n6Q6K1m4
4538a2kr8J23O2q6LQoK1K7J0l1mj41K4n0K29j18L3Pm2QK0k1R0P4p7M6J2K3j32
4569@j3k2J4q1N2L2o4j26K31o2J75n1j94J64j9N2o2J8j63J02q5N5J83j83M5M8
4595D6j57Q0Q2n8p8J28o5Q4k9j2K5j09Q3j51K26l10L21j45M9M2l4o2J06j56K3
4620g1Q3k5O9o2lR5k35O5Q6o0KnJ10K1j13K3L8m0M3K2k1k23K46m9K6Q1p9m4O9
4649D9j80J13p9J11r7J39n3m4J22j03j04L5J66j05MP6j88J84j80j7K07j14M2J31
4673A15j7k67L80k05J2P2j22p3R4J84j73q0J32r5N2Nj2J10j42N2o1r3J44r6P5
$$ plain form
4486 46 -90 -33 77 30 10 128 -5 -96 19 -19 -70 -137 -29 31 52 18 -1 -38 29 4 174 97 58 -174 168 197
4512 197 111 -261 93 152 20 108 -77 -37 -26 27 9 -59 124 -9 -54 -91 50 26 3 67 -82 -19 -75 11 32 -12
4538 -12 -14 -112 11 73 -13 -10 -2 -8 13 40 50 19 15 -126 -102 -152 77 -41 -8 -1 -43 -35 -15 -36 54 128 51 97 109 132 0
4569 0 -13 -35 -21 -102 -50 -18 -82 -208 23 -39 136 85 -109 55 36 88 26 44 -119 -17 -102 -47 136 -47 -2 46
4595 46 -111 -31 51 -7 -85 43 -22 62 33 21 46 -63 20 -131 95 -215 106 -39 10 52 18 -44 62 -94 -71
4620 -71 12 -13 56 -6 -9 86 -149 -84 2 -58 -56 -61 49 70 -43 -20 18 -22 21 43 22 -201 45 -4 22 103 24 -20 49
4649 49 -131 -18 -97 14 -83 56 3 -41 81 -22 -126 -91 75 -30 -26 50 -138 46 -134 -151 56 -58 -16 115
4673 115 98 -169 211 6 18 90 -32 -105 -11 173 0 -80 52 -43 9 14 2 112 -30 22 -39 -132 12 -84 -9
4698ij16K34j60M7mM1Rj08K9J03O1k5j35J41k78Q2K11k08Q1pK3R3k18J02O1j83
4724a33J37j11J25l1J00k62J49o9K5M9j41J88M2r8J9P0j72J64j50J16j5M2L8j53
4748g1J2P8m6m0R2r7n5J39R8k05J68o4J4n0P6q9L0Q0j72J20K0q7J15k43K34m1
4774A6j11M8j34K18j31M3K9q7k6J89m8R8k58K49q2o8Rj01J28J62j88j60K46j40
4798i9J39q9J67j83N5KO7j97K28l15J15M3rO0P4j01p0LJ05N9j73J72j61J7J00
4823InP4j04l1K23j79J18j05O5j16J34j47N2N1K9j82J19k3m7J18p9P8p6K1M9r7
4849e1Kk6N8J02j99N4l9K02l0j03L4j42J40M3j50O2Q3k40J63QL7qp1J08N4P5j02
4876F4K6j06Q6J6j35K9l7K7RL9O1j73R4j29Q6J39j71N6lJ5P0p4J07r8lL8J5L1
$$ plain form
4698 -9 -125 109 -51 -4 -8 33 42 -66 -37 66 127 102 -33 108 -170 -88 123 -85 -4 -11 12 105 -113 -11 50 -133
4724 -133 4 -107 18 -13 87 -175 -26 -95 -70 -21 -162 26 68 -30 -11 59 -113 51 -99 17 2 44 82 -71
4748 -71 -59 19 -27 -67 25 -72 -127 12 110 -95 73 9 23 -27 49 -40 -10 70 -102 18 38 -49 66 -177 57 16
4774 16 -95 -47 -181 37 -94 -51 -22 -109 -135 54 6 104 -154 95 13 -55 -46 -147 -19 143 -45 -205 41 -99
4798 -99 40 -49 118 -65 -10 -8 59 -138 90 -225 -110 -67 -76 -16 58 -43 -113 -110 -5 54 -119 53 -108 -91 9
4823 9 4 78 -26 -57 166 -13 105 0 65 -51 83 -64 -12 39 68 -114 5 -18 -65 53 -26 52 -24 -3 46 -51
4849 -51 -49 -75 -17 85 -114 -60 -99 103 73 -30 4 -138 2 45 -105 -43 40 -200 -37 -29 8 0 -71 37 91 166 64
4876 64 90 -16 70 86 -49 -20 -57 -30 -21 18 79 -94 0 -129 -43 96 -75 -19 -22 -7 63 -11 96 -2 -5 33 48 79
4904G9j07K8j59R1N9k7qN4K1o4N6rn5k1J18j79J02O7q0o3J0J51j29J62j07J53
4930A43j46J17r8R4k1m8l2k6J98j60n3J85n7k14O0J52j7j11K29k97Q4M4j67L26
4954A85k04l0l0M9Q0p8K1J92j37j84P8J18l1k2Jj22r3K38o5P6J57j88o8Q7O6J8
4980A14j54J30n6K9j10M2L6P0j14p2J25k71K65M7j85N0J75k61J05n2l4K78k39
5003h2l1J06J9n7l6J5J6Q9o1p6J08L7J04j47l0M2r8J22J56j74M9K9o2Oj35J48
5029E7qrj56J90r8j0J06j67J03k7J21P9j26k56J35J0J52j45J85l02J35N0pJ7j47
5054a18J20k4Q2j4j81J14M2l3k3P1r1OK9j25R1R1k00L0J53r7R0O9m5j66O8J10
5080D9j91M7J96j53o5R6J60j49j58L35o2k3q4j45K04o8J24p7j25J63k43J39j0
$$ plain form
4904 79 -28 0 -159 -68 -9 -36 -44 10 31 -33 23 14 -41 -62 56 -123 -21 46 -34 -97 -87 64 -65 97 -10 143
4930 143 -3 114 16 110 89 41 9 -17 181 21 -32 153 96 -118 -58 94 77 -34 195 -102 -18 26 -141 185
4954 185 -19 -49 -79 -30 50 -28 -7 185 48 -136 -58 60 29 7 8 -114 -207 31 -34 42 199 11 -57 30 96 114
4980 114 -40 90 34 63 -47 -5 31 101 -13 -85 40 -231 34 81 -104 -54 121 -140 -35 -87 -121 157 -82
5003 -82 -113 -7 12 -45 -81 -66 -50 39 -22 -98 10 47 151 4 -26 16 -82 40 196 22 71 100 38 44 -91 57
5029 57 49 40 -116 74 -24 -34 72 -95 8 -19 102 181 55 -201 -66 -56 96 -49 136 -166 -31 19 12 29 -118
5054 -118 2 -22 60 46 -135 -21 21 -12 -35 36 -55 -49 -20 -145 -54 37 -163 -133 20 -77 13 82 37 -129 -61 49
5080 49 -142 -95 101 -52 -117 -21 139 -10 -168 167 105 82 -2 -147 57 -11 113 36 -89 74 -169 -30 -40
5103d0J3R9j76K1k7J44l2N9n4jL0j0oL7j71K05j15j06K36k15K7n3J42j53L15k54
5129h5Q4j9j37K68r7L8r1jP7j18M5J1j8M2M4J49j11j92K53k03O4j14J19k8Q5j65
5155a00l6L3M7M2o5J80N7j47Mp0J4P1j04J06J9R0n8j88J23l6o7J36k3l7l5N4J06
5182A16j43Q6J42k55p2N7J15J3o4M3k5q4K03M9j36j61N4k9J03j55j3Q9J57j15
5206b5m2J39p7k2m0J28o2j5M5n5J3qo7J30Jj6J91k32j01J73p3J24l44K75R5j80
5232d5P8j53K72j49M0o6j31L09k59N7R0o0R2k37J23k4ON1k9j26K32lrL2n6lm2
5259a0Q4l3l0J4k1K6j19K15j69q9J02J15q0j57K65j43K6j3j5p0J63p4j47O7J49
5284E6n3o9J52p5R6r7j0Q1j77RL10k77l3R5j7o5q8J99kMKj93J80n8q7J56k5j2
$$ plain form
5103 -40 -27 72 -104 -83 -110 34 2 61 7 6 36 26 20 57 -114 91 -24 -130 106 -109 -82 -135 7 -146 169 -85
5129 -85 -1 -20 -157 111 14 52 -39 -40 37 -81 -36 -25 -43 -1 43 192 81 -111 142 -61 3 -111 8 -20 65 -100
5155 -100 -136 -103 -56 -14 -79 101 158 11 15 -55 -41 30 -74 32 51 141 83 -105 18 -18 -85 51 28 -9 -44 10 116
5182 116 -27 59 201 -54 -126 -69 46 59 -5 38 13 -71 132 181 45 -116 -62 -91 12 -143 -156 -67 90 -25
5206 -25 -67 72 -5 -27 -67 61 -1 -16 29 -26 -13 -21 -88 42 43 27 218 -14 -115 58 -15 109 -235 40 135 -45
5232 -45 33 -120 152 3 43 -23 -154 155 -104 -47 43 -17 75 -162 -39 -63 -57 -6 -35 -161 71 68 59 91 35 32 -10
5259 -10 74 41 11 25 4 30 -89 126 -43 -132 -30 85 5 -152 113 -30 -4 -17 -32 -102 61 -13 -160 -93 56
5284 56 3 -66 86 11 107 10 0 81 -96 -87 223 -54 -87 8 -9 -74 -162 37 35 39 41 -152 28 -30 -117 39 14 2
5312Bn4j23J30R9J0j21p6K42j59jK5K26k35q9K20j20J3J02o2J9n6rQ3j58O9ko6
5339i1K71k30K70j33q4q8J26p6J7J6nO1k53J71r7L4J7J0J81l1j70K9J44j75Ml6
5365a18P5l2j7Q3K7N7j44R5p7P7P3q8PJ06j57j7K1O4m1L3k8q2K24j93j9J14k18
5392a75K20j91J48j10O3jK9Q6j93K83j69l6J4K9m4J19p2J45k98L21j57K6J3l5
5416A5m0N1j36O1N6r5K49k07Q7m7Q1l5J3j11l5J17m1J45m3q8J4L6p2r6K68j43
5442DL9L3j31m9K24q5j96J82O8j65k2J04J6j93J41J83l26J47lJ9J18J4j77q0O5
5467g0P6P7j01L5m6J40k27J15M0j18Q3qJ47k91J84Lk2q4J36mJ07j59K2N8j56J87
5493A24k51J43j55J77j03p1M3M6J51j69n7j4J00n1N3M7j9l0J1J31k58M1R1J15
$$ plain form
5312 2 -52 -175 -45 54 64 -57 -133 109 -50 -51 -26 200 -35 -124 96 -24 -11 91 29 48 -8 -17 66 -92 -23 -25 -91
5339 -91 180 -50 220 87 3 -85 41 -35 -18 -2 -7 54 -199 -28 -125 -91 -74 -64 117 86 -84 -55 89 -86 -82 -118
5365 -118 -43 -75 -92 -9 18 75 -69 26 -51 26 99 11 18 124 -33 -50 -29 35 -6 27 -1 -83 141 -52 -71 43 -175
5392 -175 45 -146 2 -108 -45 -46 -17 69 -124 159 -10 -46 -32 -3 -47 72 0 145 -153 168 11 37 50 15
5416 15 -25 26 -110 -49 7 -88 161 -46 41 -6 75 40 53 -58 -93 24 -17 128 85 -3 11 47 -25 -121 147 4
5442 4 43 76 -55 -104 120 35 -161 21 89 -76 -98 6 22 -171 -30 153 -173 -26 -29 -10 108 122 -55 -135 -70
5467 -70 6 83 -18 17 -29 111 -116 -1 39 -79 4 -4 143 -148 36 39 17 -67 69 65 172 13 35 93 -63 124
5493 124 -127 16 -139 38 -65 -136 -93 -47 104 -65 -122 -136 -36 -87 -34 13 -6 -36 -25 106 -152 -111 -20 95
5517I5k44K6J88j39k2R6lM8q0K9O3j32R0k1M1K0J5j36K5J22J8N4j93m2J77n4j31
5544i0J99j64J11j1j9J34k64J65l00Q2P0RQ3k22L09m0q2o9L4K43r8k3r9j47L07
5569A18k05K63j26m3M1m3M8n9N6k3q7Rj8P1j70J57K0M6r0m2R3O4m8L8j31J13q4
5596c2O6L5k7q4J23j39M4l8J93M8k24k1J21j13O0r7O7K13l11K53j10L1J2l7Mn1
5622a4k0M2jJl1q2J09n0Q3j63J32q9M3J47j74N6p4M8m3J27n9L3k1q1K09l13J07
$$ plain form
5517 95 -149 -123 65 -74 -96 0 -3 45 -35 -6 57 -75 15 -6 35 55 70 -66 -41 81 99 153 -40 -82 95 41 -90
5544 -90 109 -55 56 45 26 160 -104 61 -239 -157 -87 -78 5 -217 92 52 -30 -99 -65 178 80 57 -42 -189 118
5569 118 -87 176 50 7 48 5 53 -6 50 27 -60 -51 -69 2 -168 -11 9 55 -35 -77 16 80 32 70 -61 52 -32
5596 -32 34 69 42 -42 81 -58 -14 -52 141 189 -35 -56 65 -48 12 -85 -18 195 -116 137 27 58 70 33 37 -14
5622 -14 -34 8 7 8 -23 -105 4 -46 37 -126 6 -83 -40 107 -67 -11 -85 -37 -80 47 -12 21 0 -81 128 -185 -78
$$ [...]
8191h
##END NTUPLES=NMR FID
##END=
