##TITLE=1H_DE-26_TFA
 CDCl3
 8 sc, 
 11.1.2024
##JCAMPDX= 6.0         $$ Bruker NMR JCAMP-DX V2.0
##DATA TYPE= NMR FID
##DATA CLASS= NTUPLES
##ORIGIN= UXNMR, Bruker Analytische Messtechnik GmbH
##OWNER= root
$$ XWIN-NMR		Version 3.5
$$ Thu Jan 11 14:39:04 2024 Russian Standard Time (UT+4h)  she@DPX200
##.OBSERVE FREQUENCY= 200.1313
##.OBSERVE NUCLEUS= ^1H
##.DELAY= (6, 6)
##.ACQUISITION MODE= SIMULTANEOUS
##.ACQUISITION SCHEME= undefined
##.AVERAGES= 64
##.DIGITISER RES= 18
##SPECTROMETER/DATA SYSTEM= spect
##.PULSE SEQUENCE= zg30
##.SOLVENT NAME= CDCl3
##.SHIFT REFERENCE= (INTERNAL, CDCl3, 0, 15.7039)
##AUDIT TRAIL= $$ (NUMBER, WHEN, WHO, WHERE, WHAT)
$$ ##TITLE= Audit trail, XWIN-NMR		Version 3.5
$$ ##JCAMPDX= 5.01
$$ ##ORIGIN= Bruker BioSpin GmbH
$$ ##OWNER= she
$$ F:/spectra/data/she/nmr/H-F/1/audita.txt
$$ ##AUDIT TRAIL=  $$ (NUMBER, WHEN, WHO, WHERE, WHAT)
(   1,<2024-01-11 14:37:56.78 +0400>,<she>,<DPX200>,
      <continue with go, POWCHK disabled, PULCHK disabled
       configuration hash MD5:
       00 E9 B6 7A A2 85 ED C7 34 08 36 98 17 FE 4E 26
       data hash MD5: 16K
       13 04 C7 A7 74 CF EB 58 49 86 E3 A4 76 0C 4C 44>)
$$ ##END=
$$ 
$$ hash MD5
$$ 7D EE D7 90 D4 81 5A F6 E1 75 9D C6 67 50 E5 4C
##$RELAX= 
##$RELAX= 
##$RELAX= 
##$RELAX= 
##$RELAX= 
##$RELAX= 
$$ Bruker specific parameters
$$ --------------------------
##$DU= <F:/spectra>
##$EXPNO= 1
##$NAME= <H-F>
##$PROCNO= 1
##$TYPE= <nmr>
##$USER= <she>
##$AMP= (0..31)
100 100 100 100 100 100 100 100 100 100 100 100 100 100 100 100 100 100 
100 100 100 100 100 100 100 100 100 100 100 100 100 100 
##$AQSEQ= 0
##$AQ_mod= 1
##$AUNM= <au_zg>
##$AUTOPOS= <>
##$BF1= 200.13
##$BF2= 200.13
##$BF3= 200.13
##$BF4= 200.13
##$BF5= 200.13
##$BF6= 200.13
##$BF7= 200.13
##$BF8= 200.13
##$BYTORDA= 1
##$CFDGTYP= 0
##$CFRGTYP= 5
##$CHEMSTR= <none>
##$CNST= (0..31)
1 1 145 1 1 1 1 1 1 1 1 1 1 1 1 1 1 1 1 1 1 1 1 1 1 1 1 1 1 1 1 1 
##$CPDPRG= <>
##$CPDPRG1= <>
##$CPDPRG2= <>
##$CPDPRG3= <>
##$CPDPRG4= <mlev>
##$CPDPRG5= <mlev>
##$CPDPRG6= <mlev>
##$CPDPRG7= <mlev>
##$CPDPRG8= <mlev>
##$CPDPRGB= <>
##$CPDPRGT= <>
##$D= (0..31)
0 1.2 0 0 0 0 0 0 0 0.06 0 0.03 0 0 0 0 0.0002 0 0 0 0 0 0 0 0 0 0 0 0 
0 0 0 
##$DATE= 1704969244
##$DBL= (0..7)
120 120 120 120 120 120 120 120 
##$DBP= (0..7)
150 150 150 150 150 150 150 150 
##$DBP07= 0
##$DBPNAM0= <>
##$DBPNAM1= <>
##$DBPNAM2= <>
##$DBPNAM3= <>
##$DBPNAM4= <>
##$DBPNAM5= <>
##$DBPNAM6= <>
##$DBPNAM7= <>
##$DBPOAL= (0..7)
0.5 0.5 0.5 0.5 0.5 0.5 0.5 0.5 
##$DBPOFFS= (0..7)
0 0 0 0 0 0 0 0 
##$DE= 6
##$DECBNUC= <off>
##$DECIM= 32
##$DECNUC= <off>
##$DECSTAT= 4
##$DIGMOD= 1
##$DIGTYP= 9
##$DL= (0..7)
0 120 120 120 120 120 120 120 
##$DP= (0..7)
150 150 150 150 150 150 150 150 
##$DP07= 0
##$DPNAME0= <>
##$DPNAME1= <>
##$DPNAME2= <>
##$DPNAME3= <>
##$DPNAME4= <>
##$DPNAME5= <>
##$DPNAME6= <>
##$DPNAME7= <>
##$DPOAL= (0..7)
0.5 0.5 0.5 0.5 0.5 0.5 0.5 0.5 
##$DPOFFS= (0..7)
0 0 0 0 0 0 0 0 
##$DQDMODE= 0
##$DR= 18
##$DS= 0
##$DSLIST= <SSSSSSSSSSSSSSS>
$$ [...]
##$SUBNAM2= <"">
##$SUBNAM3= <"">
##$SUBNAM4= <"">
##$SUBNAM5= <"">
##$SUBNAM6= <"">
##$SUBNAM7= <"">
##$SUBNAM8= <"">
##$SUBNAM9= <"">
##$SW= 18.0517328524113
##$SWIBOX= (0..15)
0 0 2 0 0 0 0 0 0 0 0 0 0 0 0 0 
##$SW_h= 3612.71676300578
##$TD= 16384
##$TD0= 1
##$TE= 0
##$TE2= 300
##$TE3= 300
##$TEG= 300
##$TL= (0..7)
0 120 120 120 120 120 120 120 
##$TP= (0..7)
150 150 150 150 150 150 150 150 
##$TP07= 0
##$TPNAME0= <>
##$TPNAME1= <>
##$TPNAME2= <>
##$TPNAME3= <>
##$TPNAME4= <>
##$TPNAME5= <>
##$TPNAME6= <>
##$TPNAME7= <>
##$TPOAL= (0..7)
0.5 0.5 0.5 0.5 0.5 0.5 0.5 0.5 
##$TPOFFS= (0..7)
0 0 0 0 0 0 0 0 
##$TUNHIN= 0
##$TUNHOUT= 0
##$TUNXOUT= 0
##$USERA1= <user>
##$USERA2= <user>
##$USERA3= <user>
##$USERA4= <user>
##$USERA5= <user>
##$V9= 5
##$VALIST= <valist>
##$VCLIST= <CCCCCCCCCCCCCCC>
##$VD= 0
##$VDLIST= <DDDDDDDDDDDDDDD>
##$VPLIST= <PPPPPPPPPPPPPPP>
##$VTLIST= <TTTTTTTTTTTTTTT>
##$WBST= 1024
##$WBSW= 4
##$XGAIN= (0..3)
0 0 0 0 
##$XL= 0
##$YL= 0
##$YMAX_a= 491263
##$YMIN_a= -612227
##$ZGOPTNS= <>
##$ZL1= 120
##$ZL2= 120
##$ZL3= 120
##$ZL4= 120
##$ABSF1= 10
##$ABSF2= 0
##$ABSG= 5
##$ABSL= 3
##$ALPHA= 0
##$AQORDER= 0
##$ASSFAC= 0
##$ASSFACI= 0
##$ASSFACX= 0
##$ASSWID= 0
##$AUNMP= <proc_1d>
##$AZFE= 0.1
##$AZFW= 0.1
##$BCFW= 1
##$BC_mod= 2
##$BYTORDP= 1
##$COROFFS= 0
##$CY= 11.3945322036743
##$DATMOD= 1
##$DC= 2
##$DFILT= <>
##$DTYPP= 0
##$F1P= 15.7292609196834
##$F2P= 12.9074282941183
##$FCOR= 0.5
##$FTSIZE= 0
##$FT_mod= 4
##$GAMMA= 1
##$GB= 0.15
##$INTBC= 1
##$INTSCL= 1
##$ISEN= 128
##$LB= 0.24
##$LEV0= 0
##$LPBIN= 0
##$MAXI= 10000
##$MC2= 0
##$MEAN= 0
##$ME_mod= 0
##$MI= 1.114404
##$NCOEF= 0
##$NC_proc= 0
##$NLEV= 6
##$NOISF1= 3.799351
##$NOISF2= 2.8
##$NSP= 1
##$NTH_PI= 0
##$NZP= 0
##$OFFSET= 15.70392
##$PC= 1
##$PHC0= -24592.88
##$PHC1= 18.4527
##$PH_mod= 1
##$PKNL= yes
##$PPARMOD= 0
##$PSCAL= 0
##$PSIGN= 0
##$REVERSE= no
##$SF= 200.130013532006
##$SI= 16384
##$SIGF1= 3
##$SIGF2= 2
##$SINO= 400
##$SIOLD= 16384
##$SREGLST= <1H.CDCl3>
##$SSB= 0
##$STSI= 0
##$STSR= 0
##$SW_p= 3612.71676300578
##$SYMM= 0
##$S_DEV= 0
##$TDeff= 0
##$TDoff= 0
##$TI= <>
##$TILT= no
##$TM1= 0
##$TM2= 0
##$TOPLEV= 0
##$USERP1= <user>
##$USERP2= <user>
##$USERP3= <user>
##$USERP4= <user>
##$USERP5= <user>
##$WDW= 1
##$XDIM= 8192
##$YMAX_p= 0
##$YMIN_p= 0
$$ End of Bruker specific parameters
$$ ---------------------------------
##NTUPLES= NMR FID
##VAR_NAME=  TIME,          FID/REAL,        FID/IMAG
##SYMBOL=    X,             R,               I
##VAR_TYPE=  INDEPENDENT,   DEPENDENT,       DEPENDENT
##VAR_FORM=  AFFN,          ASDF,            ASDF
##VAR_DIM=   8192,          8192,            8192
##UNITS=     SECONDS,       ARBITRARY UNITS, ARBITRARY UNITS
##FACTOR=    0.0002768,     1,               1
##FIRST=     0,             0,               0
##LAST=      2.2672688,     0,               0
##MIN=       0,             -612227,         0
##MAX=       2.2672688,     491263,          0
$$ Real data points
##PAGE= N=1
##DATA TABLE= (X++(R..R)), XYDATA
0@%%%%%%%%%%%%%%%%%%%%%%Nl3R0j26J28j28J28j28J40j93K43k54K68l17L70l97
38b04M45n03N63o24O90p69Q48r39J039j146J264j397J535j684J857k049K261k502
56a315K774l089L450l868M376m993N755o737Q059r942J2843j7950K9554r8395
70g9478K3917K28456p2440p8271K23813K45266j62134k43568J9498J30376n4012
81A81423k18186k05693J4450J65525k533k35003p1194K42635K12726p1562j28966
92a16378Q8632K17942N4395j48747j01639Q2524J12106l9188j59206q2553R0435
103a677R1240j03919j65695K4540J46794L1683r3105o3491M8087J28556O7960
114A10973r2079r0510R7624J40132m7844j41908k3659Q8004M7678o9366j11934
$$ plain form
0 0 0 0 0 0 0 0 0 0 0 0 0 0 0 0 0 0 0 0 0 0 0 0 5 -28 62 -64 64 -64 64 -64 76 -117 126 -128 140 -177 193 -204
38 -204 241 -262 301 -323 367 -402 446 -493 546 -600 664 -733 802 -882 975 -1074 1187 -1315
56 -1315 1459 -1630 1820 -2048 2328 -2665 3090 -3647 4412 -5530 7313 -10637 18917 -79478
70 -79478 -55561 172895 100455 22184 245997 491263 329129 85561 105059 235435 181423
81 181423 -36763 -242456 -228006 -62481 -65014 -300017 -371211 -128576 84150 12588 -116378
92 -116378 -27746 190196 244591 95844 -5795 76729 188835 149647 -9559 -92112 -1677
103 -1677 89563 -14356 -180051 -155511 -8717 22966 -70139 -133630 -85543 43013 110973
114 110973 18894 -71616 26008 166140 118296 -23612 -47271 40733 88411 19045 -92889
125i2889o415J06826M3289r6525p2460P6536J06583j5849r1935j7019Q7238O4533
137I1913n0313q0989Q991P6006J9829p3505o8526L1044P3267l184p0372k1392
149f7231O1824N4018j8246n3277o74O1959L6222n4817o3303J9359N5363j340n3245
162b3388k6858L8963N3307j0094n9793j1199N6684K9504m3043m3652J5550M2753
174A8734P750l8808k8456K9107M3412j0232m6326r099L9149K5973k5737l0810
186b5343J1413M0587J1561k7595k3136J3387K8928n294l8334k3382K4501K2328
198I621k1773k7667R452K8980J3886r794j5360R434L0771Q220k8906j5219K2949
211A4594J7001j5774k2832l925J1666Q746j2828k4020N68K0533L232j9030r386
$$ plain form
125 -92889 -99304 7522 50811 -45714 -118174 -41638 64945 49096 -42839 -59858 27380 91913
137 91913 41600 -39389 -30398 45608 65437 -8068 -76594 -45550 27717 24533 -45839 -67231
149 -67231 -5407 48611 30365 -22912 -23586 38373 74595 19778 -43525 -24166 31197 29857 -23388
162 -23388 -50246 -11283 42024 31930 -27863 -39062 17622 47126 4083 -39569 -24019 18734
174 18734 26484 -12324 -40780 -11673 31739 21507 -24819 -33918 5231 31204 5467 -25343
186 -25343 -13930 26657 38218 10623 -12513 874 29802 24508 -13826 -37208 -12707 9621
198 9621 -12152 -39819 -30367 -1387 12499 2705 -12655 -3221 27550 35770 6864 -8355 14594
211 14594 31595 15821 -7011 -10936 730 9476 -3352 -27372 -26804 -6271 -3039 -22069 -31455
224c1455J7483K2755K712r567L071J6832J2963p455j6824m583Q863K386j9518
237b337k0139L573J3148l766j2074k006R487J2300L831r426l252J6530J3824p821
251A1872j0245Q564R617K34j0895r935q86Q056k105j7620q307R831R599n466r103
266a6789L753J1514P431l158p121N254J3516M584j0583r089N829O684o235j2082
280f492k243P348L258m540r272J698J1237M891r011q437Q564Q919m821p729j18
295f748Q478P315k273o862q32J0926L898r282q219N232N284m340q833l395L542
310f109N306l468q252M70J1114O074n867k294O268R375j594o516k551L250L336
325H542l797p559k129O834J910p574o957M903M573k494n466j549L721P047J03
$$ plain form
224 -31455 -13972 8783 11495 1928 4999 21831 34794 27339 10515 5932 14795 17181 -2337
237 -2337 -22476 -18903 -5755 -9521 -21595 -23601 -14114 -1814 2017 -7409 -10661 5869 19693 11872
251 11872 1627 10191 19808 20042 9147 -788 -1674 6382 4277 -13343 -21650 -11819 -2220 -7686 -16789
266 -16789 -13036 -1522 5909 2751 -4370 884 14400 18984 8401 -688 5141 11825 5590 -6492
280 -6492 -8735 -1387 1871 -2669 -11941 -10243 994 5885 -3126 -11563 -2999 5920 1099 -6630 -6748
295 -6748 1730 9045 6772 -90 -922 10004 13902 4620 -3599 1633 6917 2577 -6256 -9651 -6109
310 -6109 -803 -4271 -12523 -12053 -939 5135 -732 -3026 3242 12617 11023 4507 1956 5206 8542
325 8542 4745 -2814 -4943 1891 3801 -3773 -10730 -5827 -1254 -3748 -9214 -10763 -7042 5 108
340A08j872K374J0978M781m976l840K474J100m884p367n933p62J632l679n097
355a4963O58P238L810r55J321O303L912J259j51r65J415M50j636n761j098K200
371C037k192n134j734n69j692j841L74J006K026M106L179J127L481M517K551k321
387I921n38r40k935j902k493m319l447P48J35j830l0K764J429r10K268J629P89
404C39K858J665R94q47J238K45k261j698q10l051k232L45n84j999N07K351J02
421b838j258K070L213Q3N00m19Q73K76O84j526m83pK650k356k762L75J942k045
439a028k143J88j1J954N21q15o16K702J545k009k053J788K251j081q70p02P83
456D04J967P74j116n3J360N68l796l156q46P03m52j551P64K64L812k05r66J462
$$ plain form
340 108 -1764 610 11588 16369 11393 7553 10027 11127 6243 -1124 -7057 -7819 -6187 -9866 -14963
355 -14963 -14305 -7067 -3257 -4212 -2891 3412 7324 8583 8432 7467 8882 9332 7696 1935 837 3037
371 3037 845 -4289 -6023 -6592 -8284 -10125 -9751 -8745 -6719 -2613 566 1693 5174 9691 12242 9921
387 9921 9383 8443 5508 3606 1113 -3206 -6653 -5905 -5770 -7600 -7630 -4866 -3437 -4347 -2079 -450 339
404 339 3197 4862 5856 5009 6247 6492 4231 2533 1723 -1328 -3560 -3215 -3799 -5798 -5291 -2940 -2838
421 -2838 -4096 -2026 1187 1270 1770 1351 2224 2500 3184 1658 1175 1168 3818 1462 -1300 -925 1017 -1028
439 -1028 -3171 -2983 -2994 -1040 -519 -1334 -1950 752 2297 288 -1765 23 2274 1193 323 -379 404
456 404 2371 3145 2029 1976 3336 3904 108 -3048 -3894 -3191 -3643 -5194 -4430 -4166 -354 -559 -1525 -63
474f3K734J434k048m93K341M36p82j168q0L51O21k680m272j565J984r83l796J160
492f869K850K618J067K632O20K662K132P03l758m26J309k546m252j241J194j777
508c082n60n13l20R69J008n88j618K061L059M13OK198K690J10J34L78j607l28
526D410j615k828m051q71n30j587o97K435K254l82J846K194K003J50J653O62j095
543C951j27k40k117j586P40N44j560q31J30j422j272L64n50j39K724J994j649
560a046J00K445J578j199J130J160q42o47r84j141p16J99o85j197j91k33n63k079
578d911J399J931J136J84J261J066K47O41k96r14N82j149q46j380L59K01p70K25
596a034J938p88l45k77o62j298M42J028r80M0J833K95J111J06P22R48P30j67k805
$$ plain form
474 -63 2671 4105 2057 1564 3905 4341 3559 2391 2311 2662 3283 603 -3669 -5234 -3250 -4233 -8029 -6869
492 -6869 -4019 -1401 -334 2298 2918 5580 7712 8415 4657 4231 5540 2994 -1258 -2499 -1305 -3082
508 -3082 -3642 -4155 -4475 -3506 -2498 -3086 -4704 -2643 416 829 835 3033 5723 5833 5967 6345 4738 4410
526 4410 2795 -33 -4084 -4955 -5485 -7072 -7769 -5334 -3080 -3462 -1616 578 2581 2731 4384 5046 3951
543 3951 3824 3584 1467 -119 621 1165 -395 -1226 -1096 -2518 -3790 -3426 -3976 -4115 -1391 603 -1046
560 -1046 -946 1499 3077 1878 3008 4168 3326 2679 1695 554 -162 37 -648 -1845 -2036 -2269 -2832 -4911
578 -4911 -3512 -1581 -445 -261 1000 2066 2313 2954 2658 1744 2326 1177 331 -1049 -690 -489 -1259 -1034
596 -1034 904 116 -229 -506 -1168 -2466 -2024 -996 -1976 -1936 -103 192 1303 1409 2131 3079 3809 3642 837
615H37o93N39j540k805L70J481L66m80N59j35P85J157o31p29Q42J170K65m38Q3
634A003J755p3l13l25L74j056j463J29k026j273N00q19r00J428K848M64O9n3K269
653B538r78J371n32l17l5J630j403k926J016O13k712k221J291q43O3J175n15P68
671b017K310N27K08K66J406J486l83j167po21o13j061r60k51q87M20j497p44P17
690b868J299o14O13J015J683p8Q73m0L00Q10J36o79k94r80p94j568o50J68l22
709a990L56r76P0P95J383K61o97K255N05KK8k2Q14n77Mj558q17L9m60j379n7m6
731b067O04R8m94J098K64L74J2L34L21L18l47M28J53O96n8r32n51P73Jj187o39
752h01o82j21J51o05j17J080K04M92j61O71J783P06m45o35k87Nr8p55q05J222
$$ plain form
615 837 144 683 -857 -3662 -3292 -1811 -1445 -1925 -1366 -1501 -716 441 -190 -919 -77 1093 1358 920 1003
634 1003 2758 2685 2372 2047 2421 1365 -98 31 -1995 -3268 -2768 -3587 -4487 -3059 -211 253 322 269 2538
653 2538 1560 2931 2399 2082 2047 3677 2274 -652 364 977 -1735 -3956 -2665 -3508 -3445 -2270 -2785 -2017
671 -2017 293 820 1028 1294 2700 4186 3803 2636 2629 2008 1395 334 -626 -877 -1764 -1344 -2841 -3585 -2868
690 -2868 -1569 -2183 -1570 -555 1128 1050 1923 1883 2183 2993 3129 2450 2156 1176 382 -1186 -1836 -1668 -1990
709 -1990 -1634 -2610 -2540 -1745 -362 -101 -798 1457 1962 1964 1992 1970 2784 2207 2211 653 -164 -125 -585 -1964 -2021 -2067
731 -2067 -1463 -1365 -1859 -761 -497 -123 -111 223 544 862 515 943 1096 1792 1734 802 251 1024 1025 -162 -801
752 -801 -1483 -1604 -1453 -2058 -2175 -1095 -891 -399 -560 111 1894 2600 2155 1520 1233 1238 1140 385 -420 802
772H02j111K90p36p1J04N18k96m09r8j23J60K75M79M90Q60R3j93J058P64l12j666
793H78J18K71j090j174j127k00K12N44o73K95M76Q22J302j109R31M82l19N41k18
812I62r1J20M57j290O97m88j86p42j045K08q7k59m78j86P95Q85N17M27R88l14
832H90P73N85k99K8Q53j105j267j7n62j646j31j0J498o26M33k3p24J540Q36j149
852a23N43k17M47L62l59L80K42j49n56r73O75N78j473j323J56L72j13J110o00
871a021L37J015O53n68O92K79K07L45J37j589J092j290p08k44o14l58L23O19j402
890b095J258M52J156q79L84Q69n63j36n14M77R53p02P59q12N59m61n38n87j90
909f10J31q65k74J89J05J26J141k1J27K96J150l91p72N46N8mr57J061J31j277
$$ plain form
772 802 -309 -19 -755 -826 -722 -204 -500 -909 -1007 -1130 -970 -695 -216 274 1134 1227 1034 2092 2856 2544 878
793 878 996 1267 177 -997 -2124 -2324 -2112 -1568 -2241 -1946 -1470 -648 654 -455 476 958 639 1180 962
812 962 871 991 1448 158 855 367 181 -561 -1606 -1398 -1485 -1744 -2222 -2408 -1613 -728 -211 216 1204 890
832 890 1663 2248 1949 1977 2830 1725 458 441 -121 -1767 -1898 -1908 -410 -1036 -603 -626 -1350 190 1026 -123
852 -123 420 203 650 1012 653 1033 1275 1126 570 -403 272 850 -623 -1946 -1790 -1418 -1531 -421 -1021
871 -1021 -684 331 984 416 1108 1387 1594 1939 2076 487 1579 289 -419 -663 -1277 -1635 -1312 -693 -2095
890 -2095 -837 -385 771 -108 276 1145 582 446 -68 409 1362 660 1419 607 1166 705 167 -420 -610
909 -610 -479 -1344 -1618 -1429 -1324 -1198 -57 -78 49 345 1495 1104 332 878 936 932 -25 1036 1167 -110
929a10n03M72k09q77N02j176N4J418j70r52J180Q30J96K28L43J004j151N18p12
948H85l40L13n15O4j482O85M8p94L38l78j67L59K72K60j142J505J057m68L37R1
968I28J036k37m04j61m16m76o1j302j307P74M72j48j080J819M07MJ12J05P78q5
988G58L15j31m55J297l50l67q86K94n06J2j141l56L64O83j112L39n87P05J261
1007A37J90J63J97n3M51Q3L80M73n17m68p84k98m91O1j202k95j50Q59j093Q47
1027a510J086N03P09k46R49l19P92q28m53k04O61m95q90m20K27M63l28j242N56
1046i89m48L63l04M04M3Q81J26M73R64N74p8J55j074j150Q29l18j258k93K42N8
1066h00r26m16J349L53M31n81J209m83N65l91km2N28M38j131K98N51r46l37K31
$$ plain form
929 -110 -613 -141 -350 -1227 -725 -1901 -1847 -429 -599 -1551 -371 459 655 883 1226 2230 1079 1597 885
948 885 545 858 343 407 -1075 -390 -342 -1136 -798 -1176 -1343 -984 -712 -452 -1594 -89 968 500 837 928
968 928 1964 1727 1323 1162 746 270 209 -1093 -2400 -1626 -1154 -1302 -2382 -563 -156 -152 -40 65 843 758
988 758 1073 942 487 1784 1434 1067 181 475 -31 -19 -1160 -1516 -1152 -469 -1581 -1242 -1829 -1124 137
1007 137 327 490 687 634 1085 1168 1548 2021 1504 1036 252 -46 -537 -476 -1678 -1973 -2123 -1264 -2357 -1510
1027 -1510 -424 79 788 542 1491 1172 1964 1136 683 479 1140 645 -245 -665 -438 25 -303 -1545 -989
1046 -989 -1437 -1074 -1378 -974 -931 -50 76 549 1513 2087 2009 2164 1090 -60 769 451 -807 -1100 -858 -800
1066 -800 -1726 -2142 -793 -440 -9 -590 619 136 701 310 308 266 794 1232 101 399 950 4 -333 -102
1086a02k05l51Q9k72P2k42M51k72p0P19M21M70k60k4M97j39P06j232r4q73J000
1107B89q39k09R95J24J85j882P16Q2N32m22k06M52M68K06n79P19q89Q67P32j486
1127a45Q98m9p08j97J0LJ01l48o84M5J157o51K50l99M16L36J504j209K30K53k00
1148F13L23k05o75O0O85n45j171M70M92o73k93o16L90N13o52N02L83O13O89o20
1168B83K96J159JN8j647N77m78k06r11m3m81P60k68K04k83N44K40N5K81O47j75
1189F13Km1N30p5M1J14n15j242P06m43j083J85K56J055j690L47N60P26O7o90J492
1210I15L61o1J5m87M2p66Q41j084l7L12j43o72L75p99M80P18j189P74M73m01N88
1231B55N30l37J13R60j004K71j80j80j23K1j056P68m18k48M93n62o6j67N18m26
$$ plain form
1086 -102 -307 -658 -569 -841 -769 -1011 -560 -832 -902 -183 238 708 448 424 921 782 1488 256 162 -711 289
1107 289 -550 -759 236 360 545 -1337 -621 -539 -7 -429 -635 -183 285 491 -88 631 -258 609 1341 -145
1127 -145 753 704 -4 -201 -191 -188 -87 -435 -1119 -1074 83 -568 -318 -717 -301 35 1539 330 560 813 613
1148 613 936 731 56 116 801 256 -915 -445 47 -626 -919 -1535 -1145 -632 -1284 -782 -399 214 903 283
1168 283 579 1738 1739 1797 150 727 249 43 -868 -911 -1392 -632 -900 -696 -979 -435 -195 -140 141 788 613
1189 613 615 574 1104 1029 1070 1184 669 -573 133 -310 -1393 -1208 -952 103 -1587 -1240 -680 46 113 -577 915
1210 915 1276 1215 1230 743 785 19 860 -224 -261 51 -92 -764 -389 -1188 -708 10 -1179 -405 68 -333 255
1231 255 785 448 561 1521 517 788 608 428 305 326 -730 38 -380 -628 -135 -697 -763 -930 -412 -838
1251h38Q52K01L49n9j94R7M14q19J80m00N1J02P1j48j13M15j106M31k96n11J465
1272A44q89L56M32l98N87M41J63p69J331n23k1k24p09l27K39j71K06k37o58l6
1292a063K72R45J50q35J76M3J195j11l50n0k16K96j46k84K18J41k00n80m54L99
1312d54O73r42m73r6R29K21n6q94R08J210k09q0j49J04J64J28r12K23q62J42j62
1333e87Q4J17o20J0k93J307M25p25o08K22M12O26j46J007n7p77N84o24k56l44
1353b43O83j032J61o40K67J54K95ok94K65k16Q64J61J086q15N13j078J46N66l41
1373D96R5r56M77r52J285m67k91K29j555P13J230q15O97o25O05o67O94l18J7O76
1393E68k71N19m14p76Q54r05k58J91Q41m86k51K53m62l56J074k65K9L85j15M15
$$ plain form
1251 -838 14 215 564 505 311 408 822 3 183 -217 -166 -64 7 -141 -254 161 -945 -514 -810 -1321 144
1272 144 -745 -389 43 -355 232 673 836 67 1398 875 854 630 -79 -406 -167 -338 -132 -369 -1027 -1063
1292 -1063 -791 154 304 -531 -355 -312 883 772 422 372 156 452 306 22 240 381 181 -399 -853 -454
1312 -454 219 -723 -1196 -1292 -363 -142 -198 -1092 -184 1026 817 737 588 692 856 984 72 295 -567 -425 -587
1333 -587 -503 -386 -1006 -996 -1289 18 443 -282 -890 -668 -256 370 224 1231 1174 397 981 357 101 -243
1353 -243 440 -592 -431 -1071 -804 -650 -355 -361 -655 -390 -606 258 419 1505 690 1203 125 271 837 496
1373 496 591 -365 112 -840 445 -22 -313 -84 -1639 -926 304 -511 186 -439 166 -501 193 -125 -108 568
1393 568 297 816 402 -374 480 -425 -683 -492 349 -137 -388 -135 -597 -953 121 -144 -115 270 155 570
1413E70j82l78N9N63L5n69o96J013p07O82j244R8P78K01j62p80K94K19m03N92
1433a7M11J6J40l22M37k18m98L89l30qk19M74r4r58K46m23L42M38p20M85K48k68
1455d49P48Q2j8J146j375M71L59k06l27m75K67k84m81J6k64L34M55L08n68J07
1475a54J82J58R8J81l07O16K76k73p10Q15p08L86m14K40o27o16N02p76O46j01
1495e86L44O9L7J70N18m13Q65k38k13J58q06j00K33o49J96q07P52m4K57q30J0
1516a077J154P1Q9j04O4Q20o24k63L64M29q45j69M34j53p94Q01J39j11j373R25
1536b23o21k72P64m2O82l80M04j172J528p84O05p45P92K3n03J10J63o21L62n26
1556d56r5J66J117m17j89r45Q04K06o18l43P10K90J89q90N94l03J455p56o98O80
$$ plain form
1413 570 388 10 69 632 667 98 -598 415 -292 390 -854 -756 22 223 61 -719 -425 -206 -609 -17
1433 -17 394 410 550 228 665 447 -51 338 8 0 -219 255 161 -797 -551 -974 -632 -194 -914 -429 -181 -449
1455 -449 299 381 363 1509 134 605 964 758 431 -44 223 -61 -542 -526 -790 -456 -1 307 -261 -154
1475 -154 28 186 284 465 158 774 1050 777 67 882 174 560 146 386 -241 -857 -355 -1131 -485 -586
1495 -586 -242 -173 -136 34 552 139 1004 766 553 711 -95 -195 38 -611 -415 -1222 -470 -514 -257 -1087 -1077
1516 -1077 77 148 237 133 197 1017 393 130 494 923 78 -91 343 190 -604 197 336 225 -1148 -223
1536 -223 -844 -1116 -352 -394 288 -92 312 -860 668 -116 489 -256 536 559 56 166 329 -292 70 -456
1556 -456 -551 -385 732 315 126 -819 -15 191 -427 -770 -60 230 419 -471 123 -180 1275 519 -179 501
1576E01m14j21p17M33rL61p07L95M57K66p79N27m53P44n26P79k28q0K9J19k17
1597C60j2m1l88K40n49k22K19o82L16J80j38J010m27P19o66Q53k11l49K75l25
1617A62N48m55n4q21K61K26m40P1l54N11p0n70J483k08q94Q70n56K61o0K80J19
1638C10n5K7q20L66K44O6r36O11K02k60m18N96l27l7pP0P68m37q9j3P70j12j74
1661C45l5m40N79o47N38k64m92J073n37p55j1N89L16m99K7Q41L21n63l99j79L09
1682A17m30j23O97m79L61K95j241P12O3L90o55M79m06m76O82MM5m43K89j79M20
1703A22p54R17j28k04M53N9k88m00m20N72K27r21J387o84j70o52J065m71L35N35
1723E80q07K93l11N86n9L44K47o90L90m10j92r74N35Q49O19j298K45j99l59N18
$$ plain form
1576 501 87 -34 -751 -318 -327 34 -673 -278 179 445 -334 193 -260 484 -42 737 509 429 458 577 360
1597 360 348 307 -81 159 -390 -612 -393 -1075 -759 -579 -717 293 -134 585 -81 772 561 212 487 162
1617 162 710 255 201 -620 -359 -133 -573 -502 -856 -345 -415 -985 498 290 -604 266 -290 -29 -89 191 310
1638 310 255 282 -538 -172 72 138 -798 -187 15 -245 -663 -67 -394 -431 -438 -368 400 -37 -126 -139 631 519 345
1661 345 310 -130 449 -198 340 76 -416 657 120 -635 -646 -57 259 -240 -213 628 949 386 -13 -192 117
1682 117 -313 -436 261 -218 143 438 -803 -91 -28 362 -293 186 -220 -696 -14 -10 35 -408 -119 -298 122
1703 122 -632 285 157 -47 406 465 177 -223 -643 -71 156 -765 622 -62 -232 -884 181 -290 45 580
1723 580 -227 66 -245 341 282 626 873 183 573 163 -29 -1003 -468 381 1000 -298 -53 -252 -611 -93
1743i3K18K96n74l46N90m26L58j52P65l59M8l3k3J22o24l16L92q56J065j93j52
1764b93j15L5N78m82R49k14L59l22l03j32l26P75k00p46q7qK34o05j79R85R1l79
1786c85J19M08k83K6P70q74j74J514j046L58q31P10r11n9J5Q98n40M35l0j30j178
1807a188P19j58O73R10j103M22l03P21j274O64r35P79M47j03r52O14m6K82o93
1826e24O66p6O8OK4p68R75q86M24K28J21M48k66l06R82j191Q30j160k4K87M61
1847C19n98L02m6R76j173O87l69J39M7j96O01j178J006o65N64J3j167J367k07
1866D22k53q32Q26o46N83L28o82K1L85j66m06j02K73L47K26l92n20R58j32P58
1886I96o74J55l05p24P8L1J073r46m8L72m14J78n76R34J30pl1N4k17J69P10j153
$$ plain form
1743 -93 125 421 -153 -499 91 -335 23 -129 636 277 325 292 269 391 -233 -549 -157 -1013 52 -141 -293
1764 -293 -408 -373 205 -277 672 458 817 495 192 60 -266 509 309 -437 -524 -532 -298 -903 -1082 -97 -6 -385
1786 -385 -266 142 -141 -115 655 -219 -393 1121 75 433 -398 312 -599 -658 -643 255 -285 150 120 -10 -1188
1807 -1188 -469 -627 46 956 -147 275 -28 693 -581 83 -852 -73 374 271 -681 -67 -113 169 -524
1826 -524 142 66 134 140 164 -604 371 -515 -91 137 258 706 440 134 1116 -75 755 -405 -429 -142 319
1847 319 -279 23 -23 953 -220 467 98 237 284 88 689 -489 517 -148 416 429 -738 629 422
1866 422 169 -663 163 -483 100 428 -254 -233 152 -14 -420 -522 -249 98 324 -68 -588 370 238 996
1886 996 322 477 172 -552 -474 -443 630 -316 -364 8 -406 -228 -804 130 260 253 222 276 59 228 938 -215
1908b15M43k25l79M39M23n79o63J06J3k6N32l74P11n39N01K24o6j21P59q19J31
1929B76mJ4j49Q1J96q20M38l5J4l04K83L20J86m88J16k80M2J35R20j063O6K61
1951B05L29j78j46r2j43O0P4o59R1P53k91j77m5j51j15K51N07J000j485P50l11
1972B27p98O95J89k56K79j68L82q58M9j95p26R52P19r2j97m82L43k05M58k39J20
1993A97p32K25P73q3J7K81r76J59Q25o20k58k4j16P69q41L09n46P95o41M78K79
2014B70j81M75o08M04m55M32n58j22J115p25P1j67k45J92j02Q16p52o40J703j072
2034a49N26J73j077k1Q53l94m41L76M89l66n60M73o36O18m75L37k91K35M26Q3
2054A79K22p71L18M59n89L75j17N84j06q65M08N33j199J234m92m32L21K7j4k06
$$ plain form
1908 -215 228 3 -376 63 486 -93 -756 -650 -637 -663 -131 -505 206 -333 168 392 326 205 964 145 276
1929 276 272 286 137 218 414 -406 32 -3 11 -293 -10 310 496 8 124 -156 -114 21 941 -122 -56 205
1951 205 534 356 210 118 -25 35 109 -550 -459 294 3 -174 -219 -370 -485 -234 273 1273 -212 538 227
1972 227 -571 124 313 57 336 168 550 -308 -259 -454 -1180 -228 491 399 202 -280 63 -142 316 77 197
1993 197 -535 -310 463 380 397 678 -298 -139 686 66 -192 -216 -332 437 -404 -95 -641 154 -487 -9 270
2014 270 89 564 -44 360 -95 337 -221 -343 772 47 118 -49 -294 -102 -204 612 -140 -780 923 -149
2034 -149 377 550 -527 -548 305 -89 -530 -154 335 -31 -591 -118 -754 -136 -611 -274 -565 -330 96 179
2054 179 401 -370 -52 407 -182 193 76 660 554 -311 97 630 -569 665 173 -259 62 89 75 -131
2074a31K68k79L61Oj058J475O1p06m55N63j75Q9M35n22l08P48n25o67J156j251
2094i15N68L63k82R5Q46m67j20M9l18L54q02R81l40l67j55R57k75J99j6r8n10
2115b53k49O29j224P88J49mj45N69m96k55Q57k82m50Q78J05j396Q61Qr6P9K96
2136C69m36j109J285M91n50K84m7j10n21K17l73Q88r71J100l21K96o63R14p19
2155B4KJ15J88o1m90J61K16k73K28r40R14j95J83M46j178N68M09j7J74o16M35
2176B93k18J23l72J087r49K40l48k2K61K53m32J79k30l78J058m0m85n02K16K39
2196b7KN19j47m41J6M37l45m99P32k34l85M66J62L27j396N66J317n39o62O7K97
2217B33j50k9j77L91j6n31j2P60l65p96L79L80J27o70P27j96J96o11o43J042M35
$$ plain form
2074 -131 137 -142 219 225 -833 642 703 -3 -458 105 -70 19 454 -68 -376 372 -153 -820 336 -915
2094 -915 -347 16 -266 -171 675 208 88 137 -181 173 -629 352 12 -355 -510 447 172 371 355 257 -253
2115 -253 -502 127 -1097 -309 -160 -164 -309 260 -236 -491 366 84 -366 512 617 -779 82 90 -6 73 369
2136 369 -67 -1176 109 600 50 334 287 177 -344 -127 -500 388 -583 517 196 492 -171 743 24
2155 24 26 141 329 268 -222 -61 155 -118 110 -830 84 -111 72 518 -660 -92 317 300 474 -142 293
2176 293 75 198 -174 913 -36 204 -144 -166 95 348 -84 95 -135 -513 545 505 20 -482 -266 -27
2196 -27 -25 494 347 -94 -78 359 14 -485 247 13 -372 94 256 583 -813 -247 1070 531 -131 -64 233
2217 233 83 54 -123 268 252 -279 -291 469 104 -692 -313 67 194 -476 251 55 251 -360 -1003 39 474
2238D74j07j76K96p85m05J128r5l91N20q45m06L30k60P61m56rL11j80P12J4N51
2259I82j220R75j47l38J35K40l47k93J4L49p09J64L15j32k4M30n07O90n32r2p3
2280a20k54R01r41K16L27N47r88M4K69n74R91r49M00J10k6k94M51j94M77r46N46
2301gK47M65j086R77q56k66J133j79j07o13O60l25l35l41O95l33j94J50l74P16
2321B7K69K7o24J07j62J67K64M1K56p99Q85j620P61l46Q11K41n61M44J95l77n56
2342e50N82j63L79m97P49o53k68M46Q3n47K06N28K17k34K27r72N95n78J24K11
2362a15n75J396m98j96q66K24N43O67j269L45J113l51q0o11K49J07M00j72l99
2381h8Q58l85n10N70K59n03j98L10q11O45k05o14N76M24J0J68o48m92Q72J40m31
$$ plain form
2238 474 367 191 487 -298 -703 425 330 -61 459 -386 -792 -462 -722 39 -417 -426 -115 -295 417 431 982
2259 982 -238 737 590 252 387 627 280 -13 1 350 -359 -195 120 -12 -36 394 -113 577 45 -47 -120
2280 -120 -374 527 -414 -198 129 676 -312 -268 1 -573 418 -531 -131 -21 -47 -341 110 -84 393 -553 -7
2301 -7 240 705 -381 596 -260 -526 607 428 321 -292 368 43 -292 -633 62 -271 -465 -315 -689 27
2321 27 296 323 -301 -194 -356 -189 75 116 372 -427 458 -1162 -401 -747 64 305 -256 188 383 6 -550
2342 -550 32 -131 248 -249 500 -153 -421 25 108 -439 -233 295 512 278 505 -467 128 -450 -326 -115
2362 -115 -690 706 208 12 -854 -630 -87 580 -689 -344 769 418 338 -273 -24 83 483 311 -88
2381 -88 770 385 -125 445 704 201 3 313 -498 147 -58 -672 -96 328 338 506 -142 -634 238 378 -53
2402e3l49k10L73k14P32k28k54j27N5R7P04o77k56J643o91n52o9j90K14K99n17
2423b70N09n13K21j41L38O66o00p01j6N43j77N64j104R02k2J44p16M47L66m94
2443e4Q3R5R4m76J8L02l87J20j74M15K72k49o72J616o78l58J04Q22q71k56j97
2464d31M17QK24k22L29j076P44j11k78J231n63q37j8M67K1K89J61k58K55k71M15
2485D96j84m55k02M22l01Q23m54k72M33q84N81r84O88k73M09M46m73j22M92k15
2505b9J61Q4l59K01k28P7J62R2m36N24k96J37m79R0l85O51l88O37n89R58n58M60
2527D87J66j011O83j65k6k54M07k88n20J387j141k29O25k87j85p56J230m64r9
2546d40J032Q7j127J043p58K37k74k82R83m11k41l10O28L07n30n12O64j69l02
$$ plain form
2402 -53 -402 -612 -239 -453 279 51 -203 -330 -275 -178 526 -151 -407 1236 545 -7 -76 -266 -52 247 -270
2423 -270 239 -274 -53 -194 144 810 210 -491 -507 36 -141 423 -681 221 199 343 -373 74 440 -54
2443 -54 29 124 218 -258 -240 62 -325 -205 -379 36 308 59 -613 1003 325 -33 71 893 22 -234 -431
2464 -431 -14 -6 218 -4 325 -751 -7 -118 -396 835 272 -565 -583 -116 -95 194 355 97 352 81 496
2485 496 312 -143 -345 77 -224 599 145 -127 306 -578 3 -981 -293 -566 -157 289 -184 -306 186 -29
2505 -29 132 216 -143 58 -170 -93 69 161 -275 249 -47 90 -389 -299 -684 -33 -421 216 -373 585 27 487
2527 487 653 -358 325 160 134 -120 287 -1 -521 866 -275 -504 121 -166 -351 -1107 123 -341 -440
2546 -440 592 679 -448 595 -163 74 -200 -482 501 90 -151 -461 167 474 -56 -568 96 -73 -375
2565c75K5M32n97N44L11m16L58j40m01Q36q32K70m29O50l32k61P15j84l92n4j65
2586d37O63n91P9qj61j50O73j15J04k25L86l0N07j004Q00k26m33M52k83J8r99
2607i80M11L04j2M41J4l14N14q61L48J67K60j092J299N04j197N46j15j47J78n72
2627c04J64k02P13n72N59n55m54L86L73j17p18J018M47p47J104j341L47m92J64
2646b27k79L13J74p13J611j251O70r55N64m87J01O74q39J274q32J46N49n94j15
2665b16K74P69p48J90j49L9k92m00O48J40R5r3o63N44q23O04P8l60L48m55O04
2686A34k2m09j43O11m34L5L32rk83l18R50j078O67m9O2n03N75k79k35K61J66K80
2708C11Q4j031J3L28O38q67L17K12k24K44r9K79k43o67K03R55J05r28J67K62R9
$$ plain form
2565 -375 -350 82 -515 29 340 -76 282 142 -259 577 -255 15 -414 236 -96 -357 358 174 -218 -272 -437
2586 -437 226 -365 -286 -294 -455 -605 68 -47 57 -168 218 188 695 -309 491 265 -168 284 1 19 -980
2607 -980 -569 -265 -277 164 178 -136 378 -483 -135 32 292 -800 499 1003 -194 352 237 90 268 -304
2627 -304 -140 -342 371 -201 358 -197 -651 -265 108 -9 -727 291 738 -9 1095 -246 101 -391 -227
2646 -227 -506 -193 -19 -732 879 -372 298 -657 -93 -580 -479 195 -644 630 -202 -56 493 -101 -216
2665 -216 58 827 79 269 120 159 -133 -533 115 255 350 257 -406 138 -685 -81 -3 -363 -15 -470 134
2686 134 112 -297 -440 171 -263 -228 104 95 -188 -506 444 -634 33 -16 46 -457 118 -161 -396 -135 31 311
2708 311 395 -636 -623 -295 343 -524 -207 5 -219 25 -74 205 -38 -705 -502 453 558 -370 -203 59 158
2729A58K1P11q81k01O98j075K62k83O53O48P8l44l09j015P34l01J98n03N26o4
2749b89J32J51J24j487J896n02k57Q2M23m31L03j62j92kQ1P2l9L34p9m83Q31J36
2771F42n28L6m37J42J50N55o83k41j91L56O3L62L60o07m84O44j87M18J60j022
2791d92L64J10N00l89K35p17O26K95r25N93M48q51M14Nj56L04j130J157j5j19
2811B57N0o5P0j63R7P18k033J517q58J263m01j054k38J138l17J83J59l24K26l34
2831a09pj31N61n62L19l29P95p54l55O83p6J23q4K65m60j36j09m16J07J252j116
2852e39P31j75K69m50M50k98r0L47n6j35N18o14j77M13L69k64k85L05o60k24M44
2873a21J11j46N94r33j81M65J17j1P20p43N40j31l06k03L66K5O54l65K79p12j09
$$ plain form
2729 158 179 890 9 -192 506 -569 -307 -590 63 711 789 445 136 -879 -145 -446 -248 -751 -225 -289
2749 -289 -157 -6 118 -1369 527 25 -232 -150 273 -158 145 -17 -209 -211 -130 -58 -97 237 158 -325 506 642
2771 642 114 150 -287 -145 5 560 -123 -364 -555 -199 -136 226 586 -21 -505 139 -48 370 530 -492
2791 -492 -128 -18 482 93 328 -389 237 532 -393 200 648 -203 211 216 60 364 -766 391 376 257
2811 257 307 242 312 149 246 964 -1069 448 -410 853 452 -602 -840 298 -19 164 323 -1 225 -109
2831 -109 -116 -247 314 -248 71 -258 537 -217 -572 111 35 158 74 339 -121 -257 -366 -782 -675 577 -539
2852 -539 192 17 286 -164 286 -12 -102 245 189 54 572 -42 -219 194 563 299 14 319 -341 -565 -121
2873 -121 -10 -156 438 -495 -676 -211 -94 -105 615 -128 412 281 -25 -228 138 163 817 452 731 19 -90
2894i0K20j30m50M96K71q95N42J94L17m92K00l18l24L49l42J092m9r38N39J8m54
2915b44PL83l45L75k66K37j87J88M34j82j74K51l76l91Rl04J062j186P43P82r29
2936a13N14k35j40K25k66J0J64K68l75L22l23J26l92L01j81k82M15K39o19L71
2956B9N12j001R01n72q4n54R56k05o86J342q23m45P48p10Q90m15L82l80J49l09
2976b75k30J219p84n73M83K51Q5O9o12R56J13j066M59M71j198M12J4P62o55J62
2996F3J01j92o7P61k12p12Q8L88m36m33Q83j88j052J246k54j17K89K73q98j90
3016f59R24qj142Q14L47J01q62N59N64k7L2q05n2M83o4l55k77M83l14l11P43k88
3038a14N29l04K41j61j345J003R74o95O2l04L02l11L52R3o69N8P84l80L74n16
$$ plain form
2894 -90 130 0 -450 46 317 -578 -36 158 475 -17 183 -135 -459 -110 -452 640 591 -347 192 210 -244
2915 -244 -237 146 -199 176 -90 147 -40 148 582 400 226 477 101 -290 -281 -585 477 -709 34 816 -113
2936 -113 401 166 26 251 -15 -5 159 427 52 374 51 177 -215 86 -95 -377 38 277 -342 29
2956 29 541 -460 441 -131 -215 -769 187 -18 -704 638 -185 -630 118 -592 298 -117 265 -115 34 -275
2976 -275 -505 714 -70 -643 -160 91 176 245 -367 589 702 -364 95 566 -632 -220 -206 556 -99 63
2996 63 164 -28 -95 666 454 -258 -170 218 -218 -651 232 44 -1008 238 -16 -133 156 429 -469 -659
3016 -659 265 257 -885 -71 276 377 -485 74 638 611 643 -162 -214 269 205 -150 -427 56 -258 -569 174 -114
3038 -114 415 111 352 191 -1154 -151 823 128 190 -114 188 -123 229 322 -347 -289 495 115 489 -27
3058b7n79Q40j99J78m89QO83n48M64j15n60P77j081n6O01l40R75j78n18l90J137
3079E83n8q08Q62l39J60k14J54O87j191k85J299n45o04K35n34J33P45o41l35J067
3099C71n00m47O49Q55q23n41L27j39L45m06M07l29O0l75K63L50l34m69P57l08
3119b87J9M80p03M56J92n06N60l96l19P78p6n47K74N64r1p62l22m84J040l43R84
3140E11km04N06n84n24O84o49J97J86l98J61R8k92O50J01J04j75j29j74j059Q84
3161c08N27K04l98J51q7m12O85j23l14L13j388J236n5Jl95M6N34o83O98p18N90
3182A04n02J82o28K95O36m22QR8N49j023J15P10P17j042j72J91L31k91P10j67
3202C99j080N60K59k75m29O3M04J72j03J61l82J29r7O09l33L95r7m46O88n05j47
$$ plain form
3058 -27 -606 234 35 213 -276 -268 415 -133 331 216 -344 433 -648 -704 -103 -443 532 354 -164 -554 583
3079 583 525 -283 579 240 400 186 340 1027 -164 -449 850 305 -299 -64 -598 -465 280 -361 -696 371
3099 371 -129 -576 73 928 105 -436 -109 -248 97 -309 98 -231 -171 -546 -283 67 -267 -736 21 -287
3119 -287 -268 212 -491 -35 157 -349 211 -185 -504 274 198 -349 -75 489 398 -364 -686 -1170 -130 -473 511
3140 511 509 105 611 27 -497 187 -462 -265 -79 -477 -316 -218 -510 140 241 345 170 41 -133 -1192 -308
3161 -308 219 423 25 176 89 -323 362 239 -75 238 -1150 86 31 32 -363 -317 217 -466 232 -486 104
3182 104 -398 -216 -844 -549 87 -335 -327 -229 320 -703 -588 122 839 -203 -375 -184 147 -144 566 399
3202 399 -681 -121 138 -137 -566 -503 -99 73 -30 131 -251 -122 -219 390 57 452 355 -91 597 92 -55
3223e5P03q20L11j83K12K71J5q26L46M21q12K71j00l40J174p02J94J30L25k50
3243B85L13j29r18O63n57QJ03j78M82o07N27k97K18n02O70o6m5P90r76N99r59
3264e76p5J084m08P53k87m31M61p71J11k93P50j45j16L09r15Q83r48J026L72p39
3284D5O90n75N1j15k89j99P12j12J16k58j94j8k94J89Q8L44n65J193q29J29p15
3305f06N49kL52q86N49J93m49j53L8M87M11k57J44l7N65p65j81N69k00r64k12
3326h55R2Q09j37L36k66J02r1q7K31Q6r00M30M19m64k9N47q63O90N38m21k00k52
3348b85K15pj2m95Q03O0J70m53K80o09m4k70L12J51L91N9j25o5n30p5R58M23p14
3371A38K22l04L66n14K92p25Q9L91n22N45q7N27k45n75N20j00l43n0L52j57J25
$$ plain form
3223 -55 648 -172 139 -44 168 439 454 -372 -26 395 -417 -146 -246 -586 588 -114 80 210 535 285
3243 285 598 469 -449 214 -343 -335 -232 -410 72 -535 -8 -305 -87 -589 81 15 -30 760 -216 383 -576
3264 -576 -651 433 25 778 491 60 521 -250 -139 -432 318 173 57 366 -549 334 -614 412 784 45
3284 45 735 160 211 96 -193 -392 320 208 324 66 -128 -146 -440 -251 -163 181 -384 809 -20 109 -606
3305 -606 -57 -59 293 -593 -44 149 -300 -453 -415 72 483 226 370 333 898 133 -48 521 321 -643 -855
3326 -855 -763 46 -91 245 -21 81 -10 -97 134 220 -680 -250 169 -295 -324 223 -640 50 588 167 -33 -285
3348 -285 -70 -77 -89 -584 219 279 449 -4 276 -333 -377 -647 -335 -184 207 266 141 76 -454 -529 429 852 138
3371 138 360 56 422 -92 200 -525 -436 -45 -567 -22 -109 418 173 -402 118 18 -325 -375 -23 -180 -55
3392e5K16m71m88N25l16k20J233N5m54m46J071n98j89N52o13O18p21j08J56N79
3412C26k07p51P71k90O38m53j83M15J85j36j45M51j109K42N02p28J028o20M13
3431C49m5o96J18P35k28j76o46N65J41k94L49o09R36j362Q47l2m89L61M89r02
3451e89P98l5J18n39L53j92M51J98j036P38m27j24N31m51N27k29l03K12M93p30
3471b36J270q95L1n68R1P39o2m96O52M51m97m35L23p26N23l35J21L83n0k5k55
3492DK36l29j51Q53l50j56O65m98n12k24l58M38P84l25q17M73k9M67j00k26L00
3513A45J57m91j07R59l21m6p58N72m02J08L8K84J49Q6L69j246N11K3k01L8m04
3534e37M20N37k5Np04N72L6m48l2K49p89K64L2N43N74q93M21o07O33m03K30k00
$$ plain form
3392 -55 161 -310 -798 -273 -589 -809 424 479 25 -421 650 52 -137 415 -198 420 -301 -409 -253 326
3412 326 119 -632 139 -151 487 34 -149 266 451 315 170 621 -488 -246 256 -472 556 -64 349
3431 349 304 -392 -274 461 233 57 -589 -24 117 -177 172 -437 499 -863 -16 -48 -537 -176 313 -589
3451 -589 209 174 292 -247 106 -86 365 563 -473 265 -162 -286 245 -206 321 92 -211 1 494 -236
3471 -236 1034 139 170 -398 -307 432 370 -126 526 977 480 45 368 -358 165 -170 -49 334 284 259 4
3492 4 240 -89 -240 613 263 107 772 274 -238 -462 -820 -382 402 77 -740 -267 -296 171 71 -155 145
3513 145 302 -189 -296 663 342 296 -462 110 -292 -184 -146 138 287 373 742 -504 7 30 -171 -133 -537
3534 -537 -117 420 395 400 -304 268 304 -144 -176 73 -716 -452 -420 123 697 -196 225 -382 251 -152 78 -122
3556a22M08N24j94m18m93l06R65k8K9l54r6K89q79O73l2L31p92R23l55l89k8k12
3578e56P57L9r4m89K03K02M27r18P21K62j279R76n35k8m5M06n95O68J74o3N37
3599G70o85k43m16K32L20j203J031K96rK95n69K26n62L19j47Q46o79M76P14j006
3619FM65o61K71k93j54P73k44M04q6k52j69n42O81o71J93M2P95k4q68L89p15M25
3641b35O43o76M92j46K7m42M77m57P21l27q18R28l00l63Q31l97L2j23N06p8k61
3662C4l10R8M40m65n88P57p18J166k17J97n55L5nl73R09m52K97K83o47L41o54
3683d27L07j12k22O16K07o80K03J65j99O3K62o31O81n11M2J99R78j140P25k55
3703B71n43N24o42N7m59J259q13J042r76J1k81K50L38q40Q87j85L2K45m17k65
$$ plain form
3556 -122 286 810 616 198 -295 -601 364 336 365 11 -85 204 -675 -2 -34 297 -495 428 73 -316 -344 -556
3578 -556 201 240 146 -343 -140 62 489 -429 292 554 -725 251 -284 -312 -357 49 -546 122 296 233 770
3599 770 85 -158 -574 -342 -22 -1225 -194 102 93 388 -181 45 -517 -198 -345 501 -178 298 1012 6
3619 6 471 -190 81 -212 -366 407 163 567 481 229 60 -482 199 -472 -279 -237 558 534 -334 55 -660 -235
3641 -235 408 -268 224 78 105 -337 140 -317 404 77 -741 187 -113 -476 355 -42 -10 -133 373 295 34
3662 34 -276 -178 262 -203 -791 -34 -752 414 197 394 -161 -126 -131 -504 405 -47 250 533 -114 227 -427
3683 -427 -120 -232 -454 162 369 -311 -108 57 -142 -79 183 -448 233 -278 -236 -37 941 -199 526 271
3703 271 -272 252 -390 -333 -792 467 -346 696 -280 -269 -550 -300 38 -802 85 -100 -68 177 -240 -505
3723e05J051m06K71n16j93m44M85K31J178j388M10k3o18L20k8K68q77J050k11
3742E5m39M12K29j25J95m26p98R76m6K45p55O33n37L34J3M23l96O4o15P12j3n34
3764c93O36k99K25o7r5K13k63n8L7m93L81l90J83M85k7k2j2j23L36p53N61j57
3786i5P33r48R3Q75O06j419M58l66j68O29j31o64R99j94o23L18p49N54J28Q5J48
3807B69m3k55N81k46m3j09n4J42p19J37L87J87k51k5l3O85j077J50N94J09m33
3828d7N73m30n17P71q11L45jK46n4J48k95M24j33j60l0J61M30m86n31Q26p89Q47
3850D87j6L77j519O21n83J293o09L43k52l40L29k94N51J11o58M75M31j696J65
3869g84L18J006q35O0M87j194R52K53j40j65n12J291j143K39j00n7j47M04k47
$$ plain form
3723 -505 546 140 411 -105 -298 -742 -257 -26 1152 -236 174 151 -467 -147 -175 93 -784 266 55
3742 55 -384 28 257 132 327 -99 -897 79 33 278 -477 156 -381 -47 -34 389 -7 57 -558 154 141 -393
3764 -393 243 -56 169 102 7 220 -43 -101 -64 -557 -176 -566 -383 102 75 53 41 -82 254 -499 62 -95
3786 -95 638 -310 -217 658 1264 -155 303 -63 -231 398 267 -397 602 408 -215 103 -646 -92 36 121 269
3807 269 226 -29 552 306 263 154 100 242 -477 -340 47 234 -17 -42 -75 610 -467 -317 277 386 -47
3828 -47 526 96 -421 350 -461 -116 -117 129 75 223 -72 352 219 59 29 190 620 134 -397 429 -360 487
3850 487 471 848 -671 -50 -633 660 51 394 142 -198 131 -163 388 499 -159 316 747 -949 -784
3869 -784 -466 540 -295 -235 252 -942 10 263 123 -42 -554 737 -406 -167 -267 -324 -471 -67 -314
3888c14J4O07n93k96K44k4O38j72k01J65j19p4l63R25o51L77J45l50m08K99o3
3909b14Q11q69L81q71J718M4j109O85J33m81J93l35K72L13k20Q3k96l19J60K56
3929C35l25M59M3M4m01m68L6j82N06m67J96R7p75Q54M59j33N15q30kp2k27j56
3951d94P56l17K03l51L41n22J148q03L89J78l35p59P1K92m63L74K29N08j061N20
3971i6L14n06J87L92n53j88J033l02j165J066m72M93pn24J31q59O40O4P07p4m34
3992a53q41O73O28j130O02Q8K44Rk70j98n7K29l10K26J87l23L92m68K40m55j51
4013h38J073j83L33j005J198j74m6O0p18P78p92N94n76k13O77K09k71m40K80K21
4033A67O0K42k21m27p17J560r00M19q8rn21N96J23k32l32J31l32K5M70n9m72Q54
$$ plain form
3888 -314 -300 307 -286 -582 -338 -362 276 104 -97 68 -51 -125 -488 437 -214 163 308 -42 -450 -151 -214
3909 -214 597 -272 109 -762 956 1000 -109 576 709 228 421 86 358 671 451 534 238 -81 79 335
3929 335 10 469 512 556 155 -313 -277 -459 47 -420 -224 -127 -902 -48 411 278 793 -37 -39 -111 -338 -494
3951 -494 262 -55 148 -203 138 -384 764 -39 350 528 193 -566 -495 -203 -666 -292 -63 445 -616 -96
3971 -96 218 -288 -101 291 -262 -450 583 281 -884 182 -290 203 196 -328 -197 -1056 -416 -352 355 281 -153
3992 -153 -994 -321 307 -823 -221 -133 111 120 -150 -348 -405 -176 -486 -260 -73 -396 -4 -472 -232 -687 -838
4013 -838 235 52 385 -620 578 404 358 418 -300 478 -314 280 -296 -509 168 377 106 -334 -54 167
4033 167 227 469 248 -179 -896 664 -236 183 95 86 -435 161 284 52 -280 -149 -481 -456 14 -45 -517 337
4055C37q16O89o0l80L8R9k15O51J22k43K21j011O68J28k82L1k11l05L96O96j06
4076D47o39k29L22j94J44K89l2K80m80N20l09k96M4M77N9o23j58Q99q47J109j245
4097d62N90J36q50O70k51j82M88O5l40J30J01k2J66p59K16M98m20L05N7n47P42
4118C31J51l0k09l0J17p9l59L78l18K7j40K55k15N34m35j99K22L29j95q8l16j22
4140c91J33K01k91K8M90J40m50L12k92j01m9o7K12n4r2o8N6M15o97P20k65l02
4162d12O11P34o31J31n0n36J27N5L70l59k84M75jR9j71o21J84N92o11M84n50K40
4184a24k64Q6j06J197l92o69P63l99K38J8k17j63j04j42N24o07k67P89n60K55
4204a44k06P79n25k94J82K73J03Nl25k38P10p06j17j29N68Q56j008K72k29k46
$$ plain form
4055 337 -479 210 150 -230 -192 -93 -308 343 465 222 443 -568 100 228 -54 -23 -234 -539 -143 553 447
4076 447 -192 -421 -99 -293 -149 140 108 388 -92 428 119 -177 -133 344 403 -220 -378 521 -326 783 -462
4097 -462 128 264 -586 84 -167 -349 139 204 -136 -6 95 73 239 -520 -304 194 -226 79 136 -411 331
4118 331 482 452 243 213 330 251 -108 270 -48 -21 -161 94 -121 413 -22 -221 1 330 135 47 -269 -391
4140 -391 -258 -57 -348 -320 170 310 -140 172 -120 -221 -270 -337 -125 -179 -271 -339 -283 132 -565 155 -110 -412
4162 -412 199 933 302 433 383 -153 -26 29 399 40 -244 231 230 329 158 -463 -279 313 -298 186 -364 -124
4184 -124 -388 -302 -408 789 397 -272 491 92 330 348 131 -32 -136 -278 246 -361 -628 161 -399 -144
4204 -144 -350 429 -96 -390 -208 65 168 173 -152 -390 320 -386 -503 -632 -64 792 -216 56 -173 -419
4224d19o54N99J97L62K58r7p1n67J46L74K28p42J13n6K28K21K37N98k28j422J103
4245D08o80O23l75j5K14j74o7k94L54K3q78Q17j87J70j86l07Q91l17L33l37r9
4266h3N09m94l74M68M63K51j023M28m55k24r7M19J80n6k25j00N62n53J25N82n76
4287b73L51m30Q50p22P06l88l33L77k73J53M96n63P09o07L75j14j315P96J70N3
4307A8P8M69j20m69q13J17O36P5N44m11k79m91P36j15k34J47k32K60N2n65J131
4328E34j96o51N83k0l81k43Q51q26O50l10n92L73L27m45l37R19K17m62J5K36M18
4349F60j311P87M0L43K55j040M46P0m45K39O90j418O04K71o27P27q51j40O18P7
4369eL73J26q44J47K86j1J98J28L37j090M77K84l37K03J90j99o20O84J04j216
$$ plain form
4224 -419 -1073 -474 -277 85 343 246 175 -392 -246 128 356 -386 -273 -329 -101 120 357 955 727 -695 408
4245 408 -272 351 -24 -39 175 1 -66 -360 -6 17 -861 -44 -231 -61 -247 -554 337 20 353 16 -83
4266 -83 426 -68 -442 26 489 740 -283 145 -310 -534 -631 -212 -32 -88 -313 -413 149 -404 -279 303 -273
4287 -273 78 -352 498 -224 482 94 -239 138 -135 18 514 -49 660 53 428 314 -1001 -205 -35 18
4307 18 96 565 445 -24 -837 -720 -84 -9 535 124 -155 -646 90 -25 -259 -112 -344 -84 -32 -597 534
4328 534 338 -313 270 250 -131 -374 477 -349 301 -9 -601 -228 99 -346 -683 236 453 -9 6 242 660
4349 660 -651 136 176 519 774 -266 180 250 -195 44 734 -684 -80 191 -436 291 -560 -700 -82 -5
4369 -5 368 494 -350 -203 83 72 270 398 735 -355 122 406 69 272 462 263 -357 327 431 -785
4389g85R79m90j52Q45j126J055n62L80L81l23k92o03J271j049P19k69k43j52L52
4408f4J27n67J66O04o50K89J61n38N78n27J09O40k96j66L2J54P98j568P49J18
4428A49j264J200j88K32K51j10n71N80k26K24m0j40n50O10K16M32p28J40q25M42
4448a66R57l39j282Q21j02O0l27m54J425q19L83K44o61P92n02j4j61Q0Qj6r7K45
4470G5P29j053j4P48p46jO97q9o33J71L06j39R3j83M06k53l08O70p44N96m55j5
4492a42N08o31m43P80k11K1k47K54l62J020o55L39l02m44N7L36q8p1M27n39M59
4513F6L09K64n21J5m1N26o76q27M39O69O34l67q67N33l73m22Q09j08m05K79J37
4534G3P0j02k78K14J24N08p3j84L39l00q42N89l85l31L66M29r62J025n57N52K80
$$ plain form
4389 -785 194 -296 -448 397 -729 326 -236 144 525 202 -90 -693 578 -471 248 -21 -264 -416 -64
4408 -64 63 -504 -338 266 -384 -95 66 -472 106 -421 -312 328 32 -134 -102 52 850 -718 31 149
4428 149 -1115 85 -103 129 380 270 -301 279 53 277 237 97 -453 157 373 805 77 217 -608 -166
4448 -166 791 452 -830 -9 -111 -51 -378 -832 593 -226 157 401 -260 532 30 16 -145 -65 -57 -73 -170 75
4470 75 804 -249 -263 485 -261 -262 435 346 -287 -116 190 51 144 -39 367 114 -194 476 -268 328 -127 -142
4492 -142 366 -265 -708 72 -139 -118 -365 -111 -473 547 -108 231 -71 -515 -458 -122 -210 -281 146 -393 66
4513 66 375 639 118 133 92 618 -58 -885 -446 223 857 490 -377 156 -217 -639 170 62 -343 -64 73
4534 73 143 41 -237 -23 101 609 536 352 691 391 -451 138 -247 -578 -212 217 -745 280 -277 275 555
4555E55K91o85l44L83M90k34p84J83k42K15K40k64P51l08K94r57P20n06J51r04
4575i55J067p4q09N21M24n43o7P90m22O8J91o20J26K55L36q8J8p74J224j725O32
4596d25O90N2k82P50m72m93L13o92L22J63k65M5N33p4m73M65j80j49M57r35O8
4617e82j1N6R27K01j82o68N70L12m02J21M36m69k4q74Q21n74J25L30o15LP33N75
4639H09n92R7o27O39k17l46k65N84j62J90n15O23j9j80K62l63j14J44m9k72Q62
4660D89p56k75M62P42j231O92l16K23O26K68r99J03j011J165j48l44L68l09Q9
4679a62M97j198Q72OM55j046P79K72k43l9n44O59K38j56P6k01j49j2l89O38o33
4700b80N12m02L92M96q57j56N42j89M09m59n19L87k21M9K15q49M14k54M35O00
$$ plain form
4555 555 846 161 -183 200 690 456 -328 -145 -387 -172 68 -196 555 247 541 -416 304 -202 -51 -955
4575 -955 112 38 -771 -250 174 -369 -436 354 -68 0 191 -429 -303 -48 288 200 218 -556 668 -1057 -425
4596 -425 265 317 35 785 313 -180 133 -559 -237 -74 -339 -294 239 165 -308 157 -23 -172 285 -650 -582
4617 -582 -593 -537 390 591 409 -259 311 623 221 342 778 309 285 -589 232 -342 -217 113 -502 -499 234 809
4639 809 217 314 -313 326 109 -237 -502 82 -80 110 -405 218 199 19 281 -82 -196 -52 -101 -373 489
4660 489 -267 -542 -80 662 -569 123 -193 30 656 924 -75 28 -983 182 34 -310 58 -251 -162
4679 -162 335 -863 9 15 470 -576 203 475 232 193 -351 308 546 390 466 265 116 104 -285 353 -280
4700 -280 232 -170 222 718 -139 -295 247 58 467 8 -511 -124 -345 -296 -81 -930 -516 -770 -335 265
4720B65l22R8L35j27K24l60j152R19J35J70M1N6j137M54J295j149k37M14q0r6
4740b54O45q44J086l67m59O14m47q9O42j200J064K6L32o37o77M53n34L09K67l55
4760d25L77L28m59O8N37j210R24km18L07K47n1n7n26M39J37q45O04l90J53M18
4781A56l38M00r18J068o10m6R87q73k2n1N50n09M56J36k93j34K23M33j088Q97
4801D24j69o99N62N3O63j348m7R27n05k86L16J39m63Q42k05R6m99O75J24l15q3
4822B02m15m62R88o1m32j6l1O6J90l19N92o14R6L41n63P04m03L3L40K07n98J23
4844c2Q5R0r7j24l41R76q36O91j136R08l72K51N59n88n59J175j216L29k27N38
4864G4M49K37n19m59O13r01K02R09p93P65n95l05K64M20J74k42J20k15r5R3o60
$$ plain form
4720 265 -57 41 376 249 473 113 -1039 -120 15 185 226 282 -855 -401 894 -255 -492 -78 -158 -254
4740 -254 391 -453 633 266 -193 421 -26 -115 527 -673 391 417 749 112 -565 -112 -646 -337 -70 -425
4760 -425 -48 280 -179 -111 426 -784 140 138 -280 27 274 223 166 -360 79 216 -629 -25 -415 -262 156
4781 156 -182 218 -700 368 -242 -288 699 -174 -196 -247 303 -206 250 386 93 -41 182 615 -473 424
4801 424 255 -444 118 171 834 -514 -561 366 -139 -425 -109 30 -433 409 204 300 -199 476 600 285 202
4822 202 -213 -675 313 252 -180 -196 -227 -161 29 -290 302 -312 -216 125 -438 266 -137 -104 236 443 -155 -32
4844 -32 53 143 46 -78 -419 557 -279 412 -724 184 -188 63 622 34 -525 650 -566 -237 -464 74
4864 74 523 760 241 -218 395 -506 -304 605 -188 577 -18 -323 -59 361 535 293 413 198 103 196 -464
4885d64K42O83p01P52n0K26r78NK95k64j6J030q39P1k54M00n74M64j82L20o68
4906e02Q42n29l2j46L42l23M10m60L4P47r15K31M68K31n00l93K58l7J55L68n06
4927b57M04M0R3k18k2O01m95n28m9N37j1l25j05J83J67q65N84%M33q0p5l07Q85
4950E90o93q0Q31l51j62J67L2l98J026o95p86O25Q00r14N78n8k42j55o41l60M37
4971d49O35n53j79K71j09N11m50j36m8L84k95K03n1M36m78M10M3k26L12m70M79
4992B40m21J22N0k14N74r4R0R9o50M46J61R3p30p9O33m32L55N1q31P2P28q52L15
5015b74N68j70m89K39m07P88r87N64l86M87o70O96M86j395J144j85M8K33K94r68
5035c84N72j0k6k73q9J70J11j49L06M96m23j55l07J01j24J32J09k52L06ml95P38
$$ plain form
4885 -464 -222 461 -240 512 462 688 -290 -285 10 -254 -270 760 -79 -8 -262 138 -436 28 -154 166 -502
4906 -502 340 -189 -221 -367 -25 -348 62 -398 -364 383 -532 -301 167 398 -102 -495 -237 -274 -119 249 -257
4927 -257 147 187 280 62 40 641 146 -382 -431 106 95 -230 -335 -152 15 -850 -266 -266 167 87 12 -295 590
4950 590 -103 -183 648 297 135 302 334 -64 962 267 -519 106 906 -8 570 512 270 115 -526 -886 -449
4971 -449 186 -367 -546 -275 -384 127 -323 -459 -507 -123 -418 -215 -266 170 -308 102 145 -81 231 -239 240
4992 240 -181 -59 -9 -223 351 257 347 446 -204 242 403 496 -234 -313 320 -112 243 294 -537 -465 263 -589 -274
5015 -274 294 124 -365 -126 -533 255 -732 -168 -554 -67 -737 -41 445 -950 194 9 57 290 584 -384
5035 -384 188 178 152 -121 -210 -40 71 -78 228 724 301 146 -161 -60 -184 -52 57 -195 111 107 -288 450
5057D50k77J7m80l8J73Q3j22l55L31L39M07j188P92l22j44O52l91n9M61p54O91
5078B66m44O19o37j63L71j12q3J24o56J057q05M26L71k00l73P68j030M91j45N26
5098C71j066K05M51M8K43K47mk88j46n34K08N59o74J90M73L26q22q7r5Q17n29
5119a07K0K61o15R78n28P0k31J77l39M70l7j029J126j67J88m10k6N40l83K50o85
5140d77R33j011m13J068K91k83J98l64O88l61l96L7m31R42k65k90N55q38P31J93
5160E07K22j175P33q9r86J202j31j68k91M15o22K59j86P46K4j229Q93m10L57j61
5180i0K09o05O34j61J49kq41R85J65K9p66K1L71j44K52K9o75O48m32k81K82l0
5202b53L94j39N50j020P98K33p77M82p06J076m51K11k25m75p7R82p40l38R4P99
$$ plain form
5057 450 173 190 -290 -328 -155 -72 -194 -549 -218 121 528 -660 132 -190 -334 318 -73 -132 329 -425 266
5078 266 -178 441 -196 -359 12 -100 -183 -59 -715 342 -463 -37 334 134 -239 529 -501 -10 -155 371
5098 371 -695 -490 -39 9 252 499 495 207 61 -473 -265 294 -380 -190 283 609 -213 -300 -395 422 -107
5119 -107 -87 174 -441 537 9 79 -152 25 -314 156 119 -910 216 49 237 -173 -199 341 -42 208 -477
5140 -477 456 -555 -968 100 391 108 306 -58 630 269 -127 -90 -521 421 156 -134 421 -417 314 507
5160 507 729 -446 287 198 -788 414 283 115 -176 239 -383 -124 -310 436 460 -769 124 -286 71 -90
5180 -90 119 -486 148 -13 136 134 -707 278 443 472 -294 -273 98 -46 206 235 -440 208 -224 -505 -223 -253
5202 -253 141 2 552 -468 330 563 -214 268 -438 638 187 398 173 -302 -379 603 -137 -475 -381 418
5222D18n37n67J019q21N33L4j02K12Q7r66K73N09K65m50K79p9k62j37O88K94k42
5243D48l75j80K07J75r63M85o6P07J90M67q14o04M90r4K8m56J38o5L15q93O96
5264a64j70l36J5K08L04J70Q5l98K5n01L39L26N44n75L20K80l27m79N63r18N76
5285a13l37O40j32k74O21j44p44J3n02R05O15k68n09j82K86n11J42N53N2p31N41
5306g9K01j45l67P29o93Q7O54J10j87J17J9n40j30o3O23o72M55p3j58J14J40M20
5328E62p02n39R00n13N56l77N4N34N26n37r73J51M68L78o26l25K96j94R12q67
5348c16L75N24r99N42k56J96Q9m2q9O24q53N18o58P53k80p5k34PN54r88k14R73
5370A51l18K35r4j03L59o6Nn13J13O32r88R99L19j522M42J68K64L04J06r30R68
$$ plain form
5222 418 -119 -686 333 -488 45 79 -23 189 276 -690 -417 92 357 -93 186 107 -155 -292 396 690 448
5243 448 73 -107 100 275 -688 -203 -269 438 628 1095 281 -323 167 73 101 -355 -217 -282 33 -860 -164
5264 -164 -334 -670 -655 -447 -143 27 112 -286 -261 -762 -423 -97 447 -128 192 472 145 -334 229 -689 -113
5285 -113 -450 190 58 -216 405 261 -483 -470 -972 -67 548 280 -229 -411 -125 -636 -494 59 111 -620 -79
5306 -79 122 -23 -390 339 -354 -267 387 497 310 427 446 -94 -224 -287 336 -336 119 46 -112 2 142 562
5328 562 -140 -679 221 -292 264 -113 -59 475 1001 464 -509 -358 110 488 -138 -463 -167 -361 551 -316
5348 -316 59 583 -416 126 -130 66 155 113 24 648 -205 313 -345 408 128 53 -181 -174 380 -608 -822 151
5370 151 -167 68 -26 -129 230 164 169 -344 -231 401 -587 412 731 -791 -349 -181 83 387 493 -437 531
5391E31p39L98j181J431p29J30J76l45pM78j77k99O56m24N02j110J264l20m64
5410b29j77L71N34n50N12J68j220Q37o40J87o12Q38O40m44n34Q58r10N41O90k49
5430F11n78m2Q38o31K25l99p81O29N28m63O31o01l40j49N71K25L89p51O00q65
5450c53K22oM60p80M36k61O94j55o89j32N57k94J271m59q88K83Q08j370R15k12
5470D7K03o5M59j148O19k22k94K91j77O90K08k20p10R38p4r13K25K73j08J12j09
5491B5Lj76K71O20j195K90o59K81m84J384j32j76K01o36P00n22M17m49K22oN30
5512E09l24n21j61P2K42j12l97Q45J44l44K32j21J26np4N11m92j19J27q76N65
5533a73L85N75n20j338J293M8N62p72R1J66k6p06K41J31j2J69n52J027p83N01
$$ plain form
5391 531 -208 190 -991 440 -289 -159 17 -328 -335 143 -34 -333 323 -101 401 -709 555 235 -229
5410 -229 -406 -35 499 -51 461 629 -591 246 -394 -207 -819 19 659 215 -319 539 -371 170 860 611
5430 611 33 -9 829 198 423 24 -757 -128 400 -63 568 -33 -373 -522 49 274 663 -88 512 -353
5450 -353 -131 -137 323 -457 -21 -282 412 257 -432 -564 -7 -301 970 511 -377 -94 714 -656 259 47
5470 47 250 185 644 -504 115 -107 -401 -110 -287 403 611 391 -319 619 545 -368 -143 130 22 134 25
5491 25 28 -148 123 743 -452 -162 -821 -540 -1024 360 228 52 253 -383 317 -205 212 -237 -15 -21 509
5512 509 185 -336 -497 -425 -183 -295 -692 153 297 -47 185 64 190 185 111 622 130 11 138 -738 -173
5533 -173 212 787 267 -1071 222 270 832 60 151 317 291 -415 -174 -43 -55 114 -438 589 -194 307
5553C07l77k62O75L64n24j5M13r54O99n32k67N74j20l3P70J43o95l37K18k6J57
5574A78n64k55P45M28j447O67M40j238J046m89N52l77l63P0K52p90J046K88m81
5593b92M81j92m20K62J16j18n49O67K10L7o9k29m14O71m38L99j93J65j70j92L61
5614I3j50K63n68K80j15L26K17r27N78L96q42L25M03J2j66o10O0J81K62j05M34
5635C47o38L97K56k68j62k62J73L31l3N70o96q45J078p96m29O56K36k82j41N40
5655C2L0l99P97k22p5k15j51o4k30O66K56k24o85P88K7k41j57J26l12N48k46l95
5677c46L1J017K31p29m58j8l93J838o85n9o16J95N47m93n24L07M88j42l44J29
5697b4R0k47j06J05Q26p54O08j32o67P04n73K41m70L23j38O9K9m80J23k17J23
$$ plain form
5553 307 -70 -332 343 707 183 168 581 -373 326 -206 -473 101 -19 -52 718 861 166 -171 47 21 178
5574 178 -386 -641 104 532 -915 -248 192 -1046 0 -489 63 -314 -677 -607 -355 -1145 -99 189 -292
5593 -292 189 -3 -423 -161 -45 -163 -712 -45 165 202 133 -96 -510 161 -277 122 -71 94 -76 -268 93
5614 93 -57 206 -362 -82 -197 129 346 -581 -3 393 -449 -124 279 291 125 -485 -425 -244 18 -87 347
5635 347 -291 106 362 94 -68 -330 -157 174 141 711 15 -830 248 -548 -977 -321 -85 -367 -508 32
5655 32 62 -337 460 238 163 -52 -203 -267 -497 169 425 201 -484 304 331 90 -67 59 -253 295 49 -346
5677 -346 -315 702 933 204 -254 -272 -665 1173 488 429 -187 8 555 62 -462 -155 333 191 -153 -24
5697 -24 66 -181 -287 -182 644 -110 498 366 -301 403 -170 71 -399 -76 -214 -145 -116 -596 -473 -690 -567
5718e67Q06j59m29P44l15J93k10m35K24j99m39J424p58M47k10M4M81l44p87N91
5738A02K64j71q63R88Pj91j95K37o60M41J76N8r8m2j17j23K54j07K9K83l51j075
5760a154J507m0n90L87J51j74K67l73q0r1O3O75p54N76m79J16p42P14k2M29n48
5781a62J20l06NQ00p9k25l08j97P68j505R86M48n01L90l35j89j63M54K78n76L92
5802I5N15r81O92o33J51M51o05K42Q35j131M09J90m5j43P03q04r76J740m75m85
5822b55L52J69j39L47L36o05m23j23R18o58l80K04p39J457o86M98R5r37N41K41
5842B13M36j035L92l81K21O9P72l85j52l51L37K49m93L9o1n60N77n70P35K23K79
5863E54j142N1Q02k93k86J9P41n27k5K85q47R5L04M43j0n63L74P8l03K69m35M7
$$ plain form
5718 -567 239 80 -349 395 80 273 63 -372 -148 -347 -786 638 -120 327 117 161 642 298 -489 102
5738 102 366 195 -668 320 327 136 -59 178 -482 -41 135 193 95 53 -64 -187 67 -40 -11 272 -79 -1154
5760 -1154 353 313 -277 110 261 87 354 -19 -99 -190 -127 548 -206 370 -109 7 -735 -21 -43 386 -162
5781 -162 -42 -348 -343 457 378 153 -155 -352 416 -1089 -103 345 -156 234 -101 -290 -453 1 279 -297 95
5802 95 610 -371 321 -312 -161 290 -315 -73 762 -369 40 230 185 42 745 -59 -1035 705 230 -255
5822 -255 97 266 127 474 810 205 -218 -341 577 -81 -461 -257 -996 461 -225 273 368 -569 -28 213
5842 213 649 -386 6 -375 -154 -85 687 302 150 -201 136 385 -108 -69 -130 -690 -113 -683 52 275 554
5863 554 -588 -537 265 -28 -314 -295 446 -81 -106 179 -668 -573 -269 174 164 -399 -25 53 -250 19 -416 -369
5885c69N30k25n0N31o4p06L20j192J335m7l8l94J52N3j97J157n69k50p2o7K14
5906E2J94l85K01j035J214q7k88l19P17l13n47Q40R03q56j9K45j002L64m23M96
5926d8l2P75r94N15O90r11o4j44P18n08N85K42j269M19K47m43l7R9P02q17O40
5947C65k3Oj5L28l74l7n73O97m41o26N61O6J51K33n1p18L30L43Lq55O99k15k74
5970d20Q06N83j134Q1n4K29M12r05Q96k28j60j74n67L32m77J065p4p34O01K24
5990C02L87r81M70o2m58N84m19n63P69J69k5m91l89R39p13K1K77j10R20q48K53
6011C2J8k15L94q00M70L43J027o68l37l1L45l02k04p23J68M73n53P72k5j54n58
6032e28P14k76J66o10M39K49m83O06o44L90n19Q20k10J88o79L51N14k86l4j42
$$ plain form
5885 -369 161 -64 -114 417 353 -353 -33 -1225 110 63 25 -369 -217 -164 -361 796 227 -23 -95 -162 52
5906 52 246 -139 62 -973 241 154 -134 -453 264 -49 -596 244 1147 291 272 517 -485 -121 -544 -48
5926 -48 -80 695 -299 216 906 -5 -69 -213 505 -3 582 824 -445 -26 221 -222 -259 -160 542 -275 365
5947 365 342 348 333 661 287 250 -323 374 -67 -693 -132 -66 85 318 267 -451 -121 222 225 -630 69 -146 -420
5970 -420 386 969 -165 -84 -138 91 503 -402 494 266 106 -68 -635 -303 -780 285 211 -523 78 302
5990 302 689 -292 178 116 -342 242 -177 -740 29 198 173 -318 -707 232 -481 -460 -183 -293 627 -221 32
6011 32 50 -165 229 -571 -101 242 1269 601 264 233 578 276 72 -651 -483 -10 -563 209 184 30 -528
6032 -528 186 -90 76 -534 -95 154 -329 277 -367 23 -496 324 114 302 -377 -26 488 202 168 26
6052B6k03N70q11M41J31M87p95O8J52K62n29J29j02K00J6K49r6K1l30K54j34L06
6074C12n63N24r99P55J3l43K05n73O55n33K17m64P52J11M55m39O5m0J98q1k53
6095b6k86J072q89L84j36o46L38N23p87R82j67o95N64M82l53o90n53J500l40l11
6115c4l21N05M53o33J51p7K79l00P8o67j21O63R7Q24k97n03L52j82N62r15O78
6136E92l02M59j003J86J25J48j30om14J9R47o45N9k48J77K88r6o57J091j38l98
6157E4o6k92J38M63K2k59n86N61J39l21L25l09j37L2K70L70o39n4k03Q24j41l33
6179a42J79l67R02p63O4N98j19pJ2m18M62q51P47oj52p79O99o94M06O54m50PJ33
6202A15m92N23m79K56O46j347J441N0k41n23j82lN93p18L91L89rr82J90J5L28
$$ plain form
6052 26 -177 393 -418 23 154 641 -154 -86 66 328 -201 -72 -174 26 42 291 195 216 -114 140 6 312
6074 312 -251 273 -726 29 42 -301 -96 -669 -14 -547 -330 -794 -42 69 524 85 150 110 308 227 -26
6095 -26 -312 760 -129 255 119 -527 -189 334 -453 529 362 -333 231 713 360 -330 -883 617 277 -34
6115 -34 -355 150 603 -30 121 44 323 23 101 -566 -687 -24 73 897 600 97 449 267 829 -86 592
6136 592 290 749 -254 -68 57 205 75 69 -345 -326 621 -24 35 -213 -36 252 156 -501 590 452 54
6157 54 -12 -304 -166 297 319 60 -526 35 174 -147 178 -131 -268 -236 34 404 -235 -289 -492 332 191 -142
6179 -142 37 -330 572 -191 -127 471 352 345 357 -61 401 -450 297 291 139 -640 59 -635 -229 425 -25 -18 115
6202 115 -377 146 -333 -77 569 -778 663 713 472 -51 -233 -236 357 -361 30 419 410 -572 -382 -367 -39
6223c9k40j70K02J13k9N22M25j343K33l37J067N7j95m62K83k85M10R8o18K86l77
6244c99J02L1L14m6k31j36P30k20k88J11j82n28N06J21l24L66RJ00p59J229j026
6265e20N56l14k61O8P45q16R59o26j63M88p14N00J76k58k30j74J084q74P22m49
6285a01k88P76N4j200J367l62q47P38l60K02j24L74l11K39N0j25k25l72N27j63
6305a51j5L48k60M98o80O99q37J76L27K03l75j8j09l88L24J12o21M16M47n37J28
6326c13L13J204j109j97k87N40M91p22M09m22O24m86l60m16L68J16N7k05j39M95
6346c9M43l62l28N7Q10j87o20K16N28p10k49M01j3n89J145r41K56P44q12R50o56
6367D4q31J428r76P99p17j7k87L40j84J73L83J45k86j39J8o0K82P22q67o70O29
$$ plain form
6223 -39 -279 -449 -247 -134 -163 359 784 -559 -326 -663 404 461 266 -196 87 -198 212 310 -308 -22 -399
6244 -399 -297 -266 48 2 -229 -365 365 145 -143 -32 -214 -742 -236 -115 -439 -73 -64 36 -723 506 -520
6265 -520 36 -278 -539 -471 274 -542 417 -209 -372 116 -598 -98 78 -180 -410 -584 500 -374 348 -101
6285 -101 -389 387 441 -759 608 246 -601 137 -223 -21 -145 229 -82 157 207 82 -143 -515 12 -151
6305 -151 -166 182 -78 420 -260 439 -398 -222 105 308 -67 -85 -194 -582 -258 -146 -767 -351 96 -441 -313
6326 -313 0 1204 95 -102 -389 151 642 -80 329 -93 531 45 -315 -731 -363 -247 -190 -395 -534 -39
6346 -39 404 42 -286 -229 581 394 -226 -10 518 -192 -441 -40 -53 -642 503 -438 -182 562 -250 700 44
6367 44 -787 641 -335 464 -253 -270 -557 -217 -401 -228 155 300 14 -125 -107 -167 115 837 -30 -700 -71
6388g1N8P63j261K32J238o35Q2j28K93p73N14R2k48o09R66J49m94J3o57M14n5
6409a17L73l44k79L33k23L08l82Q22k61l33P39j385O45K15L87l23q3J84L86k85
6429C77p0K51n54J62L1l78J61n57N12n6r6j09K22K26l97J71j39N1ML34l48m96
6451f98O74K3J25L8K54o50K57m01L04N87j34k52j69n91O98l13K55q5M8k3j1J188
6473A124j691P16j10j86K42R0J37n48M68k14k64L68K21K01l19n63j57N55n83j58
6493f71L95j26q1P35n27J36J034r10m36Q80L0k59K21m49m6m10P94m52L82l00j70
6514b30K30j55J62R36j048L91q17M99N69l89l62j18Q46n2q92R79r4o42K46K00
6534B59r66Q43q7n7j68J84m6m46N06r00J131m55N78j95O5j13l49M76L2k66m21
$$ plain form
6388 -71 -13 750 -511 -279 959 324 406 278 571 -202 312 404 156 -453 513 662 168 181 -476 -62 -117
6409 -117 256 -88 -367 -34 -257 51 -331 491 230 -103 636 -749 -104 111 498 175 92 276 662 377
6429 377 307 558 4 166 197 -181 -20 -577 -65 -121 -217 -326 -104 122 -275 -104 -243 -192 -188 146 -202 -698
6451 -698 -24 -1 124 162 416 -234 23 -378 -74 513 379 127 -42 -633 65 -248 7 -78 -30 -53 -64 1124
6473 1124 -567 149 39 -147 95 185 322 -226 242 28 -236 132 353 554 235 -328 -485 70 -513 -671
6493 -671 -276 -402 -483 252 -275 -139 895 -15 -451 429 459 200 421 -28 -74 -484 310 -142 240 -60 -230
6514 -230 0 -155 7 943 -105 286 -531 -32 537 148 -214 -332 514 462 -430 549 455 -187 59 259
6534 259 -707 136 49 -8 -176 8 -38 -484 22 -878 253 -202 376 181 246 133 -216 260 292 26 -395
6555c95k37K21K4N83M12L9m04k04K42O0K19r43L18L23k75k7n56ON19J07M29l91
6577G0O3k36j58J56M30n38L79l4L61p50N94L24n61k31J26pq09P73l39J11M3J057
6599H24n01o78M24l55K57k04M2K82n0L42j327J136r68J111k73k63k4P2N3l12K50
6620a62n67J093j030J072j52k5P07j347J35M63k64L27j40o2k43k08L34l09K25
6639a53J24M9N7j84L60j29L21J46r14M57r91J231k26J10k21L56J0k26K11Q3l76
6660I5m60Q47k06j91K81J67j156L70Jj81K97o54J93N36Q9J8J21k69L49k93K52
6681B06R3Qm43p57Q72L43o33J25K82N71k076J505L11j44l29P50r69Q03l45K75
6701D48o84k3N21m54R93j16j104M5j08M64J22p80L18K51N41l80j19M71n91P53
$$ plain form
6555 -395 -632 -411 -387 196 608 647 243 39 281 341 560 -383 -65 258 -17 -44 -600 -594 -75 32 461 70
6577 70 133 -103 -261 -105 325 -213 166 132 493 -257 337 661 100 -131 -5 -12 -821 -48 -387 -276 -233 824
6599 824 323 -355 69 -286 -29 -233 -191 91 41 383 -944 192 -776 335 62 -201 -225 -153 -100 -412 -162
6620 -162 -729 364 -666 406 254 229 936 -411 -276 187 -77 250 110 48 -195 -403 -69 -378 -153
6639 -153 -29 20 77 -107 253 124 445 591 -323 134 -857 374 148 258 37 393 403 177 388 471 95
6660 95 -365 482 276 85 366 533 -623 -253 -252 -433 -136 -790 -597 -61 28 46 167 -102 247 -46 206
6681 206 299 307 -136 -893 -21 322 -311 -186 96 667 -1409 96 407 263 -66 684 -285 518 173 448
6701 448 -236 -259 262 -192 801 685 -419 -374 -482 -18 104 -676 -358 -107 434 54 -65 406 -185 568
6721E68k22l03L34l36J45o75N78R0J67j62m77L05m0j02K38J23K78p10r2j30R22
6742D99r50N21k59l97O63J07J61m36m68J000p18m6K50l20j50J009o12L27k37j53
6762b09P06l23k76k33M94O67n16k89L57j44l0o3k10K49j76L19L73o36q4J33j4
6783I5l86M72m76J49K39m54M25j03K03q45O86M62o95n31O05M83l06l22K33l52
6803d18L53J6o9j36Q90m61j55J15L34q31RL30j016R58l21k44N08L1o4j92L88J78
6825B03j63j088L16J391M0j044M03p01J045p90Q30r47Q80q25L41k82N85l51n5
6844b12l42N09N26p50p3N50p8o28M02m5N02K51o5r43R01r18J40P5O05j119P78
6865F6K72l83j8k87R95n0m04l10O51p80Q30l67l17K48j80J59K62j90k18j8r1M26
$$ plain form
6721 568 346 43 377 41 186 -489 89 179 346 184 -293 12 -28 -130 108 231 509 -201 -293 -423 499
6742 499 -451 70 -189 -586 77 184 345 -91 -559 441 -277 -323 -73 -393 -543 466 -146 181 -56 -209
6762 -209 497 174 -102 -335 159 826 310 21 378 234 204 141 -69 180 4 323 696 60 -24 109 95
6783 95 -291 181 -295 -146 93 -361 64 -39 164 -681 5 467 -228 -759 -154 329 23 -299 -66 -418
6803 -418 -65 -49 -118 -254 636 175 20 135 469 -362 -353 -23 -1039 -81 -402 -646 -138 -107 -171 -363 25 203
6825 203 40 -1048 -732 659 699 -345 58 -643 402 -388 442 -505 375 -450 -109 -391 194 -157 -212
6844 -212 -554 -45 481 -269 -342 208 130 -498 -96 -141 361 612 547 -396 505 -413 -273 -198 407 -712 66
6865 66 338 -45 -63 -350 645 595 191 -119 532 -248 582 215 -102 146 -34 125 387 197 -21 -39 -130 296
6887B96l41k02J32J18k41L47k31K01j91K29q1k61L50q43R46L96j21l84k16K93
6907A96l02o8R4q5j78Q80k30n04N68m77K13L38j010M68n7k24L25Q36o92L56m2
6928D05m57j27j37m4L74j64o7N35n75N2J17o28J95L04k9L08J14L28l36j9K5j08
6950F6L40o74R73p74J3l56J86K02p87O15P56o16j72r3M10L68j71R6Q8m75J54N9
6972B08n80K37k72J34j06J89P37m84m3J43J27p22M48L68j36k62o75N06J22L0M44
6993D13K69j090M82J31r21R76k1m4N4l28N2k29O09j82L3J62k71k94k77R26n60
7014a10l64J70J15N12l71M18q55K09K19l03O75k85j74N1J98N33m56J43o63P79
7034D41k82k06K33k57M77j9k6J05k74m80J186j928J153N1K00k19o15J49J89R3
$$ plain form
6887 296 -45 -247 -115 3 -238 109 -122 79 -112 117 36 -225 125 -718 228 624 503 119 -97 196
6907 196 -106 -174 -80 -165 -343 537 307 -197 371 -106 107 445 -565 -97 -154 -378 -53 783 91 447 405
6928 405 -52 -179 -316 -360 14 -150 -217 318 -257 -205 -88 -716 -521 -217 -246 62 176 504 168 149 174 66
6950 66 406 -268 705 -69 -56 -412 -226 -24 -811 -196 560 -56 -228 -321 89 457 286 382 470 -5 149 208
6972 208 -372 -135 -407 -273 -379 -190 547 63 20 163 290 -432 16 384 248 -14 -689 -183 -61 -31 413
6993 413 682 -408 74 205 -716 260 239 195 249 -79 -27 -256 353 171 204 366 95 -199 -476 450 -110
7014 -110 -474 -304 -189 323 -48 370 -485 -276 -57 -360 315 30 -144 -93 105 638 182 325 -338 441
7034 441 159 -47 186 -71 406 387 361 466 192 -288 898 -1030 123 174 374 155 -460 -311 -122 -29
7054b9M96m32l90J049k21o14j43N06k73k96r3L57J41k44K74k62L31m28M83q7M52
7075E77m37N30k81n67P10k52l18q3K08L72p60J89J09q78J165L13o92k74J163p84
7095A0n29O71m9J38p88P28m64M19L7l56j92Q52q1l5j41K09r06P00Q60j838Q73
7116A18j77N4l09L56J37L54j75k03m12N12l45O81o83P00o38M65j58n80o2M01j56
7137a20O0k7Q27p97l30M77kn13O50K08K90o35Q8j37J42j5n14O44p5o21o5O62k4
7160A73o40N90j09M04r71R85j229O45N25r37N17M53N34j555Q8L70J83j8l12J90
7180a14j25O12o48L71O77o00m80j19Q88o93P9N22k03r7Q55l14j216Q63J08l06
7200F0l85k51M30J82p7o4O72k23k98m99O93l88m08O02n06Q84j62j66k55q32R57
$$ plain form
7054 -29 467 35 -355 694 473 -141 -284 222 -51 -347 -440 -83 58 -186 88 -174 157 -271 212 125 577
7075 577 140 670 389 -178 532 280 -38 -121 87 459 -301 -112 -3 -881 284 597 -95 -369 794 10
7095 10 -519 152 103 241 -547 181 -283 136 173 -183 -375 477 396 361 220 429 -477 223 1083 -755 118
7116 118 -59 -5 -314 42 179 533 358 155 -257 255 -90 591 -92 608 -30 435 277 -303 -365 36 -120
7137 -120 -60 -87 740 -57 -387 90 88 -425 225 433 723 88 176 39 181 166 -348 296 221 -400 -465 197 173
7160 173 -467 123 14 418 -553 432 -797 -152 373 -564 -47 406 940 -615 -527 -157 26 8 -304 -114
7180 -114 -239 373 -275 96 773 173 -307 -426 462 -231 -152 370 167 70 925 611 -605 258 366 60
7200 60 -325 -576 -146 36 -41 -105 567 344 46 -453 240 -148 -556 46 -460 424 262 96 -159 -991 -34
7221c4K96l8o04L87j35k56P66q08J58O24k50N28j167O54j60K54m28J17p3L03k27
7242i3L6L56j20l57n53K54J057q28L69o75Q75n73L50j89N17J52n87N22p12M04
7262B05m66j14k2o42J200J68o24P91k61J16o07P09l89m22L63l79M88M49j91j157
7282g85J210r56M44M67j74l37M24r70Q60M8p65J431q97L84m47K02K90j103Q44
7301A70m71P14m98L13p14J78k13J449q11k13M44J02j131N01j59K61P3J34N7k37
7321e1n22J026l34m74K85m0K70o8M84l03l26m56p0k90J019L01p62J25Q89j029
7341c26P6J46j5P5p16N21N88j59n65J44m60P19j063L39J99L68P44J76n79J5o06
7362c79J38K86m06J43M21j33m19M71O33j160L32L77Kj84m44k93P90L22j91l29
$$ plain form
7221 -34 262 224 -380 7 -128 -384 382 -426 -268 356 106 634 -533 121 -39 215 -213 -96 -169 134 -93
7242 -93 -57 299 179 -178 -731 -477 580 -248 121 -554 321 -252 98 -91 426 578 -9 513 -199 205
7262 205 -261 -375 -397 -1039 161 329 -295 496 235 351 -256 453 64 -358 5 -374 114 563 372 -785
7282 -785 425 -531 -87 380 206 -131 293 -677 183 231 -534 897 0 384 -63 139 429 -674 170
7301 170 -301 413 -85 228 -486 -308 -521 928 117 -96 348 450 -681 -180 -339 -78 -5 129 186 -51
7321 -51 -573 453 119 -355 -70 -110 160 92 576 273 -53 -509 -579 -869 150 451 -311 -186 703 -326
7341 -326 -250 -104 -119 -44 -760 -239 349 190 -375 -231 -691 28 -1035 -696 -497 -129 615 791 212 227 -379
7362 -379 -241 45 -361 -218 203 70 -349 122 755 -405 -73 304 306 122 -322 -615 175 497 306 -23
7382b3l51Q11l81P13l33J5l37r22J137K74K4r57L41n38j25M62j67L49Q5l17P88
7403E48l2m09K08m40N38o76N07n2M05m87n09l05O31k61J39L13J22m45K10J84j82
7424Gl36l57L24o14R20L67j00n93O21k62M29m14q97N63O17m58L95n49m69J080
7444B74k44n8l70O95J07L23q57R6K34n48k06Q53r63M56j70N6j3O90R9j49o55J42
7466b08Q52o41k75Q63m86N4j99P05o15N80j507K46J036m10K06n34O52q60M26L68
7486B53n31P83l27K70j042KK68N70m49L26O41o84K66p24K95j44o5O71K20j136
7506e37P07m9N84p7p99L97j90k75O15l49k62J91m10K14P49r78Q67K48o43P9J42
7527B24O81j306M24p0j47M42m65J10j67L75K74m53l0J37M97r61j3N71M06l72j96
$$ plain form
7382 -23 -374 437 56 769 436 451 114 -808 329 603 627 -330 11 -527 -652 -190 -357 -8 77 -240 548
7403 548 516 107 315 -125 413 -263 244 192 597 110 -399 -704 -73 -334 -195 118 240 -205 5 189 7
7424 7 -329 -686 -362 -976 -56 311 211 -382 239 -23 406 -8 -905 -342 275 -183 212 -337 -806 274
7444 274 30 -28 -398 297 404 727 -130 -34 200 -348 -554 299 -664 -208 -378 -322 -335 355 454 305 -350 -208
7466 -208 644 3 -272 591 105 159 -40 665 50 630 -877 -631 405 -5 201 -333 319 -541 -115 253
7486 253 -278 505 178 448 -594 -592 -324 246 -203 123 764 80 346 -378 -83 -227 -292 379 599 -537
7506 -537 170 121 705 628 -171 226 36 -239 376 27 -235 -44 -454 -240 509 -469 398 646 3 82 224
7527 224 905 -401 23 -47 -194 248 -217 -107 -274 101 375 -78 -108 29 526 -435 -448 123 529 157 -39
7548c9L85n82O56o54J55j8N82l97k15M16J25o09N53k23k23j51l08N18l7o75P76
7569C5J29n46O64J71k70m71M37O10j007P45j33o36L21m58M32N2J3M15q6n11P22
7590F28R1j081K76r2K36kl00M02N2k39p53J589m09o84m8L09J98l16M9J032o16
7611C22m92R9K17R2l83J78O8K48l95L54r0K10j599J251K17L59q58J70k27l56N42
7632g3K96j2j98P1L39Mm90K38J31k21m36J223m94l15O8K87K7m88M11k7p4O26j068
7655a75K38l30J21K97M69j459R56pm62J092n16j23l32l2l34J461p41R0o81P65
7675B97j67J4M28p3m45l0L66J22o64L21m11K96K14k01m09K09m61m11P87M80L9
7696C01K2m41JN35k70n93k92P55k5p1K35k00m31J47q4n31J253n86R62q61N81q35
$$ plain form
7548 -39 346 -236 420 -234 -79 -97 485 88 -127 289 414 -195 358 135 -88 -239 -547 -29 -66 -741 35
7569 35 164 -382 282 453 183 -288 149 759 -248 497 364 -272 49 -409 23 75 88 503 417 -94 628
7590 628 719 -362 -86 -178 58 56 -244 158 210 -29 -782 807 398 -286 -334 -25 173 -143 -94 938 322
7611 322 -170 -71 146 238 -145 33 101 349 -46 308 218 428 -1171 80 297 656 -202 -32 -259 -615 -73
7632 -73 223 211 13 84 423 427 -63 175 306 85 -351 872 378 63 131 418 445 -43 368 341 267 893 -175
7655 -175 63 -267 -146 151 620 -839 117 110 -352 740 224 101 -231 -263 -597 864 123 213 -468 297
7675 297 130 144 572 499 54 24 390 512 -152 169 -242 54 268 67 -342 -133 -594 -1005 -218 262 301
7696 301 323 -118 -117 418 148 -445 -737 18 -7 -78 157 -43 -474 -327 -411 -942 311 -275 687 -174 407 -428
7718d28Q22m88M37k13m80R0N7k86R15l35k79l01J266r26j83L77pM68j089L01K52
7739c0N86n63L57n72n39K97L32K57k51N82l73j45N5k34P69M38o83k87j37M03m26
7760a64N57l54n66M58l49N65K26n88m67O67m75l7N83q65J404m05j69k50L61n73
7780d41O67K79l52m72R17p99K53k30k52K89N28Rk35P6k97k16K09K97j44p7K40
7801B49l21M76o01N06J14n69k5P54k78n21J57k03L08K55o5j79k11p1R46rj204
7822d92P30p62N25jj23n01J272M0k71j88q09O9M43l14P08p0o43J060r17j90J58
7843b76R95k61p91K47L29n49J108j013L41l25Q19r72Q27q60O03k75O08l29m25
7862a99N9o24R19K52l2p65q5N93j61K38O1r4j07Rk64J21M2j83l9L00J59j54K94
$$ plain form
7718 -428 394 -94 343 130 -350 -260 -203 -489 426 91 -188 -489 777 -149 -332 45 38 506 -583 -282 -30
7739 -30 556 -7 350 -222 -761 -464 -132 125 -126 456 83 -62 -7 -241 528 966 283 -4 -141 262 -164
7760 -164 393 39 -527 -69 -418 147 373 -215 -682 -15 -490 -527 56 -809 595 190 21 -229 132 -441
7780 -441 226 505 153 -319 598 -201 52 -178 -430 -141 387 396 161 237 -60 -276 -67 230 86 9 249
7801 249 -72 404 -197 309 423 -146 -171 583 305 -216 -59 -262 46 301 236 57 -154 -225 721 712 -492
7822 -492 238 -524 1 0 -123 -624 648 688 417 229 -580 -511 -68 -382 326 256 -387 673 -244 -434 -276
7843 -276 719 458 -333 -86 243 -306 802 -211 130 -195 624 -348 479 -381 222 -53 555 226 -199
7862 -199 -140 -764 155 407 375 -390 -475 118 -43 195 256 162 55 64 -200 -79 -37 -220 -259 41 200 46 340
7885C40J0n06k15R56l81q39K40K25M02J62j30p46P24m05j51J49N52q6L95j196
7905e00M68J50q42P15k37O38l12r25J050k32K99k65l95N41K49m95L95J28m01k94
7925b65l54J256j004O93n68j1k85O29q3k70l28P17j43M3l57j14M08L20j25l61
7945b02K1L07nk15Q6L3K81k93L80J30o49n3J64L86k16r5L40Kq07J298q44o30L47
7968b34L36p31Q64n53L19n0k23M56R6pj69J62L33j52r23P52n22K84Q3l61n4O27
7990C33m72M74k20k57L85m90l96Q54j56J1K72o88K59k33Q39m30p0q3L88k45k53
8011a78O26P03q44j02r6l41K3M33q32O25r6m61L33K80j39j47J9K62j9k50N35l11
8033B3j28L18r9L1l06L42r5M21l39m00K71m16O90l57j20P1O07q58n09J294k68
$$ plain form
7885 340 350 -156 -371 585 204 -635 -395 -170 232 394 264 -482 242 -163 -314 -165 387 301 696 -500
7905 -500 -32 118 -724 -9 -246 392 80 -845 205 -27 272 7 -388 153 402 -93 302 430 29 -265
7925 -265 -619 637 -367 326 -242 -253 -538 91 8 -262 -590 127 -16 27 -330 -444 -36 284 159 -202
7945 -202 -181 126 121 -94 -8 25 306 13 393 523 -126 -179 -15 371 155 60 400 402 -405 893 49 -581 -234
7968 -234 102 -629 235 -318 1 -49 -272 184 280 273 104 266 599 447 -476 276 -246 38 121 -240 -294 333
7990 333 -139 335 115 -142 243 -247 -643 211 55 66 338 -350 -91 -324 515 85 15 -68 320 75 -178
8011 -178 448 1151 307 205 109 -232 -209 224 -608 17 -79 -540 -207 73 -66 -213 -194 68 49 -201 334 23
8033 23 -105 213 114 145 -161 181 86 507 168 -232 39 -377 313 -44 -164 -93 514 -344 -853 441 173
8054A73r8k43r6n97O19M45l77k33J39O28m07K90j84m39q87R11L47k47P5j31K28
8075h4K7o22Q72o93N13P5o24J079l33J18k50n51Q65l86l51M13k50n0J21k81N71
8096A79r4j076J309o32J57k0L28m83K70P21q77o5q7L06k54J55R8J42J07l19l07
8117d42q7O48j35l20L02m83K69P4K32j41j32O15j52M48j185l83J165l68K44p36
8137e67L04O71p49L1J13K60m27J20L9L12J41l73J90k08J5l87K28N91L95o51J82
8158B30m39N22n17J66k08OL56n81Q64j42J13j40k50o29M46K65K0j39M08l17M8
8179H2r76M59O00J25j86k00N01j046J083q66K34K61
$$ plain form
8054 173 75 -168 -264 -861 -242 203 -174 -407 -268 360 -47 243 59 -380 -1267 -356 -9 -256 -181 -312 -84
8075 -84 -57 -679 193 -500 13 88 -536 543 210 328 78 -473 392 6 -345 68 -182 -232 -111 -392 179
8096 179 85 -991 318 -314 -157 -177 151 -332 -62 659 -218 -283 -370 -64 -318 -163 -65 77 184 -135 -442
8117 -442 -529 119 -16 -336 -34 -517 -248 -174 58 -83 -215 400 248 696 -489 -872 293 -75 169 -567
8137 -567 -263 408 -341 -310 -197 63 -364 -244 -205 107 248 -125 65 -143 -128 -515 -287 304 699 48 230
8158 230 -209 313 -204 -38 -246 -240 116 -465 399 257 370 230 -20 -649 -203 62 82 -57 351 34 82
8179 82 -894 -435 165 290 104 -96 405 -641 442 -424 -190 71
8191G1
$$ Imaginary data points
##PAGE= N=2
##DATA TABLE= (X++(I..I)), XYDATA
0@%%%%%%%%%%%%%%%o4J28j28J28j28J37k01K56k66L30l85M49n57O21p04Q32r60
32e12J088j216J357j545J740j942K185k442K716l022L356l715M114m551N024n544
48b909O110o727P413q173R008r930J0959j2122J3445j4957J6703j8748K1187k4147
62a2888K7844l2607L8999m8087O2169q7136J44861n56425j48957O68612j18123
73f1738k01459k5127L33989K32019J0785k60175j0648K74236J56805k76612k35762
84f3687O1745J67232o2528j97114j31579Q9810J35465l8142j96644m2106J89832
95h7716J81025o6879j44334O4033K30921O6647j51094j11825P7529J17024k2168
106A53163j68265j09185Q9262J10879r8954j59615M2092J48461J2940r1719l1501
$$ plain form
0 0 0 0 0 0 0 0 0 0 0 0 0 0 0 0 0 -64 64 -64 64 -64 73 -128 128 -138 192 -193 256 -301 320 -384 448 -512
32 -512 576 -640 717 -828 912 -1030 1155 -1287 1429 -1593 1763 -1952 2162 -2389 2635 -2909
48 -2909 3201 -3526 3887 -4286 4722 -5208 5751 -6371 7074 -7883 8820 -9928 11259 -12888
62 -12888 14956 -17651 21348 -26739 35430 -51706 93155 -463270 -612227 56385 -61738
73 -61738 -263197 -288324 45665 277684 288469 28294 17646 291882 448687 172075 -63687
84 -63687 -1942 165290 102762 -94352 -225931 -136121 -656 -38798 -235442 -277548 -87716
95 -87716 93309 26430 -117904 -53871 177050 243697 92603 -19222 58307 175331 153163
106 153163 -15102 -124287 -35025 75854 -23100 -182715 -140623 7838 20778 -70941 -102442
117a02442P5860J04994J6914r1616m2845R5519P4019p6093j01524J3162P5931
128D1879J1748p4467p2136K3346Q1550J6957o5827l2199O5831P4411j9146p4656
140b2709j2245O9234L7304n4541o6174J3641O1466J2803n9524m6843M2716O6215
152D1343j5313o4795q746N1603L5751k5146m5645N015N8338K4628m5898l9886
164b8751K5408L7626j2881m4345k0378K8383M0273p521m3960k220M8825K2736
176D3195l2303l5396Q484L1945L938l6098k6279K1119L6655l008l3985o912L7013
189H368K9104j9211l2719R297L4020L685k8210k0952J0510K8059J743l7161k2103
202c5570K6381K2393k3065k8750P800K8112J2705j0236j4232J1776L4116R328
$$ plain form
117 -102442 -26582 78412 95326 3710 -39135 56384 130403 54310 -47214 -34052 41879
128 41879 53627 -20840 -92976 -69630 11920 28877 -36950 -69149 -3318 71093 51947 -22709
140 -22709 -34954 34280 71584 17043 -49131 -35490 25976 38779 -20745 -67588 -24872 41343
152 41343 26030 -38765 -47511 4092 39843 14697 -30948 -25933 32405 57033 11135 -28751
164 -28751 -3343 34283 21402 -22943 -43321 -14938 25335 17814 -26146 -28366 20459 43195
176 43195 10892 -24504 -16020 15925 19863 -16235 -42514 -21395 15260 12252 -21733 -28645 8368
189 8368 37472 18261 -14458 -5161 28859 32544 4334 -16618 -6108 21951 23694 -13467 -35570
202 -35570 -9189 13204 -9861 -38611 -30811 -2699 10006 -230 -14462 -2686 31430 40758
214D0758k8698j4479K3702J5131j9163k9604q210J4963Q132j7161k0447O246K7714
227a116O854j9328j1737J8687K4634l236j7713J835K1571J0600j0086j6715j177
240C073J4996K630k3797k0375R394J3746j0840j7084Q1J5071J3650R49j0231M075
254d662K1825Q783j4720j1033R595J1055o192j3296p869M971N718r091j3422J88
268a8150J3935O272j0971m834R051J0620N18q797k450Q944P406j890q709j086
282a41R566M351j0258q909L475N343k256o874l583K465L898J541p417j468R938
297c29N888n340n008M927M050O27j311j831R74N851Q43p490l479L592J577m658
313a117m332n14K194J691j952l967k133N576M317j608j037O597N315J636n75p91
$$ plain form
214 40758 12060 -2419 21283 36414 17251 -12353 -20563 -5600 2532 -14629 -35076 -28830 -1116
227 -1116 5738 -13590 -25327 -6640 17994 14758 -2955 -1120 20451 31051 20965 4250 3073
240 3073 18069 20699 -3098 -23473 -14079 -333 -11173 -28257 -28176 -13105 545 1494 -8737 -4662
254 -4662 17163 25946 11226 193 9788 20843 14651 1355 -6514 -1543 4175 -4916 -18338 -18150
268 -18150 -4215 2057 -8914 -13748 -4697 5923 6441 -2356 -4806 4138 11544 9654 945 -141
282 -141 9425 13776 3518 -5391 -1916 3427 1171 -5703 -9286 -6821 -2923 -1382 -8799 -10267 -329
297 -329 5559 219 -4789 138 4188 4815 3504 1673 2647 8498 9341 1851 -1628 1964 3541 -1117
313 -1117 -5449 -5963 -3769 -2078 -4030 -7997 -10130 -4554 -237 -1845 -2882 3715 9030 10666 10091 9300
329I300l56Q70k288o710o114R94k3m209l304J569L439P81J681J096K220N058K019
346F023k734j673M932M247j329l294M1J216j981m191o317k609J182jn645m112
362a6245N451N415J094m17M923Q020L812J366k594j778K781j912q200p063N15
377d832K111m982l090M26K913K797M01k213K503N872L955l512q19N452K920k704
393G198l235J155j5m30l496n322l055J535J039m281j323N118L962l01p14K914
409G49L666K499j202k840N59L879r29m709l102J902J223m764l742J673K395J057
425a686j837j445K101M166J210j200m93M303Q2l358q15l7k9r4j283n19J078J277
443A421j12k877n24K112r69j906N0Q72j57N74m22o19K181K444O83j378L49J672
$$ plain form
329 9300 8944 9814 7526 816 -5298 -4304 -4327 -8536 -11840 -10271 -6832 -6051 -4370 -3274 -1054 4004 6023
346 6023 3289 1616 6548 10795 9466 6172 6213 7429 5448 1257 -5060 -7669 -6487 -6488 -12133 -16245
362 -16245 -10794 -5379 -4285 -4702 221 8241 12053 13419 10825 9047 11828 9916 1716 -5347 -4832
377 -4832 -2721 -7703 -10793 -10367 -7454 -4657 -4256 -6469 -3966 1906 5861 2349 1530 6982 9902 7198
393 7198 3963 5118 5103 4673 1177 -4145 -7200 -5665 -4626 -8907 -10230 -5112 -1150 -1451 -2165 749
409 749 4415 6914 5712 2872 3431 7310 6381 1672 -1430 472 1695 -3069 -6811 -5138 -2743 -1686
425 -1686 -3523 -4968 -2867 1299 2509 1309 816 5119 5201 1843 1028 991 962 868 -415 -934 144 1421
443 1421 1309 -1568 -2092 20 -949 -2855 -2805 -1933 -2090 -1516 -1938 -2557 -376 2068 2751 1373 1722 3394
461C394q21j240K29k64K02M24j111p14k87k01j826k681L03P03j063P97K748K031
479F23O18J329J987O12N35j15k780R7j96l230j930O55Q98j737j535M38j076J017
497c790PK53n71J453L427J778Q90J824L136o30j431j447j099l339j257k268l368
514f432j17J518j502j037K268M724m3Q94K160L007p33K31j271o92K17N14j335
531B371k458J115N51m126k553K543r35r37p28R89J732O37J348K25K052L416K120
548G362k016j910p6j0l148q42m65j010J65k76k243j174L643R24j769M07K174J278
566A014K06O11P99M08J547k300j906J05L73r26j467Q12k48Q37j114r86N1J88R02
585a094k88n19J83J379K54M69J026K650o15m77M63o02j202r28k347j927Q92K069
$$ plain form
461 3394 2573 1333 1562 1298 1500 1924 813 99 -188 -389 -2215 -4896 -4593 -3890 -4953 -4156 -1408 623
479 623 1241 2570 4557 5169 5704 5589 2809 2906 2710 -520 -2450 -1795 -897 -2634 -4169 -3731 -4807 -3790
497 -3790 -3783 -3530 -4101 -2648 779 2557 3447 5271 8407 7777 6346 4899 3800 461 -796 -3064 -6432
514 -6432 -6549 -5031 -6533 -7570 -5302 -578 -621 273 2433 5440 4707 4938 3667 2975 3192 3706 2371
531 2371 -87 1028 1579 -2547 -5100 -2557 -3492 -4429 -5157 -4168 -2436 -1799 -451 -226 1826 5242 7362
548 7362 5346 3436 3360 3350 202 -640 -1105 -2115 -1950 -2226 -4469 -5643 -2000 -1076 -2845 -2438 -264 1014
566 1014 1220 1831 2630 3038 4585 2285 379 484 857 -69 -1536 -724 -972 -135 -1249 -2235 -2184 -1996 -1094
585 -1094 -1382 -1901 -1718 -339 -85 384 1410 4060 3445 2968 3431 2829 1627 699 -1648 -3575 -2683 -614
603f14k028r37K388J527K63j097L58p9J473N11j030j702K251k65n49N74J211Q56
621C111j244j684J83j034L00j776j630M28J537r19J35O03K433J294q59J910J03
638B891n8k96o82k99o50q04J216j553q44p33j55j641L71P80j54N38J01O04J049
657c19K706M86r79J089J491j436j293L1M79j525j914l55r42N69o88j221O21J429
675a771J610j556R75J337J073N60M97Q5Q82l31q20r57j100J00j524n59k313R81
693b831Q99j107j075J245J535O26J324N45O94J089k79m66p37L90j33p63j835K76
711f03l63m6o98j417O24Q38p4q14J376K253M87n53m82Q44J717m31j470l46L08
730A150O97j789o31l59L72n40r63o0L44Q6M75p65J835M86J405r75M48J042m26
$$ plain form
603 -614 -2642 -3579 -1191 336 599 -498 -140 -219 1254 1765 735 -967 1284 1019 470 1044 2255 3111
621 3111 1867 183 366 -668 -368 -2144 -3774 -3346 -1809 -2728 -2593 -1990 443 1737 878 2788 2891
638 2891 2833 2537 1855 1556 906 102 1318 -235 -1079 -1812 -1967 -3608 -3237 -2457 -2611 -2073 -1972 -1368 -319
657 -319 2387 2873 1894 2983 4474 3038 1745 1776 2255 730 -1184 -1539 -2481 -1912 -2600 -3821 -3200 -1771
675 -1771 -161 -1717 -742 595 1668 2228 2725 2810 3692 3361 2541 1584 484 584 -940 -1499 -3812 -2831
693 -2831 -1932 -3039 -4114 -2869 -1334 -708 616 1161 1855 2944 2665 2199 1462 1852 1719 956 -879 -603
711 -603 -966 -1012 -1710 -3127 -2503 -1665 -1739 -2553 -1177 1076 1563 1010 528 1372 3089 2658 1188 842 1150
730 1150 1847 58 -573 -932 -560 -1100 -2063 -2123 -1779 -1693 -1218 -1983 -148 338 1743 768 1216 2258 1832
749A832j52j470N06o93O97j163l53oJ182j119l9q74Q19M69j805K63J194O56M06
768C50r32O82J452M80o30k57l61P17P2j454j270O70l73n08o54J65R62L94J46m86
788h35Q88R14O44j554P0J388q71k52O21N76m79j01P80j834k8P54j933j064J64
807b152k41N96n42M96Q80P51J199J46O75R99k42n71l10o95l34P9k617J284o15
826a214K91m50k29j65N73J61M86m06J276Q20o48K04J60Q93r6p85L21K33j462N09
846D72q96j559Q15L72j101o93M96P78j90J607m29J723K34K22J7p38J107l98j016
865H23n18N45q64q43j176M77P46L39o67q60J077N33M15l23Q12J081m74m95K19
884H47N39n35J26Q0n64p94Q89j267k25o61N18p39J71l6J202N29O47r8j43P43M20
$$ plain form
749 1832 1680 210 716 23 720 -443 -796 -802 380 -739 -778 -1652 -833 -364 -2169 -1906 -712 -56 350
768 350 -582 100 1552 2032 1402 1145 784 1501 1573 119 -1151 -481 -854 -1362 -2016 -1851 -889 -495 -349 -835
788 -835 53 967 1611 57 127 1515 644 392 1013 1589 1110 1009 1789 -45 -73 681 -1252 -2316 -2152
807 -2152 -2393 -1797 -2339 -1843 -963 -212 987 1133 1808 2807 2565 1994 1684 989 655 734 -1883 -599 -1214
826 -1214 -923 -1373 -1602 -1767 -1194 -1033 -547 -953 323 1143 495 699 859 1752 1656 871 1192 1425 -37 472
846 472 -424 -1983 -1168 -796 -1897 -2590 -2094 -1316 -1506 101 -328 1395 1629 1851 1868 1130 2237 1839 823
865 823 305 850 -14 -857 -2033 -1556 -810 -471 -1138 -1998 -921 -388 27 -296 516 1597 1123 628 847
884 847 1386 851 977 1057 493 -301 588 -679 -904 -1565 -1047 -1786 -1615 -1651 -449 80 727 629 486 1229 1649
905A649o35j053J269l91m71l15L10K40m65o49L7k00M2k54K80m74J091J92o92N77
925H8O01M41L5q55J134k27l42L04r73%q05N91j876Q45l20m01M42J51j74J182k26
946c85n4Q22K19Q15l21m24N5M20J60l53m82r90j50l33m61j161J035N26N57r39
966a444P72J113M2o21L14O89J25k25L32k02j56J185j509n31n29M89p75k36r0p5
986a332M57pk8M26J61J135n22M6J116O48o26j23k63k31J03p12q66j72k25l08K98
1007a025o44P08K22k57K81Q46O74N13k41n70J99Q97n50l61O21J76p29j283K69
1026b54q55l53K10m40n19J075Q84J10P2N59N36j85j04L50P87o0n94j393R49m93
1046B82j232n66p09J321N12j285J520o58Q37P83j209M20O73q76J468m85J96L30
$$ plain form
905 1649 1014 -39 1230 839 368 53 363 603 138 -511 -474 -674 -632 -886 -606 -1080 11 203 -489 88
925 88 689 1130 1165 310 1444 1217 875 1179 206 206 -599 -8 -1884 -1039 -1359 -1760 -1318 -1167 -1341 -159 -385
946 -385 -439 383 602 1417 1096 672 727 1147 1307 954 472 -518 -668 -1001 -1462 -2623 -1588 -1062 -505 -1444
966 -1444 -672 441 483 -138 176 865 990 765 1097 895 739 1924 415 -116 -645 -156 -931 -1167 -1257 -1332
986 -1332 -875 -882 -910 -484 -323 812 290 336 1452 2100 1474 1351 1088 857 960 248 -618 -790 -1015 -1323 -1025
1007 -1025 -1669 -961 -739 -996 -715 131 805 1318 1077 507 706 1603 1053 692 1313 1489 760 -523 -254
1026 -254 -1109 -1462 -1252 -1692 -2211 -1136 -252 -142 -70 489 1025 840 736 1086 1873 1813 1219 -174 775 282
1046 282 -950 -1516 -2225 -904 -392 -1677 -157 -815 22 805 -404 16 689 -187 1281 796 992 1322
1064A322l29m0r01N94l80m38m52j352M33P8k71J192q41J908J10q81P36J230n91
1083A127K39o95J26m56j21o01P5J00j60J91j049P85M86m32p99j36J924j106Q86
1102C84l45kM86L54p5k8p6o7O41r77k06L72k62r90o10M38R7K3L53k55o1J228j93
1125B29j263O09J083J85j491J295M64l2O3o86n85o3L12j138n9J02K46J46j58o9
1145h10n02O57P68j176J087M33M11j08m63J406r98k06j91q8r50P79j239p14Q81
1164a023L1N47j048P34M06K28J79Q2O95k31K57K79l72O51k65n52q26n77P72o58
1184f91o59JO06k57L38J67L99L54O03K1k84O83O71j411J05m31k89K7m08l1l28
1205h14k5J87o16K50P56j10p8L79j24M80P24q15R93k59L53l24r2l52M7k97q96
$$ plain form
1064 1322 993 953 52 646 266 -172 -624 -1976 -1543 -1465 -1736 -544 -1385 523 633 -248 488 1718 1127
1083 1127 1366 671 797 341 220 -381 -306 -206 -366 -175 -1224 -439 47 -385 -1184 -1320 604 -502 384
1102 384 39 37 523 877 802 774 698 631 1272 295 89 461 199 -791 -1401 -963 -866 -843 -490 -745 -806 422 229
1125 229 -1034 -425 658 843 -648 647 1111 1079 1142 456 -129 -192 120 -1018 -1077 -975 -729 -583 -741 -810
1145 -810 -1312 -655 113 -1063 24 457 868 760 297 1703 705 499 308 220 -730 49 -1190 -1904 -1023
1164 -1023 -992 -445 -1493 -759 -353 -125 54 136 831 600 857 1136 764 1415 1150 598 -228 -805 -33 -691
1184 -691 -1350 -1349 -743 -1000 -662 -495 -96 258 861 882 598 1281 1952 541 646 215 -74 -47 -455 -486 -814
1205 -814 -839 -652 -1268 -1018 -262 -372 -450 -71 -195 285 1009 194 1187 928 1281 957 865 513 560 263 -633
1226f33L8p24O20l02L69O0J190n67o47O42N67J23j46K08o67J69P48p46M55p26
1246C1MM67o75o15j03K68k62M47j39J63M32j70j91J449J2r95m4L85l9M97q86o52
1268f16J049m31M75n55k05L92l53l89Q84j589O50M9J083l81j34Q22m84j66N75
1287F76P20p96l96l04N55j11m45l35n67O67n74L03j9J4M44m42N59l59J162k89
1307D63o44R83m30j13P38p29r64O35k16Q4l37J52L36k92K70l49k76M76J70j21
1327a64K02O25p8L17J62o66P54p28Lm45m19n40L58K98p19N36O58o04n30R97j33
1348a16K22M12M4o29J031o70l62J82M44o98M8k50P4l97K12J74M16p41J017n59
1368a46M46j39L2O44o32k47P62m32L99J36j143J064r79o00R01r72J108j038o8
$$ plain form
1226 -633 -595 -1319 -699 -1001 -632 -572 618 51 -596 46 613 736 590 798 131 300 1048 302 757 31
1246 31 35 502 -173 -788 -891 -623 -885 -438 -577 -414 18 -152 -343 1106 1118 123 79 464 425 922 36 -616
1268 -616 433 2 477 -78 -283 109 -244 -633 251 -1338 -688 -639 444 63 -71 751 267 101 676
1287 676 1396 600 204 -100 455 344 -101 -436 -1003 -336 -910 -607 -626 -612 -168 -610 -51 -410 752 463
1307 463 -181 802 372 259 997 268 -696 -61 -277 -193 -530 -378 -42 -334 -64 -413 -689 -213 -43 -164
1327 -164 38 663 585 902 1064 398 1152 424 427 -18 -437 -977 -619 -321 -1040 -504 154 -450 -980 17 -116
1348 -116 106 518 562 -67 964 294 -68 114 558 -140 -92 -342 -268 -665 -453 -279 137 -604 413 -146
1368 -146 300 161 193 837 205 -42 720 288 687 823 -320 744 -235 -835 66 -906 202 -836 -904
1387i04J079j81M0k02K85j86N81o77L79M72m82k28J03P5J68k24J6m03j58J47l0
1408c30k8N45q9P6l65l0m08O55r8N24m78N04o7L35m38L9o28P45j21q06M46L69
1430C52j034J33r7N22o67P47J48m00M23J68L40L99l6j344J150L5j68n57M18l61
1450A71n72q6M57q54L68n46N12jR07m55N13J00j37M03j22%N02o12l57n73O64l79
1472i7K23q42k49j31O49m1k13L36m35M22O20L01k40J034n47k9M1r16k00j00j4
1493d28m03N69j62j36o17R85o15p9Q35Q54q32l89O83K49m02m1r9J110o89K26m23
1514A96o33PO6m23q6M93m61R59r84R37K9l29J85M68n90P90o91K48pL17q20J93
1536a36J10M03q36K71m7m34P94k92P24j579J212q13N01k00Q71N6K68r75K71N2
$$ plain form
1387 -904 175 -6 34 -168 117 -69 512 -165 214 686 204 -24 79 154 322 98 114 -289 -447 -300 -330
1408 -330 -358 187 98 174 -191 -221 -629 26 -72 452 -26 478 411 746 308 347 -281 464 343 -463 -17 352
1430 352 -682 -549 -646 -124 -791 -44 104 -296 127 295 635 1034 998 -346 804 839 671 114 532 171
1450 171 -401 -487 -30 -884 -516 -1062 -550 -551 356 -99 414 514 377 780 658 658 1160 548 191 -382 282 -97
1472 -97 126 -716 -965 -1096 -447 -488 -701 -365 -800 -378 242 543 303 1337 790 761 802 -114 -314 -414 -428
1493 -428 -831 -262 -424 -560 -1177 -192 -807 -886 -51 803 -29 -418 265 514 112 71 -28 1082 393 619 196
1514 196 -437 -430 -364 -787 -873 -380 -841 118 -866 71 100 -229 -44 424 -166 624 -67 181 174 491 -329 -136
1536 -136 -26 377 -459 -188 -235 -669 125 -167 557 -1022 190 -623 -122 -322 549 605 873 -102 169 221
1556B21l24N59N9l55j15n28J86p9o15J153l03j76k12K08M51m14J097p78Q72o34
1576B73j56L8r62R14j28J87p25P48k58%L6j38o44J536j119m7jN01L06l12k33R44
1598G60o64Q43o8m24o05K55J96m89k66k38K16J05j18N61o96M97M16p94N25J00
1618A12L47K08o42O31K44q29J1q6J088j231j16J05p61M69k47M21K44k86K80k22
1638b60J23P57m55J74o17N16j28j2l05n1O0m31L39p32R42k53J75L1l14o2L99R8
1660fR90n7K16l23p73k76n62Q25L89N51j068P30j348Q14n17j6P55n76L7n10Q17
1681I2K41L22k53n00N56L06p95k64M93q7p80Q75k76j68j69O75n84p61J97M23p3
1702e30J78J066m57k95J32L64j29m0p8m12J50M38L7k57o1m59j98L84k8K29j05
$$ plain form
1556 221 -103 456 515 160 45 -483 -297 -376 -991 162 -141 -317 -529 -321 130 -284 813 35 907 273
1576 273 117 155 -807 107 -21 166 -559 189 -69 -69 -33 -171 -815 721 -398 -445 -446 55 361 49 -184 760
1598 760 96 939 871 447 -158 97 293 -196 -462 -700 -484 -379 -497 64 -632 -135 281 -513 12 112
1618 112 459 667 25 656 900 71 82 -4 1084 -147 -263 -158 -919 -450 -697 -276 -32 -318 -38 -260
1638 -260 -137 620 165 339 -278 238 110 98 -207 -258 -198 -629 -290 -1022 -80 -333 -158 -127 -441 -503 -104 -6
1660 -6 984 927 1143 820 47 -229 -791 34 423 974 -94 636 -712 102 -415 -431 324 -252 -215 -725 92
1681 92 333 655 402 -98 458 764 -31 -295 198 111 -669 206 -70 -238 -407 268 -316 -1077 -880 -457 -530
1702 -530 -352 714 257 -38 94 458 329 289 211 -201 -51 387 424 167 106 -353 -551 -167 -195 34 -71
1723g1J49j040K24O09n17Q85OK25n31M77p31O17m66K58J78r04Q30k91K66o01L37
1744i1k61P1p29J280Mo20L72M43p86P63l47J047p42n63L69m74N84j06j77k87k03
1765d53Q95j357P05k05j69P76j00L61r36J106N0j66j54k63J26J87j003P34J8k41
1785h9M3j97O5J43J46l3n75P61o20j4L81P17o07K36k28J99k95J02j86K76O3q67
1807e79J57j85O62l69K31k90O57l18n95M67L39m10L82O01j22m24l17k89Pj38P83
1828B50r88M19o5L71J37p95L98M49N88j080M65O40q09N99o17m22N74L38j43j132
1848h23J037om1j16l92L64m24L90j87N35O0L98j582J478l27K08Ml81l59M64j230
1869i30R73L36j309J181k96m07j177J188J66L06L7p27O54O30l23k96N66q35J84
$$ plain form
1723 -71 78 -962 -738 -129 -646 239 245 470 -61 416 -315 302 -164 94 272 -632 198 -93 173 -428 -91
1744 -91 -352 -281 -1010 270 274 -346 26 469 -317 446 99 1146 404 -159 210 -264 320 214 37 -250 -453
1765 -453 442 -915 -210 -415 -584 192 92 453 -483 623 673 507 353 90 216 403 -600 134 152 -89
1785 -89 -46 -243 -178 -35 111 78 -497 264 -356 -370 11 728 121 357 129 328 33 135 -51 225 288 -579
1807 -579 -422 -607 55 -314 -83 -373 284 -34 -629 -162 177 -233 149 750 628 204 -113 -402 -395 -533 250
1828 250 -738 -319 -384 -13 124 -671 -273 176 764 -316 149 789 -20 579 -38 -460 114 452 309 -823
1848 -823 214 208 167 51 -341 23 -401 -11 -198 337 397 795 -787 691 364 572 576 195 -164 300 -930
1869 -930 43 379 -930 251 -45 -452 -1629 -441 -275 31 68 -659 -5 625 302 6 572 -263 -79
1888g9J57R2P9n1j06Qn56m10K64J478m77m09m14J12j51P52m58N52k50m81J576
1909A228j391O19p31L58J06k43k31j34k88O87n14Q87o69K30qj9l8l23M74K77l75
1930i8M42m94Q50p11P22k71p81N24j62n39O16p35R81q27J700j844L98L71k74M87
1950C55l84P26m36j24O05p53J85k51k91Q46M67j424J13M1o8K02R8k64j99N85L80
1971D09l69l36P00J27j063N92N05J7j59o98Q88l26L79j505Q02l2l52M96m04J20
1991b09k99k1q7O63o2K04K94r8m43K91l4N52l81j67o32Q23q30L49m11R83O9m68
2013H6L71k76J55p57M74kM03q46K16N78k44l26J02Q04j95o17M09N06q10l75O57
2034C13l07J0K64P8n46l2O21k24m72K19O50m77L02R3l73L54p54O2J5N01k39L46
$$ plain form
1888 -79 78 170 249 198 92 100 -456 -866 -602 876 399 -10 -424 -312 -463 289 -169 383 133 -348 1228
1909 1228 -163 456 -275 83 189 -54 -285 -419 -707 -20 -534 353 -316 -86 -94 -113 -151 -474 0 277 -98
1930 -98 344 -150 700 -11 711 440 -341 183 21 -518 98 -637 344 -483 1217 -627 -229 142 -132 355
1950 355 -29 697 261 137 742 -11 174 -77 -368 478 945 -479 -366 -325 -393 -191 -93 -357 -556 29 409
1971 409 40 -296 404 531 -532 60 565 582 423 -275 613 287 666 -839 -37 -69 -421 75 -329 -209
1991 -209 -508 -529 -616 47 -15 189 483 385 -58 233 199 751 370 203 -429 394 -436 -87 -498 485 554 86
2013 86 457 181 336 -421 53 51 454 -392 -176 402 158 -168 -66 738 543 -74 335 841 31 -344 313
2034 313 6 16 280 358 -188 -220 401 177 -295 -76 574 97 399 492 119 473 -281 -219 -204 297 58 404
2056D04p0p06L13k19P68o74R9N98L70k35P8r07J115j262N76K59J08q66P91n33
2076Gm0K25j696J606L52n53l22j29O57R0j73o5K40J80j91L10N7o99K46m8O98o02
2098A50p29M41k72P67K46o46J31J63J03q92Q57p34K61l31L13M82k23n43k72J118
2118C90K21p12p75P58N3K17r61P23O22q41N28p71J048J15L16o58p91L22L84j077
2138h89P03l16N82O48q09K58o02k50L57O03L14n68j28J040n43q6j215P27M43j104
2158h35J259n20M09q10N22j60M29p90L11R0l46J46m2R55j356Q16ml34J65P3O1
2179C9M33n1j487J442l13q2K29n27k22O50N9q89J088p19L07J76j3l8K12l32QK01
2201A71n52N52N9L50rq76K84n9k58O65m3j388M90L2Q07p17P60J13J93m31l43K20
$$ plain form
2056 404 334 -372 -59 -278 490 -184 -85 513 883 648 726 -181 934 -328 248 507 615 -251 540 7
2076 7 -33 192 -1504 102 454 -99 -421 -550 107 197 24 -41 199 379 188 498 555 -144 102 54 752 150
2098 150 -579 -138 -410 357 603 -43 88 251 354 -538 319 -415 -154 -485 -172 310 87 -456 -728 390
2118 390 611 -101 -876 -118 -65 152 -809 -86 536 -305 223 -548 500 615 931 273 -518 -196 188 -889
2138 -889 -186 -502 80 728 -81 177 -425 -675 -318 285 599 31 -97 943 400 314 -901 -174 269 -835
2158 -835 424 -96 313 -497 25 -135 294 -496 -185 -95 -441 -295 -337 618 -738 78 74 -260 -95 -22 39
2179 39 472 421 -1066 376 63 -19 210 -317 -539 111 170 -719 369 -350 -43 133 120 82 294 -38 -30 171
2201 171 -381 171 230 580 571 -305 -21 -80 -338 327 284 -1104 -614 -582 225 -492 268 381 574 143 -200 20
2223B0J81l15N55J21m79Q4K37M0p3k31km97L31K4q18J307j113J86J99N03n73K30
2245h3m89O99Q24p38p11L39K06O3l0j35K94m89K2k8L15k40j24K16P48m53m25M84
2267B65j75M75l66j58L27ln38P99p48K60J95j81k64N1K75j24L2j12J64m88M59
2288A45P21j270Q12nj03k91j86K51n04P51k5k35OQ7j10L61l70J01q18M32N39J25
2310D14k73l02J83K07m45j92P22j73q1J48k68k33J02L17K40o3j292J389o30K28
2330bL06k49J69m39M35m31O86j57j71K22k08n28K20n87K92M92Q0n36L03k86P66
2351C77j287J013k98Q95m85o65L96M20N17m21q80P35n49j85J360j049j38M48l83
2370a79L60n70P43k40j26M84n63P43n25J78l87J74p47K55L48l4K04l54j66M84
$$ plain form
2223 20 201 -114 441 562 83 167 404 444 371 140 138 -359 -28 -4 -822 485 -628 -442 -243 260 -313 -83
2245 -83 -572 127 951 213 -498 -159 47 110 80 -55 239 -250 -228 -256 59 -181 -305 -89 659 206 -219 265
2267 265 90 565 199 41 368 365 -173 626 -122 138 333 152 -112 -61 214 90 122 10 174 -314 145
2288 145 866 -404 408 403 300 9 -177 74 -430 321 296 61 67 154 44 405 35 136 -682 -250 289 414
2310 414 141 -161 22 229 -216 -408 314 141 60 208 -60 -293 -191 126 366 303 -989 400 -230 -2
2330 -2 304 55 224 -215 220 -211 475 318 147 369 161 -367 -147 -734 -442 50 130 -406 -103 -389 377
2351 377 -910 103 -195 700 215 -450 -54 366 883 462 -418 317 -232 -417 943 -106 -244 204 -179
2370 -179 181 -389 354 114 -12 472 -91 652 127 305 -82 92 -655 -400 -52 -86 118 -236 -402 82
2390H2J46l27j77R5n5N17m43K08l87j28K78J63l53Q57p80M57o64M93K55l94O99
2411E42l46l17K30m38J72L53K22q65j55L85J63l41M75k89J90J73j5J6m07L92o52
2432e12R20n92j00Q10l18l25J49K66j202J419k95n81J079j024J85K2O02n6l68
2451G9o60O90Q1J62j69J8j003L41N38m09l07O81K2j68L03k83j79K15k80M67O44
2472G83j036O47q47L34L42k77J74J82p93O58m01n08J046J03r73J56l12J278q44
2491b88O91l28J49L11n05l84J142p00k50N44o65J00K03o63N30r3jP52j059m5M58
2512a01J42L04q22L19q26J036O1k48N82r01L55J12m43O29q59R32o12j1K96M13
2532C58J38q03R25j111R55k54K10q28R39o72O65j077R59L97j123L88M52j016j
$$ plain form
2390 82 228 -99 -276 -181 -236 281 -162 46 -341 -469 -191 -28 -381 476 -304 153 -511 -18 237 -157 542
2411 542 196 -121 109 -329 -157 196 418 -447 -602 -217 -54 -395 80 -209 -19 154 139 155 -252 140 -512
2432 -512 408 -184 -284 526 208 -117 32 298 -904 515 220 -361 718 -306 -121 -99 503 447 79
2451 79 -581 109 190 352 183 201 -802 -461 77 -332 -639 42 64 -104 199 -84 -263 -48 -328 139 783
2472 783 -253 394 -453 -119 223 -54 120 302 -491 167 -234 -742 304 407 -566 -410 -722 556 -288
2491 -288 403 75 224 535 30 -354 788 88 -162 382 -283 -183 20 -643 -113 -206 -207 545 -514 -559 -101
2512 -101 41 345 -477 -158 -984 52 113 -135 447 -454 -99 13 -430 199 -660 272 -340 -351 -55 358
2532 358 496 -307 618 -493 462 208 418 -410 529 -143 522 -555 404 801 -322 66 518 -498 -499
2551d99K42K10L16m86j72J321r25J098r68L92m51N11J15r84m7j2j72O49j80m40
2571d82M18p63P96N51k94n90J34l42M87N85l77J96l62k9k37M82p68l32R27m20
2591d20J045j064N03M01k46n25L33j4N2N74m07j61j13Q8l1J34m03N26l43j06L88
2612B11L6l6m72L67J30m49L23K46m42k19k23P40J63l33k32M85k18L77p19M0K00
2633b5M1l46N68o47Q58p56R6k60O4n8K11M84M18l46n15J185n28k73j07Rj05j7
2655d9r0O27j572L66J045j61j84J81k47M29k42N5o89P17M47j26K85m65J34P80
2675A241r70m34o04M62j05J53M12J46n33j04M89Q2J48q37J168k54m39J3r4M20
2695C60o9k27j46K5J135j087o13N03QK24P9j356Q37k6o3P87m56R14r57l36n19
$$ plain form
2551 -499 -257 -47 269 -217 -389 932 7 1105 137 529 78 589 704 -280 -327 -339 -511 138 -42 -482
2571 -482 -64 -827 -31 520 226 -364 -230 -572 -85 500 123 319 -43 -72 -309 173 -595 -927 0 -420
2591 -420 625 -439 64 465 219 -306 27 13 65 639 232 71 -42 46 15 149 -254 272 -71 -177 211
2612 211 247 211 -261 106 236 -213 110 356 -86 -305 -528 212 375 42 -190 295 77 454 -265 -225 -25
2633 -25 16 -330 238 -409 449 -307 -211 -471 -407 -465 -254 230 648 302 -213 972 444 171 64 73 -32 -49
2655 -49 -139 488 -1084 -718 327 166 -18 163 -84 345 103 158 -531 186 633 507 792 327 461 1241
2675 1241 271 -163 -767 -305 -410 -257 155 301 -232 -336 153 235 383 -454 714 460 21 34 -60 360
2695 360 291 64 -82 -57 1078 -9 -622 -119 -111 113 192 -1164 -327 -353 -416 371 -85 829 -128 -464 -983
2716i83K90Q51k42K57j42m35J08n7l63N92K62m40J4K23O3r42R31L25j61l01k62
2737d12N00j64R4L15K79r30O78m97R5L28l44k53Q57M1o24q46R41n23R35M19j47
2758G42o58K55p8jN4k91M08k13q64j90P26l00N85K06o2l99j71o2N53l07N8K21
2780B12p98O93n30m45R69n83N75M37q16M57n86j30R63j185J234p89k2K48L80m18
2800a34R0L70K18j47n25N22q31j2N18K82M29o77o00Q30J7q34N9j15K40J001n52
2821A49j3j43M39j49o04K0M78J87m21o88J214l86j74r5k61R81p56K02J49pM36
2842E58k48j49j86L2n21O10k69k63N22K98n10L51k99K85m92L99k0k91L99o98P38
2863B46n69M09J74L01j018R25k90k10JO00o03m53N78P5p36R0M86k32K55l21m72
$$ plain form
2716 -983 -693 158 -84 173 31 -404 -296 -353 -716 -124 138 -302 -288 -65 -2 -944 -13 312 151 -150 -412
2737 -412 88 -76 18 333 612 -318 360 -137 -42 286 -58 -311 546 587 -37 -883 58 -465 470 889 742
2758 742 84 339 261 260 314 23 431 218 -646 -836 -110 -410 175 381 319 -80 -251 -313 240 -67 -9 212
2780 212 -586 107 -423 -868 101 -482 93 530 -286 171 -415 -545 418 -767 467 -322 -344 -96 284 -134
2800 -134 -44 326 544 397 -128 394 -437 -449 69 351 780 103 -497 333 350 -484 -425 -540 -300 701 149
2821 149 136 -7 432 283 -321 -301 177 364 -57 -745 469 83 -91 -186 -447 534 -222 -20 129 122 558
2842 558 310 161 -25 7 -514 96 -173 -436 86 384 -126 225 -74 211 -281 118 98 -193 206 -492 246
2863 246 -323 86 260 561 -457 468 178 -32 -31 569 -34 -487 91 166 -570 -480 6 -226 29 -292 -764
2884g64Q74j37j55N75m91j88J18O05j62O2m97O47l6n5j46k40P65j32j086P8K20
2905a45q8L75M83q25R6L40o96M87k88J82O84o32k25PM57J7m48O64k99j19N58l21
2927B64n14R79L03j355l53J132j079Q88j76k29P8L8K0J56n31O15J35r31Q02o35
2947c93J37j63R43l20n74O73r45m8M49M79m69j69P43j76pm40J11k84j87J043o49
2968b46N31r2j44l43M54j62j01J65M5o0l31J99N24o38R3Q4J19k9n64N76L9q9j93
$$ plain form
2884 -764 110 -27 -182 393 -98 -286 -168 437 275 337 -160 487 451 396 250 10 775 643 -443 -365 -145
2905 -145 -233 142 625 -200 -104 236 -460 27 -261 -79 605 -27 -252 -245 212 229 -219 445 146 27 585 264
2927 264 -250 729 1032 -323 -676 456 -623 265 89 -140 -62 -24 -4 152 -379 236 371 -560 242 -393
2947 -393 -256 -419 524 204 -370 303 -642 -690 -241 238 -231 -400 343 167 160 -280 -169 -453 -640 403 -246
2968 -246 285 193 49 -294 160 -2 -103 62 107 47 -284 -85 439 -199 -106 -22 97 68 -496 80 119 30 -163
$$ [...]
8191e
##END NTUPLES=NMR FID
##END=
