##TITLE=1H_DE-26
 CDCl3
 64 sc, 
 10.1.2024
##JCAMPDX= 6.0         $$ Bruker NMR JCAMP-DX V2.0
##DATA TYPE= NMR FID
##DATA CLASS= NTUPLES
##ORIGIN= UXNMR, Bruker Analytische Messtechnik GmbH
##OWNER= root
$$ XWIN-NMR		Version 3.5
$$ Wed Jan 10 14:42:20 2024 Russian Standard Time (UT+4h)  she@DPX200
##.OBSERVE FREQUENCY= 200.1313
##.OBSERVE NUCLEUS= ^1H
##.DELAY= (6, 6)
##.ACQUISITION MODE= SIMULTANEOUS
##.ACQUISITION SCHEME= undefined
##.AVERAGES= 64
##.DIGITISER RES= 18
##SPECTROMETER/DATA SYSTEM= spect
##.PULSE SEQUENCE= zg30
##.SOLVENT NAME= CDCl3
##.SHIFT REFERENCE= (INTERNAL, CDCl3, 0, 15.7039)
##AUDIT TRAIL= $$ (NUMBER, WHEN, WHO, WHERE, WHAT)
$$ ##TITLE= Audit trail, XWIN-NMR		Version 3.5
$$ ##JCAMPDX= 5.01
$$ ##ORIGIN= Bruker BioSpin GmbH
$$ ##OWNER= she
$$ F:/spectra/data/she/nmr/H-F/1/audita.txt
$$ ##AUDIT TRAIL=  $$ (NUMBER, WHEN, WHO, WHERE, WHAT)
(   1,<2024-01-10 14:41:14.71 +0400>,<she>,<DPX200>,
      <continue with go, POWCHK disabled, PULCHK disabled
       configuration hash MD5:
       00 E9 B6 7A A2 85 ED C7 34 08 36 98 17 FE 4E 26
       data hash MD5: 16K
       55 25 06 79 A1 9D E1 54 86 89 56 0D 54 C9 36 22>)
$$ ##END=
$$ 
$$ hash MD5
$$ 68 F8 B7 97 FD C7 C1 E8 A7 58 E1 AF 26 7B 86 46
##$RELAX= 
##$RELAX= 
##$RELAX= 
##$RELAX= 
##$RELAX= 
##$RELAX= 
$$ Bruker specific parameters
$$ --------------------------
##$DU= <F:/spectra>
##$EXPNO= 1
##$NAME= <H-F>
##$PROCNO= 1
##$TYPE= <nmr>
##$USER= <she>
##$AMP= (0..31)
100 100 100 100 100 100 100 100 100 100 100 100 100 100 100 100 100 100 
100 100 100 100 100 100 100 100 100 100 100 100 100 100 
##$AQSEQ= 0
##$AQ_mod= 1
##$AUNM= <au_zg>
##$AUTOPOS= <>
##$BF1= 200.13
##$BF2= 200.13
##$BF3= 200.13
##$BF4= 200.13
##$BF5= 200.13
##$BF6= 200.13
##$BF7= 200.13
##$BF8= 200.13
##$BYTORDA= 1
##$CFDGTYP= 0
##$CFRGTYP= 5
##$CHEMSTR= <none>
##$CNST= (0..31)
1 1 145 1 1 1 1 1 1 1 1 1 1 1 1 1 1 1 1 1 1 1 1 1 1 1 1 1 1 1 1 1 
##$CPDPRG= <>
##$CPDPRG1= <>
##$CPDPRG2= <>
##$CPDPRG3= <>
##$CPDPRG4= <mlev>
##$CPDPRG5= <mlev>
##$CPDPRG6= <mlev>
##$CPDPRG7= <mlev>
##$CPDPRG8= <mlev>
##$CPDPRGB= <>
##$CPDPRGT= <>
##$D= (0..31)
0 1.2 0 0 0 0 0 0 0 0.06 0 0.03 0 0 0 0 0.0002 0 0 0 0 0 0 0 0 0 0 0 0 
0 0 0 
##$DATE= 1704883050
##$DBL= (0..7)
120 120 120 120 120 120 120 120 
##$DBP= (0..7)
150 150 150 150 150 150 150 150 
##$DBP07= 0
##$DBPNAM0= <>
##$DBPNAM1= <>
##$DBPNAM2= <>
##$DBPNAM3= <>
##$DBPNAM4= <>
##$DBPNAM5= <>
##$DBPNAM6= <>
##$DBPNAM7= <>
##$DBPOAL= (0..7)
0.5 0.5 0.5 0.5 0.5 0.5 0.5 0.5 
##$DBPOFFS= (0..7)
0 0 0 0 0 0 0 0 
##$DE= 6
##$DECBNUC= <off>
##$DECIM= 32
##$DECNUC= <off>
##$DECSTAT= 4
##$DIGMOD= 1
##$DIGTYP= 9
##$DL= (0..7)
0 120 120 120 120 120 120 120 
##$DP= (0..7)
150 150 150 150 150 150 150 150 
##$DP07= 0
##$DPNAME0= <>
##$DPNAME1= <>
##$DPNAME2= <>
##$DPNAME3= <>
##$DPNAME4= <>
##$DPNAME5= <>
##$DPNAME6= <>
##$DPNAME7= <>
##$DPOAL= (0..7)
0.5 0.5 0.5 0.5 0.5 0.5 0.5 0.5 
##$DPOFFS= (0..7)
0 0 0 0 0 0 0 0 
##$DQDMODE= 0
##$DR= 18
##$DS= 0
##$DSLIST= <SSSSSSSSSSSSSSS>
$$ [...]
##$SUBNAM2= <"">
##$SUBNAM3= <"">
##$SUBNAM4= <"">
##$SUBNAM5= <"">
##$SUBNAM6= <"">
##$SUBNAM7= <"">
##$SUBNAM8= <"">
##$SUBNAM9= <"">
##$SW= 18.0517328524113
##$SWIBOX= (0..15)
0 0 2 0 0 0 0 0 0 0 0 0 0 0 0 0 
##$SW_h= 3612.71676300578
##$TD= 16384
##$TD0= 1
##$TE= 0
##$TE2= 300
##$TE3= 300
##$TEG= 300
##$TL= (0..7)
0 120 120 120 120 120 120 120 
##$TP= (0..7)
150 150 150 150 150 150 150 150 
##$TP07= 0
##$TPNAME0= <>
##$TPNAME1= <>
##$TPNAME2= <>
##$TPNAME3= <>
##$TPNAME4= <>
##$TPNAME5= <>
##$TPNAME6= <>
##$TPNAME7= <>
##$TPOAL= (0..7)
0.5 0.5 0.5 0.5 0.5 0.5 0.5 0.5 
##$TPOFFS= (0..7)
0 0 0 0 0 0 0 0 
##$TUNHIN= 0
##$TUNHOUT= 0
##$TUNXOUT= 0
##$USERA1= <user>
##$USERA2= <user>
##$USERA3= <user>
##$USERA4= <user>
##$USERA5= <user>
##$V9= 5
##$VALIST= <valist>
##$VCLIST= <CCCCCCCCCCCCCCC>
##$VD= 0
##$VDLIST= <DDDDDDDDDDDDDDD>
##$VPLIST= <PPPPPPPPPPPPPPP>
##$VTLIST= <TTTTTTTTTTTTTTT>
##$WBST= 1024
##$WBSW= 4
##$XGAIN= (0..3)
0 0 0 0 
##$XL= 0
##$YL= 0
##$YMAX_a= 277286
##$YMIN_a= -509897
##$ZGOPTNS= <>
##$ZL1= 120
##$ZL2= 120
##$ZL3= 120
##$ZL4= 120
##$ABSF1= 10
##$ABSF2= 0
##$ABSG= 5
##$ABSL= 3
##$ALPHA= 0
##$AQORDER= 0
##$ASSFAC= 0
##$ASSFACI= 0
##$ASSFACX= 0
##$ASSWID= 0
##$AUNMP= <proc_1d>
##$AZFE= 0.1
##$AZFW= 0.1
##$BCFW= 1
##$BC_mod= 2
##$BYTORDP= 1
##$COROFFS= 0
##$CY= 11.3945322036743
##$DATMOD= 1
##$DC= 2
##$DFILT= <>
##$DTYPP= 0
##$F1P= 15.7292609196834
##$F2P= 12.9074282941183
##$FCOR= 0.5
##$FTSIZE= 0
##$FT_mod= 4
##$GAMMA= 1
##$GB= 0.15
##$INTBC= 1
##$INTSCL= 1
##$ISEN= 128
##$LB= 0.24
##$LEV0= 0
##$LPBIN= 0
##$MAXI= 10000
##$MC2= 0
##$MEAN= 0
##$ME_mod= 0
##$MI= 1.114404
##$NCOEF= 0
##$NC_proc= 0
##$NLEV= 6
##$NOISF1= 3.799351
##$NOISF2= 2.8
##$NSP= 1
##$NTH_PI= 0
##$NZP= 0
##$OFFSET= 15.70392
##$PC= 1
##$PHC0= -24592.14
##$PHC1= 16.05273
##$PH_mod= 1
##$PKNL= yes
##$PPARMOD= 0
##$PSCAL= 0
##$PSIGN= 0
##$REVERSE= no
##$SF= 200.130013532006
##$SI= 16384
##$SIGF1= 3
##$SIGF2= 2
##$SINO= 400
##$SIOLD= 16384
##$SREGLST= <1H.CDCl3>
##$SSB= 0
##$STSI= 0
##$STSR= 0
##$SW_p= 3612.71676300578
##$SYMM= 0
##$S_DEV= 0
##$TDeff= 0
##$TDoff= 0
##$TI= <>
##$TILT= no
##$TM1= 0
##$TM2= 0
##$TOPLEV= 0
##$USERP1= <user>
##$USERP2= <user>
##$USERP3= <user>
##$USERP4= <user>
##$USERP5= <user>
##$WDW= 1
##$XDIM= 8192
##$YMAX_p= 0
##$YMIN_p= 0
$$ End of Bruker specific parameters
$$ ---------------------------------
##NTUPLES= NMR FID
##VAR_NAME=  TIME,          FID/REAL,        FID/IMAG
##SYMBOL=    X,             R,               I
##VAR_TYPE=  INDEPENDENT,   DEPENDENT,       DEPENDENT
##VAR_FORM=  AFFN,          ASDF,            ASDF
##VAR_DIM=   8192,          8192,            8192
##UNITS=     SECONDS,       ARBITRARY UNITS, ARBITRARY UNITS
##FACTOR=    0.0002768,     1,               1
##FIRST=     0,             0,               0
##LAST=      2.2672688,     0,               0
##MIN=       0,             -509897,         0
##MAX=       2.2672688,     277286,          0
$$ Real data points
##PAGE= N=1
##DATA TABLE= (X++(R..R)), XYDATA
0@%%%%%%%%%%%%%%%%%%%%%%%%Nl3Q5j20J27j28J28j28J33j60J99k31K54k76L08
39A63l49L90m27M70n26N83o50P17p83Q67r57J051j153J269j402J554j723J915
57A009k136K391k690L053l503M070m812N831p322R716j4183K5267r9026j60270
71b42605K47282K01945k714j459P2247K590j0750k9235j05961r7767j4653o6198
83d7278j13742l6900R342k7844M787O2556M7954L2496O3351N5613J0436q25L1975
96I1921L8563n417l5981n569R221k8995m1088k1530k3046j8953p15k1173l0953
109i3715J7193K5644j3820J3873N7657P747k5007L1357L7225j4518l954J8178
121E7860j2780k2483M66j2603k4828M279K219k1529l918J4833n517j2105J7554
$$ y = [0, 0, 0, 0, 0, 0, 0, 0, 0, 0, 0, 0, 0, 0, 0, 0, 0, 0, 0, 0, 0, 0, 0, 0, 0, 5, -28, 57, -63, 64, -64, 64, -64, 69, -91, 108, -123, 131, -145, 163, -186, 204, -223, 247, -279, 304, -346, 371, -412, 455, -502, 549, -604, 665, -737, 817, -906, 1009, -1127, 1264, -1426, 1627, -1876, 2194, -2618, 3213, -4109, 5607, -8576, 16691, -82335, -242605, 4677, 206622, 203908, 202449, 274696, 277286, 266536, 237301, 131340, 33573, 18920, -47278, -161020, -197920, -188578, -216422, -211635, -149079, -101125, -68629, -5278, 50335, 60771, 59946, 91921, 130484, 125067, 89086, 83517, 92738, 63743, 22655, 1125, -21921, -40874, -41589, -62762, -93715, -76522, -50878, -64698, -50825, 6832, 14579, -10428, 20929, 58154, 43636, 39682, 57860, 45080, 22597, 23063, 10460, -14368, -10089, -7870, -29399, -33317, -18484, -24001, -36106, -18552]
134a8552K0752l86k967Q044O499k828k900K396N50l419r71J75n125k191J0966
149A0043m72j0148J500M601r080p052P52o103o39J4872L767j0224N848J4391m623
164G433q501N759K711l889r52k258l189N374O052p035k938N254J84r731n611J534
180i803J948j362j021M734P439L960L057J021O91K391J411n132o235J833M2q900
196c926l423K214q88l056j010j718k00N261J143j789N454R955J316j221L710J967
212A3789P90m410m783m469j237l528o493j419J721M28P01J312K857N039J989p63
228A524R42M969J872k111q36O10o3J61l643n661J1j43n928l281P22K739p72K760
246f128K144M523L851K473j323J506N117k320n909p71j40j580m177l482n13R93
$$ y = [-18552, 2200, 1814, -1153, 6891, 13390, 10562, 7662, 10058, 10608, 7189, 6218, 6393, 1268, -923, 10043, 9571, -577, 923, 5524, -3556, -10608, -9856, -15959, -16598, -1726, 2041, -8183, -2335, 12056, 7433, -1068, 4691, 7402, 3513, 2561, 303, -2886, 2488, 8540, 1505, -1433, 3821, 4005, -5726, -11337, -9803, -7855, -9217, -10238, -5504, 1935, 5895, 8952, 9973, 10664, 13055, 14466, 9334, 3099, 4932, 4974, -3926, -7349, -5135, -6023, -9079, -10089, -11807, -12007, -6746, -5603, -7392, -1938, 8017, 9333, 8112, 11822, 13789, 14579, 10169, 5386, 917, -320, -3848, -10341, -11760, -10039, -9611, -8910, -7598, -4741, 298, 2287, 1524, 2466, 7435, 9307, 7196, 6360, 6970, 6907, 7068, 3425, -2236, -2225, -2368, -8296, -11577, -10855, -8116, -8888, -6128, -3984, 539, 4390, 6863, 5540, 7046, 12163, 9843, 3934, 3163, 3023, 1443, -2734, -6216, -6729, -5736]
262e736L03k476n9M169K826m51J532K023L165N65k295L23J704J89k520j962p24
279E76k71r44k872k129O17J760k175j405K319K571P43J404J817K098K197j29j211
296D966j288Q30j399m726j235O91J042j814k05J501J396j3l93k162J720R45j396
313a540k384J134L475m33%J481K420J309n73j122r8o37j089l531k411J436K99
330b264o82n95J112J397N42j569M27P84P19r79j230K081K330J132p0P97J881k55
348E558j601k519j466q23j617l177j481J875J785l87J04K263J596J611K45k24
364A742J206J352n83p81O80o69m21k314j424n0j01j356j618R50N07l38M10N03
382b305K242J329M39l66J770O01O53r21q52N14kk134k860l54o26o88o27nM86J934
$$ y = [-5736, -5433, -7909, -7968, -3799, -973, -1424, 108, 2131, 5296, 5861, 3566, 3889, 5593, 5782, 3262, 1300, 576, 305, -639, -3511, -5640, -5023, -3263, -5438, -6843, -4524, -1953, -1210, 194, 2011, 4109, 6306, 6177, 4966, 3678, 4508, 3109, -1617, -2852, -2161, -1119, -2933, -3138, -1637, -241, -254, -647, -2809, -1089, -144, -1540, -3924, -2790, 685, 252, 252, 1733, 4153, 5462, 4889, 3767, 3669, 3032, 1943, -1588, -3999, -2563, -2264, -2946, -3541, -2429, -1032, -490, -2059, -1632, -848, -129, -1108, -2338, -257, 2073, 3205, 3135, 3932, 5813, 5558, 3957, 1438, -28, -851, -2468, -5645, -7126, -5251, -3466, -3853, -3749, -1486, 110, 1721, 1966, 1742, 2948, 4300, 3717, 2936, 3616, 2947, 2526, 212, -1212, -1262, -1363, -2719, -4337, -3387, -2880, -3218, -2808, -2305, -63, 1266, 1705, 1339, 3109, 3710, 4363, 3442, 2590, 3104, 3102, 968, -1892, -2246, -2872, -3560, -4187, -4192, -3706, -1772]
402a772J326n85K279J421Q74q24j40J43j83j501j40l77k10n84p37q38R14M76j115
421a573r56K0J372L94n86J034J937N13p43J02P46M83j110r27j581L93L23j271
439a430m44L17Q36L96j004N56j93N06N45r56J354k30J490j54j54N81o78q8j125
458A25k83N61j110m65K64n84J515k58p81J87R04j53o70N54P0Q03n16M08M16P25
478A712K22j636k15R6R41o14j671m56L35M94o76n63J096R98N5n53M72K84J013
497A334k90k51R84j83j239O02o24n0Kq25m58m10N54j448R6K19O09R42j380N52
517a264K719q48Q34O02M37r1M67j132p00r69k81k50k676J504K80p96l22J09K407
536C0q23Q68N2M40Q31l92M89r68K070j95j357j3l46M30j356P7j355j134Q26L10
$$ y = [-1772, -446, -1031, 1248, 2669, 3543, 2719, 2579, 2722, 2539, 1038, 898, 521, 311, -273, -1010, -1848, -934, -458, -1573, -2529, -2509, -1137, -743, -1329, -295, 1642, 2155, 1412, 1514, 2260, 2743, 1633, 706, -875, -482, -159, -1430, -1874, -1557, -721, -325, -1329, -773, -966, -460, 85, -871, 483, 253, 1743, 1589, 1435, 2016, 1338, 1250, 125, -158, 403, -707, -1172, -908, -1492, 23, -235, -1016, -829, 75, -78, -748, -194, -124, 679, 163, 571, 987, 1712, 1934, 298, 83, 179, 1120, 506, -1165, -1621, -1286, -792, -1468, -2031, -935, 63, 118, -435, 37, 321, 1334, 1044, 793, 1777, 1594, 355, 957, 333, 283, 285, -540, -998, -1408, -854, -2302, -2206, -1987, -1378, -436, -1816, -1264, 1455, 607, 1441, 2043, 2480, 2389, 2856, 1724, 1024, 55, -226, -476, -3152, -1648, -1368, -2164, -2486, -2377, 30, -793, 75, 127, 567, 1398, 1006, 1495, 527, 2597, 2402, 1045, 1032, 686, 1116, -240, -163, -1518, -2652, -1826, -1516]
556a516j195J065J693n32K16J161O47N51r0K37J2j054l39p06j169M18N08r10o62
575a665J227J02r50k39J014n65L89J597n01n76Q50J182j310P72N48j63j707k08
593b03N16m09r78J99l22k96L05M97n28N75J338j17n24R03k9k44L0j34P62j433
613i2J381j401p34J615r07O5j215P01k34K41r02k41Q64L22l43Q55P8J435K14k85
633A417j116J143%j338J61o32j22l59L54L31p92N03q7k9l50J339k65r88L06J394
653H70L3m03j13M37J48l30j34o89O19n47j118L05K24m33N41J3r5N60Q29j130K51
674a62l4J744j117K13QO76j236k85L33k39J69k92n05M37n85Q69M81r59l09J276
694D83N35j425K88J369k81m54p10O94J62k51k42p24J236m90k57l97j71L64J37
$$ y = [-1516, -2711, -1646, 47, -485, -269, 892, 1539, 2090, 2000, 2237, 2249, 1195, 856, 150, -1019, -601, -93, -1003, -1665, -438, -336, -1286, -1525, -511, -1076, -687, 910, 409, -167, 683, 1865, 555, 1327, 1875, 1712, 5, -203, 313, -96, -1074, -875, -1197, -1493, -1188, -691, -1219, -644, 694, 577, 53, 956, 927, 683, 713, 579, 1341, -92, 1289, -112, -846, 769, -138, -73, -1288, -587, -821, -580, -1482, -1723, -859, -537, -880, -25, 53, 1488, 1702, 1417, 301, 1444, 1444, 106, 267, -365, -487, -846, -492, -161, -953, -450, -537, -566, -916, 423, 158, -830, -524, 870, 903, 500, 387, 824, 972, 642, 508, -181, 438, -109, -1227, -922, -698, -1131, -590, -577, -672, -112, 717, -413, -162, -196, 1548, 431, 644, 652, 1328, 92, -193, 140, -99, 70, -222, -727, -290, -875, -6, 475, -484, -793, 483, 1018, -407, -119, 1250, 969, 515, -195, 499, 661, 410, 168, -556, 680, 190, -67, -464, -635, -271, -134]
713a34k19m72J69R73l97q4L72O03n71J64l55N03k62%j131J284q93o41l34J823
733C98j155J007l29q54J79Q23O29q63O21J52k84m74M70N8L29m53j45p20K67L5
753c09l42M64o34O82j03o79N43J86J102p11j80P88q10P03o46P9N12J36p22o1m11
774d13m84Q17l82K25n45L88j37K03p03J595p67O3O73K08N23n16J41n03m26Q15
794G75q89n15N16p36K89k05K16j10K84N67o50L54J111j145j06L03Q0O39r34M18
814B62N60K33L7j054P57j347J092j599mj41R79k25o08P51P73M25m77q2K44M57
834A033J4m43j5m86Lk10j97M79m33l44P90m53J52M71o40R1N28k62k72p92J964
855I78J59m45k36M02n42J35pm65k37l27O66n96j49n01O58Q74l45O65m36N06p86
$$ y = [-134, -353, -825, -656, 317, -80, -164, 208, 811, 240, 404, 49, 552, 290, 290, -841, 443, -450, -1091, -1425, 398, -757, 250, -79, -933, -754, 69, 698, -165, 456, 608, 324, -150, 320, 378, 707, 254, 109, -611, -344, -309, -651, -187, -821, -139, -242, -921, -378, -192, 910, 199, 19, 807, -3, 700, 54, 133, 645, 781, 59, -2, -413, -897, -80, -462, -237, -782, -394, -531, -328, -1031, 564, -203, -140, 533, 741, 1264, 748, 889, 386, -40, 775, -114, -629, -113, -849, -560, -765, -549, -659, -375, 192, -458, -104, 1007, -138, -244, 59, 139, 778, -156, 262, 822, 1055, 1092, 38, 795, -552, 540, -1059, -1063, -1204, -225, -450, -1058, -307, 466, 891, 414, 332, 576, 1033, 1047, 604, 589, 103, 106, -104, -301, 178, -255, -599, 191, -262, -110, 361, -279, -188, 340, 78, -194, -986, 978, 1137, 692, 456, 858, 316, 451, 444, -21, -258, -585, 81, -515, -664, -1165, -507, 367, 22, 687, 251, 757, -29]
876b9K47O8m77L67L90Jj002L97K31j19N17r60P4m09KP23l14r35P80R39k29j038
898g76J170m48M87j48J07j72l08J8o93L73k85R53m24j01R5p6J78m30L35j71Q83
919E67J29j038J07R65m76m33J165l59m02k64r85J671j91l96o34j0N85n23M30L46
939B54p96O72k7J70j99K59q11R97j71L5j44K46m22j15o3M63j15m27m94Q50N7j43
961G6L23o86O00K3m65O76j55J57J70n35J79n06M39j291Q47j48K28k44l36N21K09
982H2k1p53Q93P1l05J45o2L40L75q47J38O92l9j101M51j147R31r0l77L69k38J55
1004c38o9o9P73k79K26K30lo50M37p0N15o49Pj47M39q7q99N46q39O02K83L54n56
1027b43m6M19N03j005P77M5l48k9J65N25j145O4M95l6m00J86n26N83L6J95q86
$$ y = [-29, 218, 286, -191, 176, 566, 567, -435, -38, 193, 74, 591, -369, -295, -704, -702, 21, -293, -1228, -448, 491, 262, -776, 394, -54, 433, 285, 392, 220, -88, -70, -763, -390, -675, 278, -146, -247, -152, -228, -50, -480, -145, -316, 567, 696, -342, -235, 730, 254, -179, 986, 627, 225, -39, -1024, 647, 456, 60, -574, -584, 1, -522, -92, 254, -542, 130, 103, 273, 74, 333, -478, 519, 348, 383, 239, 485, 63, -52, -115, 348, 233, -194, -688, 162, 219, 76, 399, -287, 313, 336, -129, 547, 392, 549, 719, 184, 363, -143, 296, -995, -148, -296, -68, -312, -648, -127, 82, 61, -692, 201, 272, -33, 112, 50, 390, 765, -82, 56, 748, 709, -392, 59, -1088, -157, -247, -624, -255, -493, -338, -407, -476, 297, 18, 244, 474, 471, -179, 258, 188, 703, 54, 61, -86, 353, 266, -633, -87, -926, -324, -41, 313, -243, -289, 130, 633, -372, 405, 450, 102, 73, 238, 763, -382, -318, 177, 141, -259, -73, -599, -16, 20, 215, -671]
1048f71L99L92j28j2J47j59L05j59n78R03j62o63K95K46M96o12n41Q15J33r37
1068d91m8K52K78q06N39k57O55ql71J81l2K34n30L71L57n76M67k92j79O0N79L43
1090G26j100J99L03N60o41k22j39J81J88j160R41j9P80m92J69j18j49O0m4k39
1110b16K89l47M85m7n47L92J42n89N0M31m49O15k55J73O11n47r1N38p34J9K20
1131A43l91K34n0k60n9o12J617k84k81Q6J44L51n32O3J58M1m51L82K19p2l81K59
1153C24m5l32l54j91J154n76j6j25N21l01P50p92N29n96k95J71Q26N18j071k77
1173a78K53k18m42L70k91N17j59m9M02k8rj032J44P23K74k5O82j486Q53n52M11
1194A60m36L38l33n1O23K86j067K78J05r2J43J13o84J120m72k86o4K30L21m47
$$ y = [-671, -272, 120, -8, -20, 127, -32, 273, 114, -464, 439, 277, -386, -91, 155, 651, 39, -502, 313, 446, -491, -539, -287, -9, -815, -276, -533, 122, 114, -257, -76, -108, 126, -404, -33, 324, -252, 215, -77, -256, -196, 383, 726, -374, -175, 128, 688, 47, -175, -314, -133, 55, -1105, -164, -183, 597, 105, 274, 156, 7, 67, 23, -216, 73, -274, 211, 164, -383, 9, 151, -438, -388, 43, -406, 209, -46, 127, 738, 191, 100, 638, -96, -77, 143, -248, -14, -64, -324, -383, -995, 622, 338, 57, 143, 287, 638, 106, 169, 327, 368, -83, 299, 518, 446, 65, 324, 279, -53, -407, -598, 556, -20, -36, -161, 360, 59, 809, 17, 546, -50, -345, -174, 652, 1170, 99, -178, 75, -143, -585, -215, -506, 11, -148, -197, 205, 177, 168, -864, -720, 3, 277, 252, 934, -552, 301, -251, 160, -276, 62, -271, -322, 301, 587, -480, -202, -97, -189, -46, 67, -617, 503, 31, -255, -319, -89, 232, -215]
1214b15R5r7m57L25k69Q02L92q25N96j001P24j0m69L15M55M7n92J31m5K17k60
1235a41J90J06l7K37p01O08J03n00M88m40J24p6r1K68l14N69p04j20M72j05N10
1256D46L82j023M15M04l80P9p9J2m71M55L36r97p5L16k35N36n75O85o7k81l0P36
1278E89l38j55K29m42M05Nr2k10M94l65k19K49p23Q96l73O6L22r16K40N11J51
1299C24k9R1l16K23m5q49Q67K36o38j79m94J191j38m86k54K75M63l36K63o79N29
1320A9l11K30K14M99k38k91K65L35j099o6P79k73j71n92K51N1N85o32O16p1J76
1341B76M51l74L74o98O37n96M89o06r4NO29m70l92M37p89P98L6p46M86j85O87
1362C55n0K34o27J56l09l4M51j03j77N76q09K79k58N57m45O98k99K57q16M86K45
$$ y = [-215, -120, -217, -674, -349, -618, 184, 576, -249, 347, -654, 70, 60, -409, -94, 361, 408, -184, -53, -98, 119, -141, 49, 155, 118, 355, -346, 262, 365, -135, 353, -87, 37, -39, -130, 138, -176, 393, -311, -431, 41, -64, 446, 828, -195, 220, 624, 244, 323, 244, 256, -215, 240, 576, -421, -496, -180, -415, 121, -454, 231, 164, -117, -147, 589, 251, 96, 325, -117, 288, 293, 201, -9, 485, 120, -99, 150, -573, 323, -50, 16, 338, -578, -338, 173, 324, 295, 386, 70, 293, 248, -601, 266, 502, -136, -315, -809, 382, 244, -242, -496, -221, 242, -94, 169, -510, 19, -292, -62, 152, 651, 413, 122, 387, 722, -377, -443, 336, 63, -108, -700, -449, -398, 187, -445, 171, 100, 276, 727, 353, 727, 29, 666, 70, 559, -47, -141, -136, 493, 23, -369, 68, -721, 77, 113, -633, -147, -332, 355, 305, 539, -88, 68, -241, -275, 176, 73, -104, 472, -337, -58, -316, 241, -204, 494, 195, 452, -364, 122, 367]
1383C67J64l34j21J31L50l38J68j15K36k61q00O23j48J007r87P82L69j159Q9l43
1403c20P82k76o40M75k48J20M70n64L52m64l89Q59o12M20OR75p63j49j15L85K72
1424E76m82L06n48J1j40N52r1M50q9o06Q42k33J46m88O6m19J022m25j022M97j39
1445b14J49n52R83j53j54j64J80L70q66L00N15j213J121m33m55O25M8n77J197
1464G07j005P9R9K05j91J8M7j13k56j81M08m00J220m30q16P64M63k27p13N78K89
1485E45m06n02l63L31N62m95J024m21p33JK59l22Q96J05K25o75m97N59k99q2K93
1506EM55k37l04j77P2J01M46j65K81m03ll30Q29j106J46K54O82q40K97o62M80
1527a79J77q0k00N83P3q91Q55n01R1j89N60n01l9J60K61l74K81m65P53n63N51
$$ y = [367, 531, 197, 76, 207, 557, 219, 387, 272, 508, 247, -553, 70, -78, 929, -58, 724, 1093, -66, 23, -320, 462, 186, -454, 21, -227, -107, 363, -201, 151, -313, -702, 157, -455, -35, -29, 946, 183, 34, -81, 304, 576, 94, 400, -148, -137, -277, 275, 184, 634, 545, -61, 781, 548, 694, 206, 272, -147, 875, 450, -572, -75, -214, -65, -617, 366, 213, 59, -105, 75, 445, -421, -121, 394, -819, 302, -131, -586, 39, 87, -490, 707, -298, -219, -120, 85, -106, -88, -41, -154, -410, -591, -183, -583, 637, 207, -609, 155, 618, 391, -322, 256, 545, 139, -363, -726, -395, 167, -328, 696, 275, -458, -457, -198, -520, 376, 481, 706, 31, -466, 93, -206, -288, 5, 460, 223, -81, -258, -186, -85, 361, 196, 477, 74, 71, -259, 570, -536, -390, -136, 546, -294, 3, -659, -179, -2, -82, -282, 301, 374, -517, 338, -163, -72, -261, 299, -202, -241, -81, 180, -194, 87, -378, 375, -188, 363]
1548C63l81L5j0J24K86L22r27lj21M18k22m44Q30m69L2N55j56m89L71p76J392
1569G30l37L8j84n08m36Q59q73J5P58Q5o3j37J02N30j245L05P47o93J040r08K79
1590A04j62R8P9j016P21K67J120j104L90p69L43J44k79P41r05O27r98L26L3M35
1610A95k42L95n64K5O76q76N43o37J049n74L32j77j09L50K19r64R60M0k07j09
1630C25o69J33j99j73P48j2j60m21J33J19j05L72o84Q90k46q1N75l55R0k94N60
1651E46l42J56n50K85Ll93R89l42n20N36m71L74l03M8R13p29j045J222j49l62
1671a34P05p8p65L35j12K59L99o18O22m86k57P84p07P46l79m82L12P9m38J88l49
1692c76L46q3M07r4Q6J67k72m48L68L99o14M95k39M7k46K78M1j40l54j84J163
$$ y = [363, -18, 17, 7, 131, 417, 739, -188, -191, -312, 106, -116, -560, 270, -199, -167, 388, 232, -257, 114, -662, 730, 393, 431, 247, -261, -697, 162, -711, -696, 62, 147, 84, -53, 49, 579, -666, -361, 386, -307, 733, -175, 104, -58, 40, 119, -897, -176, 91, 1211, 107, 497, -272, 71, 215, -64, 677, -228, 399, -599, -273, -240, 195, -47, 348, -216, -191, 485, -391, 152, -485, 564, -10, 322, 145, 36, 386, 605, -359, 601, 641, 434, 325, -344, -211, -410, -583, 165, 153, -7, -428, -295, -176, -281, 91, -593, 297, 51, -30, 545, 190, 280, -14, 546, 204, 360, -190, 95, 98, -295, 694, 352, -168, 368, -103, 271, -32, 16, 929, 200, -845, 377, 228, -134, 571, 493, -272, 63, -49, 210, 609, -9, 613, 127, -130, 654, -53, 693, 314, -168, 144, 223, -215, -27, -376, -30, -113, 294, 200, 286, 453, 181, -267, 101, 500, -114, 381, 142, 189, -57, 221, 262, 122, -232, -416, 747]
1713G47j108K18K06k25J64J83m76J00K36M32K08j358J214L79n37p56K04O24l73
1732H2k3L80o58J09J30k87R4K9K2K26J60j4k41l33K77R16p47r16P63n8L60n8o54
1755d41R5o8N80n23M79j75L34m9j87K14p17J070q73O14K48OJ2q40N05jk86j68
1777a71j35N24K06po67M61k36J096r33p49N83J36L48p30K58J21l2M84p71J3j81
1798c82P73j8r55R80p59J536j387j43N80R7m41L07p81R27j69n27L36l0o12J688
1818A020j514Q20l83L9k13N82j27k81lq40P83j23J26n0K39j2M32k78l63J61l48
1839c33J21k21M24K48J31o51L91j37j44k13K73N52N90j318M12l48K10L11l78j3
1859i3n04Q71K15m19L33P46o42j68m71j21O08j9l60j62J58L85o57j06k86O73q8
$$ y = [747, -361, -143, 63, -162, 2, 185, -291, -191, 45, 477, 685, -673, 541, 920, 383, -373, -169, 455, 82, 59, 439, -219, -110, 20, -267, -173, -144, -122, 104, 264, 250, 9, -324, -47, 869, 122, -794, -31, -89, 271, 213, -441, -346, -414, 166, -357, 122, -53, 281, 232, 45, 259, -458, 612, -261, 353, 601, 607, 619, -221, 284, 283, -3, -171, -306, 218, 424, 417, -250, 211, -25, 1071, 138, -611, -28, 108, 456, -274, -16, 105, 73, 557, -214, -201, -382, 391, 373, -582, 398, -361, 1175, -212, -355, 225, 322, -119, 188, -593, 334, 165, -362, -26, -56, -668, 1020, -494, 326, -57, -18, -231, 351, 224, -57, -60, -900, -117, -240, -114, -164, 75, 63, 495, 217, -146, 15, -333, -212, -433, -9, 239, 370, -281, 110, -27, -171, -384, -111, 441, 1031, -287, 125, -223, -13, 298, -80, -93, -597, 274, 489, 70, 403, 1149, 507, 339, -132, -253, 355, 336, -24, -186, -28, 357, -300, -406, -692, -19, -107]
1880a07l74M19M12r05N11L48M30n89M29L20j075k70L06p9m60R19j114J141L98
1899F60o87L79m30J50q7l4P31n25q1J19l15N18o19L87j00k57L94p68J85J35o0
1920c05J12j24J039n6j670J264o4K16p61Q4K83m22J014q3m34L88n97rl36N77M31
1941E47l61k10J76P4m70m5K04k8R99l45L7j01M4k07r02N75k50K39j95k34P14m31
1963a70N62j88p09j72L05P42k81n33P65l33K02J25o17K76o67Q47j16M16q33K94
1983h5k5l07O85o57M44m49rj1l73O17j39j10Q86Q8n62L74r02R45ok08k50k62N42
2006B26Q7n80j01N87j194K83Q54k11j9J30j95o62J358l33N25j062o3R74j728R46
2026a78L14j18P2Q8p12O9M93P6L6m09K72j1k48P72p67P64r26N84r12R62m4J36
$$ y = [-107, -481, -62, 350, -555, -44, 304, 734, 145, 574, 894, -181, -451, -145, -224, -684, 235, -879, 262, 660, -27, 352, -78, 72, -15, -49, 682, 157, 76, 195, -120, 398, -221, 166, 66, -191, 203, -565, -380, -245, -305, -193, -317, 722, 666, -1004, 260, 196, 412, -349, -265, 18, -404, 610, 527, 93, 481, -116, -125, -461, 116, 547, 186, -24, 152, 226, -244, -289, -85, -113, 886, 541, 578, 477, 521, 314, -588, -13, -263, -24, -219, -453, 261, -170, 392, 204, -505, -677, -372, 370, 89, -444, 321, -12, 190, 315, -302, -26, -693, 154, 38, 454, -379, -85, -110, -417, 268, -389, 55, -394, -403, -414, -787, -170, -309, -419, 467, 555, -7, 367, -535, 410, 404, 196, -54, -316, 226, 313, -267, -368, 219, -975, -692, 162, -49, -68, 62, -133, -795, 563, 230, 755, -307, -370, 604, -1124, -178, 136, 18, 90, 178, -534, -465, 28, 104, 140, -269, 3, -8, -256, 516, -251, 513, -413, 171, -741, 221, 177, 313]
2048C13p19pn2M45N42p42p4N34M34m44o38J37J019j166L07J23P67r38j7j56Q08
2069D76j25K15j072R65m45O96j161R45o4m53OJ85q9k90J38k62L9j26k7O42n0P27
2091H70n84o67M46K4k79r5K40n0m39M85O10q27M57N9P3k34K61m59Kk6L29K55j074
2114f23O49j009Q25k64P00j150J244m96O8o49K59J009k49j79k87J065j163J052
2132H02r00N61q90N46l81K10k67K56K36J60l84o36N96j90R70o38O19j176J055
2151E49j117P38q5J62p41M44K46o7J63k5k04l18n5l84M54J25K35m07M63n59N11
2172A28j43o1P07n13q27N48k25L15J04k76N76m60k11M63L47n03k53k32N8K47p54
2193i65P16K89j51J78J79m64N93l01k91J81j93m4N31m08K42q66M13J025r44l34
$$ y = [313, -406, -413, -465, -20, 522, -220, -294, 240, 674, 230, -408, -271, 748, -418, -111, 12, 779, -159, -176, -332, 476, 351, 566, -506, 459, 14, 710, -451, 494, 430, -23, -17, 168, 79, -211, -73, -335, -296, -422, -449, 193, 143, 870, 286, -381, 65, 89, -190, -285, -45, -95, -534, -49, 561, -266, 191, 250, 323, 89, 350, -109, -107, -133, 196, 451, -623, 26, -983, -158, -422, 278, -872, 372, -124, -56, -705, -446, 563, 314, 135, -152, 913, -250, 802, -98, 463, -427, 119, -262, -52, -319, -63, 173, 333, -51, -687, -91, -281, 689, 51, 670, -506, 549, -568, 170, 85, 247, -494, -50, 196, 129, 292, 267, 63, -255, -310, -694, -240, -115, 120, -287, 176, -383, 128, -15, -76, 631, 118, -709, -161, -386, -71, 33, -243, 333, -127, -338, 125, 472, -31, -284, -516, -458, -211, -965, -249, 40, -111, 67, 246, -218, 375, 74, -217, -36, -229, -273, 258, -150, 92, -774, -361, 664, -280, -614]
2213f14O15J04l57P17k0J82m54O83r34L89j87k29P28j18m40N63k11p83n39J308
2233D03m32J33J36J13K04o39L98p50m86M49O7J12Q0m02M08j38Q78r64K80K9p65
2254h86Q18J04q27J047p53J080r84M77L1K10N8j170O88O21J20l10k79k10N9J99
2274I3K70M5j059N23M60j57l07K8o76J239o21K11m77J080k49n26n28O15M5N84
2294E93k98l98K46j56m6J30M1k34k95M94l79k02O06o51J429r36l31R42p52J36
2314f1k13J56K9N62r48p2R2K03K36j85K15M99n19n3j18J78K53J92o46K94k68k8
2336b02N04p38K11l72K01J136j349J077l26k59j6K97J13J000j050p03J148n47
2354A25o09N43k88k67j44L79J67j83l77R73J52l82L32j63l59l51R43n70j25K09
$$ y = [-614, 1, 105, -252, 465, 445, 627, 173, 856, -78, 311, 124, -105, 623, 505, 65, 628, 417, -366, -905, 403, -29, 104, 240, 353, 557, -82, 316, -434, -920, -471, -404, -292, -212, -614, -206, -344, 534, -430, -150, -121, -886, -68, 36, -791, 256, -497, 583, -401, 76, 107, 317, 375, -795, -107, 514, 634, 324, 45, -165, -106, 93, 363, 408, -651, -128, 332, 175, -132, -104, -780, 459, -162, 49, -428, 652, 403, -123, -651, -36, 9, 593, 295, -103, 143, -13, -59, 71, 112, -122, -417, 77, -302, -504, 102, -549, 880, -56, -387, 555, -197, -61, -274, -118, -89, 473, -475, -547, -455, -252, -16, -201, 14, 513, -6, -59, -177, 1, 254, 446, -200, 94, -174, -202, 302, -436, -225, -597, -396, 740, -609, 468, 142, -117, -133, 164, 277, 1277, 227, -476, 672, 125, -484, 59, -229, -496, -640, -261, -94, -277, -654, 319, 471, 89, 421, 258, -101, -452, 491, -79, -204, 5]
2374Ek25P37j011M11K38m9n3O68j101M9N52p03J96Q26n19o37L74O07m02O03n68
2395bn28P11l6m87N84j09p96O21r6R2l2j36n22P47K43p13P68L1l74K59p19N55
2417F1K74l48o21N67J203j226J10N25o46J03J91J59j232M47L01K01k95j48O94
2436C20n30M40q7k27M06l97k17O7L03P6l51K0P9J27K10j044J204P78r91m04p2
2457b90K81j95J62l1m94R44m13k24O49k74L14j102J061L07n46q8j6k18P98j587
2477i62N44L67M7l50N20k12p83J383j60q45M15p9K79p5k70K44L70o36J47K0j16
2498a52k56J39o2K10j04j31Q4J21l60N27J6J33N52q46N6j18M41j181P49M37p8
2519A77k89j62L22M54o78N7L79j185Q57m9K01Q80p37n07N32R8m74m3o06J118k17
$$ y = [5, -220, 517, -494, -83, 155, 106, 53, 721, -380, -331, 221, -482, -286, 540, 21, -616, -242, 365, -37, 566, -2, -530, 181, 145, -342, 242, 133, -663, -42, -138, -46, -78, -214, -736, 11, 254, -459, 309, 340, -34, 225, -494, 61, 335, -13, -634, -67, 1136, -90, 20, 545, -101, 2, 193, 352, -880, -433, -132, 69, -226, -374, 320, -210, 230, 143, -84, 322, -75, -292, -225, 78, 154, -197, -177, -98, 29, 239, -805, 399, 1177, 186, -218, -290, -9, -204, -42, -73, -567, 377, -36, -260, 389, 115, 429, -673, 388, 695, 149, 61, 45, -173, 625, -962, -418, -51, -4, -354, 166, -46, -829, 554, 394, -451, -36, -115, 164, 89, -181, 63, 433, -203, -56, -36, -152, -408, -269, -331, -121, -225, -356, -272, -151, -511, 16, 32, 165, 717, -129, -73, -191, 250, -931, -182, 255, 177, -112, -274, 48, 502, -176, -119, 260, -925, -68, -117, 84, 964, 227, -280, 252, 350, -124, -167, -773, 345, 128]
2540A28j59o73J008o66K90L37r54Q62n95J031o64k0j54j39Q77m58O4m35J090o16
2560A54p56P48K23l58K62k41O16K25j598J29O97L88r74Q91l39L31ll14m48l3L95
2581ej31L64o43M35J93q24P08k10J77L1r37L47O62L29m95N04j345J233p57L23
2601d1M23J09j37n88K64j05L36j84p47N39K99L38r36O50N75m48j29L84j088m85
2621i71R69k98O06n01L54m32l31L22L50n29l42Q62K00n19L06k6J58o24P53k72
2641C5J017n16l38L25l80O58o03o76J14P17m10N08r1j86j76k47K92j17o5K63o6
2662E8J30P98r34j50M26j002J090l85p9J4K75l12j96k00L99n03J310p30K90l2
2682B67r33J53M31N22p3o74nJ49j49J48l40J038j179J89M34K14n78L63K28J97
$$ y = [128, -31, -704, 304, -362, -72, 265, -689, 173, -422, 609, -55, -75, -229, -368, 509, 51, 115, -320, 770, 154, -602, 146, 369, 11, 273, 32, 648, 873, -725, -596, 101, 489, -485, 406, 67, 398, 395, 81, -367, -400, -5, -136, 228, -415, 20, 213, -611, 97, -113, 64, 95, -842, -495, 167, 496, 1, 505, -840, 393, -364, -41, 382, 491, 354, -234, 30, -75, 261, 77, -670, -131, 168, 506, -430, 220, 795, 347, 218, 602, -486, -971, -2, -300, 306, -195, 159, -273, -604, -282, 68, -461, -803, 59, 259, -260, 46, 20, 178, -446, 307, 35, 1052, 536, 198, 523, 143, 801, 198, -478, -364, 353, -57, 451, 360, 174, -2, -249, 43, -74, -139, 124, 58, 188, 986, 52, -98, 328, -674, 416, 31, -48, -34, 241, -71, -267, -467, -68, -571, 739, 9, 299, 267, -666, -513, -82, 440, 367, -307, -312, -163, -312, -164, -504, 534, -645, -456, -22, 192, -386, -23, 205, 402]
2702D02m71M1L65n85J39K20J32L66m80K57k86k52L68n37L77l18N6M74q67K42m
2723c61R2L22o11P35l09K1j65k96J06P71l59j24N92m30J50j28J09J21k44q30O23
2744b15J70J64p26L14M41r5L34q01M35L78q03K57M07k54N67q65L5j84L02P72j031
2765c98L17N5n07N81p7P24o32J5k02j10R41k76J8n23M79o92K87L91n55J60j20
2786a24L7m19O78j00M55k24o20K81j70Q40n56O8J95J03k07J17m2r27N97o31N07
2807a42M54J40k99j32k21k40N04l90M1L9R3J63P49m84n33O25j405J258l54p25
2827h59N60J36l84P08K6p30L52N03L2o27L16n63L90J10k73M82J80o20K36N76n33
2848A8M6N61o81O6r6L17k1l36L1L24J66j73j003R07j40L32n64P7q15O56L05J20
$$ y = [402, -69, -28, 337, -248, -109, 111, 243, 609, 129, 386, 100, -152, 216, -321, 56, -262, -206, 268, -599, -357, -361, -269, 53, -558, 177, -132, -111, -276, -572, -466, 305, -54, -178, 414, -16, 134, 6, 115, 236, -8, -838, -215, -45, 119, -607, -293, 148, 53, 387, -414, 21, 399, -404, -147, 260, 6, 573, -292, -257, -441, -139, 633, -398, -81, -26, -533, 48, -29, 695, 63, 78, -124, -234, 707, 431, 449, -74, 405, -287, 0, 391, -164, -4, -124, -87, -506, 172, 72, 527, 303, -317, -36, -206, 634, 78, 146, 341, 444, 237, 354, 312, -615, -18, -649, -142, 312, 452, 153, 21, -200, -440, 64, -326, -285, -246, -153, 10, 759, 275, -258, 367, -1038, 220, -134, -859, -299, -163, -547, 161, 187, -543, -191, 312, 344, -283, 33, -530, -140, -30, -303, 179, 359, -261, -25, 551, 18, 64, 625, -56, 10, -86, 231, 210, -126, -95, 229, 395, 222, -781, 126, -14, 318, -246, -169, -984, -328, -23, 97]
2870I7p39P44o2m09M44j31j11j31M60q8m81L38n57K57O40j031O71O12k10m80K64
2891I7q87J122P5q88o6J115j324O92l11p0Q77P3m23J89l95J1p2K56M89k69J57
2912D48q39M04Q4o8K59p03R70j233L66J01K8R2L8j46l31O52Q0K20j88k10Q8j67
2934e5P15K01j274J117J68j80o08j17n0K93o95P4k9O7M84K91n28J35j69j27L73
2955H6j0J96j23q22N63j41L23J93m1J15q58N16K57k77N44m89j92M35k75J44O36
2976G80o75k22R28k25o45j56J05M31k50o35K92P69m02k83M72m00k2l8K54J72K8
2997B78o37R6Q4P74o13O54n98q86L02Q26j04j61M63lp15R7L12l52J17K38n51o0
3019d39L27P1Q20j464Q48r49R19p37M28J39Q98j153O69j009R67q61P51O4k34l19
$$ y = [97, -642, 102, 40, -369, 75, -56, -167, -298, 162, 74, -407, -69, -626, -369, 271, -760, -89, 523, 313, -167, 97, -790, 332, 407, -481, -547, 568, -756, -64, -375, -445, 432, 505, 82, 271, -124, -113, -185, 71, 560, 291, 448, -391, 13, 97, 29, 288, -415, 555, -678, -312, -211, -183, -91, -53, -199, -530, 122, 202, 422, 234, 24, 112, -55, 660, 861, -413, 704, 872, 692, 84, -33, -83, 210, -485, -411, -440, -373, 111, 402, -126, 9, -160, -287, 86, 76, 272, 149, -673, -110, -251, 72, 265, 224, 339, -519, -3, 254, -23, 521, 32, -160, 275, 0, 144, 780, 105, -117, 811, 586, -59, -215, -110, 321, 71, -564, -272, 497, 95, -188, 284, -116, -138, -176, 78, 250, 278, -359, -263, -179, 595, -18, 636, 38, -848, -546, 280, 176, 15, 478, 475, -240, -143, 169, -183, -66, 172, -379, -439, -112, -41, 779, -685, 163, -786, 133, -604, -176, -37, 861, -292, 377, -632, 335, -526, 225, 289, 55, -264]
3039b64j18O00o74O03o7r46J249r98L96K78rJ59J38O64j232P21q8k12J09n8M90
3060G41r30j82L02Q4K3L49j86l45M32l38j31M53l17J91l92K70L09n30J022j220
3080c95N35n88M49L05r18K47M79j16k98P8P81l02K3n63R0n02O25k82L31M88l99
3101F8o26N31J8n3K00n85K61N1k16J90M14m14Q8O23p11K49L9n00P95l38M09r07
3123d14R3k65P1O34m31K57L2k30N27p31M06j55k86N43L30J132j169j216J17M80
3143b75P45n51J03L46l07l12P83m89l72l43J067m80n12l19M51l3J443r08P54j121
3163c30P98m51R18r40p6J7K10j80p0p2O82l94J04ok88m21K45K35J55j53M35p32
3185c14L09n70O09K4J91k30J4L88j46j070P83o42O99m50L70J42M61j041J015m49
$$ y = [-264, -382, 218, -456, 147, 80, -866, 383, -615, -219, 59, 50, 209, 347, 1011, -221, 500, 412, 200, 309, 251, 741, -189, -371, -69, 15, 38, 387, 201, -144, 288, -50, -181, 272, -45, 146, -246, 24, 333, -197, 825, -395, 140, -448, 1, 306, -612, -365, 114, -2, -300, -222, 559, 257, 280, -283, -193, -695, -70, -352, -21, 467, 68, -558, -27, -9, -62, 138, -447, -186, -135, -351, -161, 253, -161, -73, 550, -161, 88, 127, -373, 422, 84, 493, -414, -321, -586, -515, 119, -312, -55, -23, -253, 274, -457, -51, -206, -492, 51, 381, 1513, 344, -872, -755, -275, 470, -81, 22, 368, 61, -251, 532, 43, -329, -672, 395, -85, -597, -916, -465, -498, 945, 37, 791, -330, 468, 17, 935, -5, -81, -64, 146, -34, -104, -176, 506, 112, 216, 210, -78, -499, -254, -19, 136, -17, 418, -314, -5, -575, 34, 58, 249, 19, 33, 421, 275, -795, -12, -654, 45, -405, -35, 107, 568, -473, 542, 93]
3205I3j71J92N0K80n49l2J89L10m13k33J80j71J53N74j158L82n52J076J74n42
3225a68K21j13m30J62N37p20L78K71r8R2k42Q09p39k17M42l83j2K50l59L95j76
3246a00N93l90m84K75O70k29M23o81K16p05P77m35L56j98l26O36J47l05N1r80
3266f89P46M81l47l76K34P7p44P08k15M06j87J2q79q2L69J12J34L34m98O94m51
3287a61N55k15N1l04j66J21L45M9k85M11q57P61l33o4o79M63N12j9l46l03j61
3308f25N78K18l6l67L42n61kP15q41l6J254r62M23n6m34N51j241J179p7n66J059
3329E15k77k05l14M87R8Lj76n74Q77q85N46j37p7N67n60n45R58r50N74k6k58M49
3351I0n13O50k5j71m16k9k29Q07J52j98n33L17N25n24l29R17K68o92k17M09n87
$$ y = [93, -78, 114, 164, 444, -105, -137, 52, 362, -51, -284, -104, -275, -122, 452, -706, -324, -876, 200, 374, -168, 53, -60, -490, -328, 209, -511, -133, 138, 40, 132, -110, 699, -40, -257, 185, -198, -210, 40, -319, 76, -100, 493, 103, -381, -106, 564, 335, 758, 77, 293, -412, 365, -70, 286, 88, -238, 398, 545, 240, 291, -689, 57, 538, 191, -185, 49, 126, -618, 90, -125, 281, 94, 106, -773, -855, -486, -374, -240, 94, -404, 290, -161, 394, 179, 230, -74, -240, -119, 226, 275, -10, 401, -456, 305, -28, -92, -771, -308, 204, 185, -161, -464, -625, -47, 171, 135, -232, 110, -451, -453, 262, -579, -615, 639, -323, 100, 44, -390, 161, -1080, 99, 22, -544, 515, 238, 33, -281, 206, 304, 307, 131, -443, 434, -451, 95, -42, -119, 448, -112, -657, 301, -649, -75, -101, -359, 90, -423, 227, 202, 31, -385, -414, -643, 164, 316, 118, -415, -98, 427, -97, -426, 491, 759, 67, -150, 259, -328]
3372c28J05J49K63l54R32r07J25m48R6J112q03Q35j479R16m30K02J58m92J22K36
3392A0%J98k6k06K13j13l26R69r7k82o24j04R71r40P64r9j92N35j85o21l8Q86
3414F93n29M44o16K95j96j8M1L42r0l50L39l23j74j22K51N88r32K3L2R39r24J24
3436a63L37L4p42O21k80K65J52J74o78k61J126r91J131p29K47q76L8N37J49o1
3456C0n7K24j81K42j100J883j763Q71R8l68j15m7M03j62l87K92j42L46J52r97
3476g78R73j70J76L61n20M05j88Q4n71K76j62j19m72N87l35J54o1p3J013k26j03
3497B51k30k17Q69j282K26Q24q1m69K4k61P3J70O10m59m15j54J037o20k52Q84
3517E28n93N48n31j74P61j146P20q9M52j032J17L46k58P03j100J014k04j68N62
$$ y = [-328, -223, -74, 189, -165, 767, -140, -15, -463, -367, 745, -58, 777, -702, 214, -216, -14, 144, -348, -226, 10, 10, 208, 182, -24, 189, 76, -250, 719, 622, 340, -284, -388, 583, -357, 407, 308, 116, 651, 466, -155, -193, 693, 164, 608, -8, 287, 91, 73, 114, 456, 366, 16, 355, 32, -142, -264, -13, 575, -357, -334, -302, 637, -287, -163, 174, 208, -534, 87, -193, 72, 224, 398, -280, -541, 585, -406, 725, -4, 243, -633, -595, -58, 91, 30, -27, 197, 16, 258, -842, 1041, -722, 149, 247, -121, -236, -283, 120, -42, -429, -137, -279, 67, 219, -778, 195, 25, 201, 562, 42, 447, 259, 343, -228, 48, -114, -233, -705, -118, -453, -299, -360, -433, 580, 354, 251, 21, -196, 673, -609, -383, 441, 360, -109, -85, -346, -273, -103, 507, 48, -367, -521, 516, -104, -356, 528, -65, 483, -48, -222, 539, -607, 113, 24, 476, -556, -439, -93, -351, 352, -748, 266, 62, -106, 456]
3536D56K7r42O02j70K49o95O00M76j000L6R57p46n7Q10k42o16m78N67L08j20o25
3557f03O97j24r62J009J48j262J225j66k0m84J6J189p02J12K53m10M67o64J74
3576a07j60K24R2l51J160j020O2Rj09L06o21k08J261n91j10m31R74n60k25K28
3596a77k13N86m77J21m8M55r61P89l91K16k36k26Q24j16q13J250j177O28o50J82
3616d34O65K71m51L6k61J34K93l22n51Q0N78J71l19N83o47M82l49J70k8l75K82
3637HM98l16J43j75n5o85O81p91P43o24O54M41n93j028M32R39qq92Q76j75l09
3658b36k84j28N91p86O52J27K66K70N45j357R57r91J07j0L33R54p20n30L15m83
3678d08k64R36q07Q00l35O24m5l78n50K22O69o67j09M62l89R1p4J87M74k42J17
$$ y = [456, 483, -459, 143, -27, 222, -473, 127, 603, -397, -361, 596, -150, -207, 603, 361, -255, -733, -166, 142, 22, -603, 94, -30, -992, 17, 165, -1097, 128, -38, -58, -542, -526, 663, -39, 73, 326, -84, 383, -281, -107, -267, -43, 49, -302, 858, -162, -100, -91, -200, 106, -515, -723, 538, -53, -163, -594, 380, -180, -405, -177, -390, 196, -281, -160, -208, 247, -714, 75, -316, -100, -336, -562, 262, 146, -667, 583, -594, 34, -616, -434, 231, 502, 51, 87, -174, -40, 253, -69, -620, -540, 38, 209, -110, 473, -174, 308, -41, 129, 101, -274, 8, 506, 190, 333, 158, 103, -582, 99, -692, 51, -573, 81, 522, -71, -1099, -667, 272, 264, -628, 248, 73, -236, -520, -648, -57, -843, -191, -64, 202, 472, 1017, -340, 617, -374, -267, -277, 56, 1010, 290, -240, 75, -408, -672, 264, -543, 257, -78, 546, 501, 123, -427, -205, 464, -203, -312, 150, -239, -148, -222, -35, 439, 197, 314]
3699C14k34K92n85K50j49K45Q28r93j05J36L9M02M54k12j08j51n01P7j51n9M36
3720B25k08k58M17L26o22P40l34p91O45M38l83o44O52k14Q1m96O15L67n82j47
3740a73r2j66P6j04P07L62j30r47N93m78N89m05l3J78P12p27j50NQ10p43q41J322
3762C65p6PQ1j43j62o77J585k93k82p02l45O41L18k57q38M04K04j23O07o45N30
3783A99j20j23j97M16j52o9K80l87M8k4k8K96r3j9J09m69O2M22k84M81m41l81
3805d74R85m56j56M47K20j079o5M81M86q72L16K62j40k02J79r56J217k80J229
3824A142j102M44k15m69O32r26O18O12o88r54J417j086J058l97o72KO9L75M1k77
3844c76O96M6m61L88k91O61n48J82q70O99K41q85O04M67j148M50L10l18K09K92
$$ y = [314, 80, 372, -213, 37, -112, 133, 961, -32, -137, -1, 38, 440, 894, 682, 574, 423, -78, -1, -152, -211, 225, 17, -241, 176, 502, -120, 620, 286, -505, 140, 578, 195, -449, 203, -11, 70, -426, 189, 556, -26, -173, -265, -431, -355, -459, 248, 610, 480, -467, 126, -352, 237, -168, -201, -23, 689, -38, -188, -183, 627, -116, -957, 365, 289, 296, 377, 234, 72, -605, 980, 687, 405, -297, -642, -1, 317, 60, -778, -374, -170, -293, 314, -331, 199, 79, -44, -241, 175, 23, -46, 234, -153, -105, -129, -157, 139, 46, 27, 136, -333, -271, 151, -133, 348, -93, -474, 511, 55, -101, 346, 566, -513, -578, -97, 389, -483, -167, 95, -45, -247, -68, -1024, 193, -87, 1142, 40, 484, 269, -200, 432, -494, 124, 736, 48, -906, 511, -575, 483, 86, -586, -584, -515, -140, -99, -376, 320, 366, -95, 293, 2, 663, 115, 297, -573, 126, 367, -518, 86, 553, -595, -145, 165, -153, 56, 348]
3864C48p39J05N58L6J62k43M2j59k10L01l91M30l60k06L38P01m34q08L05k17R80
3885E39m81m24K26J18l8l38J05L23q21N35P78q73N15p66K13L74J61j46n12O26
3905A14l12N62J83j175P09m63K81j53K2l86J001r64K86J14K87k71K86K8p14J122
3925E57p46N03j082P62J84K1j77k64j99N05M8n00O10r11L25J040k72o44M7L41
3945A48j178J462o30K74q9J14n9j02j42RP16p29L70J78m64K11M58o53M80m56m
3966h6m20P6J0K49N31o08J24L0m69J80L70n19L74K41j44L82M34p83l51K48J80
3987D9k0K30o44j19M15k05j31J33p3j86K58r3M10P4l8l55M47l17L79j04K39J22
4009D71o9p50P0R7J162j153K45K1l61R23k84l07l31L29k26j48L94J34J77n41j05
$$ y = [348, -391, -286, 272, 308, 470, 227, 269, 110, -100, 201, -190, 240, -120, -326, 12, 713, 279, -529, -224, -441, 539, 58, -366, -140, -22, -60, -398, -293, 30, -791, -256, 522, -351, 164, -602, -389, -15, 146, 0, -512, 114, -198, 364, 547, -628, 81, -382, -101, -254, -232, -618, 383, -581, -295, -181, 106, -165, 121, 149, -565, 557, -189, 314, -768, -6, 178, 199, 22, -242, -441, 64, 112, -388, 222, -689, -364, 676, 404, -240, -193, 148, -1030, 432, -198, 76, -13, 101, 42, -60, -202, -193, 523, -206, 164, 342, -122, 89, 547, -106, 374, -82, -86, -506, -430, -420, -171, 360, -248, -124, -94, -563, -383, -13, -532, -158, 83, -61, 321, 755, -28, -379, -131, 49, 29, 259, -385, -504, -89, -294, -425, -292, -365, -551, -293, -386, 24, 98, 60, -295, 152, -165, 214, 110, 349, 471, 402, -348, -278, -181, 981, -172, 73, 94, -267, 656, 372, 65, -266, 63, -163, -311, 83, 217, 394, -147, -252]
4030b52J67j16M19J28j71pO5o12R5M04l29J86m5mn18o5K04M87q6J86l56P8j12
4053b54j13R95n76m20k7Q61p15k10L42k05J93J79K20p08K69J49K58Q5N63j523
4073f37R21o13N43j00L37k99l01N26J93l01r7j64o91J580j021pj79N15M07l02
4093C10L2m60K32K45m75K63q26K11J211J13j248J06O3l77N15K73J32n50P41l39
4113A72l06j8p6jL30k30K97O10p26L08r30j59J135Qj06p35K55M46r3l16l66N24
4135B3j57KL25l95L63l83l46M63K1o12J143j1p31j02L09M63o4P3or52k67J147
4157C06j038J510j77j351P27L53p44J41Q9M3J39K21J65r44n6N98J5R9N8n27N92
4178B19o51R07l68L06n35J39k83R9K54p17J05J003n7j170p5Q42L60j74l58m0P11
$$ y = [-252, -85, -201, 218, 346, 175, 168, 233, -379, -284, 120, -209, -23, -68, -72, -590, -655, -451, 36, -50, 136, -220, -142, -254, -367, 628, 52, -368, -395, 466, -249, -459, -117, -322, -129, 50, 270, -438, -169, -20, 238, 323, 886, -637, 284, -329, 214, 114, 451, 152, -149, 377, 570, 269, 172, 8, -683, 897, -124, -131, -310, 205, 612, 310, 342, -118, 114, 359, -116, 147, -679, -468, 743, 856, -392, -286, -223, -600, -85, 188, 320, -230, 511, 172, -134, -152, -228, -229, 101, -129, 168, 778, 52, 360, -570, -729, 406, 414, 308, -427, -172, 274, 181, -135, -501, 23, -134, -132, 193, -202, 161, -222, -568, -105, -84, -696, 447, 436, -295, -397, -88, 375, 311, 384, 378, -574, -841, 306, -732, 778, 601, -750, -23, 330, -414, -273, -184, -141, -2, 219, 384, -560, -616, -18, -3, 96, 154, -373, 219, -432, 475, 107, 413, -122, 17, -266, -167, 87, -630, -525, 478, 421, -749, -824, 18, 378, 204, -154, -194, 517]
4199E17p65M15L29j052M88K81j21k66o39Q01J11J23j80m00M02m72J33m76J104
4218C33j89p9k20k72j80J73L93J05l72L26J14n1K42q23Q35k29p5j11N58o82N39
4239C35r65Q66K30n98J32k37O73q93J98L03J53l26p1K85m24N0N83m79M19L02m56
4260H0J10M81p4M3m83m08j25J85J87M2M12q0M41p79j63l96J49K45j76R9m62O39
4282c3n21Q40l96N75j220O11q5Q54l48l75J32M65q1n54L98J8l60m26M98j90J76
4303b2k20Q85l61j95P6L54o47m52J284j292K2J198m61j79k71M08m81P69l21m78
4323c84k92R46k75k27O78l62l9l52k8O24j054O51L2o3P75n47L74l87K72n70Q62
4344F34q23K55k85k47j47M81K94o95M40Q47p99M72m51J48J73j52r4n0K25m19O71
$$ y = [517, -248, 167, 496, -556, -68, 213, 92, -174, -813, -12, 99, 222, 42, -358, 44, -428, -295, -771, 333, 144, 65, -155, -427, -607, -434, -41, 64, -308, 18, 132, 81, 323, -500, 335, 106, 31, -80, 478, -204, 335, -630, 236, 466, -132, 0, -237, 436, -457, -259, 44, 197, -129, -200, 85, -339, -289, 294, -185, 234, 536, 80, 190, 671, 597, 640, 157, -251, -376, -191, -4, 38, 450, 370, 811, 32, -131, -527, -378, -133, -309, -210, -672, -33, -554, 286, -110, 465, -755, -144, -229, 625, 277, -98, 34, 499, 418, -136, 262, 280, -80, -506, -8, -198, -22, -242, 643, 282, 87, 163, 517, -130, -582, 702, -590, -568, 630, 169, -10, -281, 127, -354, 415, 94, -384, -676, 270, -5, -232, 446, 84, 45, -307, -335, 289, -765, -114, -82, -145, 630, 83, 457, 70, 342, -228, 634, -189, 66, -219, -466, -613, -132, 162, -533, -93, 754, -45, 427, -24, 124, 297, 145, 51, 1, 226, -193, 478]
4365D78j046l4R74o18L66r3K46o5m69J227p39Ok21N54o03L88J22r21Q46l9n5o28
4387c24J136p91L84M02n43K55n19l85R91O9q65O04j41q45R90O3n81L39J91j99
4407B31J72J30n13l25j03K0N30j81r4K23r8K56j82o09J183r28J53k6J098p57m72
4428b92k27j48O41j50k5m04P59K21P73o98l76o0M70k14n03l97l38L27O45k0J66
4449A50l03j85J052r87N5M83k47L23n05L95l22K8L23j30p8n7K32l65j038J360
4469A84k9n41L32J93j86j38J06J22n1p10J271j046K90R08j003N34L33k37m09M24
4489C47j042M89R06o18K6o94N67j56n62K19O23l54K28J73P7m25J79Q8M5K40q28
4510d72M67l13j9j37L82q5K57n24J80L38m41ML86j32k98J14Q0L95J59n98K21J92
$$ y = [478, -568, -602, 372, -246, 120, 27, 273, 208, -261, 966, 227, 233, 12, 566, -37, 351, 473, -448, 398, 359, 304, -324, 812, 21, 405, 807, 264, 519, 0, -385, 606, 675, -190, 414, 273, -572, 418, 481, -100, 239, 430, 231, 403, 533, 20, -305, -408, -388, 142, -39, -133, 90, -8, 248, 66, -543, 640, -288, -135, -161, 937, 180, -292, -519, -667, -26, -176, -201, -605, 154, 375, 1148, 450, 74, 14, 484, 270, -233, -630, -968, -641, 4, -16, 150, -153, -338, 714, -273, -218, 265, 18, 341, -164, 231, -91, -63, 260, 130, 52, -5, 227, -138, -1176, 184, 155, -386, -54, 139, -47, -185, -79, 43, -8, -718, 553, -493, -203, 705, -298, 236, 569, 332, -77, 347, -695, -206, 700, 82, 108, -586, -19, -175, -737, -518, 105, -249, -21, 152, 229, -196, -17, 71, 116, 356, -472, -5, -318, -337, -474, -92, -177, 80, -444, -264, 74, -367, -363, 23, -109, -407, -293, -213, 182, 341, -257, -36, 156]
4532A56j94n60J028q96P18L20m38N7K86j206n5P62M28j78m74l94P20P22l5o66
4552A01l92L72L0p57R07l04l26K94M8k65Q5P18j263J178J15l80k90K06J38r41
4572g26L81K4Q26m16n89L79l64N71L53m62m39O76m4J04o35L41J67J46m18L05m59
4593b79N21m23n4J50L87m57k87L00J4K91n13L43n9J22k24P36j089m76R92M46n34
4614i3N4N18n04O50j2j276M90O6K80L20n19N46k8n84K49J89j98K64p9p3r09Q80
4636B31n80L68N67o11n71P53o44J16O86r0j23l68P1Q76r47k64Q59p44k08L52J09
4657a62l57M65L79m86o12Q30N89n44p68J099l66m50O90n55K23J00N11l09l13N37
4677E01L1j064R93o64l65P6P58n62J81K07M0p14k76O61Q70m41j8j94J19m76O51
$$ y = [156, -38, -598, 430, -466, 252, 572, 134, 191, 477, -729, -784, -22, 406, 228, -246, -640, 80, 802, 767, 101, -291, 81, 111, -646, 261, -43, -369, -75, -27, -292, -207, 511, -752, 426, 541, 161, -129, 77, 215, -726, -345, -321, 505, 89, -500, -121, -485, 86, 439, -23, -462, 214, 170, 274, -361, -20, 147, 293, -125, 180, -279, 242, -181, -235, -85, 302, -155, -442, -142, -128, 163, -350, -7, -66, 56, -168, 568, -521, -997, -5, 441, -93, -39, 479, -25, 625, 613, -663, -173, -107, 173, 493, -26, 520, 492, -92, 157, 346, 148, 412, 333, 260, -649, 231, -349, 19, 586, -25, -596, 157, -487, -371, 315, 225, 102, -266, -195, 681, -266, -530, 329, -415, -623, -271, -162, -519, -54, 325, -161, -773, 57, 646, 102, -666, 433, 67, -383, 307, -248, -25, 75, 586, 277, -36, 501, 532, -532, 461, -203, -568, -492, 266, -296, -115, 92, 132, -582, -858, -197, 673, 232, 214, 20, 139, -337, 314]
4698C14j075R59M91j084K63L72L66p88N30m09L03o90P29k3K59J38l64j58L65l57
4718A41L12L08q96J10k38L29M61j40o86Q76n58k93K25L40J10m47L8l25L12N42
4738E21m04l09n7K39m63J184n83j10Q8n58K20K14m82j01M71j55MK55N18m59J06
4759A39p2M4j09l62M92M55j74p81K35Rm64R8l43J198o4j46o59L99l30J78J522
4780A265j179R9j106J230n95K88j49N48m61j66R1k70M4M71M32j442P95J56m14
4799c63P32N0m18K70r67J024r95Q24p86N32r9N1M8l72Q92n55j61M67n95K21M73
4820B73m39l67k21J551p31j00o90L78N63l49j54j25P60l96L75m93l25p84J608
4839C34o20P8n3j85L88J09p5J30l42R49l91q22P91J4p96L22P4k92J81L80n11M48
$$ y = [314, -761, 198, 689, -395, -132, 240, 606, -182, 348, -61, 242, -448, 281, 258, 517, 655, 291, 133, 498, 141, 453, 761, -135, -25, -263, 66, 527, 387, -299, 577, 19, -274, -49, 291, 401, -46, -8, -333, -21, 521, 117, -192, -249, -10, -473, 711, 128, 18, 106, -452, -232, -18, -500, -601, -130, -285, -281, -26, 492, 33, 139, 67, 111, 2, -360, 132, 587, 413, -368, -133, -124, -588, -490, -833, 365, 301, 155, -504, -105, -435, -257, 1265, 86, 185, -921, 309, -286, 2, -147, 401, -60, -226, -135, -405, -361, 110, 542, -900, -105, 51, -363, 369, 419, 1, 271, -696, 328, -667, 157, -629, -97, -196, -145, -97, -469, 423, -132, -293, 174, -421, -200, 273, -166, -533, -754, 797, 66, -34, -724, -346, 217, -132, -286, -411, 349, -47, 328, -165, -490, -1274, 334, -286, -208, -261, -446, -58, 51, -24, 106, -236, 713, 322, -500, 291, 305, -491, -169, -95, -387, -206, 174, -337, 111]
4861A11M41J98n2r30k46M92o30P63J19k90J5q55N36J31k2o02P33M22j036N83l28
4882d47l95K98oL80L63P5j185L08Q00l44O02L36j249L72O21N63j108k06R39p84
4902f7N82p42L49j87pJ80N22n27J42L1m55J72l54j09P0J74M66J99l34o61Q28m58
4924a86k72N54J92j09O68o33oL30l73l39K58k7J24K63m78l36l20J370k23k79O7
4945B45j84k9m77Q09n2k54N17j390J220n24j93p9O35n6p31M18m30O39N03r57N82
4966B12k22K22n4p67P10J11j093N08L18J08o30O71N99n37k64k33M11j48L19m43
4986b02R4M23l02p22O95l03m6P71k35l7O21o62K45k31J77n6k74M15n90L42k89
5007a66j67M67L84n49K21p3K49q95Q97l91l25L35P5Qk00M05n89K49o4p84J100
$$ y = [111, 552, 750, 698, -232, -478, 14, -616, 147, 266, -24, -9, -864, -328, -197, -219, -821, -88, 334, -702, -119, -447, -842, -544, -550, -170, 193, 268, -917, -609, 191, -153, 449, 785, -464, -92, 529, 1092, -16, -222, 717, -67, 515, -227, 122, -65, -72, 108, 630, 103, 245, 276, -179, -7, -361, -470, -400, -226, 240, 439, 105, -556, 272, -186, -458, 96, 288, 179, 847, 214, 208, 538, 165, -174, 84, 57, 181, 444, -34, -370, -690, 680, 457, 178, 245, 61, 32, -445, 364, 312, 58, 575, -815, 405, -119, -312, -391, 244, 188, -543, -125, -555, 84, 587, -370, 212, -10, 212, 158, -609, 101, 212, -881, -373, -55, 53, -577, 94, 693, 156, -108, -341, 70, -78, 241, -202, -108, 315, 13, -709, -14, -317, -363, 408, 173, 136, 757, 95, 340, 109, 286, 230, -44, 371, -219, 123, -166, -333, 134, 518, -31, 190, 117, 366, -529, 368, -23, -348, -13, 62, 70, -130, 275, -314, -65, -129, -913, 187]
5028A87l43K73qL51m76K41n02J02l66O01j48J03m57p35J948k05n15j282J459n2
5048A76o25K4M30n11M92L5m17L74J95J33q7l8M89p24k39M99j94L73r57Q34o2q0
5070A20l97M71n14R27m87m84j76P88k65M5L3p7L25q9j44o10K96L84o0k80r5M20
5092A31O47j090O42l4J58j005P77r87M72M9q3M57j031Q42k01Q0K7l88j58R16k79
5113e8o02J07J03J34p0J06J24L11m03l17J74N58Q3l74q10O65N97k55k03M09K88
5134E67r56J117o34Q94r36k28L92j001R4J53O83L48n11p03R14l36O69l54o78Q82
5154C76l27JK62l26j9k52K32M3O8L8l95k2O97r84N69k51M93m64M71j04k66j37
5176b97L20j81K51O6M07m59k75K41j40n6j6l50O76M4M97R2j393O61o83M7Q06n83
$$ y = [187, -156, 117, 109, 460, -16, 225, -277, -175, -541, 60, -88, 15, -442, -1177, 771, 566, 51, -1231, 228, 176, -449, -425, 5, -506, -14, 21, -396, -22, 173, 306, 219, 181, 670, -54, -293, 206, 12, 385, -572, 262, 200, 120, -277, 194, -320, 607, 120, -364, -540, 248, -17, 28, 61, -16, 309, 220, 76, -534, -238, 146, 86, -194, -289, 131, 778, -312, 330, 296, 454, -551, 226, -761, -289, -240, -323, 134, -897, -55, -256, -176, -149, -537, -695, 221, -58, -660, -553, -450, -316, -386, -280, -156, 155, -248, -565, -391, 167, 250, -124, -934, -269, 328, 73, -130, 279, 567, -389, 728, 94, 988, 52, -176, 216, -785, -691, -538, 145, 493, -18, -721, 193, -143, 526, 172, -506, 376, 49, 50, 312, -14, -33, -285, -53, -10, 58, 96, -299, -321, 376, -608, -39, -290, 203, -261, 210, 106, -160, -297, 23, -158, 93, 159, 566, 107, -168, 73, -67, -123, -139, -489, 187, 231, 728, 820, -573, 88, -595, -548, 258, -325]
5198c25L5N96p95K59nJ48K19l1q72J166j019l69J58N76O22k87K3m20l0L50l84
5219c85J00p1K20K13P2m91N17j01m3n17R63p59o52R34M53k01j78Q6j36R6m18n4
5241c52p7L78L92j042M47J37K12k65j73N49O0n71M61m70M69m27K50K43r07J176
5261D90m91n7O5o01J92Q71j96l06j97m9J91k85P85n11j60j66j9L84l45r6M20P7
5283dj27N17n30k76N68n82N41l21Q25q36O27k63m00L26L99n06K2N79j383J111
5303B87m68L62j06j321O18L74M24k77M63o02J89l99P30k70jK29j01J61l81r43
5323a032M42M31J17N24r74N18J73j18K04n52j66M31m12N36j81l44Q96k09m32n57
5343g05R27j46L74p12K83q75O30j3J69L13M1m6o51Q45J29j373J066K53r28O18
$$ y = [-325, -290, 306, -489, -230, -235, -87, 132, 101, -771, 395, -624, -993, -835, -259, 363, 76, 99, -321, -351, -1, -385, -285, -356, -136, 77, 149, -342, 175, 74, 31, -486, 477, -282, -934, 0, 453, 252, 74, 160, 24, 120, -298, -352, -429, -51, 341, -701, -254, -117, 95, -170, -343, 206, 266, -305, 156, -314, 155, -272, -22, 221, -686, 490, -1, -58, 7, -594, -402, 469, 273, -33, -230, -279, -88, -373, 412, -99, -259, -425, -444, -60, -405, -501, -81, -4, -131, 386, -144, -420, 148, -434, 107, -214, 611, -225, 402, 139, -261, 65, 464, -42, -20, 559, -824, 287, -181, 181, 75, -1246, -628, -254, 170, -107, 356, -246, -57, -456, 274, 4, 3, 232, 131, 292, -89, -1032, -590, -159, -42, 482, -492, 26, 199, 81, 285, -267, -433, -2, -414, 122, -59, -403, 493, 284, -148, -705, 222, 76, 450, -262, 21, -854, -224, -237, -68, 245, 286, 240, -411, 434, 563, -810, 256, 509, -419, 199]
5363A99r3j51m90K22J125j654J729o62o39N40o45L55n7Q43j130L95J68N45r13
5382c13j57M30M98k84l92o2K48O66n79o72O31m63k59R47l33L97l38J60J27o79
5402d27Q14j167mM90M03m16K44P00q63j06k32O21k11R17j117K81J90k75M79j48
5422A73n14L32LM37o34L81l36L67q97p5Q11k66K00J25L47K81r13K36k97J0n40
5443g69O48Q56R9j208M12J68j61m43J304p81L46q21K5L30m26O85p13L26K36M53
5463E66m95j79j82o5M60j33M98o23O26q8L68p52Jk7J46J23o36J273j305K24j28
5484c28K69mN48j068L89O19J10k68n66N21m29M18L78j507N31n43J290K42j82j37
5504B83q91P42L24J35l59Ll97N3j94j11M19k36K03J82k99ql05O35K97r56N81L93
$$ y = [199, 106, -45, -535, -313, 812, -842, 887, 225, -414, 126, -519, -164, -221, 622, -508, -113, 55, 600, -313, -470, -40, 458, 174, -218, -280, -32, 634, 55, -617, 14, -449, -708, 239, -94, 303, -35, 125, 252, -427, 387, -780, -784, -294, 109, -307, -63, 637, -226, -332, -564, 57, -154, 763, -354, -73, 117, -158, 321, 173, -341, -9, -6, 431, -203, 178, -158, 209, -688, -763, 48, -218, -18, 107, 454, 735, -178, 58, -239, -229, -769, -121, 735, 834, -374, 38, 206, 45, -398, 906, 125, 471, -350, -325, 5, -421, 264, -449, -123, 113, 566, 71, -108, -290, -355, 105, -28, 470, -153, 473, 385, 753, 1, 2, -25, 121, 244, -392, 881, -424, -200, -328, -59, -63, 485, -583, -194, 425, 535, 267, -299, 222, -207, 211, 589, -918, -387, -930, 360, 602, 420, 283, -608, 134, 458, 593, 234, 237, -160, -107, -301, -412, 7, -229, -26, 156, -143, -151, -456, 179, 476, -480, 101, 494]
5526D94r67J021o68K89k59L00L16l65o97K93m9N60K01n35k04J48k38J91K93%m89
5547c65L61N99m15l20m9Q37o39j35K7N01J03o44K48P83r42K80l73P58o55k99Q58
5568E19o22k38L09K87m66N1J76k6K96j28J68n7m02L15p76J99j35J18j49r7M34
5589b24nj2o5q57P82N61n77L90l3l9K87P8K37j073K68K55P9j03P10j091m33O36
5611b29j32j17R57n22K08j94j053J301o52M81O63j242M19J30%l16k06Q10m17L58
5631B47R6N05j338Q82J55l47n86N82r7j202J277L61q42L08J67m41O49l33P04K5
5651G72j174j41Q80p5r16N19l97J174J22q60L08O8k78N17j44j309R48N9P52j710
5671h85J008m98P05n07L36K62j59j06j95l69N92Q9N4m54Q3p9k9l25O43n04M89
$$ y = [494, -473, 548, -120, 169, -90, 210, 526, 161, -536, -243, -292, 268, 469, -66, -270, -122, -360, -169, 124, 124, -365, -4, 595, 180, -140, -189, 648, 9, -126, -99, 402, 505, -139, 109, 892, -50, 230, -143, 615, -40, -339, 519, -103, -341, -32, 255, -211, -160, 16, -10, 286, 158, 326, 269, -133, 182, -594, -395, -530, -412, -561, -658, -224, -229, -241, -306, -1163, -381, 180, -397, -7, -40, -79, 208, 286, 523, -550, -282, -27, 52, -51, 659, -432, -865, -229, -361, -478, 479, -43, 165, -29, -1082, 219, -433, 48, 711, -531, -112, 18, 18, -298, -504, 306, -111, 247, 343, 848, -490, 392, 547, 200, -386, 196, 99, -1103, 174, 535, -307, 1, 168, -273, 376, 43, 747, 772, -402, -543, 337, 262, -654, -135, -532, 642, 764, -96, 212, 280, 2, 519, 375, -934, 14, 73, 825, -885, 123, -375, 330, -177, 159, 421, 262, 156, -39, -408, 184, 273, 327, -127, -44, -123, -152, -477, 166, -338, 151]
5692A51p36O03k33M67l44K16k58k3k2J75K80NJ21n92M37m38K53M41j175M80R85
5713G93o07L54j063J050n84M8l72P87q45P8K75Q4J07K88J75N7m82J40m95p12J185
5734B61K95l68p45O48Q7M7p69N32k2j24n3R41p9O8o67L37Q2j304P64M21p26N87
5756B13n00M36q17Q31l30N40m30L70m10K9M6L22jk36J8N1L30j282J213n79J57
5777b9L36l26j00N39j005M96n71m8O19O57o29m19J107m25J03j86J85k55k61q3
5797b95O24PO27j057P89j255P63k39k87L32l30J91K1j48L53p4l2l98L99j63K31
5818E9J94j19K77q34J116j129M89L01j35j92r0l15O99k76J40q4m54l24M91P15
5838E29K91o90K52q27P28L51j158M78j81O22n2k52Q1J02n59j81P4M93o04N62L74
$$ y = [151, -585, 18, -215, 252, -92, 124, -134, -157, -179, -4, 276, 281, 402, -190, 247, -191, 62, 503, -672, -192, 793, 186, 540, -523, 527, -57, -9, -381, 406, -439, -361, -86, -2, 105, 393, 568, 625, 143, 283, -212, -924, 261, 556, 188, -557, 91, 178, 225, -544, -12, -34, -158, -211, 730, 651, 719, 52, 389, 471, -833, -69, 352, -374, 213, -287, 149, -668, 163, -167, 373, -57, 313, -97, -68, -22, 300, 299, 63, 81, 132, 462, -820, 393, -186, -29, 307, -19, -119, 420, -585, -89, -660, -708, -89, 568, -61, -480, 627, 202, 305, 119, 304, 49, -212, -295, 329, 336, 963, -94, 695, -560, 203, -36, -323, 9, -321, -130, -109, -257, 96, 22, -10, -408, -9, -172, 59, 253, 134, 411, -423, 693, -436, 53, 354, 219, 27, -63, -378, 321, 45, 185, 101, -353, -677, -186, 529, 820, 130, 382, -445, 283, 634, -524, -46, -227, 395, 343, 91, 172, 274, -285, -466, -392, 101, -503, 59, 433]
5859D33n40j40K01N53l55r42J011l85N09K68j045Q86j70n21k93o9N06K32j069
5878i30Q93M56q64O30L7k05j87M3O29o50j19l43K82Q45p37o5L67l94O91n71M76
5899B84K15m19k21m94K50J51Q7J0J88k38M96p31J32K01q02J340p73O45n64K80
5919C7L87l72L4m30n17O95NN0J14p51L03m16P05P09q33M40l12K75n94J031p23
5940a63o3L30p75N11K40N24q43M02k00q9Q15l50J69p08P04r81J83J1N45J14m16
5961d0q70R76L53p87N33N7p24J058j040K00N44O24j036l35P13o53K74n7p1M5M02
5982A66j37P45j022O97q40O41r5M33q15K96n0j43L20k77J74O33n84p5p0N66O33
6003A196j239p9o60J295l85j96m07M52K91n65J176j278Q8P66r37K61J65L45j03
$$ y = [433, -107, -247, -46, 507, 152, -790, 221, -164, 345, 613, -432, 454, 284, -237, -530, -599, -93, 139, -930, -37, 419, -445, 185, 222, 17, -170, -127, 502, -148, -267, -610, -328, 517, -220, -285, 82, -312, 379, -192, 284, 499, 80, -141, -635, -385, -234, -147, -137, 51, -187, 309, -422, -290, -89, -891, 449, -324, 321, -243, 37, 424, 52, 86, -344, -861, -166, -161, -111, 3, -748, -445, -861, -156, 553, -280, 160, -152, 123, -471, 560, -163, -226, 104, -671, -160, 80, 604, -239, 163, -37, -126, 689, 339, 508, -200, 504, -477, -294, -283, 262, 376, -40, -910, 66, 419, -368, 165, 222, -502, 556, -484, -284, 260, 884, -152, -487, 226, -427, -153, -210, -281, -236, 166, 29, 774, -248, 449, -391, 250, 155, 588, -227, 69, 19, -124, 196, -81, 93, 726, 142, 67, -3, 563, 1196, -43, -122, -782, 513, 128, -68, -475, -23, 268, -297, 879, -399, -311, 455, -482, -221, -56, 289, 186]
6022A86J39k23m42Q18K34j93l95O20q65N44K6r31q2P75l88J304j462q3o5R20o17
6043a80K09j81m91N3M87J94J64p58Q92p14K12L63K31k11j049P16l49J75L39m64
6063c62M48J11k64Q91r37j77J91O2m2r37J088N36p91L18k19l63J228q94k83M02
6083Fj81M01P9l45M5m41J68NL37k81j10N52J60o16K94K68k73M51j30R0j60j55
6105A64l12L73k75L18L40k64m11j98O16q00M08j49l87O50l25o2J22k65J397q84
6125E6l0N4k20O08l21p08Q08J28J13l25j45n06j69Q3J433p95M87q97j97j4K12
6146c45L96L60K43o99q18L50K30L09k06J052j305N22K78R0l22N26r05K32J67m78
6166c23L39N03j09k07o62P96n12m4N46n76L2l15Q73j241Q6L42K10M63O5l13r1
$$ y = [186, 325, 102, -340, 478, 712, 519, 124, 744, -121, 423, 449, -482, -564, 211, -177, 1127, -335, -418, -483, 437, -180, 29, -152, -643, -590, -103, 91, 255, -503, 389, -325, -113, 250, 481, 270, -779, -63, -412, -237, 102, -362, 86, 197, -67, 824, -113, -290, -99, -37, -79, -1016, 72, 608, -183, 135, -84, -447, 781, -113, -396, 6, -175, 226, 305, -40, 5, -436, -268, -263, 74, -207, -317, 235, 395, -221, 73, 341, 68, 519, 389, 479, 319, 164, -148, 225, -50, 268, 608, 344, -67, -265, 351, -449, -41, -190, -577, 73, -252, -314, -192, -457, 940, 56, 26, 80, -140, 468, 147, -561, 247, 375, 488, 163, 18, -488, -657, -574, 859, 64, 551, -346, -543, -557, -345, 51, 411, 654, -45, -863, -513, -283, 26, -180, 872, -433, 89, 367, 457, 135, 661, -244, -12, 155, -323, 16, 519, 410, 203, -459, 337, -175, -219, 327, -249, -217, -532, 341, -900, -814, -472, -262, 201, 266, -47, -138]
6187a38p3r0O48n4o9k7l24K15J63o36M14l34j04R8P24m54M81l49l71n2O28K4o97
6210c77O19j79j16K49q49J122l32q33J213j087O20o72J402m48j37o7J43j86m57
6229c72O60l9m53l2p7k63P18mL34M56r2q73L15o55J18K57k13L66m29L26L47L72
6251G67m18K10j034N88O63n01k74l62N26O9k50j9M38p52N63k42p50L35r1P67o59
6272d26M81M5J01J8n76J66K72j39n0N91l99m7M39r68O82k63o65J328o45k02l04
6293e61R84m91m15N94k12K87O0j53K03j22K38K20k93k19q20M21L10J67j8n2r3
6314C5j78p7Lk44O08N61j190N39j34O6O21n83l1m27k18M09P71j4n45k6M13k14
6336A45n00L25N10l72l68q7N36n23q3L05K31l63Q23k39o64P55k12L33n36k99l19
$$ y = [-138, -211, -301, 347, 293, 224, 197, -127, 88, 251, -385, 29, -305, -409, -311, 413, -41, 440, 91, -280, -332, 296, 320, -377, 242, 63, -53, 196, -653, 469, 137, -696, 517, -570, 50, -622, 780, 332, 195, 128, 271, 85, -372, 288, 249, -204, -236, -313, -576, 142, 138, 472, 928, 836, -37, 278, -377, -259, -2, -215, 151, -278, 48, 395, 767, 349, 559, -475, 113, 776, 275, 1, -361, 165, 234, -16, -35, 403, -349, 214, -28, -778, -443, -534, 233, -426, 55, 100, 201, 219, -357, -191, 81, -58, -108, 483, 84, 37, 476, -492, 190, -73, -738, 590, -55, -257, -561, 423, -68, -483, 111, -101, 186, 246, 93, 296, 174, 412, 632, 339, 120, -700, -279, 31, 198, 180, 128, 35, -143, -220, -217, -461, 147, 708, -482, 57, -77, -11, 610, 27, -4, -431, -649, -240, 531, 517, -28, -54, 359, 145, -355, -30, 480, 108, -260, -347, 189, -334, -417, -112, 119, -244, 579, 340, -324, 431, 219, 552, 16, -283, -602]
6357f02M87l40K27l83j39R53p05Q53J57o00M30k73O2J87J50o2p30O91n28K44J27
6378B06n27N56n77J49K87k4J03m16l14J095j257J218p68M01J41l08j76K91L35
6397D15k81M48k12o18P05m69M37n54m4m3L99o81O33n00M95L97p23L79m98L0K30
6418e5M79l76l50M79rJ45L07k76o61MJ42K68J16l38k27kR25o42J40k28K88m1m52
6441c64O33m60N72l15N2J24j88N33j81l69N11n96l51N61p7K24k51k56J094q08
6461H8l46M65j59l11N29k27J30n40K24K81J8L83J49r5o97N4n71P47k9p36O99m17
6483c61k45j47L86J61k93J11Q05J1j059M88j59n2O80m00j12m40L26o0O52k85N72
6504E79j11j44m88k85N10K62q42P20R4q05L26m3L15l26J01l07M61M24m76n45K11
$$ y = [-602, -115, -455, -228, -611, -750, 203, -502, 351, 508, -92, 338, 65, 127, 314, 464, 402, -328, 363, -165, 79, 206, -321, 235, -342, -193, 94, 70, 173, -243, -557, 538, -719, 499, -269, 132, 273, -35, -211, 80, 415, 134, 582, 370, -248, 457, -12, 425, -129, -173, -216, 183, -498, 135, -365, 130, 527, -196, 183, -315, -285, -55, 424, 48, -302, 177, 168, 313, 620, 344, -317, -313, -171, 97, 213, -125, -352, -354, 571, -71, 69, -159, 129, 88, -364, 269, -191, 381, 66, 118, 242, 54, 587, 406, 37, 548, -48, -399, 162, 85, 309, 58, -198, 896, 88, -258, 207, 48, -263, 266, 39, 169, -371, -147, 134, 152, 535, 684, 589, -108, -54, -625, 122, 93, -643, 56, -361, -606, -753, -367, -206, -499, -388, 417, 428, -631, -143, -302, -354, 326, -74, -186, -626, -300, -360, 292, 7, 579, 468, 324, -164, -449, 61, 323, -519, 201, 295, -510, -184, -227, 88, -238, -137, -444, 17, 441, -35, -580, -369]
6525c69N68o54O80Q1m00M53K00m07m60R30k13j91j118L52J197j50q40J44N69l42
6545C0l49K98j7rm90O65l30P49q64J1O43k27J59p2j89k72K31L44q31L84O52q44
6567c28O9L62L57l55k41k82K08K17m18L93nJ9j0J61m89j26M6Q55p32M55n69M22
6589Ij25M39K13j291J006M02p93P15r13J064q79P8L52j25q07R17p61M04L48k76
6609b3Nn93O89q3N49JK83j825J001J171j159n01Q09m55k13K03k69K27l31l47Q38
6630b3j82L63ql29k33N45n86Q99l18o89M24N8m86N23k70N41k47j8l50j1Q42q69
6652d24R68r93K84N19O4j073N05n90J157j485J006m91Q47n60q9K41J31j45o21
6671g49J25J168p71L91n21P3m25J218n26r8K36l98L69j57R0L7n98L47P09j377
$$ y = [-369, 199, -455, 225, 306, -94, 359, 559, 152, -308, 622, 409, 218, -900, -548, 649, 499, -341, -197, 372, 30, -319, -21, -38, -47, -537, 128, -202, 547, -317, -306, 337, 110, 269, 197, 8, -264, -33, 311, -520, -136, 516, -328, -259, 103, 460, 105, -136, -418, -210, 7, -411, -18, -23, -4, -14, 147, -342, -468, -422, 433, -299, 156, -413, 9, -116, 323, 536, -755, 251, 653, -140, 575, -338, 726, -153, -75, 277, 152, -655, 262, -499, -95, 253, -23, -18, -611, 78, -5, 544, 545, 828, -997, 4, 1175, 16, -485, 324, -131, -344, -141, -410, -183, -514, -861, -23, -205, 158, 150, -179, -412, 133, -453, 446, 128, -561, -137, -79, -565, -42, -312, 229, -18, -36, -386, -397, 445, -424, 544, -449, -165, 354, 418, -655, -150, -740, 417, -1068, -62, -553, 294, -266, -355, -114, 17, -128, -749, -624, 544, -227, 164, -357, -284, -709, 509, -17, -115, 121, -277, 92, -65, 25, 62, -536, -189, 520, -857]
6691h57O16q3K89K33o96O91j45k88J19J24n2K86k5k86k38J429j069O22q02j36
6711b68j67N97k82M21k67m33M97R6m84M88r24J089K65j152P08j88o0PO42K61j272
6732d26M92N7o42k22O01O9K92l45k71P35J2M14q86k87O6K61L76n16l82O72n42
6753d72P20K11j138O17l25p3M83p13N01m90L32j9O4N04l15K65m77p5N51l80q02
6774a031J056j23O58j478J279j1m22K95k87j21J0L31J67o56M87L32l90R3L01p4
6794D16k03K64q68K20k12J42N47o00K73M00o7n46J02n6J39O89j189M91P05k90
6814C57L81m68N51n22o12K23J40J95m2m6N3m4l20j24L84M7L4k99L33o10N50l32
6836a71j57M09m00N16j73k70Q00p11J012q93J29j93n93R23j49P9o2L58j003R56
$$ y = [-857, -241, -324, -35, 198, -498, 193, 48, -240, -121, 3, -49, 237, 212, -74, -312, 1117, 48, 670, -132, -268, -435, 162, -120, 301, 34, -399, 98, 194, -290, 198, -726, 363, 628, -524, 184, -4, -64, -57, 585, 846, -426, 66, 123, -519, -741, -140, -71, 221, -124, -395, 340, 352, 766, -120, -407, -341, -80, 296, -220, -602, 70, -472, 248, 459, -679, -62, -387, -460, 23, -690, -189, -679, -347, -366, -302, 202, -113, 152, -325, -400, 151, -229, -1031, 25, -98, 560, -918, 361, 350, -72, 223, -64, -185, -175, 156, 323, -333, 154, 486, 96, 189, 490, 416, 213, 477, -391, -171, -383, -241, 306, -294, -21, 379, 312, -234, -132, -188, -49, 640, -549, -58, 647, 357, 738, 270, 821, 299, -313, -90, 50, 245, 203, 157, 210, 166, -154, -278, 106, 153, 187, -112, 221, -389, 161, -171, -328, 81, -319, 197, 24, -246, 554, -157, 855, -38, 91, -102, -695, 228, 79, 158, 96, 454, -549, 407]
6856D07m32k96M49M12q60k90J12N74q81P07j8J72N85m84r84L63O27j94P67o22
6876A14M88k62n92L20Lj67j2M92K38q44N21J35j96j81m71O98k36K13j08J72j032
6897g07Q4Q57k8l32k97M12J53K83p60k01J159p0k63j99l74J47K94M06n28j67O38
6918E07r02O05N0p10J146q41m87N23R17m02n56R1J26O41j7q01M95L0n08Q2M73
6939D62m78Pj62J82k03K88Q2N50j046O15o7n04P76n28k49P3K81m50O99o99Q91
6960E20r88j62J024o71R9o26k58Q53P38m17o9k88L98j93O0l37L5K7o51J529r76
6981c53P50l41m98L28q9K62K17j07J28O11q18m84J092q36P01J93n04m54LM92K62
7002E55m00J28j92k61Q83M3j105J89O19q42R14q98O54j73n46M9L67P05p58M46
$$ y = [407, -25, -321, 128, 540, -320, -610, -498, 76, -805, -98, -116, 56, 641, 157, -827, -464, 163, -31, 736, 114, 602, 340, -252, 68, 71, -96, -108, 384, 622, -222, 299, 434, 238, 57, -414, 284, 48, 261, 153, 325, -707, -623, 234, 206, -126, -423, -11, 142, 425, -335, -536, 623, 553, 290, 91, -283, -136, 158, 564, 36, -131, 507, -395, 210, 260, -450, 696, -145, -632, -109, 808, 406, -150, -59, 67, 708, 691, -110, 385, 415, -93, -11, 462, -16, -9, -171, 11, -192, 96, 178, 728, -318, 297, 230, -274, 502, -26, -275, -202, 79, -371, 328, -371, 520, -468, -630, 394, -277, -178, -804, -1062, -209, 529, 112, 43, -245, 153, -40, 20, -317, -282, -255, -906, 623, -353, 397, 56, -442, -114, -203, 59, 276, 169, 297, 908, 90, -394, 698, -138, 563, 756, 252, -202, -199, 293, 555, 155, 283, 91, -170, 713, 756, -349, -160, 459, -383, 531, -367, 287, 114, -432, -383, -16, 689, -69, 377]
7022C77r14K48j51O22p46J010l47Qk10J25j21k63M96q16K85K82M37o23J59M20
7042B78J7N10n70J88l08M0l42l71m32P90rK04M46k61n86Q88o11p42R54n50k96
7063g63L27M11M88j31l14K62j68K2l25L88m23P44k85l95o7P19q14N47l45k68Q5
7084c05M71k78o3L38j58k65l33J065k58n40K07p5M08j54L42j35n83K33M1M53m62
7105e1M7Q35j207M04M92r9r50O57j60O90o39L3J78l04O81n66K3L23m11L78k94
7126F0J55P49o15k70O23q94j32M10l96j76K21J372j044K50p40M32J22n63L94m97
7146e39M5O91o84M76K28n70N90J14K04n70R7n27r3L60j04O17l27Q2L73k52k9J72
7168C54r2o30J84K05J55o05P63n31J032l13o69j78P23j27r63L24P26j345Q50N83
$$ y = [377, -537, -289, -440, 182, -564, 446, 99, 107, -103, 22, -99, -362, 134, -682, -397, -115, 322, -301, -142, 278, 295, 805, 235, 423, 115, 155, -187, -558, -990, -200, -209, -5, 441, 180, -406, 482, -129, -871, 83, -467, -763, -436, -25, 463, 332, 18, 280, 112, 134, -191, 197, -226, 518, 233, -162, -229, 490, -324, 223, -122, -390, -305, 166, -112, -175, 163, 5, -260, -593, 472, 214, -326, -119, -194, 214, 60, 402, 267, -316, -83, -42, 411, -51, -4, 831, -376, 28, 520, 421, -529, 128, -32, 658, 19, 52, 230, -74, 607, 41, 64, 387, -24, 354, 60, 215, 964, 349, 79, 702, -192, -324, 86, -310, -486, -265, 1107, 63, 313, -427, 5, 127, -436, -42, -539, -494, 197, -487, -11, 217, -353, 237, 351, 555, -15, 82, -445, -538, -178, -282, 335, 8, 90, 463, 211, 182, 354, 262, -368, -184, 21, 176, -429, 334, -197, 835, 522, -147, -325, 398, 271, -692, -368, 358, -987, -137, 446]
7188D46k88l2r6j94M37o13N92k79M09p12j39K51M03n23o00R50n9l64N65n65P56
7209C45n67Pm00J141l32n5P6q8n74P38K78J7q01K30K98k6m42j43N99r08O36o7
7231c8K92l99l72P44m31N59r47J62P9M74n69J029p24k60O19l40k0k24N90p99N09
7252f6J116j040j45j53r0J79K60l19K68k47K92j3j08r5N25mq71N76l2k45M89n17
7274b40O6P06q82J31L97qk01N3L82p09L00k97Q98o24K64p8R7J96k45O76n19l26
7296C7N67r54O88P0n82J47M91j174J197m94n06M22N41j117K59J91m51Q72m43J84
7316e5l23j19nL85n98O79L03l59mm02M56N59j97q17j1J74R94m97l52r36O26R8
7338d01K58O84j043R83r41K31r3N8p3J51L25n90R44q26p2j14R61n53O3k27N77
$$ y = [446, 158, 126, 30, -164, 273, -340, 252, -27, 382, -330, -469, -218, 185, -338, -938, 12, -47, -411, 154, -411, 345, -222, -215, -615, 526, 194, 139, 215, 127, -447, 291, 569, 586, -215, 15, 313, 287, -155, -298, 301, -607, 29, -38, 254, -145, -517, 227, -204, 355, -592, -430, -351, 123, -446, 583, -141, -401, 218, -122, -142, -366, 224, -575, -66, 1050, 10, -135, -288, -378, -199, 61, -258, 10, -237, 55, 42, -66, -161, 364, 360, -511, 65, 33, -212, 277, -240, -174, 532, -350, -219, 178, 170, -31, 22, 404, -305, -5, -302, 596, -28, 236, 158, 255, 451, 206, 882, 363, 37, 604, -350, 338, 408, -174, -27, 464, -710, 487, -7, -513, -91, 450, -667, -408, -217, -668, 204, -239, -55, -378, -497, -502, -117, -715, -36, 267, -92, -96, -498, -42, 517, 320, -497, -508, -334, 660, 163, -189, -1125, -499, -401, -143, 541, -502, 481, -460, -229, -322, -264, -337, -186, 139, -451, 493, -333, -405, -519, 442, -111, -48, -275, 302]
7359C02l54K90J4l69L33n98Q41l33q24N77K05j31k66O34Kq43J16K88O1j48k29
7380d32L52l43J71M0L6j88j10N80j06J5J67n82K12K8m22R58k20J51nJ48k96R3
7402B47N84l06k42k97K59M26n24k30K09L58j03o41l98O31k75K25L44p75J025p91
7422b74J42N30n38P09n51j57l55P12l17Q46q10j6M20k88p55P38K06o26O85l60
7442e9l98N25Q9J56q39O38k63P36k76o04J81L9K9L3R0l32Q8q0j29P18k33N72q15
7465a34k61O92j65j10J12K58j018R57l61Q61k88n16k69L01J42l2J69k50O16n69
7485A35L38J70q0n38l51P44m99j45q4J00M19m29L9K58O17l03m61M46j070O83l02
7506c13L21j02J30L21l65P5m53R76m92l15N95q78K72R75n28N4K83p24R1O7j26
$$ y = [302, -52, 238, 252, -117, 216, -382, 459, 126, -698, -121, 84, -47, -313, 321, 323, -520, -404, -116, -55, -203, -432, -80, -423, -252, -212, -176, -364, -474, 106, 0, 15, 182, -400, -188, -160, -582, 376, 156, 307, 302, 450, 154, 247, 831, 525, 283, -14, 245, 671, 147, -83, 126, 484, 381, -260, -658, -27, -302, -77, 267, -508, 517, -274, -132, 398, -140, 569, 18, -139, -494, 218, -99, 747, -63, -79, 341, 53, -702, 36, 242, -384, 301, -59, -457, 68, 157, 313, -526, 112, -151, 585, 309, -295, -114, -75, -46, -13, 77, -255, -167, -247, -376, 342, 109, 681, -134, -395, 297, 132, 22, 134, 392, -626, 331, -30, 831, 543, 27, -242, 59, 201, 169, 338, 88, 704, 135, 473, 643, 563, 25, -326, 418, -81, -226, -310, -210, 209, -220, -181, 77, 694, 391, -70, 376, -694, -11, -313, 8, -94, 36, 357, -8, 67, -386, 590, 98, -217, 378, -500, -228, 747, 219, 273, 556, -168, -77, -10, -136]
7527a36J13l93M52M67p75O79m82O84r94j97N96J82n29k84Q13P0m52M04j178J010
7547E0J22J7q0O80m80k78N80j6j77o70K18j71J86k48M58n0l94N93l14o5M05m47
7569h1L16l32m5J81l88M23J018j353K77J11L01o97N16J76n46J58M82k75n25m94
7589g77J082m7k77l74N32N0j50m32N54p8L45J29Q3k95k03O23l12o5j253P65k66
7610c66M85j94K70K22n74J74Q6l1q8n14L35q2q8R87j26r7j096J747j570N92m30
7631c58J029j070K53K78k22o7L49M92q15Q5j85j23P29o9k59K24L67m73n00L73
7651C8L2R10k78p82N9N86n35j77N30o12j89j78L31M6K09j5Q1m47R0N75l16R1K15
7674B64L20l33k42o82J010n65N06n21m25M50L9k61K34j15J16J56l76L56J22m12
$$ y = [-136, -23, -416, 36, 503, -272, 407, -75, 609, -385, -582, 14, 196, -333, -617, 196, 266, -186, 218, -960, 50, 172, 189, 109, 789, 309, 31, 611, 595, 418, -252, -34, -205, -19, -267, 191, 141, -253, 340, 26, -39, 366, -81, 235, -97, -142, 39, -349, 74, 1092, -261, 16, 127, 428, -269, 247, 423, -123, 35, 517, 242, -283, -777, 305, 258, -19, -393, 139, 189, 39, -393, 161, 83, 428, 557, 640, 345, 142, 765, 453, 388, -865, -100, -366, 119, -75, 195, 417, -157, 17, 103, 72, -16, -530, -195, -277, -365, 622, 496, 399, -697, 1050, -520, 72, -358, 671, -399, -146, 132, -90, -157, 192, 684, -131, -46, -231, -354, 375, 306, 47, 271, 638, 165, -335, 38, 70, 980, 702, -80, -21, 565, 30, -147, 383, -229, -418, -596, -265, -219, -10, -25, 56, -391, -301, 274, -42, 49, 264, 584, 251, 9, -673, 337, -228, 278, -243, -668, -218, -179, -440, -206, -321, -205, -49, -425, -69, 53, -359]
7694c59M1l53J592j357M18j2k73N07N4j16j43j37m11J181n09p11J31K85P22p47
7714a97K23K10j86J79N12j34m16k05L06J12o71P1N40k69m42J90J69O33j500P04
7734a71m97L00K24k29K61K58m3L46n38k1M23o99k97N35k68P04P6o64J38K8l91
7755e25O79k16L6l71Q81m88j61l61K27j62O46l3q49J154M02j872Q13K22Q6L33
7775D41j7m82J15m83K25M84n50J51q7J9P8J96p04P95k81O14o22N96o20P79r14
7796b67Q17j011R54r66M22n9n33J044n42Q77Nq4o51k52L32K39m2o3L5m69K23m20
7818d11P31l85O93j177K09L50J115p01K52n19m71K80n8J5m87M48Q9n52o2N33J216
7839A108j329J62Q60o08N28q70m89P17q1M83k23k13j3J043n84q19M04K54m83p1
$$ y = [-359, -318, -671, 921, -436, -18, -30, -303, 204, 258, 142, -1, -138, -549, 632, 123, -588, -457, -172, 550, -197, 26, 236, 50, 229, 741, 607, 191, -14, 292, 404, -267, -196, 344, 75, -367, -177, -8, 625, -875, -171, -668, -368, -144, -373, -112, 146, 103, 449, -89, -110, 313, -386, -683, -148, -416, 288, 364, -300, -162, -134, -525, 154, -62, -26, -397, 484, -4, -165, -526, -299, -461, 185, 152, -697, 457, 859, -1013, -200, 22, 108, 441, 424, -58, 57, -426, -201, 283, -267, -116, -203, -184, -106, 90, -614, 181, -100, 514, -108, 488, -132, 647, -267, 550, -461, 493, -473, -51, -110, -643, 401, -141, 736, 741, 657, 6, -246, 86, 325, 283, 220, 255, -214, 9, -411, 320, -65, 628, -549, -340, 10, 1125, 424, 676, 157, -314, -34, -92, -77, -564, -116, -27, -579, -641, -108, 1108, -221, -59, 801, 193, 721, -149, -638, 79, -2, 481, 258, 45, 32, 1075, 491, -328, 76, 330, -153, -224]
7859b24j17K01K3l37J20M64q3k16M39n53k3Q55j580Q41m29N51J09k46o0R47j225
7880e43J9R63m18J75R6q37L94j48k0J91O02m81J80p9k94q4J11K22O02p97L90n10
7902b66L56p27J060N2o41J98N0Q9J01p12M91o41P44l02L28j95k02N66m93J211
7922A067j757Q40l80L75m94M18j95M36K1q56R46k27k04p54O37N13r33L80K07r0
7942e0j61J16J80l52o60M52L14PK7L24p30J087q45P06r61M17k23J49L92j03M12
7963D98q15P54o03K18l69j38k94J019n19M42n47J43M93k59N61p37K63M28j417
7982h79O66n14M85N64j37j92q35J582q94Q6K50N7r32M26j9j22N77j053K77l4O19
8003b2j40J63l57j09J034j11m70k04l49J52R03n86Q84p39J17l29J78q18K83M3
$$ y = [-224, -341, -140, -117, -454, -334, 130, 47, -169, 270, -283, -306, 549, -1031, -190, -619, -68, 41, -205, -265, 682, -543, -524, 439, 21, 196, 292, -545, -151, -299, -319, -128, 474, -7, 173, 94, -200, -284, -173, 49, 651, -146, 244, -266, 90, -637, 423, 475, -166, 32, 82, 171, 272, -440, 51, -590, 154, -148, 180, -15, -217, 349, -144, 1067, -690, 150, -230, 145, -349, 69, -126, 310, 331, -525, 421, 194, -10, -764, -127, 386, -547, -167, 40, -50, -211, -95, 85, -267, -927, -475, -161, -154, -127, 197, -533, 554, -291, 415, -546, -129, -352, -203, 189, 86, 498, -317, 437, -166, 52, -317, -455, -749, 270, -249, 193, -354, -211, 282, 23, 584, -153, 110, 538, -879, -213, -727, -242, 322, 185, -7, -842, 740, -154, -68, 182, 239, -693, -267, -286, -408, 169, -884, -607, -641, -22, -162, 1, -356, -465, 569, 458, -12, -216, -565, -413, 490, -96, 788, 49, 166, -163, 15, -803, -520, -477]
8023d77J08J101o02J57M7j91r6j87k77l67Q03R7l78M93j39n36K7O09n24P24n40
8044a48l45L17Q9k81J082m72lp32R43q2p11N65L97q46K10jl46M89k11j46O92n96
8066a36j14k61J437p46m07J28L23k60j8j74L97P5l93J60M68j185K37L54n44P45
8086H6mL35N94j106j39N52o63P43l59l46J48O3o98N15m1L85j70Q3J24J42K62l22
8108A84J08q79N03K36r5K21m37J9O22n04M66l55NK3l02K58p75J042J06j80L3o82
8130c83K96L46q02J002n79K36m90J94o38M95k38P96n20K77M30l03n38Q9R5l76
8150f11N20L13k27o5K78No93J654j448J45k6l81J071j041K32Q81L74o15o32Q66
8170F00k34k14k63j25l8j24M42J4L7l92k30N45j3k85O18j94o86P96o5j97m
$$ y = [-477, -369, 732, 130, 287, 334, 143, 47, -140, -417, -784, 19, 116, -262, 231, 92, -444, -417, 192, -332, 392, -148, -493, -176, -87, -368, 714, 242, 239, -493, 450, 368, -343, 222, 619, -227, -17, -18, -364, 125, -86, -232, 460, -136, -250, -511, 926, 180, -227, -99, 224, -36, -54, -228, 169, 244, -149, 11, 479, -706, -469, -115, -659, 86, 82, 417, 1011, -95, -234, 318, -345, 398, 39, -307, -159, -96, -794, -279, -320, 65, -105, -22, 102, 244, 506, 184, 292, -587, -84, 152, 57, 278, -159, -140, 482, -22, 444, 89, 94, 117, -185, 73, -702, 340, 446, 266, 299, -383, -87, 259, -543, 459, -120, 116, -374, -180, -818, -323, -561, 235, -285, -8, 422, 119, -419, -330, -235, -611, -91, 222, -5, -70, 208, 213, -480, 1174, -274, -129, -155, -536, 535, -506, -274, 607, 981, 366, -266, 600, 366, 152, -111, -236, -274, -398, 44, 58, 95, -297, -527, 18, 5, -280, 338, 144, -542, 254, 189, -8, -12]
8191a2
$$ Imaginary data points
##PAGE= N=2
##DATA TABLE= (X++(I..I)), XYDATA
0@%%%%%%%%%%%%%%%%K8r2J28j28J28j28J91k55K56l01L65l96M60n42O07p05Q25
33D41r29J036j169J318j476J644j836K053k284K533k804L101l428L790m181M605
49B414n073N588o158O788p486Q267r146J0141j1278J2592j4131J5968j8205K0990
63A1271k4570K9374l6203M6795o5574J09147m28003j52134L53368j02102M4490
74b14141J04345J28620L0720Q8863o393J7788N0240K3283r0142j9704j820m8630
86F3029p1409n669l9034n6428l1931l973l4603n224M0966O5477K6924J3352M4110
99E587O5525J6813m055J1593P223j3507r512k9125m5998j1246L333l7835k4269
112f5473K2413r175m0728K1562M8322m889j381L6177J2250r029J8503J1878j1993
$$ y = [0, 0, 0, 0, 0, 0, 0, 0, 0, 0, 0, 0, 0, 0, 0, 0, 0, 28, -64, 64, -64, 64, -64, 127, -128, 128, -173, 192, -204, 256, -286, 321, -384, 441, -488, 548, -621, 697, -779, 865, -971, 1082, -1202, 1331, -1473, 1628, -1800, 1990, -2191, 2414, -2659, 2929, -3229, 3559, -3927, 4340, -4806, 5335, -5943, 6649, -7482, 8486, -9719, 11271, -13299, 16075, -20128, 26667, -38907, 70240, -357763, -509897, -156529, -258631, -214141, -109796, 18824, 49544, 138407, 132014, 149802, 200042, 223325, 133183, 113479, 111659, 63029, -8380, -14049, -53083, -109511, -141442, -145415, -180018, -185242, -144276, -78799, -51875, -38523, 5587, 71112, 87925, 83870, 95463, 102686, 89179, 79667, 50542, 4544, -6702, -3369, -41204, -65473, -43060, -52235, -92963, -71401, -23079, -27968, -29349, 6828, 19078, 10049, 28552, 40430, 28437]
125B8437O383P999k1947j3691P751r923k1629N687J2488j2749j3695L579N324
138a5986j671L27O154P269K316L085N332m19L26Q940l18j1038j424N528q378p619
154g576L847L88k107J0586J418j4776Q32J1414n831j2164N145O671l411l79M337
169a606K149O235Q244m715m337N114q12j0207n291L280Q99l335l334J146K342
184d228j108k148r35M15L664L045N2l66Q461N959j731O33M068j076o624m593m975
201a487m492j246l167o677K621O897K09k132N224O522J633O68P74J487L451P48
217A1033l317j350J767k473m835m035j268j248k242n486J4M899L634n21L802M658
233C032M576K022k69j892P81J740m906n262J078j102m084k789k4r86J627o6j637
$$ y = [28437, 34820, 42819, 20872, 7181, 14932, 5009, -16620, -10933, 1555, -11194, -24889, -21310, -15986, -17657, -17330, -11176, -3907, -1591, 1494, 6826, 6407, 6733, 15673, 15355, 4317, 2893, 8421, 43, -7576, -3729, -3341, -5448, 5138, 6556, -8220, -7388, 4026, -1805, -13969, -8824, -2153, -5564, -5943, -1606, 543, 6778, 15022, 10307, 5970, 11084, 10272, 65, -5226, -1946, -1047, -4382, -7716, -6570, -4228, -5336, -7484, -8419, -8004, -4340, -1295, -1243, -1609, 6852, 12811, 11080, 11713, 15781, 14705, 8081, 3488, -1487, -5979, -7225, -10392, -17069, -14448, -7551, -7342, -9474, -4250, 2272, 3905, 4573, 5347, 6834, 10285, 11033, 7716, 6366, 8133, 5660, 825, -3210, -4478, -5726, -7968, -13454, -13440, -8541, -4907, -5428, -1626, 3032, 7608, 9630, 9361, 7469, 8250, 9990, 5084, -178, 900, -202, -4286, -7075, -7099, -8085, -6458, -6524, -8161]
250h161J632M363J819k006L729M648J611j44j136K81k23p69m133l888P81k014
266c610l121k251J570K661n24J1K140M375K170O37K90J022K056n02l235k257P63
283B195n29k622l790J272R06n83j079N23J925K95N35j184J55J967K18n48J097
300G53L157Q2K61j030N43M7j707j534j755m57j016j701j795J660K761O15P82k82
318f16J637J254k225j456O55P96J05q77J471J659K152p51q46J949l11l393k905
335a702j648o37q46j474K60J225K940J123n31J029L641J001j621q52J259Q76j233
352B810j401n04J416O79k417k451j069J453j679k334o14J958J676K74J381J005
368A83K152J413O15r14Q92l04m03k356O06j540j258k293j396M26j02L72k15R64
$$ y = [-8161, -6529, -2166, -347, -2353, 1376, 6024, 7635, 7491, 6355, 6636, 6413, 5644, 1511, -2377, -1596, -3610, -6731, -8982, -7412, -4751, -5275, -5264, -3124, 1251, 3421, 4058, 4348, 5370, 7426, 6924, 3689, 1432, 2195, 1666, -956, -4746, -3474, -2568, -3151, -4230, -3707, -1782, -1487, -952, -2136, -1981, -14, 204, -344, 753, 3910, 3992, 4253, 3223, 3766, 3813, 2106, 572, -1183, -1640, -2656, -4357, -6152, -4492, -1731, -1116, -334, -616, 1021, 2275, 50, -1406, -751, 45, 150, -727, 744, 2403, 4555, 3804, 2958, 4907, 4596, 1203, -1702, -3350, -3987, -4833, -6307, -6047, -4822, -1882, -759, -1290, -261, 3380, 4381, 2760, 1908, 3167, 4043, 2810, 1409, 905, 2321, 3000, 583, -1868, -2937, -1484, -3163, -5497, -6111, -4153, -2477, -2203, -822, 183, 2335, 3748, 4363, 3449, 4341, 4037, 3634, 1278, 1884, 344, -914, -3207, -4603, -4177, -4279, -3907, -4122, -3158]
386c158K128J003L79Q21J470J278k55j051r4j14m89j031j166j58K95j574j269
403b985J009k93L15j627N03J540J030K09O04J778J970o2j031r6n53n21j533j315
421a058p28l04k09l54L22J792l10m9o45K203J93J49r18L85J360M53J57j250O84
440A873j79n47j693n37O58n39q12p14J287P00j76N4n61J033J143k5j068J20J23
459A40J019p19N08O46n96k41j562R35L13o77j298O7O52J57L35o1M05R74K55q43
479D09o2O67L62k97j291O17R01n21o13m1n6L33j050p81Q0k35M71n28n8J553k7
500a67M77l20K229j21L72o07m01K6q89J69j309m78R03j016j654Q42N28J00K27
519a089k41J89R74L91L70n22J879J00m99l17L53M65j450p04J03j31l64j484o90
$$ y = [-3158, -1030, -27, 352, 1173, 2643, 3921, 3666, 2615, 2521, 2407, 1918, 887, -279, -437, -142, -1716, -2985, -1976, -2269, -1954, -3581, -3078, -1538, -508, -299, 305, 2083, 4053, 3991, 2960, 2864, 2311, 1790, 257, -1058, -1786, -2090, -2299, -2653, -2331, -539, -849, -898, -1543, 660, 853, 1002, 84, 469, 1829, 2282, 2439, 1189, 1873, 1694, 1147, -546, -1083, -425, -964, -1776, -2490, -1203, -503, -679, -625, -1186, -153, 990, 965, -103, 17, 140, 1159, 440, 948, 1594, 998, 757, -805, 130, 443, -234, -1532, -1465, -813, -656, -321, -382, 23, 997, 1252, 409, 347, 1014, 1376, 1079, -212, 405, 1306, 785, 172, 131, 75, 408, -642, -1423, -1343, -1578, -1107, -1635, -1693, -140, -167, 310, -10, 2219, 2098, 2470, 1863, 1462, 1488, 599, 768, -541, -1019, -116, -1132, -2786, -1944, -1416, -1316, -1089, -1330, -1141, -167, 224, 594, 72, 1951, 2051, 1552, 1235, 1588, 2053, 603, -101, 2, -129, -493, -1977, -2667]
538b667n55Q85L15j56J502J382J343q78R87R9j33Q10j022j001ko67k25j890J484
557c89K43n9j495K35p5j87N21L83M73k37Q64N31P44N23O08q39r6k31j9k297q15
578a614K27l82L89m97K28m87J570K75j38M06J460l48r51M25M41m33J40L49o4j769
598g73Q85J27o15L86J60k96j811M39j57M02L46Q42K4J73Q28n1n60J80J068k19
618A378j929J082p82r7l18k24O91p33L91J45k54O09q8p06L22J281k37o07o6R81
638H39N60n53L55J7k03o76N89q66j613J164l03j336N73M83P78J3r9R56k04J04
658E78o89m1N29J4N25q73N04k54p65J14m91L23j95j79l97L06O66o71N27J92O62
679C85O44k09p23P92K9j68j56o53M38o39K65q28o4P0O40j9p75k62P68j5K64j81
$$ y = [-2667, -3222, -2337, -2022, -2178, -676, 706, 2049, 1171, 2158, 2257, 2124, 2934, 1912, 911, 909, 242, 17, -1873, -389, -146, -205, -1700, -1465, -1540, -1727, -1206, -823, -350, -587, 277, 808, 1552, 2075, 2683, 1844, 1748, 1517, 1498, -799, -1614, -1387, -1769, -1380, -1877, -1649, -2136, -566, -291, -429, -23, 1437, 1089, 138, 563, 1004, 571, 711, 1060, 996, -773, 112, 239, -376, 10, 170, -126, -1937, -1498, -1655, -1253, -907, -65, -41, 132, 960, 909, 349, 529, 1597, 1378, -551, 531, -251, -348, -666, -890, -199, -932, -541, -396, -650, -41, -129, -835, -513, 768, 531, -76, -142, 839, 1399, 846, 1201, 1218, 1015, 339, 928, 62, -1551, -387, -690, -2026, -1453, -970, -192, -179, -278, 678, 474, 578, -111, -152, 377, 391, 916, 43, 547, 293, -472, -358, -849, -526, -721, -900, -1297, -991, -325, -996, -469, -277, 385, 1029, 820, 97, 889, 918, 750, 594, -59, 379, -260, 5, -823, -887, -817, -177, -196, -971, -1233, -465, -480, -216, -397]
701c97R35L40l72l52k27P58r9k7o55M62j20r80j20K39O81j047Q0M5k6J010Lq79
723g48R98j31J23M55n90K66k33N9n44M94L6j3p78R7j076J307l23k30k06J035l6
744c8l37J441j036J72m87Q53J84q56Q90j070K63L91r67p99J600o76J45K29k24
763c22K34k73KO9J73K35K99l78P82O67p34j39L48k28o89l18l02O8o42Q00k55k72
785h75J78J30L86J13J015j037J15k01J41R03n38J438j515P0M32j92m12q18k82
804i49Q27n77l02k4J20J209j48n79J071j64L8q0LR81k03p11j007L11M99p45M3
825c87j99P91l0M12j195O02k98O06k89J93N96n62l16O32j01P25j073j8m89N67
845A67Qm37j53J96o23j7L58M82l22L62P90j84l11J82L62j001m3K02L40j18n15
$$ y = [-397, 538, 878, 506, 154, -73, 685, 586, 559, -96, 366, 246, -734, -854, -615, 66, -981, -901, -856, -882, 128, 131, -748, 250, 119, 242, 697, 107, 373, 140, 199, -345, 149, 185, 172, -606, -509, -1585, -278, -601, -831, -1037, -2, -38, -375, 1066, 30, 202, -285, 568, 752, -104, 786, -284, -21, 370, -597, -1396, 204, -472, -327, -98, -322, -88, -361, -359, -290, -117, 118, 417, 39, 821, 1488, 754, 615, 963, 735, 46, -272, -574, -506, -1148, -348, -603, -875, -697, -567, -181, -68, 947, -90, 25, -176, -35, 868, 330, 1768, 253, 323, 755, 563, 151, -667, -949, -122, -699, -1001, -1025, -905, 304, 156, -423, 648, 484, 522, 442, 445, 1426, 1223, 512, -495, -184, 315, -430, -387, -586, 205, 175, 587, -608, -6, -304, 302, 13, 206, 802, 240, -76, 556, 455, 1180, 107, 89, -400, 167, 175, -262, -415, -219, -842, -859, -501, -19, -341, 21, 811, 627, 316, 498, 860, -141, -184, 18, 358, 240, -275]
866b75Q0N39n76L67k51M63n90O8j003R33J012j45l89j53L10l15R46o99l08K01
886B15K23j07K1N14p20q12P42n97N2l06PM01K73K21o37N12l0l46L82K89j79k0
908I8M98m52k03k99M91m59n17J000p01J51O67r3m78J090r18l10J45Q5M11q1m06
929b81N64l82l8J01l8M13m46m20O26L10j517O12Q59j045L45J62M90q56Q50J93
949E02m05q5K49N1M63k23m40o72Q20R8m9j255k8L2J279k22n17O84j041J297j315
970g77J125j10J81m40L46j28K07n42L34l82R1L65m35k07K24M45j023L7M13l17
990e93J05J4P12M56n90R42q48J68j51m26P58l74k24q78N86k45P92p40J76o73Q86
1011a47J78L44k82L07Q7m40rq0O96N6r86J95K77j32l17J16Q98k57p25L68j21J13
$$ y = [-275, -195, 344, -232, 135, -116, 347, -243, -175, -1178, -245, 767, 622, 233, 80, 390, 75, 1021, 322, 14, 215, 438, 331, 352, 866, 146, -666, 76, -521, -469, -775, -768, -367, -94, 127, -510, 2, -28, -374, 8, 297, 118, 98, 596, 144, -59, -358, 133, -326, -843, 157, -544, -393, 274, 181, -297, 793, -125, -435, -290, -205, 206, 125, -281, 283, -99, -137, -36, -74, 339, -107, -527, 99, 409, -1108, -496, 363, -682, -337, -175, 315, -541, 309, 502, 97, 12, 261, 312, 775, 552, 112, -560, 260, 358, 309, -946, -974, -942, 337, 115, -402, 282, -759, 538, -777, 348, 238, 419, -21, 325, 197, 404, -138, 196, -186, -95, 270, -165, -372, -148, 297, -726, -689, -276, -593, -488, -474, 238, 694, 104, 1046, 198, 366, 215, -211, 547, 173, -51, -929, -343, -588, 204, -536, -360, -1033, -147, 31, 375, 93, 400, 487, 47, 38, -42, 654, 710, -276, -81, 196, 64, -253, -137, 761, 504, -221, 147, 26, 139]
1033A39J79n56P0K82N17j417J148K59n65l02l22P81n89Q2J006r48P7M21l88R14
1053G88q04j73J69j63J087l3j161J47l04O45L93n54K22n06N84K9J9l06n33L88
1073f6J22M09l36l88R7Q3R48j115j13P32K36j0r48j61O65m7l93R75p63K33q20
1094f60M11O1l73L2L94n45J94J96R00n70J95K78o31L62n98L97n74R10n76Q72j078
1115d03L64q76K66K63L90m66J60K50K46n17M31M20j22l83P34o96N49j022L55J7
1135d0q42R20J147j082o97M41j2M3M23n43M56L13r12L75l12P50j75m61M46J58
1155C96q83L22Q1l51j4P05l40j03K96m46l0L84o5o44J066k57j96O18q79R99l11
1176C48m96j11P95m98J56n34Q00o28L22l68j0N78o45k06k1L18l00L35j76OP68
$$ y = [139, 318, -238, -168, 114, 631, -786, 362, 621, 56, -246, -568, 213, -376, -294, 712, -236, -159, 262, -126, 788, -16, -189, -20, -183, 904, 871, -290, -143, -447, 198, 591, 37, 259, -247, 337, 366, 385, 79, -454, -66, 56, 465, 129, -259, -162, -79, 869, -246, -359, 373, 609, 599, -349, -510, 155, 108, -285, 690, -73, 160, -660, -249, -188, -561, -529, -135, -680, -486, -290, 610, 40, 235, 513, -118, 244, -354, 43, -531, 379, -197, 675, -403, -39, -915, -649, -386, 4, -462, -302, -52, 194, -323, 108, 528, 406, 23, 757, 61, 610, -412, -57, -40, -882, 38, 1185, 103, -594, -153, -165, -122, 301, -242, 214, 527, -385, -10, -322, 428, 253, -208, 238, 396, -487, -165, -84, -435, -449, 256, -84, -187, 109, -337, -367, 17, -48, -692, 374, 117, -79, 539, -340, 659, 348, -148, -259, 536, 38, 194, -340, 460, -168, 154, -214, -224, 354, -291, -497, -518, -200, -500, -165, -341, -335, 433]
1197D33r23Q1L40o44R62l48l25O53o61l54O30R0j33l4j25l18j49R77k70J82N19
1218E83o26J2k36R29m51o12P12o8m12M03J16P8m33R3K1J71J56o86J50q2Q3M09
1240C10J67K06r09K08j24j34J178o33pm55k58J32O55q72R59m73l14L1M88N4j16
1261I3j378K283j063J93n24N19l26N95k30l26K85m13l50M96M42N9p67k67J176
1280D97o75n02J539p48M36j40l86J18J20j066J92N21K80m79j75K15L49l58N62
1299C00m63M4K59l74N06n25O61m93O69r7J13l90p1m28N9k00K54J88J39k79K47
1320A19o5O77j268R69j55k63k74P24r1n69Q35k93m40n12J181n46n92M53L87j79
1340I8N17q08L36n48L92k20N35M28l87m68L88n47R10j37j536J340J58n39P9m35
$$ y = [433, -490, -409, -69, -713, 249, -99, -424, 229, -432, -786, -156, -66, -199, -233, -358, -676, -825, 152, -118, 64, 583, -43, -31, -267, 662, 211, -401, 311, 243, -169, 234, 350, 428, -5, 88, 109, 280, 436, -250, -100, -182, -99, 310, 477, 683, -226, -18, -142, -276, 902, 269, 262, -193, -451, -319, 336, -536, 423, -50, -364, -333, 155, 209, 93, -1285, 998, -65, 128, -396, 123, -203, 392, 162, -164, 121, -292, -642, -146, 296, 355, -412, -679, 497, -178, -680, 859, 111, 547, 407, 21, 139, 259, -807, -615, -94, 186, -293, -468, -253, 96, -262, 300, -163, -119, 140, -234, 272, -253, 408, -85, 584, 487, 600, 210, 139, -289, -230, -430, -176, 12, 151, -128, 119, 54, 731, -537, 432, 277, 14, -260, 464, 373, -196, 639, 346, -94, -606, 575, 29, -563, -110, 277, 98, 615, -193, 143, -405, -13, -233, 302, 730, 343, -125, 263, -284, 626, 489, -1047, 293, 451, -88, -9, -444]
1360d44P61j19k84l55P31M8p38K98j50j6L7N62o49N76j84K17n02L46MJ44l98P44
1382F29q67j40j38M13L70K96k03l10J15n29K80j63k96P63K53n89m3J47J53m59
1402c18N46o29o14R20k53O30m24K32m10M22L08n86L25j44n7K00m90N40j45m12
1422c59K53O12n45j87K09j148J142O8m82j37P52m31o2k93k83J087M31n72j2j49
1442a06M96o66k12M08R0o05Q55m31j52K7j63l53O81J37R3n81P20m32N42q71L42
1463a81L15j66n32K58J074j000Q7R97q41q01J181k39N56j094p8O16k86j91M77
1482A52M78j286L5J281q91n03Q48N07j137K61J37j77k77L74m20RJ078q55L21j92
1502b57M48L78k23o7N80m56l87O39o14K93o29K6R8j3j5K70K34r07M88J1n92Q28
$$ y = [-444, 317, 198, -86, -441, 290, 338, -400, -102, -252, -268, -231, 331, -318, 258, 74, 291, -211, 135, 139, 283, -115, 629, -238, -378, -516, -103, 267, 563, 360, 50, 165, -364, -84, -247, -543, 220, 473, -116, -159, -12, 141, -318, 228, -401, -1015, -95, -348, 282, -142, 90, -320, 102, 410, -176, 149, 5, -52, 148, -342, 198, 53, -359, -106, 506, -39, -226, -17, -1165, -23, 45, -437, -574, 178, -253, -315, -608, -891, 196, 627, 55, 43, -106, 390, -276, -488, -80, 10, -595, 260, -171, -323, -296, -459, -812, -131, 6, 99, -482, 238, -194, 348, -523, -181, 134, -32, -564, -306, 768, -232, -145, 852, 11, -790, 391, 152, 708, -386, -464, 152, -134, -325, 152, 630, -656, -621, 660, -231, -734, 114, 621, -516, -255, -118, -295, -572, -198, -618, -609, 469, -386, -65, -257, 191, 569, 346, 279, 859, 403, 16, 655, 41, 334, -295, -269, -171, -184, -199, 71, 305, -602, -114, -103, -695, 133]
1524A33j94k57N2L60J02j77m06M39l95k36K42o5K14M62j70N3n41J059q62O78m96
1545eN12m92L41o72K6J09L18K90o01O96l16q07M20O89k76N1M28l94m00Jk20J042
1567G40l97p36O62Pk77n86N68m44K41K59l02K0L16N14k33r62J434l85q5k04J03
1588B53K26K14l15k8k45k23j23M70n73Q66K8k22j11k1l13k57L1O4j4Q67l68m71
1610b65L05n49J05k05O52r43P74m22Q26m26N08j79l06o3K51j48L76j174J41m2
1630g84L40M95o91J047k22r3L1J12o54N29m74L95l19Q31o93O71o92M45m77K92
1650H9k06K41L9l38k67M55n25O13R6J18q9l05o85N31k43P51l71j13L31m95Q98
1671E25n18k93k14J28O67p5o00J14P12k57ML5l36N48k46k02k48L8M63q22M39J9
$$ y = [133, -61, -318, -266, 94, 196, 19, -387, 52, -343, -579, -337, -402, -188, 274, 104, 157, -384, 675, -187, 491, -5, 507, 15, 356, -316, -290, -181, 137, 427, -174, 522, 206, -601, -181, 508, 232, 283, 711, 317, -83, -82, -302, 740, 343, -393, 269, 276, -1, -587, -19, -463, -222, 37, -265, -245, 71, 585, 352, -610, 824, 439, 354, 150, 253, 479, 693, 378, 350, 105, -118, -241, 229, -344, 522, 550, 328, 217, 196, -117, -374, -343, -279, -293, 574, 206, -265, 40, -509, -404, -609, 43, -900, -126, -548, 278, -148, 360, 181, -125, -188, 63, -85, 291, -883, -742, -784, -444, 51, -640, 407, 185, 92, 123, 235, -419, 110, -364, 31, -288, 543, -150, 521, -171, 274, -203, 89, -117, 124, 163, -175, -442, 13, -512, 101, 197, 315, 226, -79, -764, -233, -476, 275, -96, -209, 122, -373, 525, 7, -286, -500, -372, 295, 220, -380, -266, 446, 189, 193, 228, -108, 440, 194, -8, -256, -218, 245, -577, -138, -119]
1693a19m2J61m82J216q37n2k53R9j05j84P65J57n32J091n72l43N62n59M26k88
1713A09M0n72L60l0l07N63N9j92n42O44o31L46q1m9J98M75q73Q1P35m12L93J14
1735D28o92Q53p99j96L17m94J554j91j111J17K96j21m9O70r9p57M43k00M92l15
1755A46K65K80n98n38L5M96j40l98j1N81K78o76O9K65M91m15p11m5k4K21m97J346
1777D20j134k91J234q38R95l34j049J210m20M69k53P94m84j47j28J11l36J04p0
1796a47M04K51m56r1O63j609J165L07p95J12O60k42p6m56O66k03k01R00n52R9
1816C99K21j95m60j97K63k99k95Q84J7n28J17Q72q35j4J43p11M54O7n15P41k24
1837i5n95j6J410q69O1q8o06J66R93k18r66L09N93o09M83n3L7k69O94n11L18q7
$$ y = [-119, -161, 0, -482, 734, -103, -155, -408, -309, -414, -598, 167, 324, -208, 883, 311, -32, 530, -29, 397, 109, 149, -423, -63, -93, -400, 163, 222, 30, -512, 132, -499, -153, -234, -283, -85, 390, -483, -402, 333, -79, 314, 428, -264, 589, -210, -406, -89, -583, 971, 780, -331, -214, 82, -39, -88, 582, 483, -274, 169, -31, 461, 146, 411, 691, 93, -445, -410, 86, -54, -452, -463, 118, 396, -280, -211, 54, 545, 130, -581, -626, -650, -429, -926, 420, -714, -1005, 229, -609, 386, 52, -997, 213, -207, 262, 9, 803, 319, 172, 44, 155, -181, -77, -147, 257, 508, 52, -39, 624, -985, 180, 487, -308, -196, 464, 222, 146, -310, 356, 153, -48, 852, 300, 399, 620, 425, -35, -232, 31, -268, -563, 321, 338, -190, -73, 799, -36, -50, 93, -618, -164, -97, -612, 129, -95, -690, -706, 704, -165, -104, -192, -798, -632, 361, 143, -823, -514, 79, -530, -47, -100, -63, -332, 362, -149, 169, 82]
1859H2l36J503j146L12p55M39m4r2M08L8p9k77j84N04q92j40J133l23r29M13Q07
1880D42o83N86j114J116l86k58k95L10O27r71P50L99q11K45K19N04r78N42J16
1899C60j96N92j471N32R0Q4M93j58m44p66J15J233m91O4R3K51p65L49j87j5O60
1920D23j3q56K34J22k85J219l39p09L58m76J40K09P3M27p57k27M83l66m29R37
1940A68J35k70l32p3Q14j165Q40J31K9J8n13R44o06J3j20J89n30L04M29j080O69
1961fj23P26o81K04n28R67j020N00j38J7rM25n46J28M38n4M67j043M7M42j11n47
1983d45O93J72k54J84O5k52L38m45K43K79k46k71L2o5N85o18m36K90M58k62L0
2004G5l30J17O23q49J027p59O39j55j54N47p44J6j040N35K19L9L27k43K43p22
$$ y = [82, -254, 1249, 103, 415, -340, 99, 55, -37, 371, 409, 330, 53, -131, 373, -519, -659, 474, 151, -778, -365, 442, -241, 345, -769, 347, -39, -297, -592, -282, 345, -626, 124, 523, -288, -43, 176, 680, -298, 244, 360, 164, 756, -715, -183, -93, -9, 484, 326, -118, -884, -769, 464, -27, 37, 130, 381, -384, -35, -222, -237, 423, 410, -446, -212, -90, -375, 844, 505, -204, 154, -322, -182, 27, 100, 527, -230, -457, 26, -340, -769, 168, 303, 33, -299, -372, 442, -723, 117, 248, 277, 295, -218, 726, 120, 133, 13, 202, -328, -24, 405, -675, -6, -129, 597, -84, 120, -408, 559, -461, 39, -99, -82, -91, 334, -212, -84, 354, 300, 767, -276, -229, 213, 102, -445, 248, 420, 166, 350, 415, 163, 501, 56, 299, 578, 332, 61, 93, 28, 613, -5, -441, -151, 307, 45, 75, -255, -138, 485, -364, 663, -96, 543, 388, 234, 781, 37, 53, -987, -452, -233, -194, 133, -110, 133, -589]
2024e89J087p8L22m49m03R05p40o25M43p2l02K92j8O82m10q8P42r64J72L71l34
2045e6L42k11m93O27m94M17R93q75K85q53M87o53J073m56m8j62O12p00J96K57
2065B88k33R8o59Q18l38O51n47o85M35N61L33m94m53M31m88M41n97J41m6N84m63
2086b22j11J67N4m52R1R44J24p53J90J14q80k5R17J91n62k33P32p13M09J06m42
2107c54O13l50M27q8j28P0L15j107j2Q59p0L22k79N04m42p64L11N75q15L79j05
2128a39N08K62j103J058j060Q20k73Q30q43k34K38M45J65n91l94L01L32p63N08
2147F7R8P3k44J81m94J184q27N5L05l20m73Q52M33k80L14n77o7m98K58k65n0N41
2169B66m7j99m90n7M20k97P91n1j88j03j07O28o53N71l33k28K38o64J55K98P4
$$ y = [-589, 498, 420, 742, 293, -110, 795, 55, -570, -127, -199, -501, -209, -227, 455, 45, -43, 699, -265, -93, 278, -56, 286, 75, -418, 209, -285, 132, 1125, 250, 535, -318, 169, -484, 589, 133, 85, -77, 535, -165, 31, 288, 55, 153, -506, 312, -26, 625, 78, -607, -172, 389, 722, 228, -225, 206, -282, 159, -438, -297, -343, 241, -222, -333, -166, -112, -564, -473, 471, 595, -158, 32, 146, -734, -759, 158, 349, -213, -446, 286, -427, -18, 88, -354, 259, -91, 336, 248, 120, 190, 505, -602, -614, 245, 175, 497, 218, 722, 280, -484, -173, 402, -413, -34, -139, 369, 631, -472, 586, -474, 346, 73, 903, 60, -174, 64, 509, 674, 83, -311, -10, 322, -441, 67, 165, 238, -6, 175, -319, 865, 38, 93, 398, 78, -395, 457, 890, 610, 924, 347, 280, -218, 40, -225, -275, 266, 219, 20, -470, -527, -107, -404, 387, 336, 148, 45, -62, 566, -87, 484, 151, -77, 161, -503, -348, -50, 24]
2190B4M59p20K02k65K19l8j8k99K46k60P12m45m67R84k43L97o00j58P02O9o05
2211a04R91j004P13L77n32l01j54j59L95m57P04j18K71r61K21L58j59k48j08O08
2231C33m53J23k27K30k4k25l41K37L75K97m22J089m39r08O90o82K29O3l32L82
2251ej53N03J28o00k77N28k55K71M15j052J492o56k2l73N70m62K83n3k52M73j141
2272f38J226p18K84n39l50Q05k70J32k29Q87l47o62N60K18r77M54M9K13K89J29
2292E16r46O69l32m41R01l5o35J07J187m73r37M76J8L4M53k16n12k81J023p74
2312a98N9l42N40n82P10R4l05N04m10l35K80n25J24N06p34J283r42Q7M61K02q45
2333c68M79L33o86K89L8J80j98j016N49J174j94j24K59o53P63r67N80j29j21q99
$$ y = [24, 483, -237, -35, -300, -81, -119, -137, -436, -190, -450, 262, -183, -650, 334, 91, 488, -112, -270, 432, 501, -104, 887, -117, 596, 973, 441, 140, -14, -173, 222, -235, 469, 351, 622, -339, -118, 240, 81, -167, -275, 333, -120, 3, -224, 6, -18, -243, -584, -347, 28, 325, -97, 992, 553, -355, 335, -347, -118, -55, -387, -5, -158, 345, 473, -127, -404, 124, -131, 140, 555, -497, 995, 339, 317, -56, 514, 52, 335, 282, 30, 503, -638, 588, -130, 154, -385, -735, 70, -200, -68, -297, 590, 243, -419, 141, 359, -618, -164, -115, 98, 387, 516, -430, 239, -93, -534, 367, 332, -303, -196, 991, 518, -419, 57, 75, 109, 562, 346, -166, -447, 576, -198, -139, -481, 59, -523, 187, 281, -24, 480, 70, -265, 15, -510, -386, 120, -614, 669, -273, -186, 275, 477, -368, 111, 444, -242, 47, 85, 265, 67, -949, -400, 774, 580, 456, 715, 62, 825, -142, 438, 309, 188, -711]
2353g11L99j73N60L11k33l20l43P5L10l67O89K43o9m45pK20j71k28J062j158J26
2374b30j21L71p13P84M48j046L34O51n21k93N5r3L2k4O06p12N49M06l17k78j72
2395b84Q3M00p71Q39q82P97l38M34K7K19K00p24R37j420M56l6j55r0J115ro36
2416A62j21n55J003j24J70q8m76O8J36J9j92L20O69j176Q12l84p1j57L6l46L70
2437G5L23m17K01m61K59j12J040k24p27N22m79l84M67m22j24J211q17n8K82J3
2457A68n32J194m92j27P81l59r01j68M37N00n07r7K51L22L64O3j254M20Q5l74
2477b26P34J06k7j076R39m15M21k56o21M4k43P88o23M81pk10j67P72r47O68M2
2498A77j27K5l52j64L62K32k27k32O23k45j78J2pN83n14N06l31J99o41M83l68
$$ y = [-711, -312, -485, 75, 386, 153, -167, -510, -435, -125, -492, 197, 440, 371, -74, -81, 139, -32, -260, 802, -356, -230, -351, 20, -693, 91, 539, -507, -173, 478, -43, -336, -281, -374, -342, -366, 240, -472, 77, 483, 166, -112, -284, -201, 199, -572, 267, -615, 182, -156, 278, 305, 524, 724, 0, 937, -483, -27, -63, -218, -308, 807, 798, 162, 41, -514, 489, 365, 535, 447, -29, 39, 175, 194, 2, 322, 991, -185, 627, 243, 172, 15, 51, -295, 75, 398, -19, 182, -279, -20, -132, 908, 684, -43, 479, 0, -384, 83, -339, -463, 748, -69, -127, 155, 168, -364, 830, 338, 211, 992, 633, -268, -436, 1, 501, -6, -103, 148, 470, 834, 897, -357, 63, 148, -226, 508, 614, 587, -489, 450, 35, 456, 200, -421, -377, -620, 168, -455, 26, 19, -191, -358, 414, -533, 135, 177, 50, 75, -277, -441, -79, 153, -74, -306, 317, 72, -106, -94, -101, 482, -32, 474, 143, 342, -299, 184, -184]
2519a84k82N0N00j88K89q85J514p88k42k98M93L08j07N02o50M07m29j47O38q07
2539c06N37K71l25K91j10j243P60j98K01L42J7j74p2J07J22k33M97n11k59o3o0
2560d09N07P83p13p48N73L67j68j35jk53L66P8k87O0l03N22L89j050j0L21N00
2581C89k83l28Q74r45K70L27m24J11M79p84L60j45n46M71l68L62j68J255j563
2600f56J644o91o20M29L01R6o44L76r40P29K20M15k0j74m97K61O68j659O58N63
2620D59r20K56N39k75M70p39K21J77j40j6r6k09P08n43M30m05L03p63Q47m8q0
2641A76l57N98m86N85n17o4P3J56k64m55K59m11J033q34P48l23K64K08r09Q97
2661C77j9j80j5l34r2M64n79Q19j81m65n37P16k8q9J16l49N24n54P33k98Q61o17
$$ y = [-184, -466, -416, 84, -104, 185, -700, 814, 26, -216, -514, -21, 287, 180, 682, 32, 439, 10, -137, 501, -306, 231, 502, 177, 468, 358, -885, -125, -323, -122, 220, 237, 63, -9, 98, 220, -13, 484, -27, -286, -349, -409, 98, 881, 168, -580, -7, 360, 192, 57, 56, -197, 169, 247, -40, 20, -283, 239, 628, -422, -432, -111, 389, 106, -222, 652, -293, -23, 304, -120, -9, 470, -314, 46, -99, -645, -174, -542, -180, -348, 907, -656, 988, 297, -323, 106, 407, 503, -141, 235, -705, 24, 244, 659, 639, 465, -32, 229, 897, -762, -104, 459, -461, -205, 334, 59, 529, -210, 11, 188, 48, 32, -64, -273, 435, -108, 322, -83, 220, -543, 304, 256, 176, -181, 417, -69, 516, -1, -65, 8, 164, -100, -555, -296, -707, 326, -508, 240, -83, 181, 389, -520, 377, 358, 178, 163, -171, -263, 201, -378, 441, 260, -205, -742, -26, -54, -143, -27, -376, 148, -406, 327, 29, 890, 273]
2683B73l41L99L44m02K96n46N56k41k40K11n56m30Q64K33n63j52K78o1j15j47
2703c40L92p32P10j14J85N7K2N79n88L7j51K27m21o8j88K28J18j56j02L16k36
2724b25K69P2l56L61J20m5n45R53o24j80M22n01K85l14L12M1j69o9M6j45J34k91
2746d49J68R2N78m20L42L14o72M04q9m63j47O26n39o94J176m29J03K92J94O21
2766A008j280M77J91k07L26o63R01j593J015m58K83P7N19o58p24J177l89m08N82
2785A76o11LJ94O26k6k43N26p17N5K29J09m88N38n95L40K2J24k19k14n29P12L35
2807C47j2o12N17k76k71K22j1n67M38O67n30p2k57O1N62n05K12K84l05o3J033
2828H62j274J03l78K02O81l7n40P50r26j16J217k45o03L47l28j39j10P98m2j75
$$ y = [273, -68, 331, 675, 273, 569, 23, 579, 338, 98, 309, -247, -677, 187, 420, -143, -295, -17, -78, -193, -340, 52, -680, 30, -84, 101, 158, 180, 759, 171, 208, 57, 284, -137, -205, -393, -165, -47, -203, -305, 11, -225, 44, 116, -240, 121, 241, 196, -349, 604, -20, -200, 222, -279, 6, -308, 4, 45, -124, -193, -147, -292, -158, -449, -281, -189, 389, -31, 311, 625, -47, 357, 268, -195, -342, 284, -255, -949, 227, -202, -99, 193, 387, 1008, -272, 205, 396, 189, 515, -148, 753, -840, 175, -283, 0, 77, 596, -62, -786, 391, 2, -406, 176, -435, -432, -238, 388, 362, 119, 645, -72, -17, 212, 321, -167, 371, -224, 116, 138, 262, 43, -171, -700, 12, 347, 335, -277, 240, -36, -307, -85, -96, -663, -225, 442, -88, -160, -417, -356, 206, -299, -87, 197, -108, -171, 862, -412, -309, -687, -485, 196, 159, -381, 369, -557, -673, 544, 299, -304, 43, -285, -424, -534, 264, 222, 47]
2848D7N65j131J84L09K77j290O92J10n7R75r65P04M28r95j1Q41p67n9J75M78n55
2869d5R7m08J52L45J80j017P2K91O01J13m73m82Q58Lk08K0o56J394r53R9M33j81
2891B35J72J02l04m87M23J29p93J33L4O63J71r12k9P26m73L88k19M5k72L52n68
2912d84R27j01l12M58n63k71P06q45p4J166n71m57J236j252O10k55N59k54M95
2931G18m72k52j22N10j087O05Q07j245O34M83p66l58R47o90P7M68M89k45j92Q5
2951C94l93K43p52R51j014m90J344o64N13o52M29M03j0m31K49L73k50L5m84M73
2971B67r7o15M72J99j66N9n5K43J53n43k14N20p56L33J61r75J278q54L0K9P91
2992B60J2o68M8N50n56J45N09k91l26L77p6J82l39J44k6L70K5q06L98m94K72O42
$$ y = [47, 612, -519, -335, -26, 251, -1039, -347, -237, -294, 681, -284, 420, 848, -147, -158, 683, -84, -143, 32, 510, -45, 52, -356, -204, 141, 321, -696, -624, -333, 268, 381, -92, -574, 284, 287, 79, 99, -557, 837, -116, -17, 416, 235, 407, 509, 205, -282, 141, 270, -523, -390, -356, 307, 478, -434, -463, 263, -210, 178, -41, 4, -268, 84, -484, 443, 342, 30, 488, -75, -346, 360, -485, -559, 607, 36, -421, 815, -437, 173, -82, 477, 223, 718, 246, -6, -128, 382, -705, -100, 707, -538, 96, 579, -187, -545, 402, -288, -211, 257, 746, 501, 309, 394, 1, 244, -508, 443, -571, -1061, 283, -381, 132, -520, -91, 312, 302, -129, 120, 493, 243, 278, -206, 267, 170, -445, 27, 226, 60, 119, 64, 307, 460, -83, -297, 223, -533, -200, -39, -1014, 264, -590, -560, -531, 260, 272, -396, -348, 202, -354, -209, 300, 9, -317, 60, -16, 166, -173, -29, -55, 315, 340, -466, -68, -562, -290, 352]
3014C52k50rm63L55r46N74O29k24J49J47o79K59J15n1M39p8j2j15n70N75o41P57
3036C13k0n72L13K0J1j47j26R52o57J36m37o90O54l65M89j03P39l65K48l3m40
3057h0k67K63N35k99m21l6J11M01k22q4j63k61N44K58l97L60j66j76q41M84M43
3078a4J59l12m05Q37L33J37o73l66N88K69m60K62o9j064L30K24o1M08o52R01o07
3099b35J39N24l20M52o31n85N86M30j328Q69M72k71r49J41Q70N3q53N80q0PM62
3120C33j22l01k10L34L30l9j03m80L1R21r35L09K16m71M89n54Q99P2n61P3n85
3141c54R29j399J611p41L08k93o50K5P2J164l50p0P32j731Q26L21J28o78n15J214
3161E49j104K12N45p12J231n05k18k13K39Q89n42r83N46q3m62O73J2k8l31L54
$$ y = [352, 102, 93, -370, -15, -961, -387, 242, 18, 167, 314, -365, -106, 9, -42, 397, 319, 307, 192, -378, 197, -444, 313, 293, -279, 34, 54, 65, -82, -208, 744, 87, 223, -214, -904, -250, -615, -126, -229, 510, 145, 393, 360, -80, -347, -84, 451, 152, -269, -305, -194, 207, -15, -99, -262, -523, 21, 279, -118, 242, 76, -100, -941, -457, -14, 145, -167, -572, 265, 598, 735, 62, -304, 284, 553, 93, 355, 286, -778, -448, -224, -285, 123, -529, 372, -235, -96, 428, 108, 560, -71, -656, -70, 360, -968, -99, 373, 102, -847, -706, 164, 217, -636, -56, -136, -129, 333, 211, -90, -300, 34, 364, 325, 222, -258, -227, 694, -241, 68, 284, -187, 302, -252, 647, 719, 158, 231, -354, 575, -824, 787, 46, 354, 61, -589, -564, -492, 672, 322, 252, 984, -747, 79, 400, 528, -150, -665, 549, -555, -343, 202, -510, 721, 216, -2, -215, 24, 913, 371, -612, -66, -149, -611, 62, 74, 46, -285, 69]
3181F9l26K23j45K0J39j41j66N44n10Q06q80N93k94P79r05J71m23Q64j92K33o09
3202a50NN08r55k73P52P16l82j7m79K42M69m51K73j78J69j17m43Q59n06p11Q92
3223B23r4n15O52q88M38L94n24j51J59L07M74o65Q24k94q07L73J42k57K81J51
3243B23j66o8O29m63q2M7O7R7m10L6RJ39k23k03N07j040J566o62n23R28j148M11
$$ y = [69, -257, -34, -179, -159, -20, -161, -327, 217, -293, 513, -367, 226, -68, 711, -194, -23, -446, 418, 226, 459, -150, -145, 363, -592, -865, -113, 603, 221, 204, -275, -33, 436, -15, 258, 80, 249, 132, -311, 548, 42, -669, 223, 129, -386, 266, -622, -184, 210, -314, -465, -306, 1, 475, -190, 634, 340, -467, -94, 48, -209, 72, 223, 57, -11, 618, 155, 73, 120, 187, 284, -126, -90, -81, 58, -165, -368, 139, -901, 665, 3, -520, 408, -740, -329]
$$ [...]
8191f61
##END NTUPLES=NMR FID
##END=
