##TITLE=1H_DE-26+28dec
 CDCl3
 8 sc, 
 10.1.2024
##JCAMPDX= 6.0         $$ Bruker NMR JCAMP-DX V2.0
##DATA TYPE= NMR FID
##DATA CLASS= NTUPLES
##ORIGIN= UXNMR, Bruker Analytische Messtechnik GmbH
##OWNER= root
$$ XWIN-NMR		Version 3.5
$$ Wed Jan 10 15:56:34 2024 Russian Standard Time (UT+4h)  she@DPX200
##.OBSERVE FREQUENCY= 200.1313
##.OBSERVE NUCLEUS= ^1H
##.DELAY= (6, 6)
##.ACQUISITION MODE= SIMULTANEOUS
##.ACQUISITION SCHEME= undefined
##.AVERAGES= 8
##.DIGITISER RES= 18
##SPECTROMETER/DATA SYSTEM= spect
##.PULSE SEQUENCE= zg30
##.SOLVENT NAME= CDCl3
##.SHIFT REFERENCE= (INTERNAL, CDCl3, 0, 15.7039)
##AUDIT TRAIL= $$ (NUMBER, WHEN, WHO, WHERE, WHAT)
$$ ##TITLE= Audit trail, XWIN-NMR		Version 3.5
$$ ##JCAMPDX= 5.01
$$ ##ORIGIN= Bruker BioSpin GmbH
$$ ##OWNER= she
$$ F:/spectra/data/she/nmr/H-F/1/audita.txt
$$ ##AUDIT TRAIL=  $$ (NUMBER, WHEN, WHO, WHERE, WHAT)
(   1,<2024-01-10 15:55:20.85 +0400>,<she>,<DPX200>,
      <created by zg, POWCHK disabled, PULCHK disabled
       configuration hash MD5:
       00 E9 B6 7A A2 85 ED C7 34 08 36 98 17 FE 4E 26
       data hash MD5: 16K
       E3 1C 49 43 45 C7 68 03 09 14 14 1C 4A DF D0 70>)
$$ ##END=
$$ 
$$ hash MD5
$$ 23 46 00 0F 6F 9B BE 13 BD DB C6 1C 92 7B ED B5
##$RELAX= 
##$RELAX= 
##$RELAX= 
##$RELAX= 
##$RELAX= 
##$RELAX= 
$$ Bruker specific parameters
$$ --------------------------
##$DU= <F:/spectra>
##$EXPNO= 1
##$NAME= <H-F>
##$PROCNO= 1
##$TYPE= <nmr>
##$USER= <she>
##$AMP= (0..31)
100 100 100 100 100 100 100 100 100 100 100 100 100 100 100 100 100 100 
100 100 100 100 100 100 100 100 100 100 100 100 100 100 
##$AQSEQ= 0
##$AQ_mod= 1
##$AUNM= <au_zg>
##$AUTOPOS= <>
##$BF1= 200.13
##$BF2= 200.13
##$BF3= 200.13
##$BF4= 200.13
##$BF5= 200.13
##$BF6= 200.13
##$BF7= 200.13
##$BF8= 200.13
##$BYTORDA= 1
##$CFDGTYP= 0
##$CFRGTYP= 5
##$CHEMSTR= <none>
##$CNST= (0..31)
1 1 145 1 1 1 1 1 1 1 1 1 1 1 1 1 1 1 1 1 1 1 1 1 1 1 1 1 1 1 1 1 
##$CPDPRG= <>
##$CPDPRG1= <>
##$CPDPRG2= <>
##$CPDPRG3= <>
##$CPDPRG4= <mlev>
##$CPDPRG5= <mlev>
##$CPDPRG6= <mlev>
##$CPDPRG7= <mlev>
##$CPDPRG8= <mlev>
##$CPDPRGB= <>
##$CPDPRGT= <>
##$D= (0..31)
0 1.2 0 0 0 0 0 0 0 0.06 0 0.03 0 0 0 0 0.0002 0 0 0 0 0 0 0 0 0 0 0 0 
0 0 0 
##$DATE= 1704887720
##$DBL= (0..7)
120 120 120 120 120 120 120 120 
##$DBP= (0..7)
150 150 150 150 150 150 150 150 
##$DBP07= 0
##$DBPNAM0= <>
##$DBPNAM1= <>
##$DBPNAM2= <>
##$DBPNAM3= <>
##$DBPNAM4= <>
##$DBPNAM5= <>
##$DBPNAM6= <>
##$DBPNAM7= <>
##$DBPOAL= (0..7)
0.5 0.5 0.5 0.5 0.5 0.5 0.5 0.5 
##$DBPOFFS= (0..7)
0 0 0 0 0 0 0 0 
##$DE= 6
##$DECBNUC= <off>
##$DECIM= 32
##$DECNUC= <off>
##$DECSTAT= 4
##$DIGMOD= 1
##$DIGTYP= 9
##$DL= (0..7)
0 120 120 120 120 120 120 120 
##$DP= (0..7)
150 150 150 150 150 150 150 150 
##$DP07= 0
##$DPNAME0= <>
##$DPNAME1= <>
##$DPNAME2= <>
##$DPNAME3= <>
##$DPNAME4= <>
##$DPNAME5= <>
##$DPNAME6= <>
##$DPNAME7= <>
##$DPOAL= (0..7)
0.5 0.5 0.5 0.5 0.5 0.5 0.5 0.5 
##$DPOFFS= (0..7)
0 0 0 0 0 0 0 0 
##$DQDMODE= 0
##$DR= 18
##$DS= 0
##$DSLIST= <SSSSSSSSSSSSSSS>
$$ [...]
##$SUBNAM2= <"">
##$SUBNAM3= <"">
##$SUBNAM4= <"">
##$SUBNAM5= <"">
##$SUBNAM6= <"">
##$SUBNAM7= <"">
##$SUBNAM8= <"">
##$SUBNAM9= <"">
##$SW= 18.0517328524113
##$SWIBOX= (0..15)
0 0 2 0 0 0 0 0 0 0 0 0 0 0 0 0 
##$SW_h= 3612.71676300578
##$TD= 16384
##$TD0= 1
##$TE= 0
##$TE2= 300
##$TE3= 300
##$TEG= 300
##$TL= (0..7)
0 120 120 120 120 120 120 120 
##$TP= (0..7)
150 150 150 150 150 150 150 150 
##$TP07= 0
##$TPNAME0= <>
##$TPNAME1= <>
##$TPNAME2= <>
##$TPNAME3= <>
##$TPNAME4= <>
##$TPNAME5= <>
##$TPNAME6= <>
##$TPNAME7= <>
##$TPOAL= (0..7)
0.5 0.5 0.5 0.5 0.5 0.5 0.5 0.5 
##$TPOFFS= (0..7)
0 0 0 0 0 0 0 0 
##$TUNHIN= 0
##$TUNHOUT= 0
##$TUNXOUT= 0
##$USERA1= <user>
##$USERA2= <user>
##$USERA3= <user>
##$USERA4= <user>
##$USERA5= <user>
##$V9= 5
##$VALIST= <valist>
##$VCLIST= <CCCCCCCCCCCCCCC>
##$VD= 0
##$VDLIST= <DDDDDDDDDDDDDDD>
##$VPLIST= <PPPPPPPPPPPPPPP>
##$VTLIST= <TTTTTTTTTTTTTTT>
##$WBST= 1024
##$WBSW= 4
##$XGAIN= (0..3)
0 0 0 0 
##$XL= 0
##$YL= 0
##$YMAX_a= 100585
##$YMIN_a= -144715
##$ZGOPTNS= <>
##$ZL1= 120
##$ZL2= 120
##$ZL3= 120
##$ZL4= 120
##$ABSF1= 10
##$ABSF2= 0
##$ABSG= 5
##$ABSL= 3
##$ALPHA= 0
##$AQORDER= 0
##$ASSFAC= 0
##$ASSFACI= 0
##$ASSFACX= 0
##$ASSWID= 0
##$AUNMP= <proc_1d>
##$AZFE= 0.1
##$AZFW= 0.1
##$BCFW= 1
##$BC_mod= 2
##$BYTORDP= 1
##$COROFFS= 0
##$CY= 11.3945322036743
##$DATMOD= 1
##$DC= 2
##$DFILT= <>
##$DTYPP= 0
##$F1P= 15.7292609196834
##$F2P= 12.9074282941183
##$FCOR= 0.5
##$FTSIZE= 0
##$FT_mod= 4
##$GAMMA= 1
##$GB= 0.15
##$INTBC= 1
##$INTSCL= 1
##$ISEN= 128
##$LB= 0.24
##$LEV0= 0
##$LPBIN= 0
##$MAXI= 10000
##$MC2= 0
##$MEAN= 0
##$ME_mod= 0
##$MI= 1.114404
##$NCOEF= 0
##$NC_proc= 0
##$NLEV= 6
##$NOISF1= 3.799351
##$NOISF2= 2.8
##$NSP= 1
##$NTH_PI= 0
##$NZP= 0
##$OFFSET= 15.70392
##$PC= 1
##$PHC0= -24588.75
##$PHC1= 9.052729
##$PH_mod= 1
##$PKNL= yes
##$PPARMOD= 0
##$PSCAL= 0
##$PSIGN= 0
##$REVERSE= no
##$SF= 200.130013532006
##$SI= 16384
##$SIGF1= 3
##$SIGF2= 2
##$SINO= 400
##$SIOLD= 16384
##$SREGLST= <1H.CDCl3>
##$SSB= 0
##$STSI= 0
##$STSR= 0
##$SW_p= 3612.71676300578
##$SYMM= 0
##$S_DEV= 0
##$TDeff= 0
##$TDoff= 0
##$TI= <>
##$TILT= no
##$TM1= 0
##$TM2= 0
##$TOPLEV= 0
##$USERP1= <user>
##$USERP2= <user>
##$USERP3= <user>
##$USERP4= <user>
##$USERP5= <user>
##$WDW= 1
##$XDIM= 8192
##$YMAX_p= 0
##$YMIN_p= 0
$$ End of Bruker specific parameters
$$ ---------------------------------
##NTUPLES= NMR FID
##VAR_NAME=  TIME,          FID/REAL,        FID/IMAG
##SYMBOL=    X,             R,               I
##VAR_TYPE=  INDEPENDENT,   DEPENDENT,       DEPENDENT
##VAR_FORM=  AFFN,          ASDF,            ASDF
##VAR_DIM=   8192,          8192,            8192
##UNITS=     SECONDS,       ARBITRARY UNITS, ARBITRARY UNITS
##FACTOR=    0.0002768,     1,               1
##FIRST=     0,             0,               0
##LAST=      2.2672688,     0,               0
##MIN=       0,             -144715,         0
##MAX=       2.2672688,     100585,          0
$$ Real data points
##PAGE= N=1
##DATA TABLE= (X++(R..R)), XYDATA
0@%%%%%%%%%%%%%%%%%%%%Pj5J6j6J6j6J6k0K8l2L2l6M4m9N5o2O8p8Q9r9J10j22
$$ 0 0 0 0 0 0 0 0 0 0 0 0 0 0 0 0 0 0 0 0 0 7 -8 8 -8 8 -8 8 -12 16 -16 16 -20 24 -25 30 -32 36 -42 47 -52 58 -64
42f4J34j48J64j82K00k20K43k69K97l26L59l97M38m83N40o03O72p57Q60r87J148
$$ -64 70 -78 86 -96 104 -116 127 -142 155 -171 188 -209 229 -254 286 -317 355 -402 458 -529 619
63F19j358J646k069K749m010P113k6652l7577Q1022M2086p950K3188K1778k2608
$$ 619 -739 907 -1162 1587 -2423 4690 -21962 -59539 21483 63569 55619 78807 100585 77977
77G7977q675j161l3468l6919n914j8242m0415j1267J7159j702R03K5920K1470
$$ 77977 69302 68141 34673 -2246 -8160 -26402 -66817 -78084 -60925 -62627 -61724 -35804 -14334
90a4334J3671K0923J3661P641N784j074m353j2348j6280j336p656k4849o028R193
$$ -14334 -663 20260 33921 41562 47346 46272 41919 29571 13291 11955 4299 -20550 -26578 -17385
104a7385p089m633J0274N317N56Q350N730m236N887J8496j409j4298J0978J1581
$$ -17385 -24474 -29107 -18833 -13516 -12960 -4610 1120 -3116 2771 21267 19858 5560 16538 28119
118B8119j5856p886M865r915r759j209r140n374Q786M624k446N150J3818P849
$$ 28119 12263 4377 9242 -673 -10432 -11641 -20781 -26155 -17369 -12745 -15191 -10041 3777 11626
132A1626k843K402Q535p50o495m366l974l639l625n913m339j569L589L812m103
$$ 11626 8783 11185 19720 18970 12475 8109 4135 496 -3129 -9042 -13381 -14950 -11361 -7549 -11652
147a1652M37J3760M347n223M647N610k841r91j124o860r73M733m076r367K541
$$ -11652 -11215 2545 6892 1669 6316 11926 9085 8094 6970 110 -863 3870 -206 -9573 -7032
162g032P221m397n801N468M130j147J532Q07K47O438K799n570j331M096l16p194
$$ -7032 189 -4208 -10009 -4541 -411 -1558 -26 781 1028 7466 10265 4695 3364 7460 7144 -50
178e0n365Q90J571m114l112K375L283K827J601r4L293N122J629l551j434M279
$$ -50 -5415 -4525 -2954 -7068 -10180 -7805 -4522 -1695 -94 -188 3105 8227 9856 6305 4871 9150
194I150L47p724l450J994k322m191j558k409p4M814k00k874N169Q298J53k140
$$ 9150 9497 1773 -1677 317 -2005 -6196 -7754 -10163 -10237 -5423 -5623 -8497 -3328 4970 5123 2983
210B983L692M834j388l069j587k372j212k060n723l319K835J299l221j289N007
$$ 2983 6675 11509 10121 7052 5465 3093 1881 -179 -5902 -9221 -6386 -5087 -8308 -9597 -4590
225d590M806k82o29L083L350R06j278j364J96J911n34n371k616K631o38o021k178
$$ -4590 216 -66 -695 2388 5738 6644 5366 4002 4198 6109 5575 204 -2412 219 -419 -6440 -8618
242h618K916J380j406N48K355L159M442J335j971J755M285k855n649r27R00l094
$$ -8618 -5702 -4322 -5728 -5180 -2825 334 4776 6111 4140 5895 10180 7325 1676 749 1649 -1445
258a445m111j100R41J188J353p04J90M653L338k515k094L482K890k707l034O36
$$ -1445 -5556 -6656 -5715 -4527 -3174 -3878 -3688 965 4303 1788 -306 3176 6066 3359 325 961
274I61J786l27k097j627k27J774o96m202j330L522J533l510k85M637K836l46K28
$$ 961 2747 2420 323 -1304 -1531 243 -453 -4655 -5985 -2463 -930 -4440 -4725 -88 2748 2402 2630
291B630J353J332M32j570m147j117J560k935m672O95M008J058j239J938K959J915
$$ 2630 3983 5315 5747 4177 30 -1087 473 -2462 -7134 -6439 -2431 -1373 -2612 -674 2285 4200
307D200N23j266j775J408K87l481l899J363K590j822k405K124K786k64n69m01
$$ 4200 4723 3457 1682 3090 3377 -104 -4003 -2640 -50 -1872 -4277 -2153 633 369 -200 -601
323f01O99J394o4k275p74L388J863k966j224L341J112k897k145j54o5n29j873
$$ -601 98 1492 1428 -847 -1621 1767 3630 664 -560 2781 3893 996 -1149 -1303 -1368 -1897 -3770
340c770j779J162L499Q10j481K174M377Q17k135j45R92r73k614k515k066M08Q58
$$ -3770 -5549 -4387 -888 -78 -1559 615 4992 5809 3674 3529 4521 3548 934 -1581 -3647 -3239 -2381
357b381j477k025K631L996j88j644K134K523n71j464k31M31K91m36k226q16K388
$$ -2381 -3858 -5883 -3252 744 556 -1088 1046 3569 2998 1534 1303 1734 2025 1589 -637 -1453 935
374I35R70l061j898K149J501k616j729J501J751O02j65l30J643L089j79k489R3
$$ 935 1905 -1156 -3054 -905 596 -2020 -3749 -2248 -497 105 -60 -390 1253 4342 4163 1674 1767
391A767K105j252m092j592J668k01j549r24L11J915J701j20o15K218K691r12k419
$$ 1767 3872 2620 -1472 -3064 -1396 -1597 -3146 -4070 -3759 -1844 -143 -263 -878 1340 4031 3119 700
408G00N64K070r37k639p66P49j72l57j193o55J901J241k246j364K084K253j239
$$ 700 1264 3334 2397 -242 -1008 -259 -431 -788 -1981 -2636 -735 506 -1740 -3104 -1020 1233 -6
425fj529J436J988K27j200n56O93J071r08k467k69K093O6k646l97K296J245j226
$$ -6 -1535 -99 1889 2116 916 360 1053 2124 1216 -1251 -1520 573 639 -2007 -2404 -108 1137 -89
443h9p29J066R45J27r61j171P72J666r90k509O83J990n71j506qJ688K88l2n90
$$ -89 -818 248 1193 1320 359 -812 -40 1626 636 -1873 -1190 800 229 -1277 -1285 403 691 659 69
462F9jJ523J022j905j433J523J301j933k258P40J391p50n39o91J488J678oj408
$$ 69 68 1591 2613 708 -725 798 2099 166 -2092 -1352 39 -711 -1250 -1941 -453 1225 1219 -189
480a89J12K045R11k741q18J245O31j726j020O93P59M4p09r89P48J726p48j909
$$ -189 -77 1968 2879 138 -680 565 1196 -530 -1550 -857 -98 -54 -763 -1752 -1004 722 -26 -1935
498a935P70K492j17j774M97K072K49q22q04n89N61j74k197j670Q07J658j195j027
$$ -1935 -1165 1327 1210 -564 -67 2005 2254 1432 628 39 600 426 -1771 -3441 -2634 -976 -2171 -3198
516c198J949K647K28k96L10J041M86n98j948j154J467j22k553q98J702J167j194
$$ -3198 -1249 1398 1626 1330 1640 2681 3167 2569 621 -533 934 812 -1741 -2639 -937 230 -964
533i64p99Q36R24J9q82l70J004J396j17j515Q00K088O55j971j16J159k07j956
$$ -964 -1763 -927 -3 16 -866 -1236 -232 1164 1047 -468 332 2420 3075 1104 988 2147 1940 -16
551a6j297o71Q4K65j200j045K061K068q8m27J627K230o90j674m61M4k07p46j832
$$ -16 -1313 -1984 -1900 -1635 -2835 -3880 -1819 249 161 -266 1361 3591 2901 1227 766 810 603 -143 -1975
570a975m25J622P86j279j28J805J457j496q24N59L56n48p73o22O83J464J36j377
$$ -1975 -2400 -778 8 -1271 -1399 406 1863 367 -457 102 458 -90 -863 -1485 -802 662 798 -579
588e79O98J927K74k332l08J002K9j845q72L58O21Q93l47n21J616J914n43k047
$$ -579 119 2046 2320 -12 -320 682 711 -1134 -2006 -1648 -1027 -134 -481 -1002 614 2528 1985 -62
606f2N72J072j166j794L8M49O65j7o09N19J742J231j876j280J286L80j832j158
$$ -62 510 1582 416 -1378 -1340 -891 -226 -243 -852 -333 1409 2640 764 -516 770 1150 -682 -1840
624a840L97J081l01n26p0J487R64j9q38LJ398k08j586o05J154M34j243r51P02
$$ -1840 -1443 -362 -663 -1189 -1259 228 1192 1173 335 338 1736 1528 -58 -663 491 925 -318 -1269 -567
643e67J066K5j046m14L64J219p94j500O44J469R1j379P21J233L37n27j75l78P02
$$ -567 499 524 -522 -936 -572 647 -147 -1647 -1003 466 557 -822 -101 1132 1469 942 767 389 1091
662A091K72j720j319Q79Q41j398q68R03J245M9p02K26R85J124o30r72P9J053K27
$$ 1091 1363 -357 -1676 -797 44 -1354 -2222 -1319 -74 -25 -727 -501 484 1608 978 6 85 1138 1365
681A365j593o08J244O94j363j079P34Q05o48n20l90Q92J135l44j055N18J388L5
$$ 1365 -228 -836 408 1102 -261 -1340 -606 199 -449 -969 -1359 -467 668 324 -731 -213 1175 1210
699A210j447K81J198j81q10q50J67P30R1j108n18J099O62n48j139Q46J191j64
$$ 1210 -237 44 1242 1061 251 -599 -432 298 389 -719 -1237 -138 524 -24 -1163 -317 874 710
717G10p14m5O69O32n48r54o8R59P9j365r42J189R00o89r07P22Q68q8p12k26Q94
$$ 710 -4 -49 620 1252 704 -250 -318 641 720 -645 -1587 -398 502 -187 -1094 -372 496 408 -304 -530 364
738C64O05o87j148N25J003j04r82j50J450Q0n21o54J80O79j31j044q38Q76O76
$$ 364 969 282 -866 -341 662 558 -424 -574 876 956 435 -219 -39 640 509 -535 -1373 -497 179
757A79n36n99R20P90K9q67k13Q13K19n77p11j27P18K90r38L42Q78O60q29q37O08
$$ 179 -357 -956 -36 754 783 -84 -297 516 735 158 -553 -680 38 328 -610 -268 610 1270 441 -396 212
778B12M92q50r92m46L93M32n8n51Q57J521N95j135j57J092M00j049q89j84N59
$$ 212 704 -146 -1138 -1584 -1191 -759 -817 -1368 -511 1010 1605 470 313 1405 1805 756 -133 -317 242
797B42l13r49m83J017J184o83p27P67Q87o02q13j99P86kq7n87N04P18O49n35n73
$$ 242 -71 -1020 -1503 -486 698 15 -712 55 942 340 -473 -672 114 112 25 -562 -58 660 1309 774 201
818B01N92J42j039j025K33J88l61r68M19J360P08N0r0K69J214j79j157j056P06
$$ 201 793 935 -104 -1129 -896 -708 -1069 -2037 -1618 -258 450 500 410 679 1893 1714 557 -499 207
837B07K9j078q67N30M85O61o76R9R99Q63p38j293O63P41n42j072J88J080L02j49
$$ 207 236 -842 -1709 -1179 -694 -33 -709 -610 389 1252 514 -779 -116 625 83 -989 -801 279 581 432
857D32m68N75N46k41j045p00L62L13r26p02M97J401J52n60N89R23K21j15j016
$$ 432 -36 539 1085 844 -201 -901 -539 -226 -1152 -1854 -1357 44 196 -364 225 1148 1369 1254 238
876B38k26N34k12j186k64O96N56l22l39O23Q09j15p69p5L59L94j024j014M37J051
$$ 238 12 546 334 -852 -1116 -420 136 -186 -525 98 907 792 23 -52 307 701 -323 -1337 -900 151
896A51k12o77K25J160K36o34l58L67K86K4r93r4R13J30o92k78O79O05n66o80j
$$ 151 -61 -738 -513 647 883 249 -109 258 544 568 -425 -519 394 524 -168 -446 233 838 272 -408 -409
917d09N70m53l87l65L83P53L26n02r5J161L13m45q25N31M95m24j071l72K48M61
$$ -409 161 -292 -679 -1044 -661 92 418 -84 -179 982 1295 850 25 556 1051 627 -444 -816 -568 -107
937a07n14p42M00J170q9o41J44R03K25l83m06N51L25o7o63j10L20j35m66j006
$$ -107 -621 -1363 -963 207 118 -523 -379 524 749 366 -40 511 836 769 106 -4 316 181 -285 -1291
957a291M92L78k45l19k0O37R10l13m21O33O62M4n89k87N20K31q45o93J87L96m62
$$ -1291 -799 -421 -666 -985 -1005 -368 542 229 -192 441 1103 1147 558 271 791 1022 177 -516 -329 67 -395
978c95o14j3M81Q9j3m40M03J164R7l58n7R59K23j101j64L35Q8n98p63o14M70O11
$$ -395 -1009 -1022 -541 -452 -465 -905 -502 662 759 401 344 1303 1526 425 261 596 684 86 -677 -1291 -821 -210
1000b10p29n65J173O99L0n29L02M50L31o04m82N67K18r5r29n3R55qq29n16N44
$$ -210 -939 -1504 -331 368 398 -131 171 621 952 348 -134 433 651 556 -373 -426 529 521 -308 -824 -280
1021b80M09m36m88Q9O02J55J59k93N70N87R7j068l4O02n18p51m05L62J53L66l79
$$ -280 129 -307 -795 -706 -104 51 210 -83 487 1074 1171 103 69 671 153 -598 -1003 -641 -488 -122 -501
1042e01J17N27O77j4p30K13O13o65p01j3K45N9l41n06O69O41J27n02K15M74K55
$$ -501 -384 143 820 806 76 289 902 237 -464 -477 -232 -173 -514 -1020 -351 290 417 -85 130 604 859
1063H59o74n62K44K93k51o78L16Q89K28n62n04N04M62o36n75j95M94K00l35J4
$$ 859 185 -377 -133 160 -91 -769 -453 436 664 102 -402 102 564 -72 -647 -842 -348 -148 -483 -469
1083d69N72Q26Pl21j95J55Ol43j153L3M75m52n17K24J022L00j54Q6L57P98p9p23
$$ -469 103 929 936 615 420 575 581 238 -915 -882 -407 -859 -1376 -1152 -130 170 16 102 459 1257 1178 455
1105D55l82M03Q8q92l48K43M16j7q29L28K68J50m26k36R3O30p8k00K58O95P24
$$ 455 73 476 564 -328 -676 -433 -17 -34 -863 -535 -267 -117 -543 -779 -686 -56 -134 -334 -76 619 1343
1126A343n94m10N23K52m67q05m70J73j63p50k35M96P62K87l92M23J014R0K3o95
$$ 1343 749 339 862 1114 647 -158 -628 -455 -618 -1368 -1603 -1107 -345 -58 -450 -27 987 1077 1100 405
1146D05M9P08n35o72k62M62r3o57j07K01M70j68o14L25O30K17m14j43P27L15k86
$$ 405 454 1162 627 -45 -307 155 62 -595 -702 -501 -31 -199 -813 -488 142 359 -55 -198 529 844 558
1167E58m60J51K25L68p14q62M61J22k97n93J44P29j0j00J6K68P80K06p41J15R9
$$ 558 98 249 474 842 128 -734 -273 -151 -448 -1041 -897 -168 -178 -278 -262 6 786 992 251 366 465
1188D65N7o54k24J47K05Oq73L19M00J28r5n28P41J45J38n27J75N79j40m21j76
$$ 465 522 -132 -356 -209 -4 2 -871 -552 -152 -24 -119 -647 94 239 377 -150 25 604 464 43 -133
1209a33J82J41r6m99n3O43O9n86l95N51J005n97k26J50K30J34l89m27P5L47k86
$$ -133 49 190 94 -405 -458 185 254 -332 -727 -176 829 232 6 156 386 520 131 -296 -221 126 -160
1230a60l87p8N99n0o06K67M30M15k13l03J17M76L78m53l16L77O5k46j107L84J27
$$ -160 -547 -625 -26 -76 -682 -415 15 430 217 -86 31 507 885 432 116 493 558 312 -795 -411 -284
1251b84J25p40l2M61M31J31k13J83N76M66o34r5nM87n56o04r1L41j98l53k20K77
$$ -284 -159 -899 -931 -470 -39 92 -121 62 638 1104 470 375 370 857 301 -303 -394 -53 -251 -604 -824 -547
1273e47N14l25L4m2M39L48l82J41M31L34l44m34L58K84j98p57n25L18j13k07l81
$$ -547 -33 -358 -324 -366 73 421 39 180 611 945 601 167 525 809 611 -146 -671 -353 -466 -673 -1054
1294a054N6L88L80QJ81M45P66m70N3l05K19k19n03l71N3J76m19l97K12M44M37
$$ -1054 -998 -610 -230 -222 -41 404 1170 700 753 448 667 448 -55 -426 -373 -197 -616 -1013 -801 -357 80
1315H0k90j54K17N25Rn88O9P37L2m02M4k0M05l52m86k09J63O3l79l06J5O93k36
$$ 80 -210 -364 -147 378 387 -201 -132 605 637 235 279 259 664 312 -174 -383 -220 -157 -536 -842 -827 -134 -370
1338c70J46K63O18P4k02j2R4M2l31n36m2L05l89l04k87N90M87ql59K85O34l04
$$ -370 -224 39 657 731 529 517 611 653 322 -214 -256 49 -340 -644 -931 -341 146 138 -221 64 698 394
1360C94k50p8JL1o9k77r3N01m1k28k34L03K47k50k41J48L81l65J4j50N43K87o8
$$ 394 144 66 67 98 29 -248 -341 160 119 -109 -343 -40 207 -43 -284 -136 245 -120 -106 -256 287 574 506
1383E06l87P3J79q2o41o9p8K86k22j84K71L69O10k02k61K90L85l04q30oN13l23
$$ 506 119 192 371 289 -352 -421 -499 -213 -435 -619 -348 21 631 429 168 458 843 539 -291 -297 216 -107
1405a07n09j07K18K79j6n28O57K45K37l20r8K10P04l08m55M67k04L91o59j96r9
$$ -107 -616 -723 -505 -226 -242 -770 -113 132 369 49 -49 161 865 557 102 569 365 756 97 -99 -198
1426a98K92k46o13J65L91j28j27NL76L32J45j36K17K81j25j25l41l25L35k56m13
$$ -198 94 -152 -765 -600 -209 -337 -464 -459 -83 249 394 258 475 756 631 506 165 -160 175 -81 -494
1447d94O2q0J30m92R7K62O64j0k18L44L67J60n10j80K32M25n96k65n9J5r9l38
$$ -494 -432 -512 -382 -874 -777 -515 149 139 -79 265 632 792 282 102 334 759 163 -102 -161 -146 -245 -583
1469e83j53M40l5J03l22L39O78J03m07N2L84k5j39k23j58J05j92k48k92L15J68
$$ -583 -736 -296 -331 -228 -550 -211 467 570 163 215 599 574 435 212 54 159 -33 -281 -573 -258 -90
1490i0q3k11j99P22n1q0j37K30M47k4k57P6J74l69l53l2j86N13l09k48p5M15J87
$$ -90 -173 -384 -583 139 88 8 -129 101 548 524 267 343 517 148 -205 -237 -423 90 -219 -467 -542 -127 60
1513F0j66R1K90K8J1l12J51K58j25l83k36L33K19k70k44Q4L19K55m41j19L85K47
$$ 60 -106 -15 275 303 314 2 153 411 286 -97 -333 0 219 -51 -295 -211 108 363 -78 -197 188 435
1535D35l00k24R8L89j24k22J02k16K99l78k65l2K71Q7j83m3L0O75p3k14K74K65
$$ 435 135 -89 9 398 274 52 154 -62 237 -141 -406 -438 -167 -80 -263 -306 -276 399 326 112 386 651
1557F51k34k48l53K38j1k64n94L83j78M16r8j32O45K95k23J52k68K92n3o55K24
$$ 651 417 169 -184 54 43 -221 -815 -432 -610 -194 -292 -424 221 516 293 445 177 469 416 -239 -15
1578a5n1K80j71l52j35N87o3m08K1K37k18l0l4J84L12R6Kj49Q53k69J2l08l04
$$ -15 -66 214 43 -309 -444 143 80 -328 -307 -70 -288 -318 -352 -168 144 240 242 93 946 677 689 381 77
1601G7J05l74l77J09o7L20n43L24J79M68O6l02M70J78J77o55k71K38l00J42l82
$$ 77 182 -192 -569 -460 -527 -207 -750 -426 -247 221 287 -15 455 633 810 155 -116 122 -178 -36 -418
1622d18l5K21K71k83j25L7M70M5k14l9K81j66J38m5Q4K78q4l19r5L3k7j03o18
$$ -418 -453 -232 39 -244 -369 -332 138 183 -31 -70 211 45 183 138 222 500 416 97 2 35 8 -95 -713
1645g13K13L72j80J3k36N97K10j84k5Q6K86j79j13m61M28J7k30k01l8L88j31L9
$$ -713 -500 -128 -308 -295 -531 66 276 92 67 153 439 260 147 -314 114 131 -99 -300 -338 50 -81 -42
1667d2p6K84k2p6j92J24K69q1m72K93K59r7j10k00o9L49r7j5k79J00K10k6j38
$$ -42 -118 166 144 68 -124 0 269 188 -284 9 268 171 61 -139 -208 141 44 29 -250 -150 60 34 -104
1690a04L72q4J3j42j23K99o0j76l96L73K11j55l30RM25k8J72l36L23J50l42J30
$$ -104 268 184 197 55 -68 231 171 -5 -401 -28 183 28 -302 -293 132 104 276 -60 263 413 71 201
1712B01l01K60J9j27l48J15J65J1l71j57L32K44l25P6J07L33q5j40K47p0J72j11
$$ 201 -100 160 179 52 -296 -181 -16 -5 -376 -533 -201 43 -282 -206 -99 234 149 9 256 186 358 247
1734B47k37J4J76j62j52p0L7j74j87J00M43p0J67l99J70J24J83m0j81%L79k87
$$ 247 10 24 200 38 -114 -184 -147 -321 -508 -408 35 -35 132 -267 -97 27 210 170 -11 -11 368 81
1756H1q1k81L5L07k00m61L38L67k64l8J99K44K76P3l98J61r7L79l59k56j55m6
$$ 81 0 -281 -246 61 -139 -600 -262 105 -159 -197 2 246 522 595 197 358 261 640 281 25 -130 -176
1778a76L8l33K66K06k89J64J21J53r5o9p2J0L46j92Q9QRJ55l10J39j11N8J6p34
$$ -176 -138 -471 -205 1 -288 -124 -3 150 55 -14 -86 -76 270 78 167 175 184 339 29 168 57 115 131 -603
1802f03K67N9M3l2J91J52j27J46l2RJ75L21n59j94J9J28J00l14J58K07j13k9O
$$ -603 -336 -277 -234 -266 -75 77 -50 96 64 73 248 569 10 -184 -165 -37 63 -251 -93 114 1 -28 -22
1825b2J08K26Nj51k96L2J59j72k73K26j9J65j40K03J11o0j44m0N8K06j17j05n4
$$ -22 86 312 317 166 -130 -98 61 -111 -384 -158 -177 -12 -152 51 162 102 -42 -82 -24 182 65 -40 -94
1848i4P1K21l13R5J61m6K04k80r7J31K04m68j35l4M42J35k33K16N2J66k22j44
$$ -94 -23 198 -115 -20 141 95 299 19 -78 53 257 -211 -346 -380 62 197 -36 180 232 398 176 32
1870C2N4Q2l25j40j48J37J66k6j44N54k06K71l44K61K3P5l19k21L98l38N3M4j49
$$ 32 86 168 -157 -297 -445 -308 -142 -168 -312 242 36 307 -37 224 247 322 3 -218 180 -158 -105 -61 -210
1893b10K10j37K47l68P9J76N1m49O0J95J57K6J27j82L19p2j85J82j40J32o09K36
$$ -210 0 -137 110 -258 -179 -3 48 -401 -341 -146 11 37 164 -18 301 229 44 226 86 218 -391 -155
1915a55j32J62J08l18L01Q7J66k3j50NM71l17l45K18l9L26k47m18R0N00m24O9
$$ -155 -287 -125 -17 -335 -34 53 219 196 46 51 522 205 -140 78 39 365 118 -300 -210 290 -134 -65
1937f5l5q3K24j08k65J93k0L32l39J94J09J6j92m8K27j18K40m15J02J1J97j92
$$ -65 -100 -183 41 -67 -332 -139 -159 173 -166 28 137 153 -39 -87 140 22 262 -153 -51 -40 157 -35
1959c5k97K20L34J7k07o7J06r3k5O9l8L12j85j94J65P6J13k51ln4N3J80k60K1
$$ -35 -332 -112 222 239 32 -35 71 -22 -47 22 -16 296 111 -83 82 158 271 20 17 -37 16 196 -64 -43
1983d3o3K39j2l6l64M19O2n07M40m7L40k36k18j82L52j05r5J84j24n6k80J55j81
$$ -43 -106 133 121 85 -279 140 202 -305 135 88 428 192 -26 -208 144 39 -56 128 4 -52 -332 -177 -358
2006c58L56K31m94J31j86K98j57J3P7K08M0L7q2N6j26p6O4Q1k04J54m9p6Q4k7
$$ -358 -2 229 -265 -134 -320 -22 -179 -166 -89 119 159 196 114 170 44 -32 32 113 -91 63 14 -62 22 -5
2030em9k76M3L14q3L3%L70k37M8R3j09M7J07m27P0NQ7j96J37k60N3J21n2M8Q8
$$ -5 -54 -330 -287 27 -56 -23 -23 347 110 158 251 142 189 296 -131 -61 -56 31 -165 -28 -288 -235 -114 -166 -118 -30
2056c0J25pk1j07M02k00n3j5P3O7K9l05q6M85o36j31J59M14l24k27J71K65J06
$$ -30 95 88 67 -40 362 162 109 94 167 234 263 -42 -128 357 -279 -410 -251 163 -161 -388 -217 48 154
2079A54K2Rr5J57k32P0m1k98L12p0j85J34O9o3r7J50p6n6L10j01j14R5l2l4k26
$$ 154 176 185 90 247 15 85 44 -254 58 -12 -197 -63 6 -57 -154 -4 -80 -136 174 73 -41 54 22 -12 -238
2104b38L40J32m58Q8K00lJ62j42j52J26R2k44N6j59L9JK87l21M58j04o1P3m16
$$ -238 102 234 -224 -136 64 61 223 81 -71 55 147 -97 -41 -200 -161 -160 127 -194 264 160 99 172 -244
2127b44M76l30j63R5L05P3M9k32r1L87pl98j73K79K59ql38o7J2M8M9j40L04J08
$$ -244 232 -98 -261 -166 139 212 261 29 -62 325 318 -80 -253 26 285 277 -61 -128 -116 -68 -19 -159 145 253
2151B53m04K06k4K63l85K51l53L0K8Jj77P6L29j62J16m6r3J76k09M7k70L78J67
$$ 253 -151 55 31 294 -91 160 -193 -163 -135 -134 -311 -235 94 -68 48 2 -91 85 -124 -77 -347 31 198
2174A98k9j39J96J84n00M41n48N33l42j66J44q0j2J02O6m43N70j92J53l03M07
$$ 198 169 30 226 410 -90 351 -197 336 -6 -172 -28 -108 -120 -18 48 -395 175 -17 136 -167 240
2195B40o3j58j08J12K23k35j84J22MJ5j63o9L11j05K1J19j97L53j95Q3j26J14
$$ 240 177 19 -89 23 246 11 -173 -51 -47 -32 -195 -264 47 -58 -37 82 -115 238 43 126 0 114
2217A14J92j5M2j99rK6k22O7j10k25L22J6j90K36p5Jn5m2N69m22J12j27r9J05
$$ 114 306 291 333 134 125 151 -71 -4 -114 -339 -17 -1 -191 45 -30 -29 -84 -126 443 21 133 6 -93 12
2241A2o2q0J50K84n80Q7L8ML6M65l46K2l0K55j24j55L09j91r7M9k01K6l3J80O6
$$ 12 -50 -130 20 304 -276 -189 -151 -147 -111 354 8 30 0 255 131 -24 285 94 -3 46 -155 -129 -162 18 84
2266H4j89Q2J23j00l15K17L2J91j26J19O1l49J53k76N24k26J47k21n9R9j15L45
$$ 84 -105 -23 100 0 -315 -98 -66 125 -1 118 179 -170 -17 -293 231 5 152 -69 -128 -29 -144 201
2288B01j72O7k10J15M9L55k43k09J32k20J40J22k32J44m14L36J64o6r2J59N8j33
$$ 201 29 96 -114 1 50 405 162 -47 85 -135 5 127 -105 39 -375 -39 125 59 -33 126 184 51
2310E1Q5K16m99L08k32J57j49J36k72J78j34K79j81L18k89O2l5L40l24L82k35
$$ 51 136 352 -147 161 -71 86 -63 73 -199 -21 -155 124 -57 261 -28 34 -1 339 15 397 162
2331A62j57L62m86J20q0K03k2P7l37J6J55k07l9K36k0j29J03O9m5j69K22K52j62
$$ 162 5 367 -119 1 -79 124 102 179 -158 -142 13 -194 -233 3 -17 -146 -43 26 -19 -188 34 286 124
2354A24o8k9J48m56K55j30k3O5J26j87O0O3N7L19k52k01N44k31k08J94J1J54l63
$$ 124 56 27 175 -281 -26 -156 -179 -114 12 -175 -115 -52 5 324 72 -129 415 184 -24 170 181 335 -28
2377b8k34K02K15j04j79J02q5K16j23m90M98M5L6M9j28K05kk68Q9j16L14j71l26
$$ -28 -262 -60 155 51 -128 -26 -111 105 -18 -508 -10 35 71 120 -8 197 195 -73 16 -100 214 43 -283
2400b83o9J93L33j96J32j24J68j32J1j86o2M91k70Pr6J90l67L95j59L07k18J86
$$ -283 -352 -159 174 -22 110 -14 154 22 33 -153 -215 276 6 13 -83 107 -260 135 -24 283 65 251
2422B51j01m13N66j35k21j45qK25M2n0Q8m0r3Kk13M38j42j02k1J64j94J52j00
$$ 251 150 -263 303 168 -53 -198 -206 19 61 11 99 59 -34 -32 -245 193 51 -51 -72 92 -102 50 -50
2445e0L5K09n6j67K0K9J09n9j24lj90M52l07k0P9O4k29J70j25J63J20j90L8n2
$$ -50 -15 194 138 -29 -9 20 129 70 -54 -57 -247 205 -102 -122 -43 21 -208 -38 -163 0 120 -70 -32 -84
2469h4L66l62Q6j28K14m2r7j46J8K61j00j59l0K97k04J88l67M35r2J65k58K4P8
$$ -84 282 -80 6 -122 92 50 -47 -193 -175 86 -14 -173 -203 94 -110 78 -289 146 54 219 -39 -15 63
2492F3J89j05k13n1P0o5O5Rk41J94J61j45L6L09l08M5K1J51J17j53k09l7K4J01
$$ 63 252 147 -66 -117 -47 -112 -47 -38 -279 -85 76 -69 -33 276 -32 13 34 185 302 149 -60 -97 -73 28
2516B8j6m6j02K05l45o4J91K20l94L31L4J93J97l84j11J61K9m3j04o9Q6k2J13
$$ 28 12 -34 -136 69 -276 -340 -149 71 -323 8 42 235 432 48 -63 98 127 84 -20 -89 -3 -25 88
2539H8l60K7K54j38k48M29j3L56o16J27N1K03k38J66K2k32J30j76L3j29L22j29
$$ 88 -272 -245 9 -129 -377 52 39 395 -221 -94 -43 160 -78 88 110 -122 8 -168 -135 -264 58 -71
2561g1J96l05J84P1%k22jKK21k12M50l12J27N7l75Q6R1j10O3m1K12O3J75n81J86
$$ -71 125 -180 4 75 75 -147 -148 -146 75 -137 313 1 128 185 -190 -104 -13 -123 -60 -101 111 174 349 -232 -46
2586d6J9R1K5k1K19j11l4%k50L1Q2j21J77M5k9l17K48J30k5r1K63m24J9K86j60
$$ -46 -27 64 89 68 287 176 142 142 -108 -77 5 -116 61 106 77 -240 8 138 113 22 285 -139 -120 166 6
2611Fl5m9j3J1O3P4k03K50m3k59L20L6n8J66k76O3Q1J9j98J43P6j92Q3j16P3o6
$$ 6 -29 -78 -91 -80 -17 57 -146 104 61 -198 122 158 100 266 -10 53 134 153 -45 98 174 -18 65 -51 22 -44
2637d4K9j37K99l18L07r2J1n7O1l6o0J09q1j17R9J8M0j0j75R2q0J05o1P8J87j89
$$ -44 -15 -152 147 -171 136 44 55 -2 59 23 -37 72 -9 -126 -27 -9 31 21 -154 -62 -142 -37 -98 -20 167 -22
2663b2l4J80p9L6j68P3j70J71o3N6J29j75k4P4J86k47O1k38L27k47J7L24K0j79
$$ -22 -56 124 45 81 -87 -14 -184 -13 -76 -20 109 -66 -90 -16 170 -77 -16 -254 73 -174 -157 167 187 8
2687HJ00j05KL48m19l30R2K93p7j08k2Q8R4K2j47J03j19J13J98q2j5j33r1K42
$$ 8 108 3 5 353 -66 -396 -304 -11 -88 -196 -218 -130 -36 -14 -161 -58 -177 -64 134 52 37 -96 -187 55
2711E5J70lj79j1m70K99J35j40J77j37Nk06K52J91j33J32q0J34j42j69J23o5j49
$$ 55 225 222 43 32 -438 -139 -4 -144 33 -104 -99 -305 -53 138 5 137 57 191 49 -120 3 -62 -211
2734b11K6J01p9J71r6k0L71l81P3J74N2k52K31M4k26P3q8j67J00J05J19k44p9
$$ -211 -185 -84 -163 8 -88 -108 263 -118 -45 129 181 -71 160 204 -22 51 -37 -204 -104 1 120 -124 -203
2757b03J47J89j34L9K43j31j7k54J41J9P0p5O3l8r3P1k26j1rJ97K34k53L7k2L02
$$ -203 -56 133 -1 38 281 150 133 -121 20 39 109 34 97 59 -34 37 -189 -200 -209 -12 222 -31 6 -16 286
2782B86l33K24j60L2J48o35J84K62p3L5p2K97j93j29K75Jj20k87K05L8J32l03
$$ 286 -47 177 17 49 197 -438 -254 8 -65 -30 -102 195 2 -127 148 149 29 -258 -53 -15 117 -186
2804a86K14J07j20k68L09j14j37K76k37j17L74k6k03j58Q2K66k1K10l1k10q2K49
$$ -186 28 135 15 -253 56 -58 -195 81 -156 -273 101 75 -128 -286 -204 62 41 251 220 10 -72 177
2826A77j10k21K71j36J42n6k32L41j01J46q83P42Q7j91R1rM4p2K48r6J76l57k6
$$ 177 67 -154 117 -19 123 67 -165 176 75 221 -662 80 167 -24 67 58 102 30 278 182 358 1 -25
2849b5K41l78pK31r1o9m1J03Q8l28L79j54J04p1J47M1k16L88k07l9Q7j73j83J
$$ -25 216 -162 -169 62 -29 -98 -139 -36 52 -276 103 -51 53 -18 129 170 -46 342 135 96 183 10 -173 -172
2873a72R0N1N0J2q4o9K79j99M6M2j08K81j35m9m6Kj00j9J07R5p1k22K21k15K04
$$ -172 -82 -31 19 31 -53 -122 157 -42 4 46 -62 219 84 35 -11 -9 -109 -128 -21 74 3 -219 2 -213 -9
2898iq8K60k85Q3j28R7oJ05j44L23n76RN29k30j9j5J25M8k02J23J08J5j49j7K20
$$ -9 -97 163 -122 -39 -167 -70 -76 29 -115 208 -368 -359 170 -60 -79 -94 31 79 -123 0 108 123 -26 -43 177
2923A77j90J72r0n9M5q9l1J45m2j91L89k22k8P5j12L9j59L5K01J11k08j65J30
$$ 177 -13 159 69 10 55 -34 -65 80 38 -153 236 14 -14 61 -51 -12 -171 -136 65 176 -32 -197 -67
2946f7J08j17L8j7Q8J05k10m1K65R4k16j3j45J75j12n2K44j80j8M0lj17K48p2
$$ -67 41 -76 -38 -55 33 138 -72 -113 152 246 30 17 -128 47 -65 -117 127 -53 -71 -31 -34 -151 97 25
2970B5L3l63N83j11j53L6o7K19j84p1M3J24k57J99l48L09M8R4k11m3Q0J75l44
$$ 25 58 -305 278 167 14 50 -17 202 18 -53 -10 114 -143 56 -292 17 65 159 -52 -95 -15 160 -184
2993a84K72k61L12r8Mr8L73m16Q8J56k38J28k51J94K4n7K32k07R1j18J36Ok65
$$ -184 88 -173 139 41 45 -53 320 -96 -8 148 -90 38 -213 -19 5 -52 180 -27 64 -54 82 88 -177
3016a77K18j45K18j03K17l3o2n7k2Q4r2k0p6n7O6J49Ll01M3J32j79K17j62R3Q1
$$ -177 41 -104 114 11 228 195 133 76 54 138 46 26 -50 -107 -41 108 111 -190 -147 -15 -194 23 -139 -46 35
3041C5J77l64M33k56Q6k46J47n6Q9N6R3j92N4j24J37j63J47j99J34L19o51K14
$$ 35 212 -152 281 25 111 -135 12 -44 45 101 194 2 56 -68 69 -94 53 -146 -12 307 -344 -130
3063a30J94J67j49j70K6j21J47r1J17k2m2P5j94J06K2L0j0o5J21N8k43q4K01J05
$$ -130 64 231 82 -88 -62 -183 -36 -127 -10 -32 -74 1 -193 -87 -65 -35 -45 -110 11 69 -174 -258 -57 48
3087D8j10L9j09J41M15n75j4O7j4J26k16L3M24m08L14l20L15nj10k06L60o4n6
$$ 48 -62 -23 -132 9 424 -151 -165 -98 -112 14 -202 -169 255 -153 161 -159 156 151 41 -165 195 131 75
3110G5j08K09k07K73j84o7L9N9Q0j69J86k69J12k86M73l30R6j15P5M54k74k07
$$ 75 -33 176 -31 242 58 -9 30 89 169 0 186 -83 29 -257 216 -114 -18 -133 -58 396 122 -85
3132h5J0Q4L41l98K43j47j32M9L8J8j82L16j76J4k4K44k70M0l09K36j08n0L93
$$ -85 -75 9 350 -48 195 48 -84 -35 3 21 -161 155 -21 -7 -31 213 -57 -17 -326 -90 -198 -248 145
3155A45j63j17K35J7q5R0m07J47P5j48L34l78J19J85J6J85m20L15j40j99R9N4
$$ 145 -18 -135 100 117 32 122 -285 -138 -63 -211 123 -255 -136 49 65 250 -170 145 5 -194 -95 -41
3177d1j09J57J03Q0m69K89k4j7K27r5q6J12M4l43K50r7Q0j16j79J12Q9L8M0k75
$$ -41 -150 7 110 190 -279 10 -14 -31 196 101 15 127 171 -172 78 -19 61 -55 -234 -122 -33 5 45 -230
3201b30J17L61l27O3O5j11K4K22k67J43k12J52R0l32L97j44l43M78N3l98K20r7
$$ -230 -113 248 -79 -16 49 -62 -38 184 -83 60 -152 0 90 -242 155 11 -332 146 199 -199 21 -76
3223g6q8J41R1K10k34J52o6k69J11J40L0j98L8n1n3J86n6L2J74l45j07J78K78
$$ -76 -164 -23 68 278 44 196 130 -139 -28 112 142 -56 -18 -69 -122 64 8 40 214 -131 -238 -60 218
3246B18j5k16j12N0K39k12KQ2N4j81J11J05q1j38K17J38p4j41j11J48J70q1m7
$$ 218 203 -13 -125 -75 164 -48 -46 36 90 -91 20 125 44 -94 123 261 187 46 -65 83 253 172 125
3269A25k04O8j55n5L01Q7k55K59P2k40J36Pj68j33J80l1j08q4J59M2R2l9K8O6
$$ 125 -79 -11 -166 -221 80 167 -88 171 243 3 139 146 -22 -155 25 -6 -114 -198 -39 3 95 56 84 150
3293A50L1p0k07J56J81l31L07j18j25K61m10k95L16j68M13l46L58j09P0Q1j93
$$ 150 181 111 -96 60 241 -90 217 99 -26 235 -175 -470 -154 -322 91 -255 103 -6 64 145 -48
3314d8o8J14L8k52J49k2l4J1J11J2O3r9J5j19P4N3K48Mk29j6m4kK72j03j50k44
$$ -48 -116 -2 36 -216 -67 -89 -123 -112 -1 11 74 -25 -10 -129 -55 -2 246 250 21 5 -39 -41 231 128 -22 -266
3340b66P8R5J74k06J23P5r5J72k13m6K06k07MK8k1jj49L12j55L30j64L6J66l63
$$ -266 -188 -93 81 -125 -2 73 -22 150 -63 -109 97 -110 -106 -78 -99 -100 -249 63 -92 238 74 110 276 -87
3364h7PR1k8J13j72P6q8k03K43M2j63K58j27q7p3J97J67j03n6l2K95j80j09J33
$$ -87 -80 11 -17 96 -76 0 -88 -291 -48 -6 -169 89 -38 -125 -198 -1 166 63 7 -25 270 90 -19 114
3388A14J12k14K08k11k28K26j78J42J00L5j2R7j44K6J6J81j50k91K74P1k64K32
$$ 114 226 12 220 9 -219 7 -171 -29 71 106 94 191 47 73 89 270 120 -171 103 174 -90 142
3410A42k26M4j93K54j27K18j82j34J22K19m5J95k89k21L07m49N35l10K59j71K2
$$ 142 -84 -40 -233 21 -106 112 -70 -204 -82 137 92 287 -2 -223 84 -365 170 -140 119 -52 -30
3431c0Q7p6R0J3j78p5J75J70j28N4j8k27J33J69J17m55K76q9j23J01j6k3l1k9
$$ -30 57 -19 71 84 -94 -169 6 176 48 102 84 -143 -10 159 276 -179 97 8 -115 -14 -30 -53 -84 -113
3455a13J79r2L9r4j24J48P6J97l22M03k44j88K13K29l36K44k27j26J61m5j98L26
$$ -113 66 -26 13 -81 -205 -57 19 216 -106 297 53 -135 78 307 -29 215 -12 -138 23 -22 -220 106
3477A06K7k78P5P4p2N7L1j40J52j24jJ58LOk43K50k37J9K1j16o1O7J97K9J11q6
$$ 106 133 -145 -70 4 -68 -11 20 -120 32 -92 -93 65 68 74 -169 81 -156 -137 -116 -232 -293 -226 -29 0 111 25
3503B5j40J95k69J97m5j79J86K15Nj82J2L8k48K34n8L9r5L70m08q3LJ83O3O0p8
$$ 25 -115 80 -189 8 -37 -216 -30 185 190 8 20 58 -190 44 -14 25 -70 300 -108 -191 -188 -5 58 118 40
3528D0p6k6o0J36q4J67o5m8k3J23j65L08m54J45L0N2K4L6M8o6j43o2j55M56k03
$$ 40 -36 -62 -122 14 -70 97 32 -16 -39 84 -81 227 -227 -82 -52 0 24 60 108 42 -101 -163 -318 138 -65
3553f5L4j08K16k6j04L44l64J81q7O5k72jK83j34m5J91k79K53k40O7J27j09R9
$$ -65 -31 -139 77 51 -53 291 -73 108 21 86 -186 -187 96 -38 -83 108 -171 82 -158 -91 36 -73 26
3576B6Q2q6l6j96L96j1l04J84k19J10Q8l93L09J46n6K4o1k67L58k38J33M9J51
$$ 26 108 22 -14 -210 186 175 -129 55 -164 -54 34 -359 -50 96 40 64 3 -264 94 -144 -11 38 189
3599A89j49o1q2p4J47l5J50J40k57p9Q6m0o2J90j6nj60K58j71K28p0j82K9n9L57
$$ 189 40 -21 -103 -177 -30 -65 85 225 -32 -111 -25 -65 -127 63 47 42 -118 140 -31 197 127 -55 -26 -85 272
3624B72l43J19J81k84J17k23K73j62r4K11j71J55j43J90l53K68j05p3K22Q3j93
$$ 272 -71 48 229 -55 62 -161 112 -50 -144 67 -104 51 -92 98 -255 13 -92 -165 57 140 -53
3645e3m0n1Q0j52J51J61k39O31n46M2O1j51K9J60M5j59l93O94m79J03J38j01k
$$ -53 -93 -144 -64 -216 -65 96 -143 488 -58 -16 45 -106 -77 83 128 -31 -424 270 -209 -106 32 -69 -71
3668g1J23J1j78J20nl4j49K65o0j49Q4J60j83L6J27m0K14m76K24NQ0K3q8p0O1
$$ -71 52 63 -115 5 0 -34 -183 82 22 -127 -43 117 -66 -30 97 57 271 -205 19 24 104 127 39 -31 30
3693C0j18J59N1k50J97j41J31k35N7M00n18J90J81l01J84j12J58M3k56k9K23K39
$$ 30 -88 71 122 -128 69 -72 59 -176 -119 281 -237 -47 134 -167 17 -95 63 106 -150 -179 44 283
3715B83j15k74Pj25L56j56o3J74j64P5J19j06j58L31J5%j59l1j1l5J21j49j1m
$$ 283 168 -106 -99 -224 132 -24 -87 87 -77 -2 117 11 -147 184 199 199 40 9 -2 -37 84 -65 -76 -80
3739h0K38r2rO0j18Nj02K91l65L29l22J74j33j06L75l26J53j74L26l87K44J4K46
$$ -80 158 66 57 117 -1 4 -98 193 -172 157 -165 9 -124 -230 145 -181 -28 -202 124 -263 -19 -5 241
3762B41k47n8O0J21j36K32l10k65L69Q8k44K91R2J47l35j29L26l96K34k46J45
$$ 241 -6 -64 -4 117 -19 213 -97 -362 7 95 -149 142 234 381 46 -83 243 -153 81 -165 -20
3783b0J95l15K67r7pK12l96N4J04K4K5j89J31K56l60J44J67k73J56j35j2j44M07
$$ -20 175 -140 127 30 23 235 -161 -107 -3 21 46 -143 -12 244 -116 28 195 -78 78 -57 -69 -213 194
3806A94k0j52m8o7Rj2P5k0k0K81J11j39j09J21p4K3k79r3j31L98J31j24R7k28
$$ 194 174 22 -26 -93 -84 -96 -21 -41 -61 220 331 192 83 204 130 153 -126 -219 -350 48 179 55 152 -76
3830g6J51P6N7j53j29L7J7j09J95k49K03PR2j88k5M8M8N3m4k01R1l9K5K30j0J1
$$ -76 75 151 208 55 -74 -37 -20 -129 66 -183 20 27 119 -69 -94 -46 2 55 11 -190 -99 -138 -113 117 107 118
3856A18L9k26K0J38oJ22k91O1j71K44j30oJ58l84L13j9m1K1KK42j89p9j8kj0J16
$$ 118 157 -69 -49 89 83 205 -86 -25 -196 48 -82 -88 70 -314 -1 -20 -61 -40 -38 204 15 -64 -82 -84 -94 22
3882B2j65p1J95K5J69k83J58J52m89M42j44J03N2j62r6L02j58n1R0M9k61J3M14
$$ 22 -143 -214 -19 6 175 -108 50 202 -287 155 11 114 166 4 -92 210 52 1 91 140 -121 -108 306
3905C06n87L65J52k76J86j91J93ro0j01J8N3l3K09k47r2J38O8k72J90r3J81j90
$$ 306 -281 84 236 -40 146 -45 148 139 79 -22 -4 49 16 225 -22 -114 24 92 -180 10 -83 98 -92
3928i2K16J0j38R4k01L07j44n9J33j50J42r6q%J07k11P0l8J00R0p7j93j20M60
$$ -92 124 134 -4 90 -111 196 52 -7 126 -24 118 22 14 14 121 -90 -20 -58 42 132 55 -138 -258 202
3952B02q2k07R5PMk69J11J16K04j63o6k6Q0Pk39J99j88K68k1j58P2%J94L3p1j43
$$ 202 120 -87 8 15 19 -250 -139 -23 181 18 -48 -74 6 13 -226 -27 -215 53 32 -126 -54 -54 140 173 102 -41
3978d1N8N5j78JK14j66k0L36k02k11J47J47P4k02o6l0q2J34J59J54m15K24j48
$$ -41 17 72 -106 -105 109 -57 -77 259 57 -154 -7 140 214 12 -54 -84 -166 -32 127 281 -134 90 -58
4001e8o9R9Q2j00PL1k12O22m23j02j77M98k5kj42o2K8N1M2k92K03J75J6j34J60
$$ -58 -127 -28 54 -46 -39 -8 -220 402 -21 -123 -300 198 173 171 29 -33 -5 46 88 -204 -1 174 190 56 216
4026B16j86l7N6j47J81j71R3K09K0l66R7J38j62K06k51K72j44j59K39J1M8j32
$$ 216 30 -7 49 -98 83 -88 5 214 234 -132 -35 103 -59 147 -104 168 24 -135 104 115 163 31
4048C1p2o7k80O58j46j88L6K11k36l7J42m7K2R8n1N6j20j60J13J31r2J59r9k44
$$ 31 -41 -108 -388 270 124 -64 -28 183 -53 -90 52 5 27 125 74 130 10 -150 -37 94 2 161 62 -182
4072a82K62MQ0l9p6o3J43n6j02j66K01q2j6r7J13K69oj80J85j36m48K01J87J06
$$ -182 80 84 164 125 49 -14 129 73 -29 -195 6 -76 -92 -189 -76 193 187 7 192 56 -392 -191 -4 102
4096A02Q8k82J40m5k2l71M12J92m20J58R9j07k85M12j06k95L96O7j77j17J17N2
$$ 102 190 -92 48 3 -19 -390 22 214 -206 -48 51 -56 -341 71 -35 -330 66 133 -44 -161 -44 8
4118Hj80K22L9j10l93M60j40J86p5r2P4k24M33k43Q2j7m6j61J53ML7j18R4k4K16
$$ 8 -172 50 89 -21 -414 46 -94 92 17 -75 -1 -225 208 -35 47 30 -16 -177 -24 -20 17 -101 -7 -31 185
4143A85n7k57J29N7k05L11%l10KM2K44l53O7O8J13j82J67k3l2Pp7K24k57M0K7
$$ 185 128 -129 0 57 -148 163 163 -147 -145 -103 141 -212 -145 -77 36 -146 21 -2 -34 -27 -104 120 -137 -97 -70
4168g0K00J9k75K7K24l60K27M5j45R3m3J97J30j85j38m8M4q5o0K23j70P0O4J20
$$ -70 130 149 -126 -99 125 -235 -8 37 -108 -15 -58 139 269 84 -54 -102 -58 -143 -203 20 -150 -80 -16 104
4192A04J9l72L15j07K08j37k77P4L11j70J80n32L45j46K59l15R4J32J31k5m1R9
$$ 104 123 -249 66 -41 167 30 -247 -173 138 -32 148 -384 -39 -185 74 -241 -147 -15 116 91 50 149
4214A49j62K50k76q1nK35K5j99j0O3O7K0p4j97R4K11j19r9K97k30K05j20P2j37
$$ 149 -13 237 -39 -120 -125 110 135 -64 -74 -11 56 76 2 -195 -101 110 -9 -108 189 -41 164 44 116 -21
4238b1Q5j88K55j75K8mP0j17j2K03r5K5k85Q6j3J33K12r3j0R2k76J94q9j5N0n3
$$ -21 64 -124 131 -44 -16 -20 50 -67 -79 124 29 54 -231 -145 -158 -25 187 94 84 176 -100 94 5 -10 40 -13
4264a3l11L30J86k05q5J05ML15l61P7O5N3l04K35r7j7J21j65j10K9Q5K13m32J83
$$ -13 -324 6 192 -13 -98 7 11 326 -35 42 107 160 -144 91 -6 -23 98 -67 -177 -148 -63 150 -282 -99
4288i9l0K88j70L8kl58L41M5j65M9K1R1r9M2J19k25J19q1p3O9%L70k51J7J3j75
$$ -99 -129 159 -11 27 25 -333 8 53 -112 -63 -42 49 -50 -8 111 -114 5 -76 -149 -80 -80 290 39 56 69 -106
4314a06J63M4Q6j92J45l32N6P5J50j25m5m3N1J63m8R9k03k17j04K97J17j15j95
$$ -106 57 101 187 -5 140 -192 -136 -61 89 -36 -81 -124 -73 90 42 141 -62 -279 -383 -86 31 -84 -279
4337b79K36K46N4J6k70o4K36k67j6Q2L0R6o1q1P0j91K48k70L39m1p6n1J36m4o1
$$ -279 -43 203 257 273 3 -61 175 -92 -108 -26 4 100 39 -42 28 -163 85 -185 154 113 37 -14 122 78 17
4362A7N6k95o4K71j31K70j88L4P4%R0k0k07J66j80J46J05k12r1k8K13j9%r2Q5
$$ 17 73 -222 -286 -15 -146 124 -64 -30 44 44 134 114 -93 73 -107 39 144 -68 -159 -187 26 7 7 -85 0
4387@m0N8P4j77j03J70L11j90j04J1J76p3k44P2J75J53l00J08j45Q4J35k94K47
$$ 0 -40 18 92 -85 -188 -18 293 103 -1 10 186 113 -131 -59 116 269 -31 77 -68 16 151 -143 104
4410A04j54J46K36j36k57o1M0J93k02J73k28P1Q4j43L45k98QJ98k68J6j2K62j96
$$ 104 -50 96 332 196 -61 -122 -82 111 -91 82 -146 -75 9 -134 211 -87 -79 119 -149 -133 -145 117 -79
4433g9K28k21J64n7k5j43r8L77k61L27n5q6j4J6J1l22K70j83K57k94J11%J4K61
$$ -79 149 -72 92 35 10 -133 -231 146 -115 212 157 71 57 73 84 -238 32 -151 106 -188 -77 -77 -63 198
4457A98m71K14J25j93j00J52J86qP5l97K13R2q4o3N1K16j1q0j97K6Kj4o4K85J
$$ 198 -273 -59 66 -127 -227 -75 111 103 178 -219 -6 86 2 -61 -10 206 195 115 -82 -56 -54 -68 -132 153 154
4482A54j33l2n4QR4j41J01k72K21k87K72J48k08LL2J20KJ07j40j72J80j46L97
$$ 154 21 -11 -65 -57 37 -104 -3 -275 -54 -341 -69 79 -129 -126 -94 26 28 135 -5 -177 3 -143 254
4505B54j96k29K64j7j12O3KOl05M86j51m5j54M8J82j28k30M22j75m9n9K40j68
$$ 254 58 -171 93 76 -36 27 29 35 -270 216 65 20 -134 -86 96 -32 -262 160 -15 -64 -123 117 -51
4528e1n1K09k28J58m5R8j74j58L46r4L20k69o0K20k83k24K13L02k25N3j87Q6j03
$$ -51 -102 107 -121 37 -8 90 -84 -242 104 10 330 61 1 221 -62 -286 -73 229 4 57 -130 -44 -147
4551a47L74m42K85j86K5J63J29j86O6N3j18J22j23K17m67J96Qj08K51K5j68M5
$$ -147 227 -215 70 -116 -91 72 201 15 81 134 16 138 15 232 -235 -39 -31 -139 112 137 -31 14
4573A4j78M7N2J16j7j21R5j30K46k63K17j16j13K3qL37j52k4K17j88k9J89m17
$$ 14 -164 -117 -65 51 34 -87 8 -122 124 -139 78 -38 -151 -128 -136 201 49 25 242 54 25 214 -203
4596b03Q6K66m8k11j49L25j48L85l68M2r3K96j29l4J91nr1ok34J08j58p4J56j26
$$ -203 -117 149 101 -110 -259 66 -82 303 -65 -23 -116 180 51 17 208 203 112 106 -128 -20 -178 -252 -96 -222
4620b22O3K40l4O2Lj53j45J73R2n8j76K37j29j95N43l25J1J47j36Q2k42J83r2
$$ -222 -159 81 47 109 112 -41 -186 -13 79 21 -155 82 -47 -242 301 -24 -13 134 -2 80 -162 21 -71
4643g1j00K38l9Np2J04k35K3J14n2J75K6L4r1R5m4j64l54L99j35J86N7k85L48
$$ -71 -171 67 28 33 -39 65 -170 -147 -33 -85 90 116 150 59 154 110 -54 -408 -9 -144 42 99 -186 162
4667A62k00j99L63l0M6k76K17j8m6j4j12K45k41j0R0k07J65q5j88P40m19j08J95
$$ 162 -38 -237 126 96 142 -134 83 65 19 5 -107 138 -103 -113 -23 -230 -65 -150 -338 402 -17 -125 70
4690G0J80k12l33P9K86J1j57mKO1r1K53j13J43l47J90J26o2j30J9j06j79K89J52
$$ 70 250 38 -295 -216 70 81 -76 -80 -78 -17 -108 145 32 175 -172 18 144 82 -48 -29 -135 -314 -25 127
4714A27k07Q6l9k39M34k01K10k59K3j07P4K0L07k65p8R8r6R2J12%J77k58J52k68
$$ 127 -80 6 -33 -272 162 -39 171 -88 -65 -172 -98 -78 229 -36 -114 -16 -112 -20 92 92 269 11 163 -105
4738a05K2J7l1n0nJ67P8j34l0L9O3O1q4K19p6K1k61P6j65L82o6m06L92l1k17J91
$$ -105 -83 -66 -97 -147 -152 15 93 -41 -71 -32 31 92 8 227 151 172 -89 -13 -178 204 138 -268 124 93 -124 67
4764F7K52k93j40K5K71l67j53N96j01o9J19l41L13j04p3j54j11K51n9J44j09o9
$$ 67 319 26 -114 -89 182 -185 -338 258 157 88 207 -134 179 75 2 -152 -263 -12 -71 73 -36 -105
4786a05j11J06Q4K62l86J43M4j28K48k17K15j44o4q8J39M7J8j52J02m1O0Q1j82
$$ -105 -216 -110 -26 236 -150 -7 37 -91 157 -60 155 11 -53 -141 -2 45 63 -89 13 -28 32 113 -69
4809f9P3r3N1M5n6n7M1K38l00J72k58J05oJ91o7o3j07J67pR4n7J09j72PO7j95
$$ -69 4 -89 -38 7 -49 -106 -65 173 -127 45 -213 -108 -114 77 10 -53 -160 7 0 94 37 146 -26 -19 48 -147
4835a47J67n9J17J2L4Pk51J67J67l12J94j64K44r6j59R2J15q6r8L8k55K91K2j66
$$ -147 20 -39 78 90 124 131 -120 47 214 -98 96 -68 176 80 -79 13 128 42 -56 -18 -273 18 40 -126
4859a26K07O2k56M4j18K07J8j19l39L30R0j44Q1Q4%j11J98J17m34J75j69j00M53
$$ -126 81 143 -113 -69 -187 20 38 -81 -420 -90 0 -144 -63 21 21 -90 108 225 -209 -34 -203 -303 150
4882A50o3l95M51P8n40L27j84K80k22OJ38P6l14J61j9K46k33r6M50m09J38Q7j6
$$ 150 87 -308 143 221 -319 8 -176 104 -118 -112 26 102 -212 -51 -70 176 -57 -153 297 -112 26 113 97
4905I7j91K78l4j01r9J3K06j60P5m9j17m4jK2K27j75K73m22L10o4J2q7j61L58
$$ 97 -94 184 150 49 -50 -37 169 9 84 35 -82 -126 -127 -105 122 -53 220 -202 108 44 56 -31 -192 166
4929A66nl38K32L2M6j48j60l8K87j12j96O86l20l47J62j78m1K90l4Q7j44K01p7
$$ 166 161 -177 55 87 133 -15 -175 -213 74 -38 -234 452 132 -215 -53 -231 -272 18 -16 71 -73 128 51
4952E1j67J17N5M2l49L64J57j67LN1j7k03K87k86J91j52R7j15K13j61j48L57k37
$$ 51 -116 1 56 98 -251 113 270 103 106 157 140 -63 224 -62 129 -23 74 -41 172 11 -137 220 -17
4975a7j90l3J14j01K76M4n1L5j12O0j55K40r8R5M7l28K08q1L46j07j56M1q8J6
$$ -17 -207 -240 -126 -227 49 93 42 77 -35 25 -130 110 12 107 154 -174 34 -47 299 192 36 77 -11 5
4999EO3K2k04J91J62j04k16R8j27J20l5R3j31K47N3m34J42K8K31k81J48o8j52
$$ 5 68 90 -114 77 239 135 -81 17 -110 10 -25 68 -63 184 237 -197 -55 -27 204 -77 71 3 -149
5022a49q6L55k34J97j80K03j19L1r0L44j89j4k79K25l0NK42k48J25Oj89K39O8
$$ -149 -235 120 -114 83 -97 106 -13 18 -72 272 83 69 -210 15 -15 -10 232 -16 109 115 -74 165 233
5045B33l66L20o6j31j88Q9r6L2L66j24n2j98M37l64J0L86k70R0L6p9j74L75m77
$$ 233 -133 187 121 -10 -198 -109 -205 -173 193 69 17 -181 256 -108 -98 288 18 108 144 65 -109 266 -211
5068b11J42J79K73l05M8K5j97j59J78o2j0J42Qj00J60m2L3k38K24j40J23j17J12
$$ -211 -69 110 383 78 126 151 -46 -205 -27 -89 -99 43 51 -49 111 69 102 -136 88 -52 71 -46 66
5091F6n4Q4O9n7L9k21J35l6m7lK0J51k86J10n2P4j65J99J07l34M11l15n7J64o6
$$ 66 12 96 165 108 147 -74 61 25 -22 -25 -5 146 -140 -30 -82 -8 -173 26 133 -201 210 -105 -162 2 -64
5116f4k9J47j26j43L99m37K6K1K21Lk7J38j48J14j10k9j25L66M3j93l3K9j88J09
$$ -64 -93 54 -72 -215 184 -253 -227 -206 15 18 -9 129 -19 95 -15 -44 -169 197 240 47 14 43 -145 -36
5140c6j17J60Q7j16O5l24M12r5r5k05K10K39j06L0l3j95P9P8j65K1J04j97M47
$$ -36 -153 7 94 -22 43 -281 131 36 -59 -264 -54 185 79 109 76 -119 -40 38 -127 -106 -2 -199 248
5163B48j30O4k47L03l70L18lr9k11O6q8m5N8L33j50L6J69j39J39k95L47k93j7
$$ 248 118 182 -65 238 -132 186 183 84 -127 -61 -149 -194 -136 197 47 83 252 113 252 -43 304 11 -6
5186fr1R8J05j80J3K00K1m2j69j21K87j36oj10L7%J08q0j31L57p1r1K32j16j15
$$ -6 -97 1 106 -74 -61 139 160 118 -51 -172 115 -21 -27 -137 -100 -100 8 -72 -203 154 83 -8 224 108 -7
5211gJ44j93M5K7L29j87k75J43P0j34j12K7P8M2K31j98j56k65M77qJ05o3j25J23
$$ -7 137 -56 -11 16 345 158 -117 26 96 -38 -150 -123 -45 -3 228 30 -126 -391 86 78 183 120 -5 118
5235A18k6l66J74q7K27K0j08O3l4K37n67K63J15K7j83R7N7O2m7P1k34J39j95K55
$$ 118 92 -274 -100 -187 40 60 -48 15 -19 218 -349 -86 29 56 -127 -30 27 89 42 113 -121 18 -177 78
5259G8j52J04k8P7rK8k82K40mP9m30N40j90j25J8J44L3l62K88J26j08l5J63l60
$$ 78 -74 30 2 79 70 98 -184 56 52 131 -299 241 51 -74 -56 88 121 -241 47 173 65 30 193 -167
5283a67J54m8J84j48K46k72P4j62L58l13jj1J56r9k1n3J41M5m17J48J37n0K52
$$ -167 -13 -61 123 -25 221 -51 23 -139 219 -94 -95 -106 50 -49 -70 -123 18 63 -354 -206 -69 -119 133
5306A33j58j7R5p7O1j45K64j3m1j73K1l7Q7k84L33p0J13J4M9j65r1J86j09K85
$$ 133 -25 -42 53 -24 37 -108 156 143 102 -71 -50 -87 0 -284 49 -21 92 106 155 -10 -101 85 -24 261
5330B61j79j22J20l9l44M03l17K67j49K56k63J02N0l13M15j66N7m1qq1K95k65
$$ 261 82 -40 80 41 -303 100 -217 50 -99 157 -106 -4 46 -267 148 -18 39 -2 -10 -91 204 -61
5352f1J46j45J7O3j68J18O0k82L79J26l21L3j7K15j97K2K1j14Q7p8J62L0j04L0
$$ -61 85 -60 -43 20 -148 -30 30 -252 127 253 -68 -35 -52 163 -34 -12 9 -105 -18 -96 66 96 -8 22
5376B2J19K3k34K80l32R4j54L39m4l82L43l32K68j48J28k6j94J68J3k52L67J9
$$ 22 141 164 -70 210 -122 -28 -182 157 113 -269 74 -258 10 -138 -10 -36 -230 -62 -49 -301 66 85
5398H5j87j01L80l98K11K9jj0L9L0j31q8M31m3k80j52J88r6K48j96k7J93k38N3
$$ 85 -102 -203 177 -221 -10 19 18 8 47 77 -54 -142 289 246 -34 -186 2 -94 154 -42 -69 124 -114 -61
5422f1q4p1J11j46k12L29K94N7j12n4p0O6lK4J3J10j26q7P3J39l24o0J7N20l35
$$ -61 -145 -216 -105 -251 -463 -134 160 217 105 51 -19 47 44 68 81 191 65 -22 51 190 -134 -194 -177 343 8
5447Hr0N6J51m85K59L10k11o4K75j96m9K15j67j80M6K07k84J29J49J90m28O7J51
$$ 8 -82 -26 125 -360 -101 209 -2 -66 209 13 -36 179 12 -168 -122 85 -199 -70 79 269 -159 -92 59
5470E9J36l26K80k01j87Q0J01J61j59J25J24r9j08j50K01J36k56k07L75j52q7
$$ 59 195 -131 149 -52 -239 -159 -58 103 -56 69 193 94 -14 -164 37 173 -83 -290 85 -67 -154
5491a54J26J38J76m13J91m8J07j04Q8k29N0r7K07r0R1M6l2N3l20K06N9J1J80l28
$$ -154 -28 110 286 -127 64 16 123 19 107 -122 -72 -169 38 -52 39 85 53 106 -214 -8 51 62 242 -86
5515h6J05L7l9N1p7M3K26l55J97j12l07M10k66J22O8j45M08j59j13O5p4k5J36
$$ -86 19 56 17 68 -9 34 260 -95 102 -10 -317 93 -173 -51 17 -128 280 121 8 73 -1 -26 110
5538A10o1k52J4L78k88J19R5m9j7j15J85j18M9j12q0L6j26M40k28Ml27K07J55
$$ 110 49 -203 -189 189 -99 20 115 66 49 -66 119 1 50 -62 -142 -106 -232 208 -20 -16 -343 -136 19
5561A9PQ8k94L97r9l25L68j30l1Pj80J58RJ79n02J75M5K74m29L08n2j29J56j5
$$ 19 26 114 -180 217 118 -207 161 31 0 7 -173 -15 -6 173 -329 -154 -109 165 -264 44 -8 -137 19 4
5585DL4o3k68K65Q3PJ29m25O3n8N5L95k07j84Q6J29N7k53K77j33K31j15k7j82
$$ 4 38 -25 -293 -28 55 62 191 -234 -171 -229 -174 221 14 -170 -84 45 102 -151 126 -7 224 109 82 -100
5609a00o7J01L08j49j57lP3Ol55M42k30o3L6J82l9O4k30Q4k14L83n4M4p5j48K43
$$ -100 -167 -66 242 93 -64 -67 6 12 -343 99 -131 -194 -158 24 -15 49 -181 -97 -311 72 18 62 -13 -161 82
5634H2j52K09j48J8j10O3n4J07p0O8nJ27o5Q1k96J46Q4j65P6j08J90r6K18k62
$$ 82 -70 139 -9 9 -101 -38 -92 15 -55 13 8 135 70 151 -145 1 85 -80 -4 -112 78 -18 200 -62
5658f2jJ27O7k59Q0K78k74R7K4n2K7o2p8rR4M9J13q0O5q3k41L24o2k67l7K0J55
$$ -62 -63 64 131 -128 -48 230 -44 53 77 25 52 -10 -88 -97 -3 46 159 79 144 61 -180 144 82 -185 -222 -202 -47
5685d7L3j2O7J47k32J35k72J75kJ81k51Q3K32l09L59k04r2j2p3Q8j85K76r8j19
$$ -47 -14 -26 41 188 -44 91 -181 -6 -8 173 -78 5 237 -72 287 83 -9 -21 -94 -6 -191 85 -13 -132
5709a32M7R9P6k89K5J69Q2j06J24k51K34l1j1P4j10k67L54k34R9K00m3o2Q1j68
$$ -132 -85 14 90 -199 -174 -5 77 -29 95 -156 78 47 36 110 0 -267 87 -147 -48 152 109 47 128 -40
5733d0L56l70P9K71j12j51L3j6k09L56j93n1J96l24K95m7Q3l0l4j48l5N9n7Q4
$$ -40 316 -54 25 296 184 33 66 50 -159 197 4 -47 149 -175 120 73 156 126 92 -56 -91 -32 -89 -5
5757ek87L40m35L36p6J59J14m6M4k59J40l5j62K19R9j02M5n3p6J97k02K0m0J03
$$ -5 -292 48 -387 -51 -127 32 146 100 144 -115 25 -10 -172 47 146 44 89 36 -40 157 -45 -25 -65 38
5781C8m7o6J13j67L08j12m9k61K50l0k6j2Q1M9j02J31J6k00j24K45L5n7Q8m07
$$ 38 -9 -75 38 -129 179 67 18 -243 7 -23 -49 -61 20 69 -33 98 114 -86 -210 35 70 13 101 -306
5805c06J11M20k52N6j08L12k16kq1L9k01K47nK13j7l97J2K74j37l03K82K09j05
$$ -306 -195 225 -27 29 -79 233 17 15 -66 -27 -228 19 14 227 210 -187 -175 99 -38 -341 -59 150 45
5828D5o1j89L50k9j27K7m4K78p9k96K74r2j69L5J58l22K57K70k03Q8l85J47J48
$$ 45 -16 -205 145 116 -11 16 -28 250 171 -125 149 57 -112 -77 81 -241 16 286 83 171 -214 -67 81
5851H1j34JK57m41J16J6L1J03j25L84l00j4n8l9Q2j30K01J15q8mN8L2O1j33p8
$$ 81 -53 -52 205 -236 -120 -104 -73 30 -95 289 -11 -25 -83 -122 -40 -170 31 146 58 54 112 144 205 72 -6
5876fK53m14l9J02J94n1k13J30J0J21j70J30L6j89L2J50J13l11M81l31NJ25j60
$$ -6 247 -167 -206 -104 90 39 -174 -44 -34 87 -83 47 83 -106 -74 76 189 -122 359 28 33 158 -2
5899blj08J15M6j84J07N8n00L24L37P9m99M30l16K63k54J23l1l2J55k49J33N1
$$ -2 -5 -113 2 48 -136 -29 29 -471 -147 190 269 -230 200 -116 147 -107 16 -15 -47 108 -141 -8 43
5922D3k66l6J74PJ06k12K48m7M4k10J69k7J7j40J44o6mk05M44k17J67Q9j02r1
$$ 43 -223 -259 -85 -78 28 -184 64 17 61 -149 20 -7 10 -130 14 -52 -56 -261 183 -34 133 222 120 29
5946B9j51K47j58nR2J55j27k5J21j82J73l22K76o6j27L2Q1q2pK06k05p4K47k06
$$ 29 -122 125 -33 -38 54 209 82 57 178 -4 169 -153 123 57 -70 -38 43 -39 -46 160 -45 -119 128 -78
5970g8K07l45J49J2M4J63M9j79Ml2m2j4K4q4K07Mm66M74M8j23pp3N9J61j8r7J34
$$ -78 129 -216 -67 -55 -11 152 201 22 26 -6 -48 -62 -38 -122 85 89 -377 97 145 22 15 -58 1 162 144 47 181
5997A81l46k8J35K2O0M0l4J5m5J55O4m06J70p6%J25j81Q3j31Q7n8k3K49J44k64
$$ 181 -165 -193 -58 -36 24 64 30 45 0 155 219 -187 -17 -93 -93 32 -149 -66 -197 -110 -168 -191 58 202 -62
6022f2k7P0q7K15j97J71j86J11j44K15K7Ok84L8L32K1k44J08j90M43l50l9J00
$$ -62 -89 -19 -106 109 -88 83 -103 8 -136 79 106 112 -172 -134 198 219 -25 83 -107 336 -14 -53 47
6045D7l4k71K15J67j80r0J81N0j16p3O6Q1R3j51m30K60K33q9J95j69J8j2K31k14
$$ 47 13 -258 -43 124 -56 -146 35 85 -31 -104 -38 43 136 -15 -445 -185 48 -41 154 -15 3 -9 222 8
6069Hm0l29L20J83j40L3n1M3k48r0K61J00k1L8r0j00J45j21J59J39j60K80q38
$$ 8 -32 -361 -41 142 2 35 -16 27 -221 -311 -50 50 29 67 -23 -123 22 -99 60 199 39 319 -519
6092e19M14P9J03j41j53K20n8j10J71k02K06J21p3j23j6l1J75k13p5L22l40K43
$$ -519 -105 -26 77 -64 -217 3 -55 -165 6 -196 10 131 58 -65 -81 -112 63 -150 -225 97 -243 0
6114@J2j9l9k05M2J74o5J08j5j44J34j2j5QKJ00k56K27K24k61r1J10Q6j44R8j71
$$ 0 12 -7 -46 -251 -209 -35 -100 8 -7 -151 -17 -29 -44 -36 -34 66 -190 37 261 0 -91 19 105 -39 59 -112
6140a12PJ79j67K60j69j47O6J57n0O0K3j53n2K09j59J91J88m15K40k46L0m5N3
$$ -112 -105 74 -93 167 -2 -149 -83 74 24 84 107 -46 -98 111 -48 143 331 -84 156 -90 -60 -105 -52
6163e2J43n2J4o3M2K7P9j36K26l47K93j67j10J54j81J49L9m5l34L32r6r5M01k46
$$ -52 91 39 53 -10 32 59 138 2 228 -119 174 7 -103 51 -130 19 58 13 -321 11 -85 -180 221 -25
6187b5L7j8n5N5N8j55K59k98R7lj08rL14j64J6N6k31J95j9L3j59L30j18p9p3J56
$$ -25 12 -6 -61 -6 52 -103 156 -142 -45 -48 -156 -165 149 -15 1 57 -174 21 2 35 -124 206 88 9 -64 92
6213I2j29L19j66k59J77RQj4k6K49k73R1j75K51l30K36M7l16L42l08L62k25L27
$$ 92 -37 282 116 -143 34 43 51 37 11 260 -13 78 -97 154 -176 60 107 -209 133 -175 187 -38 289
6236B89j09k07o4k02M90l52J96j2j61J85j76j3J01j22K35k87K31j81L83j24j01
$$ 289 180 -27 -91 -293 197 -155 41 29 -132 53 -123 -136 -35 -157 78 -209 22 -159 224 100 -1
6257aj34J50J71k38l28J33J88K15J0o1r3P9k06P5M2k7J57M2j80K8K31k52P1k72
$$ -1 -135 15 186 -52 -380 -247 -59 156 166 105 12 91 -115 -40 2 -25 132 174 -6 22 253 1 72 -200
6281b00L10o5q3j98K04j70K43l7J2M7m4J85J4L5l13M4o2L02j42Mj01O8l7j82J94
$$ -200 110 45 -38 -236 -32 -202 41 4 16 63 19 204 218 253 -60 -16 -78 224 82 86 -15 53 16 -166 28
6306B8M8J5o1N7o6K61k46n0K19k04n2K32K02k57j71k02K40M2q9J76j54J49j33
$$ 28 76 91 30 87 21 282 36 -14 205 1 -51 181 383 126 -45 -247 -7 35 -54 122 -32 117 -16
6329a6M8Q3J78k14k76J10K0J7lK50j26K03j66j30k5l8R3J9l8j14J51j63J54J53
$$ -16 32 115 293 79 -197 -87 -67 -50 -53 197 71 274 108 -22 -47 -85 8 27 -11 -125 26 -137 17 170
6353A70j72j27J32K54o7k11K5K36l77j16L1L16L1R0k63M51k13j67J50l15l2J80
$$ 170 -2 -129 3 257 190 -21 4 240 -137 -253 -222 94 125 215 -48 403 190 23 173 -142 -174 6
6375Fj31K49q8p1kL0qQj34L1K47K1R5m09N3J20L8k26J0L50q9r5l1LO2O0J31m9
$$ 6 -125 124 36 -35 -37 -7 -15 -7 -141 -110 137 158 253 -156 -103 17 55 -171 -161 189 100 5 -26 -23 39 99 230 181
6403A81l01J68n5l2j70M87l58L39j82j71j19M40k71n8L35r7m7O8k27j5J9J41N6
$$ 181 -120 48 -7 -39 -209 278 -80 259 77 -94 -213 227 -44 -102 233 136 89 157 -70 -85 -66 75 131
6426A31j42J7q5J49M5l32Q3k5L81k1k42J83N5j4j19M1k20K24O6l13O2P1J42k25
$$ 131 -11 6 -79 70 115 -217 -134 -159 222 201 -41 142 197 183 64 105 -115 109 175 -138 -76 -5 137 -88
6450h8K89k97R9r0J6Q3M7j26L51k57k63L51k28K63k42L02o0O9k45jO2M3j37J68
$$ -88 201 -96 3 -87 -71 12 59 -67 284 27 -236 115 -113 150 -92 210 150 219 -26 -27 35 78 -59 109
6474A09o0j59O0PJ98l00K07o2M2L13k98k58K69J1j15j50J29K74k76j00M3O2R2
$$ 109 49 -110 -50 -43 155 -145 62 0 42 355 57 -201 68 79 -36 -186 -57 217 -59 -159 -116 -54 38
6497C8o8j60L86l41L7m8J65o8M0O1j87n1N5J65j86K20K9Q2j14j87J38J66O8J8
$$ 38 -30 -190 196 -145 -108 -156 9 -59 -19 42 -145 -196 -141 24 -162 58 87 169 55 -132 6 172 240 258
6521B58k84Q9j2N2K6k14K4l0J70J9k93K40l05L59l5k80Q9J68J44l84J6J10M2L09
$$ 258 -26 63 51 103 129 -85 -61 -91 79 98 -195 45 -260 99 64 -216 -127 41 185 -199 -183 -73 -31 278
6545B78j59j83o5J04K03k9r8j65J84K31m91L29p6p6M7m9j05K89l42m7L82j4k69
$$ 278 119 -64 -129 -25 178 149 51 -114 70 301 -190 139 63 -13 34 -15 -120 169 -173 -220 162 148 -121
6568a21J23O4K3l38J90L66j10l72K28J18k11j56q1K86k14K29jJ65l48M90k47l60
$$ -121 2 66 89 -249 -59 307 197 -175 53 171 -40 -196 -277 9 -205 24 23 188 -160 330 83 -277
6590b77J53M6J42L9j94n3J14M3n8j1J60k17P1j81K19J83p9k15M64n64J26R1k62
$$ -277 -124 -78 64 103 -91 -144 -30 13 -45 -56 104 -113 -42 -223 -4 179 100 -115 349 -215 -89 2 -260
6613b60L02o0R6k03Q3R7K57k14nK1j74r3L48n1P6k15K19l85J72j82J24J54j07
$$ -260 42 -18 78 -125 -42 55 312 98 93 114 -60 -153 195 144 220 5 224 -161 11 -171 -47 107 0
6636@J44o3m6l64J98J85r2Q9P0j66J16l5Q6j56p1L72l57j30L4J72k19L88k07K55
$$ 0 144 81 35 -329 -131 54 -38 51 121 -45 71 36 122 -34 -105 267 -90 -220 -186 -14 -233 155 -52 203
6660B03l04K6J59m3j79J55m9J47l34K01K13km6l11J65j97M05l44M2j47L72l37
$$ 203 -101 -75 84 41 -138 17 -32 115 -219 -18 195 193 147 -164 1 -196 209 -135 -93 -240 132 -205
6682b05K15M8j8j15L7P5j32K78j49j02M6rJ85j08J30p7j63J22M4l7k89N00k77
$$ -205 10 58 40 -75 -38 37 -95 183 34 -68 -22 -31 154 46 176 99 -64 58 102 65 -224 276 -1
6705aj52L65k97q0K95l13J32rJL72l26Q3j93K26k16K3o7RK04r2O7j03k47L02J76
$$ -1 -153 212 -85 -165 130 -183 -51 -60 -59 313 -13 70 -123 103 -113 -90 -157 -148 56 -36 31 -72 -319 -17 159
6730A59l37L57l40K44j49p7N9L16m06J9R2J02J2j62O6J30J06pl37M32j66o0j91
$$ 159 -178 179 -161 83 -66 -143 -84 232 -174 -155 -63 39 51 -111 -45 85 191 184 -153 279 113 53 -138
6753a38K16m3j5jQ2l55K52n3O4K7p0J39p6J3j44L12j50k25J43rm23N08N0J71j57
$$ -138 78 35 20 19 101 -254 -2 -55 9 36 -34 105 29 42 -102 210 60 -165 -22 -31 -454 54 104 275 118
6778A18k83K43n3k20r7K39J12j76J25L7N6m9O4q9J45k42L9k3L33k17n5j18O6m0
$$ 118 -165 78 25 -195 -292 -53 59 -117 8 45 101 52 116 27 172 -70 -31 -54 279 62 7 -111 -45 -85
6802h5n4L46l82J60j2P5J50j88l9QJ21l07L77k56O9n7J14J77m33J08M57l07n1
$$ -85 -139 207 -175 -15 -27 48 198 10 -29 -21 100 -207 170 -86 -17 -74 40 217 -216 -108 349 42 -9
6825iL71k40n8J10j05KJ28J13n94N1K72J49r2j49o0o2K42j92l6K53j23J6L26p44
$$ -9 362 122 64 174 69 71 199 312 -282 -231 41 190 98 -51 -111 -173 69 -123 -159 94 -29 -13 313 -431
6849d31N56k59J69M2p2n7M0R2Lj65N4p6k90L80J1j16K79j77j55J22J15J63k33
$$ -431 125 -134 35 77 5 -52 -12 80 83 -82 -28 -104 -394 -14 -3 -119 160 -17 -172 -50 65 228 -5
6872eq4l5n6M59m31Q1J47k78J22j77M84m24J94K2M5o5K3k83J5N37k08j48o2J62
$$ -5 -89 -124 -180 279 -152 -71 76 -202 -80 -257 227 -197 -3 19 64 -1 22 -261 -246 291 83 -65 -127 35
6896C5m0j22j65L07rJ3K5m6L6J9p0j54K01j38O4J37J2J25k59n3J49k45Q1J2O3
$$ 35 -5 -127 -292 15 6 19 44 -2 34 53 -17 -171 30 -108 -44 93 105 230 -29 -82 67 -178 -97 -85 -22
6921b2J10m0n3rJ71l31K82J23m00K97j71J95k40J77n6M4l3j45J90Q0k63K11k33
$$ -22 88 48 -5 -14 157 -174 108 231 -169 128 -43 152 -88 89 33 77 44 -101 89 169 -94 117 -116
6944a16O0p6O6m8j40K79q5J26j86M46l82J83o6j01k9j00J69l39L53k02K25K82
$$ -116 -56 -132 -66 -114 -254 25 -60 66 -120 326 -56 127 61 -40 -69 -169 0 -339 14 -188 37 319
6966C19k95m5k83J15m9J85O7p5P8j76J64n4J39j96J46j20L07j28k89P5o5M1J18
$$ 319 24 -21 -304 -189 -238 -53 14 -61 17 -159 5 -49 90 -106 40 -80 227 99 -190 -115 -180 -139 -21
6989b1j70L80o4K2l49J44J04p3O9lLR7j76j99K74R8j85j07K22N0k0p8L1J80j13
$$ -21 -191 189 125 147 -202 -58 46 -27 42 39 42 139 -37 -236 38 136 -49 -156 66 116 96 18 49 229 116
7014A16l7m6q3j01L53j6m1k87L56k15K8J1l19P7O4M0n8K61j6l4K2j3j47J49j89
$$ 116 79 33 -50 -151 202 186 145 -142 214 -1 27 38 -281 -204 -140 -100 -158 103 87 53 75 62 -85 64 -125
7039a25L50r0j01j43J48o9j10J33J20l08J01L3n7o3K0K48j91J31k71J53J80m5
$$ -125 225 135 34 -109 39 -30 -140 -7 113 -195 -94 -61 -118 -181 -161 87 -104 27 -244 -91 89 44
7061D4kQ3l34j21L51Q6j11j98NK09pj20L59m2j52k01K90r1q3p9J86L4L2j00j08
$$ 44 42 125 -209 -330 21 107 -4 -202 -197 12 5 -115 244 202 50 -151 139 48 -35 -114 72 106 138 38 -70
7086g0r5K95k05j60K23j59M9K47m9p5K2j85L02m9k80R0J12j51R9L03o26M29l30
$$ -70 -165 130 -75 -235 -12 -171 -122 125 76 1 23 -162 140 91 -189 -99 13 -138 -39 264 -362 67 -263
7109b63P0J03Oj22K82K8k43J87J9nl15M71k56J17P4k65K18k90L08k14J50k9J53
$$ -263 -193 -90 -84 -206 76 104 -139 48 67 62 -253 218 -38 79 153 -112 106 -184 124 -90 60 31 184
7132A84q4j66OJ1J2J25k05n4J54q9j22K93K6l91K11J30j20K5j10K84k14K27m6
$$ 184 100 -66 -60 -49 -37 88 -117 -171 -17 -106 -228 65 91 -300 -89 41 -79 -54 -164 120 -94 133 87
7155H7R6k09K95k21J80m18J84P7J16l73J44p7O9j16K28J52j19J14l28J83k12J14
$$ 87 183 -26 269 48 228 -190 -6 71 187 -186 -42 -119 -50 -166 62 214 95 209 -119 64 -148 -34
7177c4k26J53J56K1m2j0m5j27K34k6k7J5j9K7m7J01Q7l22J80O4m5Nj19l4k4L06
$$ -34 -260 -107 49 70 28 18 -27 -154 80 54 27 42 23 50 3 104 191 -131 49 113 68 73 -46 -80 -104 202
7203B02l23M5J42k3O5JNk22R4p0J60J44l10J2o0l2Q8o2J46j30K14r9j7L6M2k39
$$ 202 -121 -76 66 43 108 109 114 -108 -14 -84 76 220 -90 -78 -138 -170 -82 -144 2 -128 86 -13 -30 6 48 -191
7229a91L7J81Kk77K40L9q1K29m26M22l06L25m7n6j86K19o3J25k35J55o3K36k84
$$ -191 -154 27 29 -248 -8 31 -50 179 -247 175 -131 194 147 91 -95 124 61 186 -49 106 43 279 -5
7252eOL1j53P3M7L4j1n4NO4j39K76l91K99p8n5%j15L31k56r5M36k33j69NJ5J23
$$ -5 1 32 -121 -48 -1 33 22 -32 -27 37 -102 174 -217 82 4 -51 -51 -166 165 -91 -186 250 17 -152 -147 -132 -9
7279ij79J70n3J11R8l71M04k19J59j60MJ33m4no2n4P5R1j97J86k05JJ64j61J98
$$ -9 -188 -18 -71 40 138 -233 171 -48 111 -49 -45 88 44 39 -23 -77 -2 89 -108 78 -127 -126 38 -123 75
7304G5o2j10N8J40j38R5RQ5J52k36j0j45J56m9k3j00K36L8Ql04k9J30K37k46N8
$$ 75 13 -97 -39 101 -37 58 67 152 304 68 58 -87 69 20 -3 -103 133 171 179 -125 -154 -24 213 -33 25
7329B5j77R9J27L3j77N2o1K19r1L3M9j49J7P7j51n2R0l3J82q5J10j9m2l72M27
$$ 25 -152 -53 74 107 -70 -18 -79 140 49 82 131 -18 -1 76 -75 -127 -37 -70 112 27 137 118 76 -296 131
7354A31l4k43O0K1J47M9k73L04j82Q3k17J47mL2L5l5M5o9j3J43k15J79j78j8J13
$$ 131 97 -146 -86 -65 82 131 -142 162 -20 63 -154 -7 -11 21 56 21 66 -3 -16 127 -88 91 -87 -105 8
7379HQ7m4J52l92J63%j25K56k01J31n6J10k32J9jL05m4p0q9o7M8q0J41QJ74l7
$$ 8 95 51 203 -189 -26 -26 -151 105 -96 35 -21 89 -143 -124 -125 180 136 66 -23 -90 -42 -122 19 27 201 164
7405A64j58r2L9Q5Q2j48K80j69j26N0j18o9lK24p2M1k28K91j31j32K51q4O7j19
$$ 164 6 -86 -47 38 120 -28 252 83 -43 7 -111 -180 -183 41 -31 10 -218 73 -58 -190 61 -23 44 -75
7429g5j23P1J70j3j86J89j76M6P9n8mJ29o3k25K33K18k78M7l4K5n4K66j43j14
$$ -75 -198 -127 43 30 -156 33 -143 -97 -18 -76 -80 49 -14 -239 -6 212 -66 -19 -53 -28 -82 184 41 -73
7453g3N1l5K73q4J79k30l7J74k8p4J75l54L1O1j29J49j93O4r0j24J57J6J85k32
$$ -73 -22 -57 216 132 311 81 44 218 190 116 291 -63 -32 29 -100 49 -144 -80 -170 -294 -137 -121 64 -168
7477a68l9K23j82J26K39k10K0J78j11j3P7j05o9O4J65j25j88M31k2l26p8J18P7
$$ -168 -207 16 -166 -40 199 -11 9 187 76 63 140 35 -34 30 195 70 -118 313 291 -35 -113 5 82
7500H2r5J26j42J78M5l75J27n8K36j10J27N4k23L2J81j00j8M8n05N45n0Qm0p5
$$ 82 -13 113 -29 149 194 -181 -54 -112 124 14 141 195 -28 4 185 85 67 115 -390 155 105 113 73 -2
7524bk49P9K94j03j58O3K55J49m34q1L23M3k60J19m04L74J13j38o0L41k12p5J71
$$ -2 -251 -172 122 19 -139 -76 179 328 -106 -187 136 179 -81 38 -366 8 121 -17 -77 264 52 -23 148
7547A48p0k45R0P3MJ15l65M00k46j36L69k58n4N9K55k71K57Pn8J20k69J47oJ88
$$ 148 78 -167 -77 -4 0 115 -250 150 -96 -232 137 -121 -175 -116 139 -132 125 132 74 194 -75 72 66 254
7571B54l4p6m58J75L28j59m7L5M8Po1j61J86j86L30k7j90J32O2j42M8j11j20J65
$$ 254 220 144 -314 -139 189 30 -17 18 66 73 12 -149 37 -149 181 154 -36 96 158 16 64 -47 -167 -2
7595bj11M59l01K34m42J41J88k97J59L04j34j78r0k5L02K1n07L86J20M4k32P8
$$ -2 -113 346 45 279 -163 -22 166 -131 28 332 198 20 -70 -95 207 228 -279 107 227 271 39 117
7617A17j32j67j06L92j65o9K98l3j90Q0j56K74j11k5J1KR2j24J01k01J88pj22
$$ 117 -15 -182 -288 104 -61 -130 168 135 -55 25 -131 143 32 7 18 20 112 -12 89 -112 76 69 -53
7640e3M2m7K64l21K37l03q8K68P4j54N9J48j52K83j41j96L8l1n4L9J75j11J68
$$ -53 -11 -58 206 -115 122 -181 -269 -1 73 -81 -22 126 -26 257 116 -80 -42 -73 -127 -88 87 -24 144
7663A44j34j85J6m6K19k25K65J60l38K93j38j33J96j99J25n6o5m1p5M46j98n5
$$ 144 10 -175 -159 -205 14 -211 54 214 -124 169 31 -102 94 -105 20 -36 -101 -142 -217 229 31 -24
7685b4j0kr2J03j41l0J71J07q6m6J80oj00j8r9J01M7m1K4k96M10k79j2L38n4j03
$$ -24 -34 -36 -128 -25 -166 -196 -25 82 -4 -50 130 124 24 6 -93 8 55 14 38 -258 152 -127 -139 199 145 42
7711D2j15j35n5M97l06P2p4j7K16K5q3o8qn1J78j47K21r2j49l7L28k67p7J63J27
$$ 42 -73 -208 -263 234 -72 0 -74 -91 125 150 67 -1 -9 -60 118 -29 192 100 -49 -86 242 -25 -102 61 188
7736A88k58Q5j90l0K14K03l05k9J67j14J30k85K65Q7l01L9J26L2k7j51J09O4L8
$$ 188 -70 15 -175 -205 9 212 -93 -122 45 -69 61 -224 41 128 -173 -134 -8 24 -3 -154 -45 19 57
7759E7j28m2j92K8N7J25oL7k30L01k9q3K09q2l5k16Q7J74j11N2j55K01p1j86M34
$$ 57 -71 -113 -305 -277 -220 -95 -101 -64 -294 7 -22 -105 104 22 -13 -229 -142 32 -79 -27 -182 19 -52 -238 196
7784A96l2l02J88J42j14j58J46m04N71j54j49r6N3K05J8j57J04j18M8O3o1J70
$$ 196 164 -138 50 192 78 -80 66 -338 233 79 -70 -166 -113 92 110 -47 57 -61 -13 50 -11 159
7806A59j21j28rJ99k70N6P4j48P9J14l4K16O0l59k8J41J82j35qL7k14J16j73J35
$$ 159 38 -90 -99 100 -170 -114 -40 -188 -109 5 -29 187 247 -112 -140 1 183 48 40 77 -137 -21 -194 -59
7830e9J57j38j49J61j91K90p1Q7j21J42k6j11j1J27Q3j2j67j29K71n5l32LL01
$$ -59 98 -40 -189 -28 -219 71 0 87 -34 108 82 -29 -40 87 170 158 -9 -138 133 78 -254 -251 50
7853E0j83L01l27K01l0K9J47k73J80j73O6j7J48q2J35k76J28K41k45N8j32J7K39
$$ 50 -133 168 -159 42 12 41 188 -85 95 -78 -12 -29 119 37 172 -104 24 265 20 78 -54 -37 202
7876B02m20K47k03K66l21L11O7j02Q9k03R7o5J93j62j26J59J16j56M6O0q0j04
$$ 202 -218 29 -174 92 -229 82 149 47 136 -67 30 -35 158 -4 -130 29 145 -11 35 95 15 -89
7898h9J01j26J6J29Rn1J60m01J72J92j47j65J54J39q9m1O3j25q3J31M13l14P8
$$ -89 12 -114 -98 31 40 -11 149 -252 -80 112 -35 -200 -46 93 4 -37 26 -99 -182 -51 362 48 126
7921A26n6j71Q6O0J40k89J14K3J61M6j91j92m2K48R1l50L4M00j34L0k55L56k45
$$ 126 70 -101 -15 45 185 -104 10 33 194 240 49 -143 -185 63 154 -196 -162 238 104 134 -121 235 -10
7944a0j62L08j67K72l96J11J80j86K3J20l14L86l21K96q9j6R3k33L7Q6M09m04
$$ -10 -172 136 -31 241 -155 -44 136 -50 -27 93 -221 165 -156 140 51 35 128 -105 -68 18 427 23
7966B3j03K36k13Q8j4j10K41j46J42J14j59k47R5J15j33K01N7j39P6k38J01O4
$$ 23 -80 156 -57 31 17 -93 148 2 144 258 99 -148 -53 62 -71 130 187 48 124 -114 -13 51
7988E1n11O60j55Q1k5J43k50J87l27mR0P4R2j68k1K5J92m6K4p3K96m93J82J25
$$ 51 -460 200 45 126 101 244 -6 181 -146 -150 -60 14 106 -62 -83 -58 134 88 112 39 335 -158 24 149
8012A49l19O0J30j6O9o3m9o4Q3l27L89J61l68J43Kp6K83k92J69j10k0l3k7J90
$$ 149 -170 -110 20 4 73 10 -39 -103 -20 -347 42 203 -165 -22 -20 -96 187 -105 64 -46 -66 -99 -126 64
8036F4K7j18k21K20j08K65j23k10N3J42j04O4L3j16J35nL65k84j11j20J00Q6j33
$$ 64 91 -27 -248 -28 -136 129 6 -204 -151 -9 -113 -49 -16 -132 3 -2 363 79 -32 -152 -52 34 -99
8059i9J07p6R1J03m14N10k42K28j26K5j1k9M7nj8N3j65K23k97n2K50P7l5k34J92
$$ -99 8 -68 23 126 -288 222 -20 208 82 107 96 67 114 109 91 144 -21 202 -95 -147 103 180 145 -89 103
8084A03J17k50p6j76L29p3n2J82k42o5J23O8j63J40l0K69l08J06j80K24J19m8
$$ 103 220 -30 -106 -282 47 -26 -78 104 -138 -203 -80 -12 -175 -35 -65 204 -104 2 -178 46 165 117
8106A17m38M35r1l0N5J83p3l24L22j62j51q5L83J22k94r2R2j6Q7J7J70k29J12
$$ 117 -321 114 23 -7 48 231 158 -166 156 -6 -157 -242 141 263 -31 -123 -31 -47 40 57 227 -2 110
8129A10j59J16l2p8J89r4K12n76K16J39k08k2j02L30K26k26p4P9k37M51l01l6
$$ 110 -49 67 35 -43 146 52 264 -312 -96 43 -165 -187 -289 41 267 41 -33 46 -191 260 -41 -77
8151g7P6R8k67K16O2J21m26K75j01K73j02jr2k26P3k9L6m9l9K55j48K39k27N4
$$ -77 -1 97 -170 46 108 229 -197 78 -23 250 148 147 55 -171 -98 -127 -91 -140 -179 76 -72 167 -60 -6
8175fJ4J04k5q5K8k3J77j35J23l36P0O9j35N5J60k97
$$ -6 8 112 87 2 30 7 184 49 172 -164 -94 -25 -160 -105 55 -242
8191b42
$$ Imaginary data points
##PAGE= N=2
##DATA TABLE= (X++(I..I)), XYDATA
0@%%%%%%%%%%%%%qJ6j6J6j6K4l2L3m1M9n7P2q2R1j06J23j45J68j92K17k44K76
$$ 0 0 0 0 0 0 0 0 0 0 0 0 0 0 -8 8 -8 8 -8 16 -16 17 -24 25 -32 40 -42 49 -57 66 -79 89 -103 114 -130 146
35A46l13L53l95M43m94N50o12O78p51Q32r20J017j122J235j360J498j651J822
$$ 146 -167 186 -209 234 -260 290 -322 356 -395 437 -483 534 -588 647 -713 785 -866 956
53I56k010K219k454K720l026L379l793M288m889N636o598P890r728J2575j7623
$$ 956 -1054 1165 -1289 1431 -1595 1784 -2009 2279 -2610 3026 -3572 4318 -5410 7165 -10458
68a0458K9308j12636n0929Q6211l1500M1302M4634K0790J1974M3862j665p315
$$ -10458 18850 -93786 -144715 -58504 -90004 -48702 -4068 16722 28696 72558 70893 63578
80F3578O985J185l7852j5030M452j5202l0662l29m939j4042l498L689P40J1331
$$ 63578 70563 71748 33896 18866 23318 8116 -22546 -22875 -27814 -41856 -45354 -41665 -40925 -29594
94b9594J0572J2416J0397Q034J5180J2631j0855r44J1278j0618j8559k795p403
$$ -29594 -19022 -6606 3791 11825 27005 39636 28781 27837 39115 28497 9938 7143 -260
107b60j5457o403k999q500J149J5334M974p173J7290K3998m944m021J4288j818
$$ -260 -15717 -22120 -25119 -33619 -32470 -17136 -12162 -19335 -2045 21953 17009 12988 27276 25458
121B5458j0371n90p309j0640J311j935j1138k608O662K643n641J072J0993L269
$$ 25458 15087 14497 7188 -3452 -2141 -4076 -15214 -17822 -11160 -8517 -14158 -13086 -2093 1176
135A176k262L575N434L347J675k349k794p81l54k075r105o516O067K68r975J289
$$ 1176 -1086 2489 7923 11270 12945 10596 7802 7021 6667 4592 -4513 -11029 -4962 -4694 -14669 -13380
151a3380Q508m23J080N230P61K872Q191j090p563J569N503p151j0565K105K618
$$ -13380 -4872 -5295 -4215 1015 1776 4648 12839 11749 4186 5755 11258 4107 -6458 -4353 -1735
166a735n184k467J697l99N283M337l387Q97Q051K038m393j915L673K175n166m780
$$ -1735 -6919 -9386 -7689 -8088 -2805 1532 -1855 -958 7093 9131 4738 2823 6496 8671 3505 -1275
182a275M39j27k625l106k563M42L459R48j930J735P671M443k788K84O109N48m503
$$ -1275 -836 -963 -3588 -6694 -9257 -8815 -5356 -4408 -6338 -4603 3068 7511 4723 5007 11116 11664 7161
199G161j606k388k740m56l653o454L45M675k013l661L889O423R91q87L290K873
$$ 7161 5555 3167 427 -29 -3682 -10136 -9791 -5116 -7129 -10790 -6901 -478 513 -374 2916 5789
215E789K324J310k651j861K752j24o600m405J134M82m744m126J643L627K82o5
$$ 5789 8113 9423 6772 4911 7663 7539 939 -3466 -2332 -1850 -6594 -10720 -9077 -5450 -5168 -5233
231e233J870L775M630J856j890j4L545p9o239l214J862q04m783j804J157O86J478
$$ -5233 -3363 412 5042 6898 5008 4994 8539 8460 2221 -993 869 65 -4718 -6522 -5365 -4679 -3201
248c201K93j834K465N052p70l124K288M756q05k621O65J472o89j144k535k676
$$ -3201 -2908 -4742 -2277 2775 2005 -1119 1169 5925 5120 2499 3164 4636 3947 2803 268 -2408
264b408Q03k30m092l128L873L626j083q81M006M672N72p26J6m7M00j599n013k378
$$ -2408 -1605 -1835 -5927 -9055 -5182 -1556 -2639 -3520 486 5158 5730 5004 5020 4973 5373 3774 -1239 -3617
282c617J842J85m334q47M149K668j586L51K134J603K92r99k060K42K211j033l733
$$ -3617 -1775 -1590 -5924 -6771 -2622 46 -1540 -1189 945 2548 2840 1841 -219 23 2234 1201 -2532
299b532J117M182l02l537o6K286n78k168j447j03J649J381j103j071L606M266
$$ -2532 -1415 2767 2465 -1072 -1138 1148 570 -1598 -3045 -3148 -1499 -118 -1221 -2292 1314 5580
315E580j229k296R81J358k485l516j685o07J99o17j362P37M336L205j379j04L989
$$ 5580 4351 2055 3036 4394 1909 -1607 -3292 -3899 -3700 -4317 -5679 -4942 -606 2599 1220 1116 5105
332E105K120l159k293K4l07j633k666j297P15K331j98k398J246L477L33k786K32
$$ 5105 7225 4066 1773 1797 1490 -143 -2809 -4106 -3391 -1060 -1258 -3656 -2410 1067 1400 -1386 -1154
349a154K499j07j232n66J319J747J239j565k160J084J935k976l314L51J364j388
$$ -1154 1345 1238 6 -560 759 2506 3745 2180 20 1104 3039 63 -3251 -2900 -1536 -2924
365b924j786R60J995K150J160J16N73K538Q21k709k405J895L45l988k671J007
$$ -2924 -4710 -3750 -1755 395 1555 1671 2244 4782 5603 2894 489 2384 2729 -1259 -3930 -2923
381b923P65n80q93M07J980K287N08j823R19K945j7k896l28K168M7k076r36M32
$$ -2923 -2158 -2738 -3631 -3224 -1244 1043 1551 -272 647 3592 3575 679 351 2519 2566 490 -446 -14
399a4K94K49j830j861J128J723j632j930J653K915N1r96R86K213O75p32j287o82
$$ -14 280 529 -1301 -3162 -2034 -311 -1943 -3873 -2220 695 746 -250 736 2949 3624 2892 1605 923
417I23N82J10k963j865J631J353j628j804J718K391k5j027J53R97J452p49j842
$$ 923 1505 1615 -1348 -3213 -1582 -229 -1857 -3661 -1943 448 423 -604 -451 546 1998 1249 -593
434e93K26K022j22k873n97K462N15j902q56J289J162l43r74m07J142J446p68k181
$$ -593 -367 1655 1533 -1340 -1937 525 1040 -862 -1718 -429 733 390 -584 -991 151 1597 829 -1352
452a352J110J812o57k414K45J243p7r41n53L69J484J093j637j061K108J678j478
$$ -1352 -242 1570 913 -1501 -1256 -13 -90 -1031 -1584 -1215 269 1362 -275 -1336 772 2450 972
469I72j578J072J570o87j948l64J051J93l30j938j50K073R3j806j92K749J338
$$ 972 -606 466 2036 1349 -599 -963 88 281 -49 -1987 -2137 -64 29 -1777 -1969 780 2118
486B118j238o11J428J108q02j624q06J44L91j094k084N58K247J41j791J126K221
$$ 2118 880 269 1697 2805 2003 379 -427 -283 108 -986 -3070 -2512 -265 -124 -1915 -789 1432
503A432N99p81o60M09Q75Q7j836j613R56J856j709j733J094J228q57j354K40P94
$$ 1432 2031 1250 590 999 1874 1961 125 -1488 -532 1324 -385 -2118 -1024 204 -653 -2007 -1767 -973
521i73P51m82p98N4K450J295j610k55K587R84k067j788L72L32j642k101n45K28
$$ -973 -222 -704 -1502 -1448 1002 2297 687 432 3019 4003 1936 148 520 852 -790 -2891 -3436 -3208
539c208J257N6o58J639K687O14j331J08J937l38j836j115K39K68k04r99m65R72
$$ -3208 -1951 -1895 -2553 -914 1773 2387 1056 1164 3101 2763 927 -188 51 319 115 -884 -1349 -377
557c77J687j126j694R27J554j130j529j5J090L81nl15O72J893Q03j697q74J545
$$ -377 1310 184 -1510 -583 971 -159 -1688 -1703 -613 -232 -237 -552 120 2013 2816 1119 245 1790
575A790K43k448j453L92M70m37o01M49J234J616n4r18N85J788n91k397q75J412
$$ 1790 2033 -415 -1868 -1476 -1006 -1443 -2044 -1595 -361 1255 1201 283 868 2656 2065 -332 -1207 205
593B05m97j627j14J249J086M15l22k51P59J065j071k055J09J531j188j524Q95
$$ 205 -292 -1919 -2033 -784 302 717 395 144 903 1968 897 -1158 -1049 482 -706 -2230 -1335
610a335J287O14o3j47O5R34K94j622j144J128P51j563r27R65J410k52o69J91Q21
$$ -1335 -48 566 503 356 421 1355 1649 27 -1117 11 762 -801 -1728 -763 647 395 -274 -83 738
629G38R59j247j307Q4J028l96j505O1J651J119p24n31J375J010p69p50o59j43
$$ 738 1697 450 -857 -773 255 -141 -1646 -1585 66 1185 461 -70 1305 2315 1546 796 137 -6
647fL48j077j467M87J405p3r51N37J191K95l64j66J37P75M04j279p30J091J012
$$ -6 342 -735 -2202 -1715 -310 -383 -1334 -797 394 689 325 159 296 1071 1475 196 -534 557 1569
666A569j009j326N30J043p25j281J63M86N75m55j196O29J387J59r95K13J622L64
$$ 1569 560 -766 -236 807 82 -1199 -1036 -550 25 -430 -1626 -997 390 549 -446 -233 1389 1753
684A753j146o03M29R65j190j138r3N25M41p80o35M49J572j72j213K29J451J76
$$ 1753 607 4 433 1398 208 -930 -1023 -498 -57 -837 -1472 -1023 549 377 -836 -607 844 1020
702A020q33j64L96P58l00r11o99R66L62r20j091Q50O67k72p42L35R24M58m61p64
$$ 1020 187 23 419 1177 877 -34 -733 233 595 -325 -1416 -566 101 -171 -913 -578 346 804 343 -421
722d21M94O25J86j194m09R38Q52j154p05M03J170n73q68k13R23K06n20r74N70
$$ -421 73 698 884 -310 -719 219 1071 -83 -788 -385 785 212 -656 -869 54 260 -260 -1234 -664
741f64J332p3j371L67J452L2j029m22N64K94n2p68o56J145O08n27q73R44P10o84
$$ -664 668 595 -776 -409 1043 1075 46 -376 188 482 430 -338 -994 151 759 232 -641 303 1013 329
761C29q44l57Q61k64o67l85L05J198L01p00j63J316Q22r64j044P24M99p09j115
$$ 329 -515 -872 -11 -275 -942 -1327 -1022 176 477 -223 -386 930 1752 788 -256 468 967 258 -857
780h57n3Q72O5k73n70P00J031l5j710j20J285J39j234l11R26Q72O9m85M27P00
$$ -857 -910 -38 27 -246 -816 -116 915 880 -830 -950 335 474 -760 -1071 -145 727 796 311 738 1438
800A438L66p49j426K52K57p03j317RO83M88n8J76R94J080l8o22JM78K41j494j063
$$ 1438 1804 1055 -371 -119 138 -565 -1882 -1873 -1190 -702 -760 -584 410 1490 1452 830 831 1309 1550 56 -1007
821a007K03Q05m08n38j46J281J80o3r56J92J149k24j365k93J217Q07q42m46J374
$$ -1007 -804 1 -407 -945 -1091 190 370 307 -649 -457 692 468 -897 -1190 27 834 -8 -454 920
840I20P87m91p09m30N28k10j270p51K44N16j19p62R34J330N23k18k13O71K62n46
$$ 920 1707 1216 507 77 605 395 -875 -1626 -1382 -866 -985 -1747 -813 517 1040 822 609 1280 1542 996
860I96p90p46N84M5r17m72R26Q47m23o09K14O67K85p20o55L32N37j36p33J57J161
$$ 996 206 -540 44 89 -828 -1300 -374 473 50 -559 -345 322 607 -113 -768 -436 101 -35 -768 -611 550
881E50P21q93o39Q95J26k65j084N3M68kk49q00M41J436j72p72k0R60R8j133j37
$$ 550 1271 378 -261 634 760 495 -589 -536 -68 -70 -319 -1119 -678 758 586 -186 -206 754 852 -281 -418
902d18j05M15l82m06j99J122L20r6o12J113N34l13q84M0L86k40p11n31J72P14
$$ -418 -523 -108 -490 -896 -1095 27 347 251 -361 752 1286 973 89 129 515 275 -436 -967 -795 -81
922h1k84m27J30O87N88j002n7P53M19l16l74L19O25Om18p14M46K58n65j290O2
$$ -81 -365 -792 -662 25 613 -389 -446 307 726 410 36 355 980 986 568 -146 300 558 -7 -1297 -1235
943a235R49p5o99k1N12J043k06j21M3R40N62j283l69N53L01o18j066K06M55J65
$$ -1235 -286 -361 -1060 -1081 -569 474 268 147 190 1130 1692 409 40 593 894 276 -790 -584 -129 36
963C6j000k08M55P76k46m04J09J016N07n62J0K11O46n54p87M1J80j80q83l71L4
$$ 36 -964 -1172 -717 59 -187 -591 -482 534 1041 479 489 700 1346 792 5 46 226 46 -837 -1208 -1174
984a174J016l30m62J38J278J71o66L7M36O09n36l90K76M80l9m65r64M59L87l56
$$ -1174 -158 -488 -950 -812 466 637 -29 8 444 1053 517 127 403 883 844 379 -585 -126 261 -95
1004i5j208q5R32o6l65J56O47M69L59o03M75P54j8j034n95M97j99k01p37j67Q22
$$ -95 -1303 -1388 -456 -522 -887 -731 -84 385 744 141 616 1370 1352 318 -277 220 21 -180 -917 -1084 -262
1025b62M7j25n2K98N06j60m66l82J146R1p20l94L46M08j82l50Q6Q43p6p25m56
$$ -262 -215 -340 -392 -94 412 252 -214 -596 550 641 -79 -473 -127 281 99 -251 -165 678 602 -123 -579
1046e79j2N57l85m55L66Q78J27n0j08L63K95N6j146j94M75l20q93k59N27P00j01
$$ -579 -591 -34 -419 -874 -508 370 497 447 339 702 997 1053 -93 -287 188 -132 -1025 -1284 -757 -57 -158
1067a58m7O38N05M21q72m97L87k2j85j072k41N13K58k84L8R27O03m40k94q8L96
$$ -158 -205 433 938 1359 487 -10 377 355 170 -902 -1143 -630 -372 -656 -618 309 912 472 178 90 486
1088D86L09p47o39J47R62j44p85K97O40j17o25n93N44l0m47l33j0R77K88j87J51
$$ 486 795 48 -591 -444 518 374 -411 -114 526 409 -216 -809 -265 -295 -742 -1075 -1085 -108 180 -7 144
1109A44Q38P27m58p25j83M75p67l55r70M06k77L04m49J09J035M72l38J54Q02K15
$$ 144 982 1709 1251 526 343 818 51 -304 -1274 -868 -1145 -841 -1290 -1181 -146 326 -12 142 944 1159
1129A159m03o44Q6N50l63j22o67K96J55k1q35j05Q31j61m66l74O54O09L5j59Q6
$$ 1159 756 112 198 748 385 263 -404 -108 47 26 -809 -914 -83 -244 -710 -1084 -430 179 214 55 141
1150A41M33O30n23j06K4Kl36r44j27N93l69l41q0P39M65j67p3K03N83K3k94l71
$$ 141 574 1204 681 575 599 601 265 -679 -806 -213 -582 -923 -1003 -264 201 34 -39 164 747 770 476 105
1172A05M12K09o38k23l20M07j96l65LR9N36j15n36J3Q64J34l90j33L64M64m3l63
$$ 105 517 726 88 -135 -455 -48 -244 -609 -606 -507 29 -86 -622 -609 255 389 -1 -134 230 694 651 288
1194B88m97M04j58m42l70J79M82M9p23L42P25P3m96M0L97K13k64k67j30K42J23
$$ 288 -209 195 37 -405 -775 -596 -114 -65 -788 -446 279 352 -144 -104 293 506 242 -25 -155 87 210
1215B10m73j94L99L93o80k62N60N3l2K66l38M47L41j42m47n3L98j69n32m00K67
$$ 210 -263 -457 -58 335 -345 -607 -47 6 -26 240 -98 349 690 548 101 48 446 277 -255 -655 -388
1236c88o5K30m62N6N80L70l55J66K96N42l75o12J27K56K15p55l67M12L70m16p15
$$ -388 -453 -223 -685 -629 -49 321 -34 132 428 970 595 -17 110 366 581 -174 -541 -129 241 -175 -890
1257h90K64K98L73l10l19N11O76j81k80J44M73J38m95k97K64J77l54q91J06K29
$$ -890 -626 -328 45 -265 -584 -73 603 422 142 286 759 897 402 105 369 546 192 -699 -593 -364
1277c64p8o16p7R18M39r1O7L36L36K82m46m14P1N7n17l51Q9L15l13l59p0M56L08
$$ -364 -442 -1058 -1135 -217 222 131 198 534 870 1152 706 292 363 420 -97 -448 -359 -44 -357 -716 -786 -330 -22
1300b2k48m79L19N17K68l28K05M25L39l76l20J61J18j66p12k89J1K04n39p6K06
$$ -22 -270 -749 -430 87 355 27 232 657 996 620 300 461 579 413 -299 -588 -577 -373 -912 -988 -782
1321g82Q11J26l65N82O80J14n67l44rK30l11m00k87J85L05O2q13J50P57R6l41
$$ -782 29 155 -210 372 1052 1166 599 255 246 476 165 -235 -522 -337 -32 30 -783 -633 124 220 -121
1342a21j35J32L57l84p3J86J74M86m53m7J77N9j9o34Q0P9j81l54j23M86N38k25
$$ -121 -256 -124 233 -151 -224 -38 136 622 169 122 299 358 339 -295 -215 -136 -317 -671 -794 -308 230 5
1364EP5J42K35K33m66j18J07K0l54p68K34L52qJ31j75O24L50n0m76J40K03j13
$$ 5 80 222 457 690 224 106 213 233 -121 -889 -655 -303 -311 -180 -355 269 619 569 93 233 436 323
1386C23k9n80K05K03j54l78O5M31J44m17m11P04M5j11l88K81K37M9qm9L78j74
$$ 323 294 -286 -81 122 -32 -410 -345 86 230 -187 -598 106 151 40 -348 -67 170 219 211 162 540 366
1408C66l16k53k5M86k16q92J38J87K33j30n0O67L77p0j15lK76k6l11l52PrL7m54
$$ 366 50 -203 -228 258 42 -850 -712 -525 -292 -422 -472 195 572 502 387 384 660 634 323 -29 -22 -31 6 -448
1432d48m08L88L32l75J41k5N33K29j55j57M51L83j49m83O9M03l68l65l35J67j30
$$ -448 -856 -468 -136 -511 -370 -395 138 367 212 55 506 889 740 257 326 729 361 -4 -339 -172 -302
1453c02q6n24K80M45J42j47K7M92L23k95k86J40M14J13n86j98M36k32m68n52K03
$$ -302 -388 -912 -632 -187 -45 -192 -165 327 650 355 69 209 623 736 150 -48 388 156 -312 -864 -661
1474f61L32j9l24L55J21L22Kj55M88L74m50k14OJ4P2j50n70J3n5J83j87L4P0M67
$$ -661 -329 -348 -672 -317 -196 126 128 -27 461 835 385 171 177 191 263 113 -457 -444 -499 -316 -503 -469 -399 68
1498F8J45l61j31P55j62m30J01N37l45k21j4k28M05N6o49J51K06M8K87o78L30
$$ 68 213 -148 -279 476 314 -116 -15 522 177 -44 -58 -286 119 175 -474 -323 -117 -69 218 -460 -130
1519a30K80K80n96LO39J24q5n55O1L19l60m63m7N41j37j23j0J65M01j62J3J28
$$ -130 150 430 -166 -163 476 600 515 -40 21 340 -20 -483 -530 11 -126 -249 -259 -94 307 145 158 286
1541B86J81P6l04k73n60O29l20K47k74q5P13m22k82M00L99j31l52k2K25nk9j1
$$ 286 467 543 239 -34 -594 35 -285 -38 -312 -397 316 -106 -388 12 411 280 -72 -94 131 126 97 86
1563H6j84K80K95n53k35N33k37l48l09L08MK10l2j27K39Q08n5l16l67P77m41l40
$$ 86 -98 182 477 -76 -311 222 -15 -363 -672 -364 -360 -150 -182 -309 -70 738 683 367 0 777 336 -4
1585dj05p1j67j59j07J43L33l4n1R9L47J86O2l04q6L39k36l57J17L9M87n95p0
$$ -4 -109 -180 -347 -506 -613 -470 -137 -171 -222 -123 224 410 472 168 82 421 185 -172 -55 -16 471 -124 -194
1608a94j4K13k9k91l60O51p9J5k47J39O38J01k58K7jN8m2n68J53K03k9q74K4L10
$$ -194 -208 5 -24 -315 -675 -24 -103 -88 -335 -196 442 543 285 312 311 369 327 -241 -88 115 86 -788 -764 -454
1632d54L08l04P0J18N64K99m94j79M34K10l94l62J13M23p4m53j84K34O9K8j54
$$ -454 -146 -450 -380 -262 302 601 107 -72 362 572 178 -184 -71 352 278 -175 -359 -125 -56 -28 -182
1653a82J63r7L81l92l14M00L99k80l31L03R3M9l62Q2K04Q3n39J5K44N2K50l18
$$ -182 -19 -116 265 -127 -441 -41 358 78 -253 50 143 192 -170 -88 116 199 -340 -325 -81 -29 221 -97
1675i7jK45j8m4J10l2l8k94L1k95M07K60m21j89L29K54J7l56L28l7J7o1M5j33
$$ -97 -98 147 129 85 195 163 125 -169 -138 -433 -26 234 -187 -376 -47 207 224 -132 196 159 176 115 160 27
1699B7K37j73j2k00K51m5m40k05N57J43l35k22L52J01J97K4j82P1r2L43l33m7
$$ 27 264 91 79 -121 130 85 -355 -560 -3 140 -195 -417 -65 36 233 257 75 146 54 397 64 17
1721A7J05J11k40l26JK10N2l98J62K34K9q4LN97j34j92J4M7J23l94k42K72j03
$$ 17 122 233 -7 -333 -332 -122 -70 -468 -306 -72 -43 -127 -124 473 339 147 161 208 331 -63 -305 -33 -136
1744a36J26k12K5K0k6L7j10k4N12n0K75m14J45J90qk80k19j07J86O8k81M7J27
$$ -136 -10 -222 -197 -177 -203 -166 -276 -300 212 162 437 23 168 358 350 70 -149 -256 -70 -2 -283 -236 -109
1767a09Q5k53j42M39n4Qj56J70j66N99l64mK07r4K54l97j10J9j08j2l2K09J32
$$ -109 -24 -277 -419 20 -34 -26 -182 -12 -178 421 57 53 260 166 420 23 -87 -68 -176 -188 -220 -11 121
1790A21n12K97P7J83M7Q7j7r9j93K03k75k65N41n10L50n31K23J67Q6P2k24J63
$$ 121 -391 -94 -17 166 213 300 283 184 -9 194 -81 -346 195 -315 35 -496 -273 -106 -20 52 -172 -9
1812iK35j89n6j18Q7J46N4MnJ17Q7k99o1J10j76k03R4J95R3j40k64K33O6L17l66
$$ -9 226 37 -19 -137 -50 96 150 154 149 266 353 54 -7 103 -73 -276 -182 13 106 -34 -298 -65 1 318 -48
1837d8j99J93J64j42j70p0J80p7l6j8P34j33q7L2j05J41l9l99q5L05k49j08j85
$$ -48 -247 -54 110 -32 -202 -272 -92 -169 -205 -223 511 378 291 323 218 359 320 -79 -164 141 -108 -216 -401
1860d01J76J47N5j07J47K40N1k49N3j69K48k43P9j41J38J87L3j42k68L96k93k01
$$ -401 -225 -78 -23 -130 17 257 308 59 112 -57 191 -52 27 -114 24 211 244 102 -166 230 -63 -264
1882b64J6p9L99k7j99K32M2J29n3j3K16J5l30L5M6m91J78J30m71M93j02J05K01
$$ -264 -248 -327 72 45 -154 78 120 249 196 183 399 414 84 119 165 -326 -148 -18 -489 4 -98 7 208
1905B08k43K98o7j55j63M75j26J80k54P9J87m17k92L56l34Q6j02j14J00K22j43
$$ 208 -35 263 196 41 -122 353 227 407 153 232 419 2 -290 66 -268 -182 -284 -398 -298 -76 -219
1926b19L4p5J60K89Q5k67J48L03m73j6O7j27L11l53n0J26K94k73k84M7L45m2k61
$$ -219 -185 -260 -100 189 274 7 155 458 -15 -31 36 -91 220 -133 -183 -57 237 -36 -320 -273 72 30 -231
1949b31L24J19k01J77k81M1M52k71K04l65j37K53p3k4k49K82R0k13j68M58J88
$$ -231 93 212 11 188 -93 -52 400 129 333 -32 -169 84 11 -13 -262 20 110 -103 -271 187 375
1970C75n01J91n4l21L82j46j37J17N17m14o7j65L28k50M31n80J60K27j86J46J13
$$ 375 -126 65 11 -310 72 -74 -211 -94 423 9 -58 -223 105 -145 286 -294 -134 93 -93 53 166
1991A66k06k7j38r0J41Q0K47k37J03o2jR9n5j39L75jl74N6J84j12o4l53K36L07
$$ 166 -40 -67 -205 -295 -154 -74 173 -64 39 -23 -24 75 20 -119 256 255 -119 -63 121 9 -55 -408 -172 135
2015A35j68N8k02q6M19Lk61J65K54l71R9LJ07j09N0l17K79R0j13k12M1K02j12
$$ 135 -33 25 -177 -263 156 159 -102 63 317 -54 45 48 155 46 96 -221 58 148 35 -177 -136 66 -46
2038d6k33L57n7J41j69k23K75L61k03q6l2M0L12l08o1j98kj5j72j82K46M0K21
$$ -46 -279 78 21 162 -7 -230 45 406 203 117 85 125 437 129 68 -130 -132 -147 -319 -501 -255 -215 6
2061Fj61J31K1K37M1l37L11k31j06K5q2K8K02j33j11K67j49k9k47K64J40k04J39
$$ 6 -155 -24 -3 234 275 -62 249 18 -88 -63 -145 -117 85 -48 -159 108 -41 -70 -317 -53 87 -117 22
2084B2k22O9P5l4J56O0p1K6l9P7NM5o8l37k66L04J56k43L09j26K77p5j75K50J98
$$ 22 -200 -131 -56 -90 66 126 55 81 42 119 124 169 101 -236 -502 -198 -42 -285 24 -102 175 100 -75 175 373
2109C73m12K33k03LR2l70J75m9L12k58N7o3J17J38k78J11r1k7J56m94K78J99j34
$$ 373 -39 194 -9 -6 86 -284 -109 -158 154 -104 -47 -110 7 145 -133 -22 -113 -140 16 -478 -200 -1 -135
2132a35K47l2%J15j24q9Q3j10J13j87J10j06J87m3P3n2N3N6l61J2l3J87k75K58
$$ -135 112 80 80 195 71 -18 65 -45 68 -119 -9 -115 72 29 102 50 103 159 -202 -190 -223 -36 -311 -53
2156e3j88M19l34K88j03m1J57J55l48l23K54M12m69N6K3J27j08OK07p2k44K25
$$ -53 -241 178 -156 132 29 -12 145 300 -48 -371 -117 295 -174 -118 -95 32 -76 -70 137 65 -179 46
2178D6JJ32Q9j00j47J14lk01L82n35J61M0K34k15k10K24J49l23n7Q7M7K47k06
$$ 46 47 179 268 168 21 135 132 -69 313 -222 -61 -21 213 -2 -212 12 161 -162 -219 -132 -85 162 -44
2201d4J21J84K92l08n04kJ78K54k63j01O2J18k50J59j82J37J88L5j43K32j13j3
$$ -44 77 261 553 245 -259 -261 -83 171 -92 -193 -131 -13 -263 -104 -286 -149 39 74 -69 163 50 37
2223C7O2l03L70q3j38n2r1K48j28k60J42K37k2J56k46J18j54J00PJ33K6j26o2
$$ 37 99 -204 166 83 -55 -107 -198 50 -78 -338 -196 41 19 175 -71 47 -107 -7 0 133 159 33 -29
2246b9J72l3o9Oj92J94p9r1q0K63Pn9j45j1j40J30K84j56J67K1n1n58N41k34L62
$$ -29 143 110 41 47 -145 49 -30 -121 -201 62 69 10 -135 -146 -286 -156 128 -28 139 160 109 -449 92 -142 220
2271B20p2k25N1k37M47j63pR3k0P0mk61%om0J62j08J52l6j76M4M8J87Rk73J24
$$ 220 148 -77 -26 -263 184 21 14 107 87 157 153 -108 -108 -114 -154 8 -100 52 16 -160 -116 -68 119 128 -145 -21
2297b1j24L79p6q7NM8M7r0l60K95J47j57j11j76K3J12j19L11l3J22j63M6j32M00
$$ -21 -145 234 158 71 76 124 171 81 -279 16 163 6 -105 -281 -258 -146 -265 46 13 135 -28 18 -114 286
2321B86j25j92p8n8L09m49R6L7L56l26J40J6J74k8k3K4kJ9k65K7J73n6r9j34r4
$$ 286 161 -31 -109 -167 142 -307 -211 -174 182 -144 -4 12 186 158 135 159 157 176 -89 -62 111 55 -44 -178 -272
2346b72K42M4J40l23l92N78l5j22K08r3j21L25j09P7O9l27J54j73R4j7P3k56K23
$$ -272 -30 14 154 -169 -561 17 -18 -140 68 -25 -146 179 70 147 216 -111 43 -130 -36 -53 20 -236 -13
2369a3j04k39j9N63k04K63j91j9L14j58J61l35J93k88J41j80k96M80j27J66l21
$$ -13 -117 -356 -375 188 -16 247 56 37 351 193 354 19 212 -76 65 -115 -411 69 -58 108 -213
2390b13N1NJ15KL59Rl08J97j33PL1k69L8K77k62K3L7j72R8J72o8k8k35J42K92
$$ -213 -162 -157 -42 -40 319 328 20 217 84 91 122 -147 -109 168 -94 -71 -34 -206 -108 64 -4 -32 -267 -125 167
2415A67j34K52k75M4P0q2p2P6L8j3r2J1N2K26k49p6J13J6Ln5j68K11J13j04j68
$$ 167 33 285 10 54 124 42 -30 46 84 71 -21 -10 42 268 19 -57 56 72 75 20 -148 63 176 72 -96
2440i6k2J36J1k21R1K08m0l30L40j31J79q8j2l6J80j48M8k3kj27J71K4j13J90
$$ -96 -118 18 29 -192 -101 107 67 -263 77 -54 125 37 25 -11 169 21 69 46 44 -83 88 112 -1 189
2464A89m62J13Q3J08k4KL3j00K11l5J42m2k54R6Rk79K12j03N0J63l94L07k30O6
$$ 189 -273 -160 -77 31 7 9 42 -58 153 118 260 218 -36 60 69 -210 2 -101 -51 112 -282 25 -205 -139
2488a39N2J35J5K32k31k53K37K74l56JmL22n57P4Q9K1K43k88J8j83L62p3K0R0
$$ -139 -87 48 63 295 64 -189 48 322 -34 -33 -37 285 -272 -198 -109 -88 155 -133 -115 -298 64 -9 11 101
2512A01j44L29M1j32j82m7j91K48o6J43k29N8N1j21K22J09k65J58o8K45k47K35
$$ 101 -43 286 327 195 13 -34 -225 23 -43 100 -129 -71 -20 -141 81 190 -75 83 15 260 13 248
2534B48l4n8j8k55L19o9l33K07N4k43J45j21o1K21k0k3m1J81j82J58O6k1k7l2
$$ 248 214 156 138 -117 202 133 -200 7 61 -182 -37 -158 -219 2 -18 -41 -82 99 -83 75 141 120 93 61
2558F1J11j09k94M93j51J76k35j59K10k10L91l07Q8K4k10M09l41J56q7J4p3OJ42
$$ 61 172 63 -231 262 111 287 52 -107 103 -107 284 -23 65 89 -121 288 -53 103 16 30 -43 -37 105
2581A05j77J00j52K57k83L40k85N4N0K18j56L9j03O5Kj79k45K51K20j68j66RK60
$$ 105 -72 28 -124 133 -150 190 -95 -41 9 227 71 110 7 72 74 -105 -350 -99 121 -47 -213 -204 56
2604E6P6j25j30K81M4l52P5J42K20q0k27K8L68k41j52L7j71K73j45K6j01K3K35
$$ 56 132 7 -123 158 202 -150 -75 67 287 207 -20 8 376 135 -17 20 -151 122 -23 3 -98 -75 160
2627A60j67o6N5J24Lj91K63J70j81l5m10L76k59O9j31L1N4K91J76m20J76R2Mk95
$$ 160 -7 -73 -18 106 109 -82 181 351 170 135 -275 101 -158 -89 -220 -189 -135 156 332 -88 88 180 184 -111
2651a11L40k29L18l09l0M6Nq8m5P1N1kl1J00j05j63K55P6o9J13j86k0M5k11M43
$$ -111 229 0 318 9 -21 25 30 -58 -103 -32 19 17 -14 86 -19 -182 73 149 80 193 7 -13 32 -179 264
2676B64j65j57Q6L9j30r5J0k86L28k02J92K00k93K56l2l8LJ81j28j43J66m7J11
$$ 264 99 -58 28 67 -63 -158 -148 -434 -106 -308 -116 84 -209 47 15 -23 -20 161 33 -110 56 9 120
2699A20k22p4R6J00K21l64L27j3k40K82o0n7K9p8j1j2J12o0J6j87j34J65O5J11
$$ 120 -102 -176 -80 20 241 -123 204 191 -49 233 173 116 145 67 56 44 156 96 112 -75 -209 -44 21 132
2723A32k21P7P0k79K47J09k30K32m5J19m17K84O9k46J35M0J52k83m3K62j10q1
$$ 132 -89 -12 58 -221 26 135 -95 137 92 211 -206 78 147 -99 36 76 228 -55 -98 164 54 -27
2745b7j83J58L38l71J17lM4k05m0k03L90O2j17q8K64j18N0j19p7j4J83J96k75
$$ -27 -210 -52 286 -85 32 29 73 -132 -172 -375 15 77 -40 -128 136 18 68 -51 -128 -142 41 237 -38
2768c8j07km6J72J28k72J40q9oJ48J17o7J7j46m4P8O1j47O1K09J26l18K24k9q4
$$ -38 -145 -147 -193 -21 107 -165 -25 -114 -120 28 145 78 95 -51 -95 -17 44 -103 -42 167 293 -25 199 170 86
2793H6Q6k42O5N5j61q4P8J14J45j15l06K86L66l65J90k25J78k64L56k36p4l6J39
$$ 86 172 -70 -5 50 -111 -195 -117 -3 142 27 -279 7 373 8 198 -27 151 -113 243 7 -67 -103 36
2816C6m6j79K48j06Oj63P1P1L09j14k32K40q8O4j96J55j81K80l57R4q7P9j93K67
$$ 36 -10 -189 59 -47 -41 -204 -133 -62 247 133 -99 141 53 117 -79 76 -105 175 -182 -88 -175 -96 -289 -22
2840b2P6j27J41n1L1K38j00p0j69J27JQ4P7j2j35j18J8k56L7K07j42j56J64J55
$$ -22 54 -73 68 17 48 286 186 116 -53 74 75 159 236 224 89 -29 -11 -267 -230 -23 -165 -321 -157 -2
2864bj45M09l68m4J59k06J78J42O2L0K79n70J13q1Q6R4j26m8P0j93m2M9NL26n2
$$ -2 -147 262 -106 -150 9 -197 -19 123 185 215 494 -76 37 -44 42 136 10 -38 32 -161 -203 -154 -149 177 125
2889A25k56K26k09K89j74j55Q1nO9k78N21l30P8J94l93K29k76L26Q9j50j71J44
$$ 125 -131 95 -114 175 1 -154 -73 -78 -9 -287 234 -96 -18 176 -217 12 -264 62 151 1 -170 -26
2911b6j77O31k27j26Rj80J52j79P4J53j67O6K17j46j06j20J3q3J79J29R0l19J60
$$ -26 -203 428 201 75 84 -96 56 -123 -49 104 -63 3 220 74 -32 -152 -139 -222 -43 86 176 -143 17
2934A7J08k21J76kM9n1N6k84K14k51M49l52J43k07K94q6j82J93k96K15m5j3J0
$$ 17 125 -96 80 78 127 76 132 -152 62 -189 260 -92 51 -156 138 52 -130 63 -233 -18 -63 -76 -66
2957f6J98m5J29m95L53j57J65k53K76ol30k26L75J71Q7k20Q7j32J11qk24RJ34
$$ -66 132 87 216 -279 74 -83 82 -171 105 99 -231 -457 -82 89 176 -44 43 -89 22 14 -210 -201 -67
2980f7J42qm7p1j07J44n0Q6J9k46J20LJ72l15R6K55j11K03n2j33J51j60OK66j97
$$ -67 75 67 20 -51 -158 -14 -64 22 41 -205 -85 -82 90 -225 -129 126 15 218 166 33 184 24 30 296 99
3005I9p7J50j46j49J48k4k2N2q7K19k14M6j18q5j37L28j0j13J1J37p0N3j52L14
$$ 99 22 172 26 -123 25 1 -21 31 -56 163 -51 -5 -123 -208 -345 -17 -27 -140 -129 8 -62 -9 -161 153
3029A53k56r7Q7J02j11l9K8J85q9k07K83o5L2o1K15K8k00Q6k60K49RJ05J6k97
$$ 153 -103 -200 -113 -11 -122 -161 -133 52 -37 -244 39 -26 6 -55 160 188 -12 74 -186 63 72 177 193 -104
3053a04J33nk45N11q6l11l5J94N1K30n23Q4K28m37L99j46L73l93K31r1l6L6k01
$$ -104 29 24 -221 290 204 -107 -142 52 103 333 -190 -106 122 -315 84 -62 311 -82 149 58 22 58 -143
3076a43J92k08L94k53r1R3p0J9J06k7o0J16l6k09J96K63j94L3J7rk30n3J26K33
$$ -143 49 -159 235 -18 -109 -16 -86 -67 39 12 -48 68 32 -177 19 282 88 121 138 129 -101 -154 -28 205
3100B05k94r1L30m0k54L06j12l6j42j60n1K29J48N7l73L49K99m21K01J1Q3k10
$$ 205 -89 -180 150 110 -144 162 50 14 -128 -288 -339 -110 38 95 -278 71 370 -51 150 161 244 34
3122C4j52K0p7J28O7r0L9L57m63l6J49k6L3L7P1j83J27j2no1Q1K6N7j99K69k89
$$ 34 -118 -98 -175 -47 20 -70 -31 326 -137 -173 -24 -50 -17 20 91 -92 35 23 18 -43 38 64 121 -78 191 -98
3148i8J2K66j90J4K85m42J21rJ7M7J87l17Q5K44j52l04L00K5k04L30j07n0J2q
$$ -98 -86 180 -10 4 289 -153 -32 -41 -24 23 210 -107 -22 222 70 -234 66 91 -113 217 110 60 72 64
3172F4l21L30J21j32k91K47L17k47j75K4M9l0J59L6J85k10l24J62J18k00J7M8
$$ 64 -257 73 194 62 -229 18 335 88 -87 -63 -14 -44 115 151 336 126 -198 -36 82 -118 -101 -53
3194e3J26k60K11J12r8o4J75j27N9l1o7J75m00J14K6J14L7n5o0k09M19L7J8l4
$$ -53 73 -187 24 136 38 -26 149 22 81 50 -17 158 -242 -128 -102 12 49 -6 -66 -275 144 181 199 165
3218A65r5m8m0K23n01M69N6j77m7K2J99m98N11l10J91q8N9k16l7K43j32Ql8R1
$$ 165 70 22 -18 205 -296 173 229 52 5 27 226 -272 239 -71 120 32 91 -125 -162 81 -51 -43 -81 10
3242A0j45R6N7jl8M1J06l03K09K9m1k16J59K03j7k31K2K71m37J44R5Q7j29J66
$$ 10 -135 -39 18 17 -21 20 126 -177 32 61 20 -196 -37 166 149 -82 -60 211 -226 -82 13 100 -29 137
3266A37k95m3L91l55P2j00K40Q9j62P1K56k68P0k33K61o1m7K12k49j6l5p3R8P4
$$ 137 -158 -201 190 -165 -93 -193 47 136 -26 45 301 33 103 -130 131 70 23 235 -14 -30 -65 -138 -40 34
3290C4l6j49J47N1j38l0J64p7K49j36oJ60k80j80O9K42k1k34L06J61k14j4m06
$$ 34 -2 -151 -4 47 -91 -121 43 -34 215 79 73 233 -47 -227 -158 84 63 -171 135 296 82 68 -338
3313c38K77N7P1q2j07M03l74L9P2K00m24K3J72j8N6p4K94l70j84K91J65p3K02
$$ -338 -61 -4 67 -15 -122 281 -93 -54 18 218 -206 -183 -11 -29 27 -47 247 -123 -307 -16 149 76 278
3336B78k19j40J23Q2k38P6m4J27M5j18j23J96l76J25L69j92J99k93K19n0m8k7
$$ 278 59 -81 42 124 -114 -38 -82 45 90 -28 -151 45 -331 -206 163 -29 170 -123 96 46 -2 -29
3358b9R2j06J80j30j08J38o1K02j49J39j87j63Q1n8L58k56J30j91P1R9j55QJ51
$$ -29 63 -43 137 7 -101 37 -24 178 29 168 -19 -182 -101 -159 199 -57 73 -118 -47 52 -103 -95 56
3381E6j20J32Oj30K7K13m38K18OJ23j58L6l4J4J43k12J46J0mp8K40k26m4P2j06
$$ 56 -64 68 74 -56 -29 184 -254 -36 -30 93 -65 -29 -63 -49 94 -118 28 38 34 -44 196 -30 -74 -2 -108
3406a08J32k09K66Q0l4K78m06j88K46J9k50K36l0R8p8MJ64m8N8j60k02J00Q1j02
$$ -108 24 -185 81 161 127 405 -1 -189 57 76 -174 62 32 130 52 56 220 172 230 70 -132 -32 49 -53
3430e3O7J14j90N8l2K1j07K17k24l7K05K04j99j96L5N3j93L90R5m34J81K5N8n4
$$ -53 14 128 -62 -4 -36 -15 -122 95 -129 -166 39 243 44 -152 -117 -64 -257 133 228 -206 -25 0 58 4
3454DNk33n5L27m4j73K26kQ8k71J71J15p0n6j12j09M57l50j64N17k60j14K44J08
$$ 4 9 -224 -279 48 4 -169 57 55 143 -128 43 158 88 32 -80 -189 268 -82 -246 271 11 -103 141 249
3478B49j33k47K26j98r5O4o7P4o4J86K23k40n2K44m2q6k4j82lJ07O4j20N2k25
$$ 249 116 -131 95 -103 -198 -134 -201 -127 -191 -5 218 -22 -74 170 128 42 18 -164 -167 -60 4 -116 -64 -289
3502b89K48K53l81K15J1K1L31o22J95M2J25Lj94J18nl2P1j29j7o8J52M9j83J42
$$ -289 -41 212 -169 46 57 78 409 -213 -18 24 149 152 -42 76 71 39 110 -19 -36 -104 48 97 -86 56
3526E6l5J62m24K28M5R5j56M9K0j70M0J37J3k80N49n34rJ67R5M4m1j14l7M9o8
$$ 56 21 183 -241 -13 32 127 -29 20 40 -130 -90 47 60 -220 329 -205 -214 -47 48 92 51 -63 -100 -51 -119
3551a19M9r3r2l2L09k55L69k01J61J26j98K1j12n1K14J20l02L2K20J3j23j39J24
$$ -119 -70 -163 -255 -287 22 -233 136 -65 96 222 24 45 -67 -118 96 216 -86 -54 166 179 56 -83 41
3574D1Q4p1M7J1lm8j43M8J98k31J40%L6k6k11J08r7Q9J85j43l08M28j96O7J5O5
$$ 41 125 54 101 112 109 61 -82 -34 164 -67 73 73 109 83 -128 -20 -117 -28 157 14 -294 134 -62 5 20 85
3600H5k4Q9j71k87M10j8r7r1R1N8J5j18J78j01M0R0o7k43L13n50O12l30O9j19
$$ 85 61 150 -21 -308 102 84 -13 -104 -13 45 60 -58 120 19 59 149 82 -161 152 -398 214 -116 -47 -166
3624a66J38J12Mj37J01r4L50j73j10r7K6O9k9j5K10p4q9j3p9R9n6k6%RJ10j15
$$ -166 -28 84 88 -49 52 -42 308 135 25 -72 -46 23 -6 -21 189 115 26 13 -66 33 -23 -49 -49 -40 70 -45
3650d5L4q9R1J20J06L0k27j66J68p8K62j93J18J6l2k99L82j07R5k99K58k18j14
$$ -45 -11 -100 -9 111 217 247 20 -146 22 -56 206 13 131 147 115 -184 198 91 186 -113 145 -73 -187
3673a87K04j44R1J19j46n5k2m0J45J81j80L9J5Q4k60K58j34kk0j21NK39r8N4J10
$$ -187 17 -127 -36 83 -63 -118 -140 -180 -35 146 -34 5 20 104 -156 102 -32 -34 -54 -175 -170 69 -29 25 135
3698A35j91J86k62L89l63O2p7j3J09k5k26N50l75R7J19j16J1j11N9L58j68j98
$$ 135 -56 130 -132 257 -106 -44 -121 -134 -25 -50 -276 274 -101 -4 115 -1 10 -101 -42 316 148 -50
3720e0K04k65L90j15j13o0m2m6J11J27l13k6r3J93j42pJ32L28k84P1J60k29k8
$$ -50 154 -111 279 164 51 -9 -51 -97 14 141 -172 -198 -291 -98 -240 -247 -115 213 -71 0 160 -69 -97
3743i7J36j14K9K90O9l34O3j6K5K56k74P4k14J50n8q6Q3O2J35k06P1N0L2r5L45
$$ -97 39 -75 -46 244 313 -21 42 26 51 307 33 107 -107 43 -15 -101 -18 44 179 -27 44 94 126 31 376
3768C76l42k2M2j01k0Q3j39J41M1r1p0P4p3K13k92L42l14K65N4k60N3K60j32j12
$$ 376 34 12 54 -47 -67 16 -123 18 59 -32 -102 -28 -101 112 -180 162 -152 113 167 -93 -40 220 88 -24
3792b4j16k6p2K93k09K82j21K73l63K03o6k13M60k92K4j21J04J41k19QP2O6P5
$$ -24 -140 -166 -238 55 -154 128 7 280 -83 120 54 -159 301 9 33 -88 16 157 -62 -54 18 84 159
3815A59j97n8J58J08j43Jr1J71j18K0k6J74l37K50L6j90r6K16j52K70j56J64j11
$$ 159 -38 -96 62 170 27 28 -63 108 -10 10 -16 158 -179 71 107 -83 -179 37 -115 155 -1 163 52
3838E2j32J28jK28l10Mj95Q5m8J78p1J38mq9L86l54J15J27k95K7J78j0j93J89
$$ 52 -80 48 47 275 -35 -31 -226 -141 -189 -11 -82 56 52 -37 349 -5 110 237 -58 -31 147 137 -56 133
3862A33n2j52K23j48P7M1J0k47J75j36M09n50J53j25L44j0m17M57j30k61K5L22
$$ 133 81 -71 152 4 81 122 132 -115 60 -76 333 -217 -64 -189 155 145 -272 185 55 -206 -181 141
3884A41q9l6j50K75k3o0k6O5j94j03K41k13J66Rj90K79R8o2l02P1M03k29J19m89
$$ 141 52 16 -134 141 118 58 32 97 -97 -200 41 -172 -6 3 -187 92 190 128 -174 -103 300 71 190 -299
3908b99K86jR6j70o6J78j0R0j31j64J28M3j7L99n74K96M1r2N5Jj69o7L11j38l69
$$ -299 -13 -14 82 -88 -154 24 14 104 -27 -191 -63 -20 -37 362 -212 84 125 33 88 89 -80 -147 164 26 -343
3933c43M10K18m72J40Q0J4j51k15L49j6j6r5J08n9L7m8J40l32J92J5l4K12k71
$$ -343 67 285 -187 -47 33 47 -104 -319 30 14 -2 -97 11 -48 -11 -59 81 -251 -59 -44 -78 134 -137
3956a37J82N5l02J67Mj34J18M5k48J96Q5J19Q3l39J0l0K89m09L67m2l66K94j63
$$ -137 45 100 -202 -35 -31 -165 -47 -2 -250 -54 31 150 233 -106 -96 -126 163 -246 121 79 -287 7 -156
3979a56l3L51j96K5n6J04j90R2J73m0M3o1K7n0Q6L3p0j78K2J03K07j46q3p0r0
$$ -156 -189 162 -34 -9 -65 39 -151 -59 114 74 117 56 83 33 119 152 82 -96 -74 29 236 90 7 -63 -153
4004a53q7J20p0L59j31J28j35J26j91J03K00j27Q3j44o6N0j05J56j34j05L0R1
$$ -153 -240 -120 -190 169 38 166 31 157 -34 69 269 142 225 81 15 65 -40 116 -18 -123 -93 -2
4026bkj45K27p1l0K1J46L5j26j80Q6k27J3L46P1k89K63j62M3m26K28K63p6M9o2
$$ -2 -4 -149 78 7 -23 -2 144 179 53 -127 -41 -268 -255 91 162 -127 136 -26 17 -409 -181 82 6 55 -7
4051gR3j78L2M1N8k57Q3L19k75K90j88Q0k67M64q3l46J16J11k18oM5L0M1J2K52
$$ -7 86 -92 -60 -19 39 -218 -135 184 -91 199 11 91 -176 288 205 -141 -25 86 -132 -138 -93 -63 -22 -10 242
4076B42j21j68K8j03K64j47Q1N8j50J73k32OK6J88n7j29J14l47K00J20K8k58J3
$$ 242 121 -47 -19 -122 142 -5 76 134 -16 157 -75 -69 -43 145 88 -41 73 -274 -74 46 74 -184 -171
4099a71M02l35J34k02L80l83O7M16k92q4k1L19k02o7J3n1n9j07lK13L54k08k9
$$ -171 231 -104 30 -172 208 -175 -108 308 16 -68 -89 230 28 -39 -26 -77 -136 -243 -246 -33 321 113 84
4122H4k19N9J8n1J87k08M66k93o9l6J56k95P7K19j38l4L7R8r3k23J1L69j60l0
$$ 84 -135 -76 -58 -109 78 -130 336 43 -26 -62 94 -201 -124 95 -43 -77 -40 58 -35 -258 -247 122 -38 -68
4146f8j9Q9j23q5j1J16J56j19L30l79K04MN0j84k24K31Q2K10j13J22k86J08J2
$$ -68 -87 2 -121 -206 -217 -101 55 -64 266 -113 91 95 145 -39 -263 -32 50 260 147 269 -17 91 103
4169A03j43K44k64P7O0j09K8q9L06j31m2Nj32Q7J75k50J4j65K33l98N19k90M9
$$ 103 -40 204 -60 17 77 -32 -4 -93 213 82 40 45 -87 0 175 -75 -61 -226 7 -391 128 -162 -113
4192a13R1K2K50l56J57rJ46l19J43l7m9k3j43j7K31j21M65l75j15K39k29K95k59
$$ -113 -22 0 250 -106 51 42 188 -131 12 -25 -74 -97 -240 -257 -26 -147 318 -57 -172 67 -162 133 -126
$$ [...]
8191F9
##END NTUPLES=NMR FID
##END=
