##TITLE=1H_DE-22_oil_d6_TFA
 DMSO-d6
 8 sc, 
 6.6.2024
##JCAMPDX= 6.0         $$ Bruker NMR JCAMP-DX V2.0
##DATA TYPE= NMR FID
##DATA CLASS= NTUPLES
##ORIGIN= UXNMR, Bruker Analytische Messtechnik GmbH
##OWNER= root
$$ XWIN-NMR		Version 3.5
$$ Thu Jun  6 16:11:40 2024 Russian Standard Time (UT+4h)  she@DPX200
##.OBSERVE FREQUENCY= 200.1309
##.OBSERVE NUCLEUS= ^1H
##.DELAY= (6, 6)
##.ACQUISITION MODE= SIMULTANEOUS
##.ACQUISITION SCHEME= undefined
##.AVERAGES= 8
##.DIGITISER RES= 18
##SPECTROMETER/DATA SYSTEM= spect
##.PULSE SEQUENCE= zg30
##.SOLVENT NAME= CDCl3
##.SHIFT REFERENCE= (INTERNAL, CDCl3, 0, 15.7039)
##AUDIT TRAIL= $$ (NUMBER, WHEN, WHO, WHERE, WHAT)
$$ ##TITLE= Audit trail, XWIN-NMR		Version 3.5
$$ ##JCAMPDX= 5.01
$$ ##ORIGIN= Bruker BioSpin GmbH
$$ ##OWNER= she
$$ F:/spectra/data/she/nmr/H-F/1/audita.txt
$$ ##AUDIT TRAIL=  $$ (NUMBER, WHEN, WHO, WHERE, WHAT)
(   1,<2024-06-06 16:10:39.46 +0400>,<she>,<DPX200>,
      <created by zg, POWCHK disabled, PULCHK disabled
       configuration hash MD5:
       00 E9 B6 7A A2 85 ED C7 34 08 36 98 17 FE 4E 26
       data hash MD5: 16K
       2F C5 83 03 2D 09 8E 6D 15 66 F8 D1 B1 38 B1 26>)
$$ ##END=
$$ 
$$ hash MD5
$$ 76 99 19 7C 64 C2 3B B7 32 7A 41 CA B8 C0 BD 5B
##$RELAX= 
##$RELAX= 
##$RELAX= 
##$RELAX= 
##$RELAX= 
##$RELAX= 
$$ Bruker specific parameters
$$ --------------------------
##$DU= <F:/spectra>
##$EXPNO= 1
##$NAME= <H-F>
##$PROCNO= 1
##$TYPE= <nmr>
##$USER= <she>
##$AMP= (0..31)
100 100 100 100 100 100 100 100 100 100 100 100 100 100 100 100 100 100 
100 100 100 100 100 100 100 100 100 100 100 100 100 100 
##$AQSEQ= 0
##$AQ_mod= 1
##$AUNM= <au_zg>
##$AUTOPOS= <>
##$BF1= 200.13
##$BF2= 200.13
##$BF3= 200.13
##$BF4= 200.13
##$BF5= 200.13
##$BF6= 200.13
##$BF7= 200.13
##$BF8= 200.13
##$BYTORDA= 1
##$CFDGTYP= 0
##$CFRGTYP= 5
##$CHEMSTR= <none>
##$CNST= (0..31)
1 1 145 1 1 1 1 1 1 1 1 1 1 1 1 1 1 1 1 1 1 1 1 1 1 1 1 1 1 1 1 1 
##$CPDPRG= <>
##$CPDPRG1= <>
##$CPDPRG2= <>
##$CPDPRG3= <>
##$CPDPRG4= <mlev>
##$CPDPRG5= <mlev>
##$CPDPRG6= <mlev>
##$CPDPRG7= <mlev>
##$CPDPRG8= <mlev>
##$CPDPRGB= <>
##$CPDPRGT= <>
##$D= (0..31)
0 1.2 0 0 0 0 0 0 0 0.06 0 0.03 0 0 0 0 0.0002 0 0 0 0 0 0 0 0 0 0 0 0 
0 0 0 
##$DATE= 1717675839
##$DBL= (0..7)
120 120 120 120 120 120 120 120 
##$DBP= (0..7)
150 150 150 150 150 150 150 150 
##$DBP07= 0
##$DBPNAM0= <>
##$DBPNAM1= <>
##$DBPNAM2= <>
##$DBPNAM3= <>
##$DBPNAM4= <>
##$DBPNAM5= <>
##$DBPNAM6= <>
##$DBPNAM7= <>
##$DBPOAL= (0..7)
0.5 0.5 0.5 0.5 0.5 0.5 0.5 0.5 
##$DBPOFFS= (0..7)
0 0 0 0 0 0 0 0 
##$DE= 6
##$DECBNUC= <off>
##$DECIM= 32
##$DECNUC= <off>
##$DECSTAT= 4
##$DIGMOD= 1
##$DIGTYP= 9
##$DL= (0..7)
0 120 120 120 120 120 120 120 
##$DP= (0..7)
150 150 150 150 150 150 150 150 
##$DP07= 0
##$DPNAME0= <>
##$DPNAME1= <>
##$DPNAME2= <>
##$DPNAME3= <>
##$DPNAME4= <>
##$DPNAME5= <>
##$DPNAME6= <>
##$DPNAME7= <>
##$DPOAL= (0..7)
0.5 0.5 0.5 0.5 0.5 0.5 0.5 0.5 
##$DPOFFS= (0..7)
0 0 0 0 0 0 0 0 
##$DQDMODE= 0
##$DR= 18
##$DS= 0
##$DSLIST= <SSSSSSSSSSSSSSS>
$$ [...]
##$SUBNAM2= <"">
##$SUBNAM3= <"">
##$SUBNAM4= <"">
##$SUBNAM5= <"">
##$SUBNAM6= <"">
##$SUBNAM7= <"">
##$SUBNAM8= <"">
##$SUBNAM9= <"">
##$SW= 18.0517689322627
##$SWIBOX= (0..15)
0 0 2 0 0 0 0 0 0 0 0 0 0 0 0 0 
##$SW_h= 3612.71676300578
##$TD= 16384
##$TD0= 1
##$TE= 0
##$TE2= 300
##$TE3= 300
##$TEG= 300
##$TL= (0..7)
0 120 120 120 120 120 120 120 
##$TP= (0..7)
150 150 150 150 150 150 150 150 
##$TP07= 0
##$TPNAME0= <>
##$TPNAME1= <>
##$TPNAME2= <>
##$TPNAME3= <>
##$TPNAME4= <>
##$TPNAME5= <>
##$TPNAME6= <>
##$TPNAME7= <>
##$TPOAL= (0..7)
0.5 0.5 0.5 0.5 0.5 0.5 0.5 0.5 
##$TPOFFS= (0..7)
0 0 0 0 0 0 0 0 
##$TUNHIN= 0
##$TUNHOUT= 0
##$TUNXOUT= 0
##$USERA1= <user>
##$USERA2= <user>
##$USERA3= <user>
##$USERA4= <user>
##$USERA5= <user>
##$V9= 5
##$VALIST= <valist>
##$VCLIST= <CCCCCCCCCCCCCCC>
##$VD= 0
##$VDLIST= <DDDDDDDDDDDDDDD>
##$VPLIST= <PPPPPPPPPPPPPPP>
##$VTLIST= <TTTTTTTTTTTTTTT>
##$WBST= 1024
##$WBSW= 4
##$XGAIN= (0..3)
0 0 0 0 
##$XL= 0
##$YL= 0
##$YMAX_a= 98778
##$YMIN_a= -81132
##$ZGOPTNS= <>
##$ZL1= 120
##$ZL2= 120
##$ZL3= 120
##$ZL4= 120
##$ABSF1= 10
##$ABSF2= 0
##$ABSG= 5
##$ABSL= 3
##$ALPHA= 0
##$AQORDER= 0
##$ASSFAC= 0
##$ASSFACI= 0
##$ASSFACX= 0
##$ASSWID= 0
##$AUNMP= <proc_1d>
##$AZFE= 0.1
##$AZFW= 0.1
##$BCFW= 1
##$BC_mod= 2
##$BYTORDP= 1
##$COROFFS= 0
##$CY= 11.3945322036743
##$DATMOD= 1
##$DC= 2
##$DFILT= <>
##$DTYPP= 0
##$F1P= 15.6554695791079
##$F2P= 12.8336369535428
##$FCOR= 0.5
##$FTSIZE= 0
##$FT_mod= 4
##$GAMMA= 1
##$GB= 0.15
##$INTBC= 1
##$INTSCL= 1
##$ISEN= 128
##$LB= 0.24
##$LEV0= 0
##$LPBIN= 0
##$MAXI= 10000
##$MC2= 0
##$MEAN= 0
##$ME_mod= 0
##$MI= 1.114404
##$NCOEF= 0
##$NC_proc= 0
##$NLEV= 6
##$NOISF1= 3.799351
##$NOISF2= 2.8
##$NSP= 1
##$NTH_PI= 0
##$NZP= 0
##$OFFSET= 15.70392
##$PC= 1
##$PHC0= -25319.38
##$PHC1= 13.98748
##$PH_mod= 1
##$PKNL= yes
##$PPARMOD= 0
##$PSCAL= 0
##$PSIGN= 0
##$REVERSE= no
##$SF= 200.130013532006
##$SI= 16384
##$SIGF1= 3
##$SIGF2= 2
##$SINO= 400
##$SIOLD= 16384
##$SREGLST= <1H.CDCl3>
##$SSB= 0
##$STSI= 0
##$STSR= 0
##$SW_p= 3612.71676300578
##$SYMM= 0
##$S_DEV= 0
##$TDeff= 0
##$TDoff= 0
##$TI= <>
##$TILT= no
##$TM1= 0
##$TM2= 0
##$TOPLEV= 0
##$USERP1= <user>
##$USERP2= <user>
##$USERP3= <user>
##$USERP4= <user>
##$USERP5= <user>
##$WDW= 1
##$XDIM= 8192
##$YMAX_p= 0
##$YMIN_p= 0
$$ End of Bruker specific parameters
$$ ---------------------------------
##NTUPLES= NMR FID
##VAR_NAME=  TIME,          FID/REAL,        FID/IMAG
##SYMBOL=    X,             R,               I
##VAR_TYPE=  INDEPENDENT,   DEPENDENT,       DEPENDENT
##VAR_FORM=  AFFN,          ASDF,            ASDF
##VAR_DIM=   8192,          8192,            8192
##UNITS=     SECONDS,       ARBITRARY UNITS, ARBITRARY UNITS
##FACTOR=    0.0002768,     1,               1
##FIRST=     0,             0,               0
##LAST=      2.2672688,     0,               0
##MIN=       0,             -81132,          0
##MAX=       2.2672688,     98778,           0
$$ Real data points
##PAGE= N=1
##DATA TABLE= (X++(R..R)), XYDATA
0 0 0 0 0 0 0 0 0 0 0 0 0 0 0 0 0 0 0 0 4 -8 8 -8 8 -8 10 -16 16 -16 23 -24 29 -32 37 -41 47 -53 60 -68 76 -85
40 -85 94 -106 117 -131 143 -159 176 -193 214 -235 259 -286 315 -348 384 -424 471 -519 580 -649
60 -649 729 -828 947 -1097 1294 -1565 1969 -2643 4131 -16794 -5279 -53852 9232 90723
74 90723 -42659 -29794 47592 -38953 -18875 56833 -43286 -56678 18752 6665 36189 50359
86 50359 -35523 -8801 41241 -24292 -16589 21166 -41111 -30053 39212 30739 20342 1805 -42567
99 -42567 -1888 29077 -27491 -28647 2706 -17033 7114 45205 14543 -11175 -14861 -14537 20229
112 20229 18198 -31352 -19730 15836 6495 12112 20426 -9743 -20448 -3777 8447 16843 -6197
125 -6197 -34543 -5829 24937 7681 -3103 -366 -9032 -1288 14287 12306 420 -18977 -21358
138 -21358 10205 22408 -3705 -12566 -508 4974 10308 9346 -4967 -16179 -16309 -2428 17703
151 17703 10639 -13425 -8789 12664 16308 6464 -5725 -14021 -10261 -296 9693 11197 -3935 -13984
165 -13984 2617 18243 7736 -10555 -16303 -8542 3206 7689 3896 -3045 -8834 -2632 13866
178 13866 14612 -4850 -15518 -6121 7352 10451 2010 -6283 -5724 452 8301 11450 -99 -13705
192 -13705 -9994 4711 9748 449 -10370 -9094 1366 8379 7462 399 -7871 -8128 2721 10660
206 10660 3499 -8410 -9181 1814 11002 8580 -1276 -7114 -5259 1901 7547 2981 -8106 -11133
220 -11133 -1414 9033 8069 -2713 -8514 -4202 3609 6663 2465 -5873 -8348 -1065 8421 8456 -249
235 -249 -7589 -4009 4595 7527 1798 -6114 -7875 -2068 5635 6724 -797 -7383 -5014 3392 7352
250 7352 2031 -5832 -7169 -825 5845 6130 -421 -6008 -3387 4169 7617 3036 -4830 -6687 -1151
265 -1151 4971 4529 -1409 -5927 -4054 2671 6064 2290 -4437 -6249 -1167 4684 4690 -1027 -5257 -3126
281 -3126 3492 6757 3147 -3201 -5191 -945 4342 3882 -1299 -5478 -3535 2436 5301 2113 -3338
296 -3338 -5150 -950 3392 3133 -1363 -4876 -2908 2606 5397 3028 -2494 -3935 -324 3798 3599 -1314
312 -1314 -4577 -2943 2241 4449 1995 -2487 -4120 -785 2843 2675 -1309 -4129 -3027 1506 4264
327 4264 2462 -1929 -3165 -261 3330 3059 -775 -3872 -3125 1282 3572 1836 -1886 -3471 -521 2956
343 2956 2713 -1041 -3804 -2673 902 2919 1732 -1548 -2358 101 2779 2499 -350 -3263 -2461 780
359 780 2497 1437 -1472 -2588 -65 2623 2487 -446 -3292 -2656 429 1928 1066 -1341 -2015 426
375 426 2685 2847 -63 -2396 -1833 537 1976 1210 -1412 -1868 117 1966 2118 176 -2202 -2049 46
392 46 1640 552 -1626 -2042 -462 1957 2127 6 -1649 -1598 11 1558 1029 -1134 -1426 113 2020
409 2020 2050 524 -964 -1367 165 1130 366 -1367 -1550 -623 1569 1769 45 -1581 -1242 120 986 459
427 459 -1140 -1329 -301 1235 1795 990 -617 -697 480 1379 690 -680 -1174 -75 878 1410 430 -1119
445 -1119 -1129 -22 1013 334 -1292 -1329 -152 1058 1029 324 -631 -869 -111 1022 341 -775 -1088 -284 1064
464 1064 1092 -98 -625 -230 397 446 474 -576 -999 -789 543 1105 7 -606 -186 683 651 397 -258 -725
484 -725 -856 129 736 222 -776 -551 635 959 74 -836 -973 -600 137 551 545 -82 -164 539 941 446 -659
505 -659 -500 8 291 96 241 -164 -751 104 306 834 -444 -991 -498 496 177 -389 -138 -105 484 265
525 265 549 104 -410 -135 463 442 -277 -447 -226 296 485 324 138 -233 -749 -346 20 -299 -833 -375 564
546 564 579 387 14 143 11 -229 309 45 -92 -100 244 677 399 -318 -369 -370 -37 -534 -206 -277 -286 -176 281
569 281 222 -99 -483 -249 58 104 176 20 -124 -92 357 184 407 -191 -59 13 327 33 -425 -372 8 -211
591 -211 119 -48 117 33 119 191 39 -142 -417 71 375 146 15 238 97 127 145 72 8 -335 -181 -17 277
614 277 -211 -45 179 331 89 -397 -117 -275 -54 -35 115 -76 -78 38 232 70 -76 -3 -186 -73 -160 66
636 66 129 -26 35 -90 213 -82 36 117 -88 -155 19 159 228 64 -12 15 165 -139 -193 68 -124 20 -53 96
660 96 168 -34 186 -234 95 -59 -214 -83 -126 -136 44 -55 193 181 32 -69 39 -85 71 12 99 -142 225
683 225 -118 -269 75 257 70 -227 -135 247 111 -93 80 39 122 118 125 -42 -263 -156 159 49 -68 52 55
706 55 109 -105 -150 47 -108 51 -97 87 10 -159 -201 1 78 -332 108 -170 -19 -144 -89 77 -128 -311 2
729 2 -61 -134 -33 315 126 -59 -24 86 61 -91 172 21 150 -349 150 -25 347 188 26 -205 192 -171
751 -171 -95 -35 -223 -3 -51 91 -9 74 92 111 91 -124 -29 -206 2 -265 -149 -133 259 30 -155 -70 -134 -76
775 -76 -112 7 282 -72 183 389 24 55 206 -56 52 -190 309 25 104 12 -89 -159 -138 -60 -93 47 -86
798 -86 50 212 -105 42 250 242 158 -119 7 -132 -141 36 -334 -209 -20 200 -110 -56 -141 -136 -30 183 94 24
822 24 347 157 23 -5 228 42 122 62 -126 -160 41 141 16 123 -181 -163 130 111 78 126 83 -128 -28 136
846 136 -49 -5 157 -59 -53 189 97 -191 103 -145 148 -62 22 -82 230 234 -44 -140 -318 -12 215 -89 -43
869 -43 132 318 -102 -155 145 199 65 -168 -20 -54 -115 7 -147 64 85 123 -168 164 51 -22 50 -156 126
892 126 71 159 83 238 -58 -130 139 -44 52 79 85 191 159 -20 -120 -48 0 -94 -365 -151 204 161 82 -20 76
917 76 91 78 -78 55 9 -145 -68 -19 81 5 173 -171 28 106 250 252 -37 227 -211 276 21 160 -311 35
941 35 -276 -242 18 -112 42 -13 20 15 68 -219 -10 -352 139 -138 -6 -149 137 -94 147 60 -232 207 -166
964 -166 19 -142 -229 -197 -34 -159 231 18 23 115 -165 -132 156 -57 -57 -283 -398 -137 -78 150 139 -132 -39 89
988 89 -241 -123 -171 -5 -146 -242 199 -52 -223 -103 110 -23 -171 -60 67 233 38 157 41 18 137 32
1010 32 117 -71 -113 304 -12 -271 377 107 -143 -186 160 -42 -199 -74 0 -28 -147 -202 -115 -23 40 -40 54 481
1034 481 115 -346 85 -30 10 -57 -12 57 -145 146 0 155 -137 18 -132 -1 -193 -472 118 165 -42 146
1056 146 -127 -66 -177 -286 -83 210 -64 175 127 179 -8 -128 -8 -284 46 -113 107 -122 35 -80 36
1077 36 52 3 -341 282 -100 74 31 -96 68 -136 37 -227 -136 -187 198 -3 -27 -278 151 -89 219 -109
1099 -109 122 269 -57 -102 143 10 -259 -189 129 68 96 236 -132 49 189 -170 160 -123 102 -112 43
1120 43 217 4 -256 203 27 -67 -117 -45 -51 -127 -191 184 185 -7 -267 -74 256 -400 69 -73 -37 31 -234 174
1144 174 154 195 332 -10 -298 -32 -291 55 -112 7 269 52 67 -433 164 -99 -26 -194 61 45 211 163
1166 163 337 -160 -115 -203 -52 24 -27 -172 -161 54 -51 -154 -1 131 114 -256 110 125 -141 6 86 -171 -310
1189 -310 -66 40 -196 63 -140 142 -123 -235 36 -110 -202 -242 -29 128 12 -7 -210 108 -200 -24 -31 16
1211 16 328 -231 -141 204 282 -153 -40 -98 80 -204 -132 180 163 -204 -154 16 26 -123 74 75 135 -103 117 -123
1235 -123 -19 -206 -8 261 199 103 10 152 -265 -341 175 -140 -299 16 192 -42 99 96 113 177 -115 -223 132
1258 132 269 86 -44 113 195 171 -243 -225 -62 157 90 -149 52 46 93 73 -22 209 94 43 84 10 15 7 -295
1283 -295 100 -46 -172 215 -215 -12 7 32 -17 79 160 -20 206 -28 -35 77 310 100 -148 -209 -18 -187 -139
1306 -139 -295 88 158 -58 -265 10 -181 98 12 -18 -138 122 177 -24 40 245 98 58 4 10 115 -140 247
1329 247 -12 64 -86 -75 112 25 130 35 -221 -108 -120 4 100 182 214 32 136 58 100 3 54 -37 143 -74
1353 -74 -154 91 245 21 301 -112 -168 17 -35 130 -57 -208 243 132 -183 60 -213 -37 78 -47 -267
1374 -267 -65 -177 -106 67 -4 101 -168 -66 -91 45 246 93 -35 -224 120 0 -139 -32 71 -55 109
1395 109 -146 -34 11 57 92 -105 150 137 -148 -89 110 21 -225 -18 15 57 -98 17 201 -94 -31 96 -220
1418 -220 -176 293 -207 -57 312 65 -14 -134 -30 13 -180 63 133 156 -117 164 75 140 29 178 79 -78 85
1441 85 64 77 35 -205 156 -54 -29 -143 -162 -109 -31 36 -110 146 131 123 176 -23 130 -59 91 55 -147 180 50
1466 50 -91 -60 61 -19 -125 165 88 236 -30 112 -73 147 313 -64 68 50 -76 42 55 -171 -177 -440 179
1489 179 57 -223 52 165 99 -92 165 65 -10 -90 -89 -25 167 -47 -187 6 112 60 282 102 -216 56
1511 56 160 5 263 28 -104 -414 -1 125 -14 -154 128 37 305 31 -48 33 137 230 -1 55 -205 84
1533 84 72 -198 145 231 -232 140 75 -26 -129 -57 9 112 -205 -118 47 -27 213 239 -202 336 119 -109 -309
1556 -309 75 -50 -136 182 234 178 -44 -235 227 84 107 17 208 -185 5 41 182 -125 -84 -4 168 -9 242
1579 242 40 -64 111 130 -204 -152 144 99 139 -110 30 221 132 25 -246 -1 76 -170 -58 129 -167 -37
1601 -37 -195 -130 -145 12 148 -187 191 58 -135 122 179 38 -159 126 -375 21 -225 -165 -120 124 -289 43
1623 43 -21 -144 -4 -7 -116 -275 -40 118 -123 147 -101 67 88 -464 297 17 -98 233 224 191 -31 98 -26
1646 -26 141 58 138 -111 -45 -55 0 95 -83 153 86 67 -120 -133 43 -137 -44 225 -2 318 114 -103 173 -27
1670 -27 -4 -48 277 154 -28 -3 -227 1 106 -53 -144 148 -141 -187 97 -34 -133 77 -12 -166 72 -286 7
1693 7 -51 71 -267 -163 109 -179 121 249 -21 21 425 -95 141 238 180 60 20 -218 -62 107 131 5 170
1716 170 60 -29 -31 -98 132 -179 -128 -243 13 65 -245 136 -4 -192 -227 54 202 259 202 -44 251 111 -86
1739 -86 86 -80 43 184 102 82 171 149 -155 -102 -38 84 46 -141 -36 -156 174 78 95 -207 -396 -35 -3 -41
1763 -41 -158 179 192 -237 -15 -49 -270 36 -229 66 5 -140 -116 125 -268 -205 71 138 166 10 65 -47 -179
1786 -179 -15 101 -226 189 88 -32 63 151 121 15 -35 -348 -43 -48 220 -269 -129 30 426 -19 154 -129
1808 -129 -135 118 -65 167 -90 72 28 140 70 70 236 151 120 166 -46 -118 -343 154 -25 120 274 -215 -20
1831 -20 59 237 251 205 -107 -145 -21 -272 76 -105 73 15 27 195 -66 -125 88 70 -109 130 -270 -162 -104
1854 -104 -29 69 -37 -149 -87 100 191 3 39 -24 54 -149 -7 -76 -58 39 -17 281 -22 48 -369 250 -174 94
1878 94 227 -189 -89 -121 -161 0 -24 -111 45 156 -29 164 46 -157 -276 63 77 -85 -24 295 79 83 80 232
1902 232 -34 95 50 16 39 -114 -59 -173 143 -4 11 -120 -56 65 -2 45 -75 151 104 172 -10 224 -92
1925 -92 -107 182 -118 108 -46 -66 92 99 273 97 70 -153 -215 321 42 86 -170 105 234 -64 -72 -154 -235 -171
1949 -171 -68 -340 -340 134 -57 -39 -114 -107 -227 -123 27 31 130 87 188 -120 -29 102 -63 126 -156 123 -50 -240
1973 -240 23 28 21 78 11 189 54 1 -72 -143 -204 139 -172 69 40 -66 45 -221 -60 32 -90 -50 39 -109 -187
1998 -187 97 61 64 -161 100 290 253 68 -224 79 -82 5 470 244 -89 4 27 -209 19 153 56 66 332
2021 332 -30 -62 -107 -203 147 339 136 236 -22 39 89 -124 -151 80 34 14 99 36 101 -103 133 52 112 -180
2045 -180 41 168 -108 52 -288 -215 36 152 367 -131 -129 -161 -77 43 -39 -69 0 -280 -41 -127 198 -172 -192
2068 -192 0 -207 126 -143 -173 47 -46 50 27 83 -46 -158 133 -241 -168 44 -156 27 16 42 -121 -332 -243
2091 -243 22 87 44 -26 -206 -112 31 -40 -59 -51 -239 94 291 85 136 -92 30 -100 18 397 31 121 -273
2114 -273 43 215 163 154 100 -95 -54 0 -260 -70 220 47 51 -43 171 -304 -23 192 -70 12 -169 -56 -199
2137 -199 228 -165 287 231 -37 154 -103 125 -213 -43 -10 -84 105 -65 179 -238 -145 -233 -93 -13 -112 -18 158
2160 158 -21 -117 -250 -70 75 203 182 -132 228 -167 -35 -76 64 44 -9 -163 -116 -110 76 -91 -48 197 -54
2183 -54 -50 -39 181 -78 8 -86 -137 13 -289 24 19 178 79 -45 16 -192 -186 -85 242 30 -76 199 -232 -103
2207 -103 126 -92 441 210 -90 101 116 -36 -7 -105 -75 185 57 -38 124 -104 55 -94 -109 179 130 8
2229 8 -111 103 -83 -160 -115 19 46 -365 180 18 91 38 -215 -300 39 129 -169 113 -88 -147 110 -446 96
2252 96 33 -56 -55 -17 133 -20 77 -319 94 -184 -11 125 377 -21 -20 -188 102 14 -188 -208 -237 59 -5 -149
2276 -149 217 219 139 263 -68 -176 -150 62 78 124 39 61 -156 -411 -128 -67 -18 14 288 -273 91 -149 54 80
2300 80 -393 139 -126 -145 237 -189 -38 141 -55 152 298 -286 -35 59 152 346 -203 392 27 49 180 149
2322 149 52 279 169 229 28 166 116 -248 48 -64 42 277 -26 -304 -14 102 5 23 213 -67 98 45
2344 45 -3 77 -59 -199 -88 -23 -34 24 66 -118 59 259 -128 138 81 32 -22 236 -147 172 -177 12 -75 286
2368 286 -522 -109 -90 253 254 76 -37 -167 -79 -166 34 -256 105 52 -193 242 103 -349 -105 -69 267 -36
2390 -36 33 180 20 -172 162 17 -46 85 -93 56 27 52 -171 66 35 107 221 201 172 -111 107 125 -24
2413 -24 74 -140 -80 -24 294 -59 -61 292 70 302 31 -116 -111 -228 -77 -161 184 -205 139 119 -124 86 146 -41
2437 -41 231 -2 -43 -180 311 179 4 -250 -202 -293 -119 -181 139 -109 -8 -154 122 297 149 133 22 -164
2459 -164 183 290 72 209 193 218 -112 -264 -12 194 -14 -104 -76 367 -90 -285 144 -86 89 115 -145 -134
2481 -134 -174 -117 148 200 -446 147 -237 176 -200 168 442 222 149 -92 97 -15 -172 68 -237 40 -80
2502 -80 -29 -125 180 281 -98 145 137 -211 -192 -12 43 116 -52 -115 174 112 -166 -117 198 -140 240 169 -278 -197
2526 -197 74 185 110 -87 2 -17 104 2 308 106 157 35 -16 58 33 197 21 95 -66 282 -32 -153 -55
2549 -55 -112 -144 140 93 -232 86 60 -42 184 39 145 105 -165 -180 161 114 20 -253 18 -54 24 -305 57 88
2573 88 -79 162 70 -125 -36 -360 120 9 68 -101 -47 -187 -93 71 -17 62 -165 101 -198 -185 -64 -56 205 -62
2597 -62 90 -108 38 -91 -469 69 -76 -13 43 -125 0 30 360 212 202 0 161 95 13 -91 -315 23
2619 23 -154 121 245 -170 80 -16 113 7 -126 -219 133 -77 -166 10 86 -71 -185 47 -70 87 135 253
2641 253 100 220 123 69 108 -45 -304 -99 -19 -106 95 251 7 57 6 247 387 -31 90 37 19 -154 -268
2664 -268 -33 -176 111 13 121 -20 -14 164 339 119 -263 -79 422 62 125 156 115 -56 -84 -110 53 -172 -249
2687 -249 -47 -136 20 -128 71 39 105 160 30 -134 -193 474 56 -30 -15 168 23 165 36 -28 -108 41 -57
2710 -57 -78 -117 60 153 22 -121 -262 152 24 177 -294 75 -112 -20 248 9 -25 -44 -141 -160 27 -46 -190
2733 -190 -80 -62 -147 74 -61 -87 13 13 -31 5 267 -85 -46 -80 -86 186 -61 -124 -23 -111 150 36 437 -252
2757 -252 -182 -229 -71 49 -164 125 -294 -44 363 9 25 251 -71 -171 -105 -84 16 -95 -271 74 60 -150
2779 -150 311 -103 47 -6 159 104 215 155 130 -70 27 72 -528 177 33 -195 22 -24 7 -182 -163 70 191
2802 191 -47 61 152 10 -79 -103 -120 217 55 177 -112 -144 -8 -123 -12 42 218 -169 54 91 71 -2 26
2825 26 151 -96 166 -179 -174 223 -81 -250 167 163 -110 29 191 58 -192 11 -99 -168 -130 -230 95 96 -113
2848 -113 45 267 407 -126 -168 239 257 -53 -12 -190 42 98 -100 34 50 96 115 -126 107 -217 70 195
2870 195 -56 -95 -186 -2 -48 8 -99 309 -106 365 5 146 81 112 36 9 -108 -155 12 0 163 -112 66
2893 66 15 77 390 -117 -226 -26 -261 165 244 -32 -127 -168 102 78 64 198 27 0 202 -140 -115 98 -174
2916 -174 -96 -64 -245 -192 22 54 -47 199 -179 50 -169 221 101 -216 313 -5 -126 182 -419 -30 -35 -254
2938 -254 58 -80 -102 -119 -57 -44 177 -257 -122 336 -127 -81 -57 -12 57 9 -170 114 129 -115 79 123 -173 11
2962 11 -113 9 -323 2 64 -113 409 -55 199 161 183 53 -68 100 -84 33 -261 190 -18 5 -43 -27
2984 -27 47 -59 -81 -33 -6 94 149 27 -33 -33 68 116 78 6 -12 -248 -8 57 67 -115 -76 -104 127 -319 -178 88
3010 88 -141 214 -223 98 230 -262 -111 123 -39 -231 240 136 -141 73 59 161 -55 -44 3 -46 115 187
3032 187 -82 -36 -96 63 -251 92 83 -2 -54 -159 148 -211 197 -12 -9 -166 -126 5 -168 -262 20 43 -12 -89
3056 -89 -159 -234 12 -80 -150 297 103 162 131 -66 129 174 -224 -180 49 -157 -26 -3 66 -221 -59 73 -150 -160
3080 -160 225 -88 157 205 -32 48 -4 17 42 163 191 -81 -118 246 228 24 -23 374 -99 -294 -30 -163 338
3103 338 -133 225 59 -148 -38 30 217 283 85 -186 121 140 132 -85 36 26 -18 72 139 -172 -118 -45 -235 -26
3127 -26 -115 -121 113 -296 -3 48 84 -83 97 -37 -80 176 -71 -181 -180 -52 -24 264 110 195 -98 148 -61 -100
3151 -100 -24 -71 -205 151 83 52 -136 38 -51 -54 -204 -174 -41 1 -84 -108 -29 64 136 -59 -111 -149 32 36 -223 98
3177 98 -7 -70 73 7 -70 146 -18 47 -153 -149 -5 -94 -110 156 -86 296 -83 251 141 -313 303 251 74
3200 74 102 74 29 -229 -31 -202 22 -59 199 40 225 419 217 151 120 -267 188 -87 -36 242 26 -108 158
3223 158 64 -183 -6 -190 117 -24 119 -91 -17 -378 -200 23 157 81 128 -18 -4 -180 50 -10 -12 -14 -282
3246 -282 -124 83 -66 121 -38 212 4 142 -265 -25 -9 -197 -34 56 -105 103 -150 165 73 54 -78
3267 -78 157 35 -255 119 -8 225 -36 96 124 106 192 -299 50 -109 94 -149 88 136 4 183 45 52
3289 52 -331 -10 -4 81 51 -26 170 -128 75 -252 -82 -58 -14 -241 136 -263 33 320 -133 -164 42 -9 -48 8
3313 8 50 -205 175 240 118 -41 279 106 -45 55 122 -14 25 -87 -87 13 155 -125 -209 28 -81 -55 65
3336 65 -44 -265 -139 -284 93 -33 -61 -206 -102 79 -136 112 129 -140 -12 30 -49 -11 -112 115 170 -90
3358 -90 -31 -105 -126 -92 -83 -10 140 25 197 -74 -64 -308 91 154 -114 -68 181 -8 52 42 6 153 8 285 72
3383 72 1 59 -38 -64 -243 -115 -134 181 -180 -271 -127 104 322 -34 -130 -21 -184 -140 -61 -163 -33 -40 26 136
3407 136 24 107 310 -4 146 -218 59 104 -177 -320 118 288 -230 -69 -10 -137 -19 -31 -15 20 -12 -18 -101
3430 -101 -46 81 175 -9 235 -71 -51 -111 103 -1 223 -38 42 99 261 -120 -120 -6 -96 -154 60 -94 416
3453 416 85 -26 -122 -242 92 -107 162 -131 234 -176 -176 -169 193 42 145 83 -8 -181 -130 78 -250 354 54
3476 54 150 -40 36 -36 12 -225 -88 270 -242 -38 -93 164 17 122 -41 150 119 -192 67 -198 -176 -38 40
3499 40 98 5 216 -156 -99 14 -173 -273 21 64 268 -44 -104 45 -180 353 -5 -223 121 -123 151 -126
3521 -126 76 111 122 196 60 -78 195 30 129 48 163 38 155 90 -31 -12 -104 195 -61 -225 158 101 135
3544 135 -4 32 -45 -32 -138 -132 258 150 35 255 59 -5 -31 -252 363 132 102 -73 -159 141 -79 47 -267
3567 -267 94 60 -312 129 24 49 -255 285 142 -126 -147 66 -72 78 56 99 -248 136 -6 -67 -53 33 162
3590 162 17 -34 15 327 196 32 -35 199 47 -109 40 -121 217 6 158 94 54 -30 32 -28 182 43 -255
3613 -255 67 -184 -197 -98 -132 -366 -137 102 56 140 -93 160 -346 129 -122 -11 337 -65 22 114 -146 105
3635 105 -183 -216 -236 -88 71 -143 -121 15 -73 128 63 166 -132 65 94 -14 -197 -97 9 -89 16 72 215
3658 215 -76 -16 -26 -217 -13 -8 -197 3 -191 89 -76 200 -151 137 -55 -187 -16 -124 198 -179 186
3679 186 220 -52 -33 -1 92 -185 -8 66 132 39 50 -151 153 -79 -320 -154 -221 1 -33 41 91 -137 33 -246
3703 -246 -101 31 -78 17 89 -32 -119 -152 -116 32 -191 19 -354 134 2 180 188 -133 115 9 -15 -26 -50
3726 -50 140 -76 -23 -76 158 -133 284 314 47 60 120 -59 -171 -84 -115 52 -10 35 15 -264 25 -100 294 283
3750 283 244 -36 -79 -45 -144 74 157 -40 -119 3 -56 -164 204 329 299 -134 42 92 230 170 -40 -224 22
3773 22 -97 -27 -97 56 -266 191 4 196 70 -157 277 169 103 -18 146 3 -105 -9 40 186 -69 57
3795 57 -85 -146 -65 32 -76 141 -210 -210 230 94 -43 -55 23 -29 -66 30 -148 110 -19 6 -45 143 -334 -129
3819 -129 26 -256 106 -200 -201 228 -114 -228 -154 110 -56 62 -105 194 49 33 73 -112 210 -284 128 -297
3841 -297 -77 -75 87 24 -162 260 -240 108 156 -111 55 61 -2 44 77 214 62 -45 -179 -287 -58 -6 10 -79
3865 -79 18 299 166 -96 30 244 65 -164 149 -138 35 -72 225 -286 -89 -76 5 141 80 312 -160 160
3887 160 111 -59 152 -388 -59 22 115 93 -138 77 -107 -270 196 265 -16 201 2 24 347 31 -113 -32
3909 -32 99 -60 -365 -103 114 17 -85 9 -5 232 -45 -60 -53 77 232 -36 202 105 61 100 -21 42 -95 -46
3933 -46 -80 -102 245 244 -113 29 37 46 71 39 68 -128 -69 -125 522 38 72 -100 -172 90 -1 -3 -35 -239 56 -10 152
3960 152 84 113 189 73 68 115 125 -126 63 47 28 -146 -92 -123 194 1 8 204 -5 419 -40 -116 270 8 -118
3985 -118 -165 -43 173 27 121 -16 69 -40 -96 152 201 -74 -24 52 -94 -152 -178 326 56 -54 -21 209 63
4008 63 -88 116 -74 -234 -310 184 140 19 7 -254 -23 50 -240 -205 -141 42 -117 -207 213 -176 -60 39 -40
4031 -40 15 311 -34 -345 174 15 -100 9 142 -116 -142 -158 234 -386 7 118 180 120 -178 264 41 -82
4053 -82 -148 5 49 117 25 140 -49 59 76 82 78 -64 159 96 -258 -19 -39 -167 -115 276 -170 -42 11 -142 6
4078 6 -87 212 -172 4 -109 -80 53 -281 -50 -59 67 174 133 -39 -25 12 302 80 -197 -6 85 -56 175
4101 175 -179 161 -180 -128 93 73 1 22 -92 222 20 155 -17 -214 97 1 -40 27 -181 158 -369 123
4123 123 -59 39 -56 -44 184 -94 130 44 -96 0 19 -86 -60 100 -153 -131 73 77 129 -10 309 -124 118 82
4147 82 -20 -146 54 -189 153 -203 61 64 77 -115 -297 -73 26 43 69 213 -91 -182 86 58 -342 -139 -167
4170 -167 95 130 -189 37 -13 -8 73 -87 -217 -52 -141 212 -143 -259 54 -220 94 -145 -16 360 -185 103
4192 103 54 -151 -108 -71 68 -96 104 190 242 122 -45 123 -89 -174 85 54 105 -250 90 51 -53 123 11
4215 11 -23 -29 -112 98 58 -11 -195 41 40 106 147 70 -162 162 -39 -15 -174 -22 8 -250 106 48 -203 -218 34
4240 34 34 -184 73 60 34 515 167 -55 173 -51 102 -69 63 137 168 197 4 30 35 -498 -178 -56 1 -19
4264 -19 -38 -51 -42 -87 -37 71 -116 138 382 -26 -40 -40 75 44 -173 -4 -178 6 -164 184 35 35 -73 -17 146
4289 146 -211 3 -90 202 24 -17 -120 68 142 119 -12 -119 115 32 28 -83 -151 -53 -216 229 4 5 128 -45
4313 -45 -41 -26 107 -73 91 24 -103 45 179 28 221 50 1 -9 36 21 24 286 73 143 -59 -48 149 538
4337 538 -133 0 -125 90 244 208 -49 157 99 -67 136 58 54 184 -256 116 44 -83 -264 226 -10 -15 -109
4360 -109 -239 -10 -130 66 -145 244 243 72 -63 127 -89 -90 195 -91 -40 -88 -36 -135 -83 234 270 -69 234
4383 234 -23 168 -79 -46 48 -221 243 -62 -302 54 92 -22 10 -171 163 -404 -241 324 314 123 -216 -168
4405 -168 -53 45 113 -164 220 -76 -102 69 -64 -195 -101 41 -30 -106 -224 -103 -70 -195 -7 147 -99 -235
4427 -235 128 180 -53 303 -50 -51 -82 -49 -64 91 -26 -139 -110 162 87 -99 99 -277 96 -135 89 190 -144
4450 -144 -58 149 151 -56 -395 102 -293 -290 70 -32 -198 161 -67 -183 -171 319 -6 -286 -306 182 -58 28 -158
4473 -158 -19 177 186 -5 51 -97 -45 -110 135 47 -54 -66 129 -78 -26 107 61 -53 -89 270 123 7 -230
4496 -230 -85 -187 -47 -65 65 -183 146 -18 164 58 170 -242 -6 199 -69 -102 -222 84 -126 133 291
4517 291 70 256 134 203 -126 -14 36 137 25 -171 -20 -105 -259 -196 -126 -79 -14 21 68 92 -96 75 -109
4540 -109 -53 124 258 -126 125 -134 -196 -40 -11 -106 167 25 18 -72 88 134 40 -51 82 116 -151 246 -233 -32
4564 -32 -149 134 253 0 -173 -74 -13 16 146 -69 -116 46 -10 -27 17 53 -39 -74 223 -143 257 -79 -37 -21
4588 -21 -208 -324 78 81 -33 232 -20 9 -29 53 52 167 21 -141 -238 136 79 -202 166 225 -89 13 -289 -90
4612 -90 -73 -256 63 119 -38 126 101 -108 63 -40 62 101 50 -143 -69 112 17 -177 95 -4 -5 -59 -158 81
4636 81 -165 -167 13 15 -14 -70 94 -91 138 -279 -115 90 188 -71 -126 245 8 50 -42 38 -94 9 176 -11
4660 -11 -14 -17 -86 -9 72 8 -17 -220 -38 88 170 -267 -291 1 295 120 -91 27 -137 -79 47 -374 -129 50
4684 50 -144 26 -220 1 -24 278 -4 -110 -132 266 -77 -99 -32 4 -36 -59 34 -184 208 -11 -143 -94 62
4707 62 245 -84 25 -321 -21 75 -175 -94 -160 188 88 -54 98 -43 -173 -207 95 50 -283 -1 167 -116
4729 -116 -56 -165 -231 0 -60 -33 92 74 -195 313 -26 -300 -74 101 -13 -131 -18 193 -209 -128 84 -241
4751 -241 389 -125 -121 207 67 167 -24 74 168 -87 77 -193 -276 -102 170 41 -128 84 -196 35 -1 -293
4773 -293 121 -129 -73 -188 -235 -47 -58 -13 -79 -49 111 60 143 -142 122 -119 0 -17 -127 -29 134 -315 18
4796 18 -63 -57 115 -81 185 66 36 -101 -31 -148 -79 17 96 -205 196 -87 40 -126 166 106 343 -97 -130 136
4820 136 -140 -4 33 -94 188 -169 128 333 153 88 -40 -16 -76 77 -4 125 -54 -74 95 111 -190 -196 -126
4843 -126 -128 -231 144 78 142 -45 -367 51 6 57 -178 214 -59 169 110 52 22 112 -119 241 181 60 182 -90
4867 -90 170 -56 -47 227 204 191 42 204 -9 -128 352 -122 -353 194 -2 176 -132 -57 103 41 5 -11 52
4890 52 3 79 -77 -11 -206 218 192 -217 -167 -119 299 -243 -21 -77 -177 -106 -188 -129 68 169 35 38 65 164 177
4915 177 -43 140 51 -1 271 -17 169 -123 -74 60 53 10 35 38 140 -308 -72 -204 -484 77 -80 -27 143
4938 143 86 155 177 409 -259 197 -216 -26 -70 14 96 -132 247 -37 -196 13 17 -85 223 -48 252 -124 -4
4961 -4 -24 142 -110 151 -178 85 -12 296 -124 93 52 1 10 -208 153 -29 -20 312 -216 -87 78 63 17 -123
4985 -123 -151 -98 -206 -12 -141 299 324 84 -60 435 82 -52 75 -72 -130 34 56 -107 -87 -55 94 44 53
5008 53 65 -123 -74 -93 323 103 52 161 105 -92 60 -11 188 54 -61 55 49 109 -137 252 -30 -132 2
5031 2 177 121 -52 171 197 -169 19 120 -123 321 197 -249 38 40 -146 145 -77 -322 40 -317 110 23
5053 23 47 99 83 -63 103 -125 -10 155 -53 232 104 -182 393 -104 -27 -29 114 48 -14 -62 55 135 266 26
5077 26 273 -41 -47 242 30 236 -178 -259 -11 -410 -14 -28 -279 149 63 150 101 -112 -31 -41 90 263 54
5100 54 -32 145 260 114 -66 11 -54 -92 23 -115 250 56 37 62 -115 -36 253 -122 -44 124 201 -92 -9 320
5124 320 -19 64 187 84 104 70 -27 102 -105 124 130 -33 -175 254 217 265 -152 44 -88 -41 -253 -67 -129
5147 -129 16 162 71 107 -29 81 -86 -126 -18 -237 -130 -174 22 -309 135 -78 22 -68 106 -124 90 175
5169 175 47 118 71 170 -151 248 261 1 -153 -142 -41 28 -47 -221 197 45 163 89 -109 10 95 80 -59
5192 -59 7 88 24 174 -279 45 49 -250 201 -57 16 -86 -264 -89 7 61 -56 152 -23 51 -84 268 171 47
5216 47 -8 104 101 282 185 -161 49 357 -336 -157 196 58 -29 146 113 -261 -160 36 118 -94 -47 120 42
5239 42 -17 -169 138 54 299 9 -95 -143 -11 3 67 16 -47 134 138 196 -77 24 93 189 103 247 91 -257 -97
5264 -97 -5 47 -32 106 -5 33 -333 -37 -135 128 -259 -314 -382 68 16 34 -65 348 -68 79 93 82 111 112 111 179
5290 179 245 14 -140 57 66 -121 -19 -47 110 -240 53 54 -7 133 -101 -41 14 102 -138 -67 0 -266 19 81
5314 81 -147 -345 270 -150 351 160 2 54 229 -14 112 75 57 224 158 74 -20 -102 -217 -37 -2 41 -237
5337 -237 95 57 -121 48 -170 -60 -96 -1 -223 31 -243 -91 -222 193 52 46 -5 158 -411 117 351 -178
5359 -178 -101 -73 282 -17 -170 -73 45 -106 76 -10 -55 -70 -119 145 -136 -77 56 302 133 -166 204 61 -67
5382 -67 -58 -104 -115 -129 -139 -14 156 42 137 104 -44 238 -237 138 -193 157 230 -238 -36 -19 143 116 -114 -107 104
5407 104 -45 -16 -76 -39 -132 -7 186 170 73 -58 -305 3 -39 -20 -148 -72 -39 3 58 55 -36 107 -3 8 63 -240
5433 -240 116 -47 -71 -18 26 85 -140 -158 -234 -191 -258 25 43 379 -86 -175 159 -5 -187 4 -65 100 -36 135
5457 135 501 -238 -134 0 -143 -150 36 -58 -75 -44 328 19 -184 -73 -175 -35 121 -91 -120 -31 108 111 -70
5480 -70 -128 151 90 100 212 5 236 -209 249 14 -71 250 -84 -32 238 -42 -79 -30 -94 30 303 97 59
5503 59 -126 -338 -40 -122 39 206 144 -225 -18 142 236 136 213 29 20 78 -136 -34 -17 -89 -241 -60 65
5526 65 232 184 90 2 -248 149 -169 -123 36 183 178 205 36 13 -35 -93 341 88 216 69 -177 133 56 80
5550 80 -46 30 85 294 -75 -141 224 -37 -183 -71 -20 -280 58 122 -349 -27 -171 33 -115 131 34 -206
5572 -206 52 7 191 191 48 90 32 -63 -99 -24 27 76 143 150 -115 70 -260 -140 -327 -101 -136 74 132 -96 96
5597 96 -93 -72 -135 104 -9 50 73 -147 -89 22 -104 78 -67 70 -11 67 -87 -166 -25 259 -41 -56 236
5620 236 -144 -111 51 -24 -214 302 136 46 149 19 -23 -260 373 25 -190 -188 -57 -29 63 243 191 217 -139
5643 -139 357 -173 -81 -70 38 3 127 203 47 -45 -128 172 -291 83 -49 -9 142 -4 157 228 57 -34 467
5666 467 47 288 -99 -162 104 -49 -145 -386 -38 -130 -74 -22 -43 107 -100 16 88 152 -209 55 -137 74 114
5689 114 146 111 11 46 -14 315 182 42 35 41 -190 1 12 -3 194 -24 60 -89 266 -41 -365 135 48 80
5713 80 -185 90 -176 -85 23 -157 158 174 21 -143 -185 -54 -109 -202 137 -198 -112 40 -134 235 -154 -53
5735 -53 87 122 -59 -352 200 -6 5 278 -101 -19 58 -80 88 -23 95 219 1 207 -21 -63 -158 -81 58
5758 58 -76 209 156 133 237 -61 -33 61 -163 -39 -155 -223 185 88 -167 192 178 -58 118 -138 8 84 103
5781 103 215 -253 -90 -272 179 43 -38 -147 204 92 38 -85 249 -39 128 -41 -97 -103 132 -137 -270 158
5803 158 61 165 -141 57 19 -85 155 -26 -435 -101 -24 17 -103 -47 155 45 12 -71 241 49 -242 -147 139
5826 139 -191 45 6 -83 98 -157 -28 267 91 64 258 -30 166 -169 -65 52 74 69 173 163 65 -189 108
5849 108 29 70 -36 -41 99 -49 124 -87 -154 94 88 -152 168 -131 278 -116 -364 91 115 45 186 34 -133
5872 -133 97 -216 63 181 -40 14 64 42 130 116 -122 214 13 214 -43 -80 107 48 123 92 -245 48 99
5895 99 124 -166 142 -120 -255 -121 -31 1 7 -72 -61 -285 37 -49 124 8 248 12 -56 144 -15 178 -94
5918 -94 88 -81 43 -31 188 -8 -33 -142 -249 154 -98 236 -10 21 18 -245 6 -199 -9 117 -214 -48
5940 -48 98 89 -10 259 -64 112 -52 -83 -12 -148 23 -66 155 -158 -186 120 31 75 -4 63 115 -144 101 123 103
5965 103 -147 124 23 -49 140 24 157 -265 71 1 -14 -125 -87 86 71 71 37 -100 112 -104 -305 -76 132
5988 132 228 34 60 -273 158 322 -22 94 -24 -127 359 59 131 -189 -7 -252 -103 87 -64 -258 212
6009 212 -64 -60 150 -32 -171 -197 -142 -97 -59 -4 -90 -143 44 -165 134 -185 50 -4 -134 84 113 237 3 103
6033 103 53 -95 51 101 -5 -93 14 101 154 104 18 -182 -92 -163 -8 73 -120 -249 -187 35 231 -37 249 34
6057 34 -5 198 -85 0 202 -14 34 -226 -14 176 87 94 -138 33 -248 105 -72 -140 153 -195 51 160 -99
6080 -99 496 280 94 93 -7 52 99 -98 -69 251 -84 -112 64 -76 -24 -41 259 5 -126 -31 68 -99 107 -123
6104 -123 -27 197 -42 -82 -118 -58 51 -54 -135 -107 156 -63 135 149 111 316 78 211 65 288 469 -18 84
6127 84 -39 -237 -6 220 140 118 145 -76 -161 36 43 28 59 14 -37 -304 -207 -19 -67 -16 64 149 116 -128 -85 -137
6153 -137 184 150 -13 88 -183 -182 34 38 383 123 45 -31 441 -235 345 -75 -84 -62 -5 -128 7 88 -48 46
6177 46 -23 -38 82 -152 -129 14 -41 119 -128 51 -36 7 -43 -9 246 -137 169 155 -39 57 162 -56 190 -195
6201 -195 143 142 65 -240 186 325 11 -124 146 -86 146 150 -47 156 -42 -111 -173 34 174 -265 -53 68
6223 68 13 -11 -92 -18 -133 134 -26 -80 76 -264 -21 -19 -137 -132 -131 -159 -14 -207 224 1 245 -290 177 -82
6247 -82 -289 231 273 174 22 317 -136 -137 255 74 -116 151 -250 115 126 176 -170 -281 204 50 -63 95
6269 95 216 -113 32 121 118 57 -217 -133 5 333 113 -121 136 -99 -47 -44 176 -178 40 32 -40 39 105 228 264
6294 264 -73 114 63 128 -291 -100 162 -82 73 -13 68 40 -214 -160 106 238 -270 -20 -123 6 -55 -261
6316 -261 201 227 12 -317 186 -145 24 49 -109 163 96 -92 -19 -81 89 -153 118 -118 199 -87 84 -60
6338 -60 -130 -41 -102 -128 -203 -45 -95 -49 -100 92 105 297 125 -122 157 -283 194 6 59 318 216 -172 83 -8
6362 -8 -198 -97 -126 -109 127 -67 337 31 94 -232 253 -220 -8 -317 68 32 -19 -150 62 247 -177 -139 72
6385 72 -102 -17 -86 221 -69 15 21 69 -111 -27 -35 -455 65 -225 -57 7 288 -353 -11 26 -57 -145 -67 -101 56
6410 56 151 -113 -205 -136 270 242 35 174 -256 1 -90 -166 152 -134 149 98 110 249 -108 -50 194 18 -146
6433 -146 -170 -168 -139 -169 -178 -64 -64 216 112 -219 -162 -148 37 -36 -101 122 24 158 30 -1 50 -60 104 280 292 -196
6459 -196 72 154 74 6 -72 135 -259 -62 100 87 18 -87 -79 -93 -233 72 157 319 253 80 57 75 -201 -50
6483 -50 20 -89 132 216 3 -81 -150 258 129 68 -384 51 285 192 -39 103 4 55 16 187 72 -29 22 -128
6507 -128 246 -48 66 49 -9 20 199 -87 -332 178 -133 -108 -103 104 -328 177 123 310 -41 -135 216 -201 -120
6530 -120 244 -353 -194 230 -84 86 259 -250 -124 -182 92 -200 17 -170 172 11 258 27 -41 60 -237
6551 -237 39 17 -81 16 119 41 7 -77 -104 -108 -137 -84 -29 35 202 349 -127 -9 -49 227 -18 -113 -185 104 164 65
6577 65 -343 -106 -99 124 181 -67 121 42 313 68 119 44 97 3 225 -318 -216 -11 81 -214 24 46 -134 87
6601 87 -101 284 -20 -106 90 -43 12 -200 -54 -86 137 13 84 -32 251 308 -195 -72 70 -5 30 -94 -6
6624 -6 -202 105 -64 247 -224 -2 -168 -188 -138 241 40 -184 -63 31 7 -187 -227 -143 -41 0 80 -14 24 -131
6648 -131 -246 22 139 -152 108 220 171 86 -113 -81 303 53 202 -12 -317 151 -27 -8 362 -4 129
6669 129 88 -195 84 162 153 -79 66 130 -135 3 -52 -82 7 -6 143 5 -36 124 213 -58 -223 173 -15 -163
6693 -163 -148 107 -114 -26 47 -152 -129 -25 176 43 180 -109 -13 19 -53 116 -129 -213 -59 133 161 -225 50
6716 50 -153 -103 70 24 57 96 5 69 129 73 58 -129 -95 71 -26 289 -260 -134 44 -52 -296 -67 -115 -153 -78
6741 -78 -212 -42 26 -11 -146 -86 35 219 42 45 -158 -10 106 48 17 -30 -81 148 -161 8 -66 -58 -66 -2 73 118
6767 118 -145 7 103 62 5 -58 134 15 -40 -65 -92 172 60 242 33 -96 89 -108 -127 123 329 163 70
6790 70 -193 22 136 74 179 5 -67 233 220 299 7 -40 485 -258 -183 -108 -168 -384 95 -140 -65 7 64 -137
6814 -137 76 79 -33 -26 322 -101 -26 191 26 -83 57 -26 -90 -191 -78 -331 -74 5 34 -36 25 210 70 155
6838 155 194 -296 188 31 -108 2 -111 -91 -95 -65 -172 106 -156 -11 159 150 42 -205 -187 -88 25 42 -189
6861 -189 75 171 -21 122 2 -61 -171 133 243 -73 79 56 -395 -17 115 83 260 -117 -131 87 -7 -178
6883 -178 33 99 70 261 26 -109 52 -23 -43 -82 -105 103 -288 27 78 23 13 -116 -115 -258 18 -137 102 -140
6907 -140 95 4 -177 56 48 -118 -121 -211 -3 175 89 113 362 -242 -214 187 -65 156 69 -179 170 30 -142
6930 -142 98 -130 -185 164 71 -9 241 -119 414 28 60 -62 -219 -89 287 87 56 34 -227 126 164 49
6952 49 30 48 -17 13 -105 41 -81 81 -36 37 187 120 116 290 136 52 42 14 127 -62 75 -87 -24 -79 -25
6977 -25 21 86 129 107 -496 143 -109 -177 -79 189 -123 32 -156 25 60 -184 -79 22 -152 226 -132 209 -25
7000 -25 -225 -61 -8 -231 -78 271 -115 -197 161 21 -20 1 -255 -36 -176 -252 50 -99 127 -75 -12 24 -298
7023 -298 -178 -105 81 -153 71 -119 137 -108 -182 133 161 -33 271 35 -10 108 -57 -101 28 -42 67 27
7045 27 126 -22 9 -148 129 -7 32 117 -168 113 7 292 -113 -24 -134 -52 28 -107 32 144 -69 -59 -76
7068 -76 -160 58 -2 122 74 -188 -106 -352 104 31 -37 -105 -95 -133 -153 -35 141 -105 59 -114 -244 -97 174 84
7092 84 40 -109 6 -97 -4 38 -46 256 58 -204 -14 42 -98 -79 -34 50 -216 -152 -38 -19 -185 148 150 -40
7116 -40 84 78 147 85 -42 120 -85 101 134 -197 -180 -408 -18 41 -28 44 -177 -190 11 89 75 -384 150 -83
7140 -83 -82 -97 101 90 5 87 -57 -129 -227 183 -183 91 -120 -130 -28 -26 105 123 14 -238 -225 81 -74 -393 -125
7165 -125 220 -20 -116 -74 155 -46 -98 -38 262 245 -160 -146 16 130 -117 -40 99 143 83 -428 205 206 241 -160
7189 -160 43 -194 -115 -146 -169 -88 37 -21 -32 57 112 23 -121 -116 155 203 -80 62 145 155 57 448 -131 -28 207
7214 207 161 64 43 15 -75 190 -222 -108 -149 -289 247 -45 16 75 106 -200 -53 160 115 86 -93 67 -224 -26
7238 -26 90 -177 -177 -357 -138 95 88 229 -179 -6 -32 -373 298 7 127 -49 145 -72 -117 -122 -53 165 -45
7261 -45 -24 -170 -32 -343 -60 -172 -110 314 1 -5 252 16 71 56 -217 -39 -133 -17 -107 139 -180 -359 -198
7284 -198 -119 -169 -117 21 -205 4 -108 -125 -235 -48 42 -141 -25 98 -113 111 -190 92 1 304 172 -35
7306 -35 247 130 -159 115 90 -111 -34 2 -96 -11 -141 56 35 129 137 90 -201 135 -67 40 -89 73 -144 -235
7330 -235 -287 -62 -292 399 -340 1 239 20 -12 39 -154 61 45 -79 -92 63 464 128 -9 -9 93 7 -5
7353 -5 -80 -112 -55 7 68 -110 133 -3 -142 -5 120 -170 -64 149 -60 -153 5 -25 -69 -377 14 281 19
7376 19 38 -35 -114 125 231 -252 -37 -24 -152 55 62 146 -151 181 -54 -21 -161 73 182 -16 -34 -86 -95 100
7400 100 0 253 94 4 14 -4 -118 149 199 278 -97 104 -68 -125 26 -173 -21 58 249 77 59 37 -64
7423 -64 155 229 88 -20 -162 -66 -27 31 -153 35 161 -77 -65 -93 -150 234 -196 94 -55 41 -50 -215 -205 19
7447 19 -31 52 -162 132 -29 -201 73 -120 -177 -16 -216 221 -91 -97 3 112 229 66 -135 -123 -165 -3 -234
7470 -234 26 -11 92 132 -189 -232 261 -44 187 -27 -39 -57 -28 6 134 167 -62 -40 50 253 19 -47 77 38
7494 38 -45 -172 -24 207 320 262 218 40 165 -8 5 -43 -204 27 -48 -31 -77 179 -170 -15 -29 225 -139
7517 -139 68 -15 35 117 -9 -290 319 36 -42 145 70 157 -327 369 -186 -84 -138 101 -16 182 171 92 115
7540 115 246 266 -205 32 13 22 -240 -71 -21 -107 -102 179 -126 -283 184 -48 -277 -69 -188 21 -326 -166 -115
7563 -115 -103 108 -83 23 -212 16 -123 19 78 125 -106 -244 -33 81 -26 290 -147 -174 92 -110 91
7584 91 -54 -89 156 -46 93 36 217 -109 -4 68 94 229 -2 -63 -34 -114 52 -133 -307 58 -276 -116 94
7607 94 -27 176 247 -309 -91 150 77 -4 -245 65 86 6 116 -46 90 -130 -92 -177 -73 -86 -90 -36 55 -181
7631 -181 173 -73 36 -76 -78 107 -78 20 18 193 122 21 -170 123 -175 294 -206 -153 -41 -55 -54 -146 135 149
7655 149 -229 11 189 100 -424 -22 24 -19 240 -77 -30 316 77 191 79 -234 109 118 -112 243 103 84
7677 84 -93 -133 -97 -7 -284 -183 -125 -133 -40 89 48 16 33 34 -54 264 129 -10 191 27 59 -292 32 -44 -37 327
7703 327 -123 32 -77 -35 -21 1 -239 80 -68 -237 -232 247 40 -71 -303 26 -32 228 184 205 -98 -3 64
7726 64 287 157 -130 -51 -198 29 204 69 211 26 264 -52 26 17 -166 284 -74 138 33 116 -22 -131
7748 -131 15 -99 89 -100 301 20 360 60 16 91 307 -33 383 -137 -109 35 26 -46 170 22 36 -7 -21
7771 -21 66 -148 -28 68 187 52 65 158 105 -91 -71 34 123 109 -2 34 -123 39 -98 -33 -136 -164 145 0
7795 0 -11 -89 -218 -4 -121 -129 -89 326 160 141 -14 -2 144 -144 -21 -66 169 21 -14 -172 299 43 -62 -19
7819 -19 -133 256 98 -153 -276 -73 -101 -125 180 -108 -140 208 210 124 128 -83 -137 166 -74 -61 148 -102 125 137
7843 137 -21 -161 -210 87 180 -313 -136 40 68 127 -16 -31 0 -80 176 -255 -143 71 -135 -343 9 56 -68
7866 -68 93 65 307 12 -106 35 238 29 101 -10 -191 19 73 12 131 -38 5 72 120 156 133 -157 49
7889 49 -151 -107 53 -142 52 -206 -32 193 -326 20 21 -167 118 117 -236 67 -83 31 31 -26 -91 -65 -3 242
7913 242 251 54 -73 -141 241 -113 0 75 -72 -4 51 92 -148 181 201 412 -47 86 103 16 60 -91 -232 84
7937 84 4 38 218 -104 40 31 -198 290 131 -445 -216 44 -107 165 -32 -119 14 -8 30 200 138 88 133 309
7961 309 -68 -160 124 206 -241 -40 -132 -198 192 -7 -67 -86 -353 -36 -62 0 195 -192 -131 23 194 217 83
7984 83 336 -92 -127 66 124 -31 -253 185 122 211 142 69 -4 -60 141 222 281 -147 -79 23 2 -197 30 -53 -57
8009 -57 207 -174 -45 238 154 80 251 29 -114 121 9 -8 -96 -38 -201 147 85 -198 72 -172 111 -92
8031 -92 -249 -203 -90 260 -9 -32 134 -141 -47 63 258 48 200 64 32 -49 144 -121 -247 -122 -57 185
8053 185 15 -112 -103 -151 49 104 122 201 -181 291 -253 -58 278 45 -224 35 -6 -61 -25 166 1 -71 46
8076 46 250 -65 135 -109 -99 -139 407 131 -62 -327 22 7 -22 174 -5 238 102 -40 -91 126 197 -127
8098 -127 -170 -21 -186 131 292 -435 71 28 266 -148 80 103 115 67 -81 91 -15 -75 18 -97 -141 -201 74
8121 74 -72 29 203 6 -89 -85 -40 -156 -225 -36 -164 -81 32 37 -194 68 -227 23 -116 175 -205 -178 -16
8144 -16 -256 42 243 -116 111 209 -72 77 70 99 -57 78 -31 112 -90 104 -119 -123 -50 8 -122 241 -95
8167 -95 -31 -186 -287 78 -202 -77 -126 133 -11 -39 -81 136 -38 108 152 -173 -105 193 68 -77 -120 73 21
8190 21 260
8191B60
$$ Imaginary data points
##PAGE= N=2
##DATA TABLE= (X++(I..I)), XYDATA
0 0 0 0 0 0 0 0 0 0 0 0 0 0 0 -8 8 -8 8 -8 16 -16 23 -24 31 -32 40 -48 56 -64 72 -81 95 -106 122 -138 155
35 155 -175 197 -220 246 -275 305 -339 376 -417 462 -510 563 -619 683 -754 827 -915 1008
53 1008 -1111 1228 -1358 1510 -1683 1882 -2117 2400 -2748 3184 -3756 4532 -5660 7445 -10711
68 -10711 18620 -81132 -34244 98778 -43208 1283 37071 -29132 25527 55577 -41693 -5838
80 -5838 -7436 -58190 38903 69112 -42954 -11599 31758 -10945 12075 16457 -39568 -10666 -405
93 -405 -18369 35696 20933 -60325 -17429 35237 7219 4681 -1577 -21569 11647 17741 -6755
106 -6755 6556 -12374 -39519 16170 47059 4113 -11699 -5084 -3740 12037 -1048 -23602 -11378
119 -11378 -9997 -7317 33398 31781 -15802 -19136 4219 9614 2835 -16714 -22042 2894 12817 11951
133 11951 22002 4464 -24190 -10061 12891 5915 -11300 -19978 -7296 16720 16024 3070 1007
146 1007 -7854 -12038 7881 16229 -3469 -18441 -10137 10338 19724 3835 -10822 -5259 408 3168
160 3168 9425 1521 -16166 -15750 2371 14866 7381 -10567 -11246 5584 12475 6264 -709 -9462
174 -9462 -12225 -340 13153 10249 -4788 -10920 1283 15354 9342 -6877 -12195 -8448 -1048 7107
188 7107 6552 -3812 -9944 -2630 10636 11707 -3531 -14417 -7433 4197 8149 5127 -2177 -6281
202 -6281 -986 8323 10884 761 -11387 -9492 3744 9846 2477 -6272 -7889 -1646 6746 8079
216 8079 242 -9187 -9164 1592 9888 3768 -6724 -8268 162 8402 8065 635 -6169 -5827 1705 7508
232 7508 4326 -5288 -8920 -1479 7056 7204 -359 -6847 -5881 1198 6110 3373 -4658 -8135 -2184 6479
248 6479 7700 516 -6139 -4398 3164 7044 3540 -3917 -7054 -2337 5409 6261 -334 -6206 -4554
263 -4554 2369 6110 2428 -4407 -6692 -2335 4444 5609 422 -5183 -3868 2567 6662 3404 -3281
278 -3281 -6108 -1832 3986 5269 -241 -4965 -3902 1700 5863 2651 -3449 -6078 -2465 3134 4265
293 4265 -80 -4693 -3600 2137 5707 3354 -2219 -4348 -1615 3363 4316 -156 -4193 -3025 1632
308 1632 5131 2526 -2619 -4777 -1972 2805 2912 -694 -4243 -2973 1524 4488 2870 -1889 -3820
323 -3820 -1446 2666 3149 -68 -3536 -3000 1467 4275 2723 -1761 -3699 -1138 2087 3044 -336 -3783
339 -3783 -3022 936 3644 2648 -1300 -2642 -673 2529 2361 -98 -3267 -2938 1033 3219 2399 -1029
355 -1029 -2257 -1268 2148 2319 -657 -3037 -3133 -21 2998 1711 -819 -2344 -324 2201 2297 -292 -2509
372 -2509 -2136 649 2513 2106 -588 -1872 -234 1887 1991 -259 -2769 -2629 -117 1544 1156 -676
388 -676 -1604 -735 1272 1990 41 -2160 -2294 169 2024 1430 -475 -1257 -105 1393 2150 192 -1480
405 -1480 -1997 182 1424 839 -779 -1658 -347 1486 1454 -3 -1734 -1930 -338 1075 1062 -836 -1319
422 -1319 -160 1594 1624 686 -1035 -904 -51 947 1027 -816 -1507 -636 1378 1603 187 -1201 -1360 -353
440 -353 667 237 -350 -991 -652 798 1763 395 -1251 -1303 375 999 155 -665 -1052 -218 1036 1701 842
459 842 -864 -1086 -4 1022 -43 -861 -1011 -325 555 649 673 -172 -395 -145 684 226 -686 -1338 -378 1068
479 1068 868 578 -281 -177 -46 515 412 -576 -1231 -829 1022 1066 150 -720 -36 299 253 249 164 -834 -469
500 -469 415 940 220 -638 -442 709 301 -281 -84 -574 -649 -259 632 523 -548 -369 594 960 441 -375
520 -375 -264 -382 253 207 433 149 -101 229 653 453 -553 -974 -408 158 -117 67 -143 -146 -428 297 533
541 533 -175 -796 -542 257 452 114 -287 -28 143 392 34 438 -284 -547 68 20 -218 -400 -283 159 29
562 29 -102 -165 1 -49 -132 -32 162 -245 -150 239 634 265 -178 16 -271 -111 -160 -404 -135 -302 -275 183 416
585 416 -130 -71 -29 -31 -247 -442 -286 80 58 267 452 187 17 -79 16 86 -129 166 -65 133 -153 -30 33
608 33 -88 -145 -275 188 156 -310 58 181 314 -23 74 -119 49 -115 34 54 16 -128 -124 -99 149 101 65 28
632 28 -110 378 57 -159 -7 -123 2 272 -12 95 326 273 92 70 37 -202 -28 -159 -48 -49 -2 27 98
655 98 278 -122 0 -8 -289 -192 126 122 200 132 -200 -49 -181 -76 -357 -327 37 95 -75 147 347 -101 72 67
679 67 -137 -177 -111 -144 -254 -267 154 -76 93 21 -124 73 -212 -33 -86 3 -119 103 105 -103 170 47 -109 -3
703 -3 162 -103 108 -45 -230 -59 -140 4 -137 -113 180 -267 -263 -51 -108 -44 30 -9 113 -69 531 269 85 177
727 177 155 -40 -128 -210 -139 -24 83 87 158 125 -48 82 9 148 -37 76 -276 118 113 2 -23 -94 -1 196 126
752 126 -65 -38 -71 68 -5 33 -72 247 -15 -111 21 -239 -182 -85 -141 42 129 -181 -98 276 -103 -8 -238 -58
776 -58 47 42 -136 -101 106 -11 -81 -121 -27 54 21 -122 -102 122 284 14 -169 -102 34 -90 -41 137 78 8 119
801 119 -97 46 238 -246 -4 -156 159 229 93 27 7 39 -165 69 -80 -17 72 -43 -222 39 -10 53 103
824 103 -37 148 -36 -98 -11 97 -60 -151 -90 -111 -154 -42 -122 -15 114 121 84 -47 -102 135 248 110 -72 -150
848 -150 -124 48 9 -100 -171 53 -126 -184 -44 -232 -69 200 -153 -77 159 64 243 31 -100 25 -35 -97 287
871 287 151 -282 -162 140 86 329 90 39 -320 169 -79 -39 -75 -169 -194 -44 -184 -130 -161 -248 99 -179 -64
894 -64 365 321 -32 -181 175 69 14 -33 13 28 144 114 -16 314 163 -289 234 -25 -145 117 -52 -199 92
917 92 -141 -88 -77 327 84 -73 72 -33 5 89 -46 67 124 -141 132 1 171 -64 -184 -204 142 32 75
940 75 129 -306 -1 -60 -267 -220 -116 -77 -206 -283 206 -85 -124 489 69 43 97 96 243 -119 140 107 84 -172 -121
965 -121 140 -104 -182 80 -24 -188 355 -269 -186 43 149 -151 22 228 -263 50 -52 -81 -41 215 74 448
987 448 -277 -12 154 -479 -24 43 54 85 119 -102 83 129 -145 23 151 -124 31 234 51 88 -140 -97 -68
1010 -68 155 43 135 42 -45 -24 137 -90 2 69 62 -180 -22 50 213 -91 -99 -198 22 -172 130 221 -97 51 -195
1035 -195 60 25 89 -73 124 39 189 -195 433 58 13 58 -67 -80 -73 60 112 172 -211 90 63 -112 170 -133
1059 -133 -268 136 -177 40 53 70 72 -298 74 -5 -206 -276 95 56 -54 -75 141 -222 -3 233 19 -119 -16
1082 -16 -459 -132 236 -79 67 121 -65 -296 -26 -10 -112 -48 -87 -132 -81 -87 -8 105 71 167 -72 161 43 -99
1106 -99 -95 155 44 -79 22 133 -56 -38 -96 188 12 -68 50 294 119 266 -141 38 125 74 340 -84 277
1129 277 -213 -31 240 -165 179 183 -185 141 -23 429 123 -296 187 16 234 84 -345 -113 198 -150 57
1150 57 13 -126 -162 75 -94 309 294 -138 193 21 89 279 250 179 115 -11 182 -67 119 -44 28 -84 -102
1173 -102 91 214 128 -265 -278 -113 -228 170 2 -20 52 224 -101 63 151 393 -246 -49 -96 -59 80 88 -197
1196 -197 -37 207 -90 66 -46 193 160 42 -263 -99 -224 105 59 83 146 72 28 -209 -141 -64 -270 -3 -5
1219 -5 24 326 357 -123 -113 47 113 187 -140 97 -31 -61 251 77 -158 -175 216 289 -127 -108 12 17 117 -68
1243 -68 124 -70 22 19 -168 -1 -139 40 -147 214 24 33 -17 -84 -118 52 129 92 74 -154 158 -19 -83 -32 207
1268 207 -6 -285 91 116 116 138 59 55 -4 13 -158 73 -100 201 263 42 -92 -19 -57 217 -32 -128 134 -20
1292 -20 142 -46 181 -34 -107 170 -266 -179 179 -232 46 153 -193 46 -97 222 55 -7 78 109 236 -142
1314 -142 -103 -217 22 121 162 -159 132 112 295 -107 -39 -319 61 139 -122 7 -217 -139 214 205 195 155 -203 -145
1338 -145 -28 109 285 60 -186 111 157 220 -146 39 190 31 228 78 17 65 3 -60 -19 31 258 -191 172
1361 172 -110 9 266 44 -144 -199 -116 -17 -164 132 -145 121 247 -45 -290 104 222 153 -5 384 -111
1382 -111 -151 263 -137 -174 -112 285 -204 104 40 56 157 -105 -186 -168 130 -269 -113 -285 266 -162 -20 -224
1404 -224 210 179 31 -23 -60 153 -40 140 98 139 -192 41 -61 -106 125 206 158 61 -135 132 -205 42 172
1427 172 62 -260 -43 -183 -126 -121 -87 -84 251 -34 30 317 136 -195 171 114 -35 63 30 88 27 44 87 77 22
1452 22 -183 75 0 16 100 232 -28 89 94 -129 -123 -3 3 -287 17 -50 139 -95 -13 -120 63 331 159 -195
1476 -195 -24 10 -58 88 187 159 -244 -234 -32 272 72 46 142 -16 -26 309 92 0 -126 7 279 -7 -1 86
1500 86 -204 76 -137 90 -93 -48 140 62 33 -49 257 -50 233 46 -103 168 -14 -168 87 76 10 -110
1522 -110 220 112 -87 -176 -260 1 -39 -159 306 45 -16 87 58 -109 70 251 -63 84 -2 236 -9 141
1544 141 -167 60 364 56 -61 -154 -56 -69 19 278 -41 105 217 16 -187 177 -133 174 -58 60 21 -64
1566 -64 76 50 0 172 -146 96 -135 -280 -134 78 -106 -37 26 -7 -43 -284 120 -20 -328 -406 219 41 41
1589 41 76 -50 155 11 -81 283 -18 -249 -126 76 -218 54 168 -145 -151 -276 236 329 -201 -428 -207 294
1611 294 -12 -39 -10 -220 -105 85 -56 -102 -93 -145 196 -181 -254 -41 218 53 -67 -105 31 -34 21 -7 113 36
1635 36 -2 -28 92 111 -6 217 134 3 -137 121 179 -114 -38 -68 228 -290 -117 55 79 -223 4 -64 93
1658 93 10 -113 255 224 -272 -37 -101 -60 43 -101 312 -31 -41 4 104 -174 29 164 -14 -98 -8 -64 -287
1681 -287 148 -211 21 124 171 178 -174 241 -101 -9 -299 54 -125 -80 265 -84 -250 159 124 -25 -3 -202
1703 -202 3 -141 28 -58 297 24 -492 276 -142 -206 271 -228 -71 241 -342 92 -234 124 57 -46 163
1724 163 -299 -35 35 -26 -183 -116 164 11 94 153 91 -55 -32 50 0 -180 -33 31 7 84 109 -85 -228 252
1748 252 52 -173 250 -24 224 -282 -135 213 21 49 126 -252 -57 72 -127 128 91 65 -215 -96 -212
1769 -212 82 142 -111 -151 -262 -5 -162 75 -313 45 58 0 12 87 -58 -186 46 -136 109 -53 -104 24
1791 24 43 225 122 -136 -36 35 -28 -56 46 -91 199 33 64 347 208 -196 29 42 137 37 59 30 127 154
1815 154 -194 154 -50 -281 -84 92 -61 -139 -61 -11 202 61 56 89 47 146 -118 211 278 -31 343 133 -27
1838 -27 -5 33 -259 108 22 199 -171 68 -386 -54 102 -36 -141 -147 -108 -134 -78 121 -24 44 152 129 100 -39
1862 -39 -93 26 107 204 -159 99 181 -68 -70 179 241 -152 253 -226 242 58 -106 252 101 213 -95 -148 31
1885 31 -128 -8 85 87 40 49 106 -200 -213 210 6 77 160 -10 -198 387 -26 67 -201 -109 -348 -129 -20 -314
1909 -314 3 -68 78 -119 220 2 -207 -91 -30 8 61 79 -121 -236 -5 220 -145 -100 73 -75 67 105
1931 105 -129 62 -14 232 -15 -19 -15 92 -186 69 -183 -58 206 -6 -140 77 231 -142 45 252 -19 -34
1953 -34 -112 136 100 -187 186 213 -13 91 -308 -65 -59 -180 21 -169 186 -324 77 -248 -34 113 102 88 242
1976 242 73 163 -97 79 41 165 -74 90 -172 -36 13 -265 111 -4 191 -170 82 240 -27 -73 -91 211
1998 211 57 -32 -73 32 -60 57 11 252 16 14 -164 93 124 -19 136 -66 217 -33 -178 60 185 26
2020 26 192 -126 37 78 96 150 -99 -301 -247 -244 292 378 -222 189 -12 -110 -195 -2 -98 196 254 -85 158 27
2044 27 257 240 200 96 64 246 55 148 125 92 -32 56 238 85 -73 -278 -149 0 -47 88 -94 1 46 -187
2068 -187 34 -99 -214 -105 -10 304 112 31 25 36 184 106 -37 24 -173 -103 75 158 -10 -98 -199 135 -55
2091 -55 -121 236 -119 52 126 -58 -186 38 -241 49 303 -86 -80 98 230 -98 19 -45 34 -98 251 214 148
2114 148 -96 -102 -72 208 0 146 98 183 -96 392 -34 16 208 -80 -127 -16 236 -17 39 120 -242 129 232
2137 232 -55 0 24 -1 178 78 128 -74 300 -278 61 -125 -167 45 104 23 73 109 172 237 254 -101 -295 -89
2161 -89 -274 254 -253 -95 30 -78 -60 123 -9 -124 -8 61 -30 13 -34 23 -175 -152 94 -12 109 253 80
2184 80 -3 81 -172 141 -13 -67 -103 101 27 9 108 50 8 -154 -192 -164 264 3 -217 -116 -209 -189 33 176 -4
2209 -4 -87 -163 155 125 -86 -132 -110 -5 -27 15 -3 -156 211 15 -17 -176 137 51 -176 -99 -73 112 206 113 78 99
2235 99 -114 -128 -107 191 27 -46 51 46 92 25 -154 123 30 111 -10 -119 -331 -171 -8 -48 -247 5 86 -135
2259 -135 156 98 -183 67 22 -336 81 -24 199 453 -260 115 -22 -109 -222 -163 85 -166 -36 -89 -39 42
2281 42 -81 36 91 181 342 -166 85 190 -73 63 -165 19 16 183 209 41 191 71 -21 -28 2 18 176 -219
2305 -219 -64 -72 -22 15 -99 -58 129 73 -222 52 127 -274 171 -206 27 201 54 502 -68 29 -115 227 -134
2328 -134 -2 -61 -110 63 325 -26 145 -113 -28 -177 -551 -64 35 86 -212 -166 19 -22 -24 115 -103 -25 -3 33
2352 33 -83 -109 132 147 5 -268 -112 110 3 -119 68 43 -190 -199 65 -107 -8 110 -116 93 -157 -208 82
2375 82 85 163 246 201 120 -2 99 -90 119 -66 -31 49 -17 32 -65 -4 230 211 -53 -71 -332 -210 81 0 -54 13
2401 13 1 65 -198 -42 -31 -126 -21 -213 22 87 29 -93 -68 -25 328 -279 1 176 254 316 -179 200 -11 -86
2425 -86 76 165 327 -13 263 15 -158 -117 -92 126 277 77 200 -285 7 37 75 43 82 77 147 61 46 -66
2449 -66 -241 250 -196 -2 -112 -9 -155 -18 -44 -216 81 -111 -160 76 284 -71 28 -118 195 -103 -4 133
2471 133 8 -233 55 49 68 127 138 -97 252 67 -23 263 293 -165 70 136 92 35 -17 -58 -39 -73 116 -169 -38
2496 -38 36 12 91 -18 204 -114 -195 67 -46 -27 -43 193 -59 183 318 37 14 -145 65 -69 23 -54 -522
2519 -522 -38 90 -42 147 135 -142 191 69 109 194 -34 -268 40 -225 337 -61 183 -67 -16 167 -67
2540 -67 -144 -7 -45 -20 29 -126 169 135 -139 -20 142 -3 87 87 -71 81 76 -140 69 -67 13 -40 -27 175 -16
2565 -16 -310 56 -194 -280 -14 -179 119 -71 -27 -131 -124 -120 132 -111 -69 202 347 -91 -80 144 -431 246 187
2588 187 251 54 29 -151 -52 -234 -39 -186 93 109 -81 135 281 94 188 -351 -61 339 -2 -23 35 158
2610 158 8 -355 160 -77 93 129 -127 -128 167 51 -161 136 -60 165 -93 -21 125 115 -147 278 -6 181
2632 181 -154 185 200 -136 93 -189 18 70 -122 76 -137 20 -14 -109 -32 -84 143 82 160 24 120 -66 -62 11
2656 11 277 19 43 -87 -155 -88 117 8 20 93 161 -84 -162 20 41 -19 248 -8 -189 -11 -12 -100 -55 19 65
2681 65 62 -60 -41 248 26 -183 187 172 -368 7 5 -119 71 149 -35 -62 150 77 -51 -40 -200 79 281 -107
2705 -107 155 -279 24 -190 18 -68 -4 231 -64 -142 11 -16 154 -187 -11 12 138 259 -60 104 66 -40
2727 -40 191 -185 -127 -10 28 -82 27 -155 -251 -20 72 -87 -24 17 -53 -284 380 -62 109 -267 23 -167 -37
2750 -37 71 93 -296 33 -25 269 58 -34 -111 68 -132 -67 -35 -128 94 -171 -16 -219 122 64 -101 -98 391 177
2774 177 90 85 -105 213 68 67 -256 66 -280 103 -190 -170 202 4 -27 141 21 -180 196 46 -63 32 -256
2797 -256 -93 131 -28 42 136 -139 -95 18 -274 367 323 -90 30 9 151 126 171 26 -179 109 -21 -7 227
2820 227 -57 -71 -79 -231 -45 -13 49 -20 -136 116 -178 8 115 -59 527 -15 -249 53 126 96 139 -28 48
2843 48 352 -99 214 -136 44 88 -33 -380 -271 36 83 -325 -39 5 -174 -116 10 38 -246 -58 -5 -127
2865 -127 -188 66 129 -147 185 35 -383 124 92 -75 139 242 134 -41 -158 35 89 -225 -154 8 181 194
2887 194 -33 10 147 225 42 4 -232 -232 81 -107 -161 -24 186 -159 154 -53 69 -245 27 -212 56 43
2909 43 86 155 95 241 -179 84 46 -51 16 131 -108 33 287 165 0 -118 62 108 -12 19 74 171 -55 102
2933 102 -264 103 -177 10 -29 -88 112 -116 -212 -61 168 -203 118 80 -54 151 -140 -177 113 108 243 -85
2955 -85 157 9 43 -198 117 -178 -124 -65 -4 -100 -96 48 118 142 -155 112 -114 -98 265 -86 -35 -108 -24 -131 90
2980 90 -25 162 166 266 -302 -32 126 -110 88 74 159 -368 -92 77 152 31 -114 -197 101 -99 10 -100
3002 -100 212 66 -170 -193 66 20 -60 -92 -148 -49 -113 -36 -34 84 83 -7 96 34 140 151 85 -7 -70 2 155 88 146
3029 146 -27 139 160 149 283 -41 148 279 43 93 -219 -192 -147 148 160 7 -16 -149 61 -197 -108 -27 93
3052 93 11 -33 270 47 146 -216 -202 -1 -109 -120 269 108 69 225 110 52 112 -42 52 -32 227 125 -302 -4
3076 -4 -55 0 -209 87 -155 -226 346 98 -32 28 98 4 161 -153 161 -206 -287 -61 46 137 -123 39 197
3099 197 -30 -17 -43 -39 49 -7 179 199 84 34 162 -63 -44 341 26 -12 -20 175 241 -57 3 209 -83 317 12
3124 12 -247 253 132 57 173 92 211 407 -65 140 18 -64 -92 289 69 72 -186 28 51 -120 78 -47 200
3147 200 -146 90 73 -35 -29 -152 57 138 -259 27 75 -19 49 -225 -180 -171 42 36 -208 149 6 -61 20 144 -120
3172 -120 -95 223 -220 -128 -8 254 161 16 -36 61 200 -6 364 109 57 12 -135 208 -47 39 2 -178 243
3195 243 259 84 -156 259 -114 62 38 75 -208 85 30 30 -37 175 -14 -43 -233 -150 -27 -79 -96 -325 -153 -221
3219 -221 76 -56 -32 83 -134 1 42 -71 -16 196 57 -32 -87 46 185 -253 -129 -56 66 -259 59 143
3241 143 -112 -114 -197 -239 -40 -137 201 -9 -169 -36 66 176 320 227 -210 -105 131 37 -58 -47 5 -165 -197 -244
3265 -244 -2 -151 12 -158 59 -37 111 186 116 68 -51 -134 12 54 -130 36 -225 158 151 39 -437 7 27
3288 27 73 -197 -370 -197 86 -116 -96 15 45 67 46 -97 244 -5 -59 34 -188 -145 21 92 66 25 391 16
3312 16 -75 32 -42 -151 10 -45 128 312 303 86 90 -116 12 81 -56 -69 4 95 126 -104 -195 -55 54 -51 42
3337 42 -193 -140 172 183 -116 86 -29 46 -68 -79 33 25 109 -136 396 -214 -118 -50 199 -201 -12 4 242 111
3361 111 39 298 -266 39 13 355 96 -103 -195 39 120 71 -6 -203 -67 -2 230 -82 -113 -94 -156 26 -292
3384 -292 -66 -35 -3 152 -26 10 157 432 -7 -220 139 230 -275 129 -48 212 165 -56 247 -114 12 107
3406 107 -108 -164 -140 -142 -45 -29 21 117 -131 61 150 409 101 28 -145 154 48 -113 111 131 -174 -114 -83 -69 67
3431 67 -55 30 -132 1 28 100 -91 -421 164 -81 14 19 -50 188 -91 91 -112 -148 325 45 108 130 173 22
3455 22 14 -12 -8 230 -162 48 -136 -344 46 240 199 301 86 -121 74 -60 -106 -98 -399 114 43 -85 -220 -4
3479 -4 -109 -11 -122 55 -81 -26 335 58 -143 -197 -128 -65 -38 109 98 -104 75 -6 375 16 68 -184 -100 155
3503 155 19 -125 91 213 -110 94 319 -98 70 62 24 118 -43 240 -143 38 -182 -77 -114 -37 7 -109
3525 -109 -120 89 -234 -158 -334 77 203 43 216 124 122 -207 -200 38 -96 -4 -55 -184 13 -41 102 -24 -50 58
3549 58 -176 -130 -137 165 -151 -29 -46 78 -59 178 85 -169 -114 -17 164 -29 -61 -442 65 110 70 245 -274 -67
3573 -67 74 -128 56 -46 88 37 -12 48 -381 -262 135 -86 -14 -146 44 -262 -28 272 -44 -28 -178 -27
3595 -27 -67 176 -467 -225 194 -80 14 -28 92 148 -54 -83 -67 71 156 -141 46 39 165 239 -175 -58 28 55
3619 55 -82 4 109 126 181 62 12 -155 -16 189 -39 -194 319 73 -51 191 -200 101 -164 -256 -99 -120
3641 -120 -226 226 42 41 50 -198 136 -218 -30 -124 158 28 221 -162 23 76 -132 71 199 108 -133 -38 -110
3664 -110 117 46 -204 44 62 13 -53 240 85 162 23 -35 -119 181 173 6 254 -113 -2 -3 2 -132 -201 -55 160
3689 160 -32 16 -71 146 -131 94 -6 79 227 -303 130 183 128 -35 328 318 -156 -83 -87 -26 37 -46 -57 -28 -60
3714 -60 45 111 -122 -170 -386 -108 -171 -102 -79 -25 96 80 27 -276 -4 149 -122 -4 165 16 212 -266 180
3737 180 -30 328 14 72 -38 98 132 -77 -79 -116 -14 -238 -90 55 27 212 53 35 79 339 171 -76 -24
3760 -24 220 67 -168 97 12 -127 31 -201 169 25 -194 -18 56 126 -29 139 240 -203 27 137 44 -30
3782 -30 128 -208 37 191 -183 44 -71 63 -267 84 65 -368 167 -182 206 248 12 -235 28 277 93
3803 93 -130 -106 149 -302 45 -162 -228 -178 139 67 -15 8 -74 -112 1 195 -128 209 95 134 47 133 160 98 -278
3828 -278 28 47 -241 -457 -17 68 11 -100 17 -183 231 -148 -70 207 201 20 121 -46 -32 -19 -94 88 -60
3851 -60 161 -51 34 -134 -45 203 101 10 -81 22 -144 46 -8 115 128 13 -123 -40 169 -87 -20 -88 -214
3874 -214 85 251 -36 -26 347 -279 104 -108 165 49 230 359 -11 32 -43 -109 152 237 -90 -59 -142 -90 47
3897 47 -140 69 -31 -47 92 32 -219 -94 121 10 -92 -203 -233 95 134 -209 -9 -301 -29 3 130 -39
3919 -39 -135 -61 231 46 -64 -63 -66 -9 93 -178 71 63 61 195 -84 -48 -144 1 -79 -55 -69 71 -7 47 -248 139
3945 139 -94 115 149 125 -61 -134 -81 163 -115 2 76 -314 -64 -15 164 22 -40 -264 -35 -69 -211 -97 -192
3968 -192 33 -246 175 340 3 123 248 147 -19 122 313 189 -60 9 221 -44 -224 -45 22 107 -159
3989 -159 -251 2 229 240 260 59 -259 -71 145 -111 -56 110 348 349 -55 -110 -56 119 -207 143 154 110 35 -91
4013 -91 -16 -29 55 -337 -37 71 -75 -126 -56 -113 -65 143 -34 248 -147 66 90 -288 192 -57 -71 -36 116 -24
4037 -24 27 -162 24 101 -173 -116 109 276 -47 -28 -50 -125 119 -35 259 145 61 214 -82 -47 65 210 31
4060 31 -203 30 -74 192 -41 -106 64 -39 201 38 -272 16 26 26 -1 -64 -8 236 248 -307 -5 -170 -270
4083 -270 146 -27 -120 239 -11 86 228 -116 52 -229 13 85 142 -60 140 -168 -157 -47 -172 -38 153 248
4105 248 87 58 -59 -144 11 -277 -14 78 1 179 -171 -1 -3 7 -106 -26 -80 68 70 -39 -269 108 3 -89
4129 -89 137 138 53 51 -21 -108 77 -277 -118 -113 -4 327 133 -228 -103 -186 -16 -31 -32 196 97 -137 37 -166 1
4154 1 -101 16 -81 -5 17 45 148 94 -27 -246 -80 -133 7 219 -114 273 255 18 -118 140 78 -11 -19 -40 64
4179 64 15 -77 165 418 22 66 -48 39 323 168 14 68 82 21 301 262 185 32 -37 -116 134 37 -105 -16 -89
4204 -89 -128 -53 -112 13 -92 133 -38 11 148 -47 76 -6 27 9 64 7 243 171 -146 -4 -7 -65 50 -197 -7
4229 -7 -18 -40 110 211 -12 -90 -187 284 -77 -257 -176 -30 -10 -152 -92 -23 -51 140 82 104 32 -60 -144 124 132 -113
4255 -113 276 -205 -148 133 292 35 -22 -72 -88 18 43 303 -75 416 24 89 -181 2 -225 -68 -95 -80 4
4278 4 111 20 -39 -281 -39 -28 128 59 82 168 147 -38 -266 16 -228 -113 -216 -235 113 -78 -60 -11 330 257
4302 257 -141 -175 22 -91 -200 -46 -129 105 96 59 146 -110 72 -131 154 199 34 117 -144 -12 -221 59 -27
4325 -27 -254 99 -52 113 -11 -26 -107 -128 175 -138 98 -32 -175 -282 158 -60 54 -61 -266 -27 -15 258
4347 258 104 -91 -136 -21 -2 -362 -57 -114 -37 55 202 -161 -132 121 -91 152 -86 67 85 -190 200 -312
4369 -312 -61 -6 328 -168 -3 96 188 107 102 -48 -142 -58 -1 190 -8 5 -46 -155 -24 -68 188 -83 -22 47 -220
4394 -220 -5 -172 54 79 92 -33 79 31 40 94 133 24 -158 21 -25 19 -298 37 -32 -5 104 4 122 33
4418 33 -314 13 24 -194 -20 -32 -50 -128 96 101 -63 65 -86 96 1 140 -177 -267 52 -49 -150 -142 -63 91
4442 91 40 133 -4 -310 162 -160 -143 -27 66 14 128 -64 272 361 131 40 -67 -113 234 14 83 -91 49
4465 49 90 167 96 55 -130 -58 -257 -272 -48 -304 -221 106 -69 138 137 -98 0 32 198 138 -69 -30 -294 -215 -138
4490 -138 -49 -271 163 38 26 237 -55 -53 -275 265 -37 34 19 63 -151 -190 153 56 13 -35 -5 -16 9 66 98
4515 98 16 -35 14 -163 136 -112 60 55 117 133 45 29 166 -149 -27 125 68 -21 138 200 94 -109 266 -133
4539 -133 19 -197 -77 -88 75 -144 -15 -148 131 -140 54 -134 -124 -46 -8 116 154 138 -85 130 -181 -113
4561 -113 296 -160 -29 185 -60 -134 180 -12 83 47 -196 -215 -219 -25 -210 -62 -83 188 90 9 -221 85 -113
4584 -113 -96 -104 321 142 -140 139 -155 263 223 -174 -21 146 -80 -311 -157 -32 104 -156 -122 28 72 147
4606 147 95 2 -307 128 -172 296 -80 -135 18 -33 -40 358 113 -125 117 149 301 -33 -126 186 127 -7 187
4629 187 2 184 101 156 -44 85 -73 -159 104 119 144 -282 111 61 127 30 -3 2 163 -199 59 -246 15 110
4653 110 21 232 258 108 -151 24 -79 -116 -5 -7 37 104 -68 -332 45 337 -25 70 -37 186 19 -13 -135
4676 -135 157 38 -2 -9 -21 125 199 -148 -273 24 -62 -259 250 -1 -232 -57 67 220 -123 211 286 95
4698 95 -27 -7 -70 -41 -230 -122 130 -196 -168 84 226 155 -3 233 122 -45 -74 115 271 -116 204 -70
4720 -70 -121 -228 247 -49 -100 55 -91 95 263 -104 -66 -21 133 262 75 27 53 119 209 249 -165 -98 50 -111
4744 -111 -70 -189 -160 120 90 81 217 386 -123 99 -11 87 43 -127 12 7 177 108 -20 158 -152 -11 66 165
4768 165 84 -78 44 36 -243 -166 -157 246 -227 128 -136 7 94 104 258 -150 -28 -53 -257 67 36 101 8 -57
4792 -57 -252 -116 -109 -108 -141 107 61 139 357 35 -177 -53 -117 -24 -46 48 94 97 -59 269 115 -24 212 54 -3
4817 -3 -211 33 -241 -368 281 -33 170 154 -190 204 120 -69 -146 -116 -131 -7 100 -138 -157 287 67 56 62 74
4841 74 326 -75 50 63 -8 296 -176 -330 42 64 243 -295 81 13 157 215 -274 308 -371 -47 -238 -26
4863 -26 -247 -15 70 21 -28 6 -66 -151 113 -345 43 -237 173 269 397 -149 -218 -41 -60 343 378 -50 -98 280
4887 280 -246 112 141 1 -69 -52 159 -171 -47 106 102 9 -41 -56 161 32 171 46 -118 281 -101 -57 -3
4910 -3 21 136 -154 26 -2 -60 171 117 -128 98 118 25 125 276 7 17 50 192 267 -23 50 -157 81 -216
4934 -216 91 118 225 244 287 156 -293 -213 -27 42 -90 -80 294 -30 -291 -96 258 369 -198 -44 -143 -106 325
4957 325 -213 71 -224 214 -42 -134 15 -4 -84 225 136 -261 472 56 217 41 57 162 -172 -186 -169 84
4979 84 -144 -75 -273 136 -138 77 211 321 -23 -8 61 21 71 -41 -43 -219 47 -158 140 43 -125 58 -32
5002 -32 -25 -46 -103 -67 -38 191 -151 88 8 12 -186 224 163 90 69 138 107 -45 -180 26 -51 -69 179 -72 170 -82
5028 -82 220 -99 -49 -29 0 -133 39 266 40 -192 288 -75 113 40 -29 14 23 -66 -119 -86 91 -86 -90 -67 75
5053 75 -286 -17 -10 -67 -182 43 -12 -17 -55 -236 267 -194 229 -72 -112 245 91 -211 25 360 -113 -101 -152 -48
5077 -48 114 -79 -20 -66 102 47 25 38 -87 79 94 175 -68 64 -32 207 19 -109 244 -126 -137 -183 -51 27
5101 27 -11 9 -20 -75 183 107 71 -179 222 52 -20 4 131 228 -21 -190 -78 -40 -94 392 6 95 -145 -10
5125 -10 -78 69 -206 -77 -112 2 178 354 16 -17 -128 289 -18 96 42 4 47 -107 -62 -106 -6 -172 57
5148 57 -119 194 189 -286 5 40 21 -157 -139 -113 302 133 -91 -100 67 90 -38 174 -158 207 170 -59 -105 117
5172 117 -247 363 -81 -259 -115 -27 -5 87 -90 137 184 116 72 -91 -10 184 -9 -92 326 243 182 68 142 78
5196 78 17 252 -97 86 -136 -36 -52 -73 35 34 82 63 92 86 -92 64 145 140 -299 -138 11 24 -306 -70 -323
5221 -323 72 170 180 83 -34 -249 -68 -220 41 66 -98 -189 -357 -172 -174 -86 78 364 -103 -52 -84 22 -124
5244 -124 -6 58 107 -297 92 69 153 10 57 -102 -206 -229 -14 -35 -94 103 88 90 189 104 -57 -178 -113 -244 194
5269 194 422 72 -111 -12 172 150 -218 85 189 137 -102 -127 112 49 -18 -94 -142 -177 -101 -302 -86 14 -126
5292 -126 -28 -292 68 114 43 31 36 -1 -268 -3 -74 -17 281 -94 102 70 25 142 -138 -9 9 76 58 38 167
5317 167 35 -104 -136 116 -19 124 9 168 374 219 -194 -170 97 -43 32 -143 18 86 -16 -231 9
5338 9 143 24 95 -98 -58 -54 308 -16 0 158 1 -54 -58 61 52 69 141 -341 157 -48 212 99 55 7 284
5363 284 -99 -42 -307 -122 20 -320 233 186 232 6 -22 -199 -154 218 338 28 -129 163 -135 -138 158 87 31
5386 31 66 -125 -215 -159 21 140 -10 -39 13 32 -70 46 -195 -2 -197 -146 155 -92 -31 64 -191 133 -38
5409 -38 -35 16 234 124 21 -281 -103 146 168 -18 58 36 -234 -121 40 -148 -108 98 -55 -122 -85 295 -128
5432 -128 -123 411 3 65 45 3 -17 135 -37 -10 -80 154 100 58 61 -246 9 152 45 -141 95 -159 -114 -227
5456 -227 164 121 -138 11 -86 -75 4 -172 -163 -30 48 -235 -251 -75 148 40 -108 -150 -167 -133 35 -19 61 129 383
5481 383 -144 90 194 38 71 -73 -166 210 -17 91 20 52 49 -41 -187 -60 -235 -149 174 1 49 -130 178
5504 178 -180 -211 -36 320 -77 -55 -59 -9 73 261 218 -184 -176 -9 12 -118 -63 54 191 161 -8 171 170 142 -55
5529 -55 145 -74 -127 147 121 173 -98 -116 63 -33 -28 165 96 153 108 43 115 62 -181 14 -101 87 38 -103 -59
5554 -59 315 113 107 -188 47 28 177 -146 237 115 309 138 -205 111 -179 -154 -209 134 17 -1 166 -68
5576 -68 360 -90 -11 37 144 51 -80 215 -9 312 163 298 26 -179 -244 -22 2 -85 -69 -178 170 92 173
5599 173 100 105 -76 42 -110 200 -224 45 -38 43 54 -20 62 -140 5 101 69 204 67 8 153 24 74 -172
5623 -172 335 136 -107 -248 -22 -1 -42 -406 168 -83 -40 281 -104 56 261 5 -243 -195 -136 -245 -17 46
5645 46 67 -40 -30 -16 -164 91 46 269 -51 -150 120 -322 14 -62 -89 -131 250 -231 67 -298 101 28 -377
5668 -377 -61 84 78 147 -204 -21 242 217 -309 111 145 -62 49 -7 178 -158 -6 50 -178 -141 202 -16 -25
5691 -25 20 272 -269 262 100 -30 13 -204 -128 -41 112 -28 101 -58 -101 75 -94 44 -77 -54 67 -17 -157
5714 -157 53 -102 269 -87 -290 -151 20 -179 -39 -72 93 -206 -15 168 326 -89 47 149 96 183 -46
5735 -46 -237 -288 -72 113 -55 -125 14 93 114 26 -30 -142 86 -220 -167 77 -96 9 94 -148 199 151 356
5758 356 -156 -179 116 49 -217 -110 -435 11 20 -127 160 -251 151 -59 -102 144 -204 100 -103 -61 -185 92
5780 92 -11 -112 -11 72 31 -168 150 347 45 57 -307 194 -4 -19 -30 40 28 19 259 -62 62 -74 -66 0
5804 0 19 197 41 208 -219 77 4 -220 111 -135 85 58 133 -121 221 19 -76 -477 -154 95 -14 -77 -161
5827 -161 335 -36 -145 -115 81 -158 364 141 -79 32 -79 147 229 169 -117 140 21 -93 -53 352 -49
5848 -49 80 150 -84 128 107 63 -4 268 -37 50 -233 -210 -22 19 -23 265 257 84 39 114 -1 -171 170 149 -97
5873 -97 333 151 32 -177 96 -240 -178 -9 -112 -68 -223 82 74 -23 -253 355 172 -166 -102 306 66 0 -389
5896 -389 106 -26 12 65 98 19 86 -90 -223 -15 -239 236 -167 -48 104 -32 366 37 -42 33 164 7
5918 7 -64 -249 308 66 112 -9 -105 -114 -294 95 -81 11 -87 33 -3 -61 -57 13 142 26 -40 -261 -93 21 -144
5943 -144 87 43 -24 136 -125 -68 67 -105 -185 -9 21 78 -6 -115 -252 3 30 -428 140 192 207 -72 -2 -13
5967 -13 17 319 -271 -51 126 248 -56 -18 184 -63 -92 108 60 -42 -186 36 -80 -22 -56 -158 -109 114 -159
5990 -159 71 -115 230 -17 -83 75 39 -131 50 28 13 -100 251 90 155 76 -241 -79 -54 -67 -98 208 92
6013 92 -130 -133 -66 25 49 118 183 97 -72 -221 351 -12 -39 -71 -97 148 -133 178 168 110 104 -101 157 100 90 -27
6039 -27 207 -27 -110 -96 115 -74 -21 -93 3 -132 -100 185 -173 204 119 208 430 184 -61 -63 231 -135 -156 25
6063 25 -103 -190 239 -22 198 249 -136 94 -33 44 119 73 -23 210 188 293 427 194 135 185 -199 23 231
6086 231 -22 183 -174 185 -33 155 30 -101 -49 -274 -63 -54 246 -118 84 -42 -234 90 -23 123 375
6107 375 -397 -50 5 -31 202 59 292 185 145 74 26 -163 -74 -273 167 27 113 -239 50 60 65 -118 -125 66
6131 66 154 122 -42 186 -38 -178 -338 139 209 11 2 -54 -59 -28 -57 -130 342 -23 -5 28 -242 -16 -140 96 -256
6156 -256 -308 99 57 38 -22 29 103 -190 -83 109 281 161 -207 -85 83 204 -152 22 -79 -126 -107 67 -301
6179 -301 -45 -346 -43 -67 -103 185 -89 13 43 -123 147 5 -62 33 -29 6 148 -90 -7 45 -50 -16 -6 -209
6203 -209 6 -34 9 129 122 26 51 37 -333 -53 87 120 -189 -107 -426 55 77 75 -19 235 57 -17 -83 -69 166
6228 166 306 -11 -12 -236 -121 83 54 -124 -232 73 62 -120 127 163 -13 -123 -122 -155 -108 -91 -142 254 190 79
6252 79 176 324 30 194 204 294 70 -36 31 202 36 -276 45 -113 -63 111 -169 -39 -313 27 -74 85
6274 85 133 -245 -65 174 -12 -129 -83 101 10 147 -54 -25 -92 -161 58 -68 -420 141 200 39 -203 -168 -354
6297 -354 249 11 -183 228 -274 103 158 87 -197 -292 -26 257 244 102 15 -92 -54 134 14 -91 -17 -48 -175
6320 -175 161 113 142 238 108 37 -154 -178 -75 115 -188 -65 -11 189 89 -26 47 -9 -55 -396 113 -200 63
6343 63 -134 -336 44 272 2 -208 -82 -227 72 -301 -60 -6 36 -113 44 -198 154 -326 -156 18 -335
6364 -335 -23 200 192 68 79 -39 298 96 -8 273 215 41 -50 -162 -69 249 251 -91 -6 5 191 -130 -187 41
6388 41 302 -283 -74 -230 -5 18 16 61 -327 -155 139 -244 134 -36 -97 289 202 37 30 -35 -171 76 193
6411 193 197 -202 -57 -306 -60 102 181 351 -113 -155 -17 126 -89 17 13 182 -74 415 76 -333 67 -64
6433 -64 122 240 279 -131 113 134 -39 -13 -96 -408 9 77 53 11 188 -35 218 151 146 -127 114 162 -354 -200
6457 -200 -112 -42 -61 86 30 32 126 -74 -266 77 4 29 -252 19 93 101 -195 -72 70 -135 148 286 -31 180
6481 180 -83 -40 -67 -7 97 168 419 -129 -54 -88 -93 251 45 94 -25 76 106 -91 -186 -12 -137 59 -13 -206
6505 -206 103 40 401 109 -194 57 92 -69 -438 -43 151 -298 -161 135 -174 74 -144 152 120 307 171
6526 171 21 78 -21 144 -38 43 -157 74 -405 72 -161 27 -86 195 203 259 120 -76 263 -101 -17 -80 -102
6549 -102 -73 16 -42 -261 -157 -66 66 6 104 132 124 -6 -143 134 -265 -15 -6 373 -58 33 -39 69 -86 133
6573 133 124 281 93 -32 197 56 -113 1 -45 65 -144 70 -31 -79 -313 -92 136 -155 -240 74 -82 -143
6595 -143 29 55 -108 90 108 -36 284 -88 -213 34 111 44 -186 134 -4 -15 -3 6 11 222 -121 -122 187 21
6619 21 232 -1 -27 -39 -22 -193 -82 -217 -112 143 26 127 299 -82 -176 -73 -140 124 255 20 -49 67
6641 67 126 -105 -250 316 6 -74 230 -47 -17 -88 -241 61 14 -1 -84 -94 149 -121 12 -66 19 -166 -104 -272
6665 -272 188 -88 -202 72 228 -27 -223 -214 -113 191 -90 130 24 92 -412 -152 -101 33 -186 -143 -128 -5
6687 -5 30 123 243 -9 -14 59 55 278 -73 -15 -76 349 -24 131 24 135 343 151 6 110 -40 -127 131 -5
6711 -5 99 117 -81 -32 53 90 1 93 -49 21 293 -272 121 211 105 219 -120 88 2 -114 -119 -293 -232 -55 192
6736 192 -54 -97 42 103 -11 156 345 -120 -4 -7 -212 -321 43 -11 -87 114 -28 175 -153 -70 -95 -2 32
6759 32 -376 60 132 141 -179 295 134 -71 -57 16 0 62 41 -226 131 60 164 4 79 81 97 27 -247 196 -64
6784 -64 204 -24 153 250 -20 87 195 -148 -224 6 -5 49 98 221 204 -123 -92 -176 -115 -307 129 229 -294
6807 -294 114 22 70 -83 -135 38 142 1 203 -16 4 53 41 28 -51 6 63 115 18 241 82 -50 -122 88
6831 88 -72 165 -42 81 165 -9 -90 137 218 230 -88 -14 360 -239 19 6 5 128 -97 -296 -133 75 -14
6854 -14 -53 262 -127 -41 -30 -31 45 83 71 172 140 79 114 255 -77 -186 135 -31 22 -85 175 -159 95 -25
6878 -25 -17 -63 -162 -177 94 82 -149 -72 -190 189 -190 122 186 329 -59 204 -64 39 -79 -49 164 160 -29 -342
6902 -342 -166 -65 90 -187 -41 -124 -351 108 23 -248 10 42 36 -109 40 82 94 -3 100 -107 35 227 189
6925 189 -108 -382 -176 -21 136 105 -296 -111 38 149 244 -94 -44 54 149 -226 191 107 -78 35 -65 -29
6947 -29 194 -13 -95 122 -13 131 195 360 96 -151 350 232 248 -31 -381 239 101 13 24 -159 65 -132
6969 -132 -118 -65 28 -328 55 -90 129 96 -147 -68 -77 187 -1 8 -15 153 26 238 -70 -89 21 -32 195 -208
6993 -208 273 167 158 77 49 -18 245 -176 -95 -100 -25 294 -362 -83 28 -156 163 -103 -68 271 -80 -160 121 -146
7017 -146 -98 137 -149 274 88 -68 328 -66 -150 165 -58 -59 45 106 -3 12 35 181 43 -58 59 66 -180
7040 -180 -61 -247 -197 -184 56 14 -49 59 129 -232 -221 -4 -233 345 -7 190 37 133 197 -169 74 28 -126
7063 -126 66 -95 111 12 -65 62 -142 -81 108 128 29 -88 -36 88 3 110 -70 47 -59 -78 321 -181 7
7086 7 162 151 -264 -183 34 142 -42 -102 -141 -36 -125 -68 -90 -18 -220 -222 215 280 -173 -150 -34 49 -1 -183 75
7111 75 -16 -213 -36 56 106 212 -115 -20 -59 4 23 -17 -167 1 -1 -59 -72 79 17 90 134 -15 125 9 81 93
7137 93 -239 52 -34 -14 -206 54 348 -12 -41 178 4 12 -115 51 11 249 246 -162 -42 29 40 -13 -90 12
7161 12 -15 93 -354 337 300 72 -215 45 -1 -107 -20 56 -67 -169 -71 190 -173 -142 -270 130 7 -24 196
7184 196 64 -83 9 -65 237 -191 -139 246 -73 -10 233 227 -289 128 105 64 81 180 -44 -48 9 -286 -44 -49 200
7209 200 260 -42 -138 9 -113 -93 -75 218 -144 -331 -84 230 -183 182 98 -108 114 -3 81 -77 -87 266
7231 266 290 -9 -43 -187 -16 217 42 -192 110 -183 200 15 -92 43 248 6 -100 178 113 -106 -155
7252 -155 119 9 -90 -56 25 12 68 -7 -166 -130 57 -54 -21 79 -85 86 22 178 -79 26 -62 171 10
7275 10 -148 13 126 -48 -27 -13 185 261 65 46 46 5 -107 -9 -35 -12 156 62 -186 223 111 46 -46 -166 -223
7300 -223 -175 -28 120 -165 -109 55 98 277 -47 50 66 -126 -7 -48 -19 110 176 -32 4 -60 127 448 -55
7323 -55 -182 -68 -119 -203 32 -86 -24 83 -60 69 -48 -10 -286 107 -127 -181 -35 -206 66 56 52 -117 -11
7346 -11 122 -154 -4 -85 190 -180 -29 -28 -189 38 -126 -71 -49 -332 -106 41 152 99 145 77 29 -75 -167 152
7370 152 202 135 294 -259 196 76 129 -100 -85 104 50 -127 -128 -41 -68 -4 -83 -291 -406 97 -14 -55 110 -119
7394 -119 -143 -179 -156 -46 -1 28 159 111 -36 -57 18 -146 243 -21 51 -199 128 106 210 218 -96 63 -142 -73
7418 -73 114 37 22 154 18 -258 -169 -204 51 37 -195 36 329 232 -293 106 2 3 32 154 -123 133 -69
7441 -69 16 -41 154 -186 69 -227 -52 -60 -160 210 -162 155 102 61 59 97 175 -35 -212 268 132 -61 241 -130
7465 -130 128 -181 -60 70 123 -31 69 -107 -22 58 15 -225 -12 -131 -186 97 -61 -69 74 0 -131 -66 -125
7488 -125 -77 -100 28 18 80 42 -147 86 366 256 -6 -112 -317 -20 104 -270 337 -74 96 -8 -4 15 -458
7511 -458 -15 265 -134 -14 22 -78 193 -101 101 -181 -136 -188 -169 -59 -234 -1 28 174 65 0 233 15
7533 15 115 43 47 173 -265 57 55 29 232 -81 191 234 177 -116 -2 -7 -75 129 -179 -89 153 26 6 78 146
7558 146 63 -15 -41 -255 34 -74 36 -47 71 264 -47 7 285 2 182 -225 -228 93 196 -158 -194 58 -233
7581 -233 39 -66 -66 98 -70 32 76 47 101 26 -229 -22 -26 12 18 72 88 -270 138 2 119 72 -269 23 129
7606 129 77 -152 160 313 -317 34 182 54 166 -20 163 119 16 176 208 -86 401 -39 153 -112 230
7627 230 194 119 211 83 154 -55 -101 7 -172 183 -33 -84 -153 92 22 -266 -57 -136 -3 -34 85 -24 96
7650 96 -33 -29 -102 -97 104 90 -43 -151 214 -101 -60 -215 -181 -258 195 95 -30 -26 -374 -82 241 -63 -9 -3 169
7675 169 59 -77 -59 241 136 -184 323 -175 273 -148 56 24 190 348 -82 -63 -130 93 -140 -100 114 51
7697 51 -23 70 -103 297 114 60 -127 -16 -91 -139 -142 81 -40 122 -10 174 219 -116 232 11 -242 88 -77
7720 -77 -31 44 94 242 -157 -46 83 -392 79 -70 -180 54 -136 -109 -174 302 49 -88 122 -113 276 -199
7742 -199 87 -205 31 104 -131 -77 -112 -88 4 86 241 -28 450 121 -274 25 -119 165 100 26 53 -74 -126
7765 -126 -96 -122 160 -6 126 -39 -53 31 -298 5 -1 -34 63 78 -114 157 210 317 4 -102 12 307 172
7788 172 274 9 -176 161 149 -168 9 -250 136 112 5 60 -72 -284 81 -209 -163 154 -37 60 -53 230
7810 230 -98 93 -100 154 82 -156 97 -98 92 -77 164 -66 -305 188 -97 150 -284 151 139 -21 -55
7831 -55 222 -133 -4 -47 -202 280 -86 101 -60 70 -298 181 -149 352 157 -45 112 -123 -69 -213 -162
7852 -162 -30 -157 88 -209 58 173 -162 -141 -33 246 50 -144 53 -436 10 48 -159 55 -99 15 50
7873 50 222 -102 -17 17 109 70 -4 207 8 122 32 282 -43 47 -56 -198 1 150 -174 -180 -163 20 -80 -39
7897 -39 74 -92 290 -56 -90 48 92 -27 132 23 17 23 -116 91 -202 -67 118 205 19 23 227 205 98 -228
7921 -228 96 185 183 -250 294 -19 30 48 22 37 -138 -8 245 109 191 90 -90 -24 186 -132 42 -361 104
7944 104 170 46 32 -288 186 138 -108 145 -58 -244 24 39 -161 20 274 74 -17 -154 196 -256 -11 -340
7966 -340 60 58 84 260 237 -134 87 -144 -130 103 -28 126 187 -72 274 -25 -194 -99 18 2 -94 94 97 55
7990 55 -49 42 190 89 -101 77 -86 132 372 105 55 102 -202 89 75 32 50 -211 126 27 -268 131 -100
8013 -100 61 -234 -74 36 -48 246 -321 -146 -4 -43 -167 -261 126 216 -229 -151 -41 287 -124 286 -167 41
8035 41 -205 -217 -23 143 31 -126 -113 184 -210 -220 50 311 37 -344 40 174 -58 -155 268 -82 126 -166
8057 -166 37 -78 149 -297 -36 -201 44 -194 -126 54 -127 74 -50 158 -135 129 -4 104 -104 132
8077 132 166 18 58 -141 86 252 165 98 126 -103 -105 -108 -124 -83 -85 174 -275 -311 79 -71 -163 152 -137 -362 -17
8102 -17 79 116 -261 118 -64 -144 122 81 -74 96 246 -56 48 29 -40 -33 281 52 -12 113 -20 -46 144 5
8126 5 -80 45 -155 153 -72 -262 104 -143 234 98 220 -85 37 25 49 153 -46 -30 -464 -180 11 -33
8148 -33 -56 -98 -116 -137 -32 77 74 98 -12 105 -185 -168 -204 -87 12 -161 -223 92 168 99 183 146 -82 29 61 -357
8174 -357 -283 -46 58 89 -159 135 134 -43 276 38 -225 -161 -66 -33 -205 85 -104
8191a04
##END NTUPLES=NMR FID
##END=
