##TITLE=1H_DE-22_oil_d6
 DMSO-d6
 8 sc, 
 6.6.2024
##JCAMPDX= 6.0         $$ Bruker NMR JCAMP-DX V2.0
##DATA TYPE= NMR FID
##DATA CLASS= NTUPLES
##ORIGIN= UXNMR, Bruker Analytische Messtechnik GmbH
##OWNER= root
$$ XWIN-NMR		Version 3.5
$$ Thu Jun  6 15:34:08 2024 Russian Standard Time (UT+4h)  she@DPX200
##.OBSERVE FREQUENCY= 200.1309
##.OBSERVE NUCLEUS= ^1H
##.DELAY= (6, 6)
##.ACQUISITION MODE= SIMULTANEOUS
##.ACQUISITION SCHEME= undefined
##.AVERAGES= 8
##.DIGITISER RES= 18
##SPECTROMETER/DATA SYSTEM= spect
##.PULSE SEQUENCE= zg30
##.SOLVENT NAME= CDCl3
##.SHIFT REFERENCE= (INTERNAL, CDCl3, 0, 15.7039)
##AUDIT TRAIL= $$ (NUMBER, WHEN, WHO, WHERE, WHAT)
$$ ##TITLE= Audit trail, XWIN-NMR		Version 3.5
$$ ##JCAMPDX= 5.01
$$ ##ORIGIN= Bruker BioSpin GmbH
$$ ##OWNER= she
$$ F:/spectra/data/she/nmr/H-F/1/audita.txt
$$ ##AUDIT TRAIL=  $$ (NUMBER, WHEN, WHO, WHERE, WHAT)
(   1,<2024-06-06 15:33:14.76 +0400>,<she>,<DPX200>,
      <created by zg, POWCHK disabled, PULCHK disabled
       configuration hash MD5:
       00 E9 B6 7A A2 85 ED C7 34 08 36 98 17 FE 4E 26
       data hash MD5: 16K
       FE FC BB 2C CE 4E AF 89 AC 77 8D DC CB E3 2B 8E>)
$$ ##END=
$$ 
$$ hash MD5
$$ DC C9 E9 49 86 DA 36 6C E4 F9 5A 5B 13 D3 DF AE
##$RELAX= 
##$RELAX= 
##$RELAX= 
##$RELAX= 
##$RELAX= 
##$RELAX= 
$$ Bruker specific parameters
$$ --------------------------
##$DU= <F:/spectra>
##$EXPNO= 1
##$NAME= <H-F>
##$PROCNO= 1
##$TYPE= <nmr>
##$USER= <she>
##$AMP= (0..31)
100 100 100 100 100 100 100 100 100 100 100 100 100 100 100 100 100 100 
100 100 100 100 100 100 100 100 100 100 100 100 100 100 
##$AQSEQ= 0
##$AQ_mod= 1
##$AUNM= <au_zg>
##$AUTOPOS= <>
##$BF1= 200.13
##$BF2= 200.13
##$BF3= 200.13
##$BF4= 200.13
##$BF5= 200.13
##$BF6= 200.13
##$BF7= 200.13
##$BF8= 200.13
##$BYTORDA= 1
##$CFDGTYP= 0
##$CFRGTYP= 5
##$CHEMSTR= <none>
##$CNST= (0..31)
1 1 145 1 1 1 1 1 1 1 1 1 1 1 1 1 1 1 1 1 1 1 1 1 1 1 1 1 1 1 1 1 
##$CPDPRG= <>
##$CPDPRG1= <>
##$CPDPRG2= <>
##$CPDPRG3= <>
##$CPDPRG4= <mlev>
##$CPDPRG5= <mlev>
##$CPDPRG6= <mlev>
##$CPDPRG7= <mlev>
##$CPDPRG8= <mlev>
##$CPDPRGB= <>
##$CPDPRGT= <>
##$D= (0..31)
0 1.2 0 0 0 0 0 0 0 0.06 0 0.03 0 0 0 0 0.0002 0 0 0 0 0 0 0 0 0 0 0 0 
0 0 0 
##$DATE= 1717673594
##$DBL= (0..7)
120 120 120 120 120 120 120 120 
##$DBP= (0..7)
150 150 150 150 150 150 150 150 
##$DBP07= 0
##$DBPNAM0= <>
##$DBPNAM1= <>
##$DBPNAM2= <>
##$DBPNAM3= <>
##$DBPNAM4= <>
##$DBPNAM5= <>
##$DBPNAM6= <>
##$DBPNAM7= <>
##$DBPOAL= (0..7)
0.5 0.5 0.5 0.5 0.5 0.5 0.5 0.5 
##$DBPOFFS= (0..7)
0 0 0 0 0 0 0 0 
##$DE= 6
##$DECBNUC= <off>
##$DECIM= 32
##$DECNUC= <off>
##$DECSTAT= 4
##$DIGMOD= 1
##$DIGTYP= 9
##$DL= (0..7)
0 120 120 120 120 120 120 120 
##$DP= (0..7)
150 150 150 150 150 150 150 150 
##$DP07= 0
##$DPNAME0= <>
##$DPNAME1= <>
##$DPNAME2= <>
##$DPNAME3= <>
##$DPNAME4= <>
##$DPNAME5= <>
##$DPNAME6= <>
##$DPNAME7= <>
##$DPOAL= (0..7)
0.5 0.5 0.5 0.5 0.5 0.5 0.5 0.5 
##$DPOFFS= (0..7)
0 0 0 0 0 0 0 0 
##$DQDMODE= 0
##$DR= 18
##$DS= 0
##$DSLIST= <SSSSSSSSSSSSSSS>
$$ [...]
##$SUBNAM2= <"">
##$SUBNAM3= <"">
##$SUBNAM4= <"">
##$SUBNAM5= <"">
##$SUBNAM6= <"">
##$SUBNAM7= <"">
##$SUBNAM8= <"">
##$SUBNAM9= <"">
##$SW= 18.0517689322627
##$SWIBOX= (0..15)
0 0 2 0 0 0 0 0 0 0 0 0 0 0 0 0 
##$SW_h= 3612.71676300578
##$TD= 16384
##$TD0= 1
##$TE= 0
##$TE2= 300
##$TE3= 300
##$TEG= 300
##$TL= (0..7)
0 120 120 120 120 120 120 120 
##$TP= (0..7)
150 150 150 150 150 150 150 150 
##$TP07= 0
##$TPNAME0= <>
##$TPNAME1= <>
##$TPNAME2= <>
##$TPNAME3= <>
##$TPNAME4= <>
##$TPNAME5= <>
##$TPNAME6= <>
##$TPNAME7= <>
##$TPOAL= (0..7)
0.5 0.5 0.5 0.5 0.5 0.5 0.5 0.5 
##$TPOFFS= (0..7)
0 0 0 0 0 0 0 0 
##$TUNHIN= 0
##$TUNHOUT= 0
##$TUNXOUT= 0
##$USERA1= <user>
##$USERA2= <user>
##$USERA3= <user>
##$USERA4= <user>
##$USERA5= <user>
##$V9= 5
##$VALIST= <valist>
##$VCLIST= <CCCCCCCCCCCCCCC>
##$VD= 0
##$VDLIST= <DDDDDDDDDDDDDDD>
##$VPLIST= <PPPPPPPPPPPPPPP>
##$VTLIST= <TTTTTTTTTTTTTTT>
##$WBST= 1024
##$WBSW= 4
##$XGAIN= (0..3)
0 0 0 0 
##$XL= 0
##$YL= 0
##$YMAX_a= 49181
##$YMIN_a= -81471
##$ZGOPTNS= <>
##$ZL1= 120
##$ZL2= 120
##$ZL3= 120
##$ZL4= 120
##$ABSF1= 10
##$ABSF2= 0
##$ABSG= 5
##$ABSL= 3
##$ALPHA= 0
##$AQORDER= 0
##$ASSFAC= 0
##$ASSFACI= 0
##$ASSFACX= 0
##$ASSWID= 0
##$AUNMP= <proc_1d>
##$AZFE= 0.1
##$AZFW= 0.1
##$BCFW= 1
##$BC_mod= 2
##$BYTORDP= 1
##$COROFFS= 0
##$CY= 11.3945322036743
##$DATMOD= 1
##$DC= 2
##$DFILT= <>
##$DTYPP= 0
##$F1P= 15.6554695791079
##$F2P= 12.8336369535428
##$FCOR= 0.5
##$FTSIZE= 0
##$FT_mod= 4
##$GAMMA= 1
##$GB= 0.15
##$INTBC= 1
##$INTSCL= 1
##$ISEN= 128
##$LB= 0.24
##$LEV0= 0
##$LPBIN= 0
##$MAXI= 10000
##$MC2= 0
##$MEAN= 0
##$ME_mod= 0
##$MI= 1.114404
##$NCOEF= 0
##$NC_proc= 0
##$NLEV= 6
##$NOISF1= 3.799351
##$NOISF2= 2.8
##$NSP= 1
##$NTH_PI= 0
##$NZP= 0
##$OFFSET= 15.70392
##$PC= 1
##$PHC0= -25317.7
##$PHC1= 7.98748
##$PH_mod= 1
##$PKNL= yes
##$PPARMOD= 0
##$PSCAL= 0
##$PSIGN= 0
##$REVERSE= no
##$SF= 200.130013532006
##$SI= 16384
##$SIGF1= 3
##$SIGF2= 2
##$SINO= 400
##$SIOLD= 16384
##$SREGLST= <1H.CDCl3>
##$SSB= 0
##$STSI= 0
##$STSR= 0
##$SW_p= 3612.71676300578
##$SYMM= 0
##$S_DEV= 0
##$TDeff= 0
##$TDoff= 0
##$TI= <>
##$TILT= no
##$TM1= 0
##$TM2= 0
##$TOPLEV= 0
##$USERP1= <user>
##$USERP2= <user>
##$USERP3= <user>
##$USERP4= <user>
##$USERP5= <user>
##$WDW= 1
##$XDIM= 8192
##$YMAX_p= 0
##$YMIN_p= 0
$$ End of Bruker specific parameters
$$ ---------------------------------
##NTUPLES= NMR FID
##VAR_NAME=  TIME,          FID/REAL,        FID/IMAG
##SYMBOL=    X,             R,               I
##VAR_TYPE=  INDEPENDENT,   DEPENDENT,       DEPENDENT
##VAR_FORM=  AFFN,          ASDF,            ASDF
##VAR_DIM=   8192,          8192,            8192
##UNITS=     SECONDS,       ARBITRARY UNITS, ARBITRARY UNITS
##FACTOR=    0.0002768,     1,               1
##FIRST=     0,             0,               0
##LAST=      2.2672688,     0,               0
##MIN=       0,             -81471,          0
##MAX=       2.2672688,     49181,           0
$$ Real data points
##PAGE= N=1
##DATA TABLE= (X++(R..R)), XYDATA
$$ [...]
1802a77r0J57J31q0km6K48k00Q1p9o8R0J10k19K53j57k4J26k99K2J50L4NJ47k1
1827I2l4j73r1M35o1j52L7R5k87j17L32l0K08l36K53k33J71J15k85K34N9k31l45
1850c44K48L16k54L75j73k12K99k89J98k09J02J0K77k28J77j60k64L1J02J89j64
1871B7Q4P5L2j42j68o5K39q2r3K39l59j49M9J34L19k44RK09J7J56l03j97K27J55
1895A69j72J25P8n3k93L53O1j68k97N2K15l8m1r1j08M0O9J69J17j13j51j29K76
1918G0p5M29o96J75j16L46j17R0j06j29J54J62j72j19J77l1p9r9L26LJ25p08N06
1941A16j02j81L09J3j82J32o9j81L00l88J84m0K29k01NM35n18q6M16j37Q7J64
1963C05l32K78m95L24n7r3n6K26n0o8ON0m4N5P1l49K84j70M9J04l72M89k77K73
$$ plain form
1802 -177 -267 -110 21 -59 -61 -107 141 -59 22 -57 -125 -35 75 -144 109 -48 -72 54 -245 -223 -73 -39 -34 113 92
1827 92 58 -115 -206 229 168 16 53 148 -139 -256 76 46 254 -82 171 -62 109 224 -61 173 232 1 -344
1850 -344 -96 220 -34 341 168 -44 255 -34 164 -45 57 67 344 116 293 133 -131 -100 2 191 27
1871 27 111 186 218 76 -92 -157 82 0 -93 146 -213 -362 -313 -179 140 -104 -95 114 131 287 -16 -213 14 169
1895 169 -3 122 200 147 -146 207 268 100 -197 -145 70 32 -9 -100 -208 -168 -99 70 187 74 -77 -206 70
1918 70 -5 424 -272 -97 -213 133 16 106 0 -129 25 187 15 -104 73 42 -37 -136 190 193 318 -390 116
1941 116 14 -167 142 155 -27 105 36 -145 155 -233 -49 -89 140 -61 -56 379 -139 -225 191 54 141 305
1963 305 -27 251 -244 80 23 -70 -126 100 50 -18 -12 38 -6 49 120 -229 55 -115 -66 38 -334 155 -122 151
1987A51m9J13k27M5k5J86j48n3K25l15K1K45j39L5j00kL17l58p1p7M31j38q8j36
2011a57Q2j20J40N6j70l7K84j27R9o2O2L56n08J65q4j77K59j22L1m1J96J73l20
2034b2OK7k27L00j58L5J86j43J5j89L4K56n56O37k75j37M67k17j26K35M2k9j51
2057A0L2j0p2k01J69k8r1K99k2N0p9j46M8J68k81N6K29l80L36k09J3J14Q3P0m6
2082A12j86K6K9O8k5k36K67J19j46P6k17q3M29o2k18L13l41J93j11L6k66K9K78
2105H4P1j89j03o7J15J14j57L12n96K45K03J20k33J60k82p8M47O8j73K5l14K31
2127CQ9j69J73Q4l04j34L97k0m3J58j61k91L45j77J99j94PM7O0Mk63L15p0J02
2151A57j7k2j69J57k68k88N09O9lj10p6J49j75m3L44k50J56j57Q3j74L55l92K82
$$ plain form
1987 151 102 215 -12 33 8 194 46 -7 218 -97 -76 169 30 65 -35 -37 280 -78 -149 -226 205 67 -21 -157
2011 -157 -75 -195 -55 1 -169 -206 78 -49 50 -12 50 406 -102 63 -21 -198 61 -61 -30 -71 125 298 -22
2034 -22 -16 11 -216 84 -74 -39 147 4 19 -170 -136 120 -436 201 -74 -211 256 39 -87 148 190 161 10
2057 10 42 32 -40 -241 -72 -100 -191 108 86 136 57 -89 -41 127 -154 -98 131 -249 87 -122 -109 5 88 158 112
2082 112 -74 -48 -19 49 24 -212 55 174 28 104 -113 -196 233 171 -47 266 -75 118 7 43 -223 -194 84
2105 84 155 -34 -137 -204 -89 25 -132 180 -416 -171 32 152 -81 79 -203 -281 166 234 61 86 -228 3
2127 3 92 -77 96 180 -124 -258 139 119 76 234 73 -218 127 -50 149 -45 -38 9 69 73 -190 125 55 157
2151 157 140 118 -51 106 -162 -450 59 128 125 15 -61 88 -87 -130 214 -36 120 -37 46 -128 227 -165 117
2174A17R7j46P4p5J71j49k6k69L68o9J08j24j15j73N13n09K17J06J35j95k45J88
2196aroj67J21J67l4j8J6m5K09j07q7J01j25N8m65N54l24L04l38o3M40o7J58k82
2221a0q3j13K46Pj70K42k41N0J6J39j59K21k51Q0R7l6J09l84K33R4q8j21L48l46
2245a20K8j7j55M30o4j50q2J47n5J09n0J56r8J41j92m3N37k48l31j19J1P7J98
2268A10j43j8o6L7M5k23J86n2J59k26J21J40p1K66k10Mm22K79P8k3Q6o1J39R3
2292B28N6j39l54K85M1l52K35Q9n7p4K2j20K61j57R3j43K17j39JJ1j19K79k5j8
2316A21j86K12j48j2j0o3k2L4L2K56m79L07J84m82K95j71J18J93j98J06p0k53
2338b36J82JJ13r0J47R4j04k81J24K53m55P3J14l06M57O0J07m28K57j01J43j57
$$ plain form
2174 117 214 68 142 67 238 89 63 -206 162 93 201 77 -38 -211 302 -207 10 116 251 56 -189 -1
2196 -1 -10 -16 -183 -62 105 71 53 69 24 233 126 39 140 15 73 -392 162 -162 142 -196 -259 181 114 272 -10
2221 -10 -93 -206 40 47 -123 119 -122 -72 -56 83 -76 145 -106 -26 71 35 144 -240 -7 87 -1 -122 226 -120
2245 -120 -92 -109 -264 166 102 -48 -130 17 -38 71 21 177 79 220 28 -15 522 274 -57 -176 -165 -88 110
2268 110 -33 -51 -117 -80 -35 -258 -72 -124 35 -191 -70 70 -1 265 55 59 -363 -84 -6 -29 57 -4 135 228
2292 228 284 145 -209 76 117 -235 0 89 32 -42 -20 -140 121 -36 57 -86 131 -8 -7 4 -115 164 139 121
2316 121 -65 147 -1 -13 -23 -86 -108 -74 -42 214 -265 42 226 -256 39 -132 -14 179 -19 87 17 -236
2338 -236 -54 -53 60 -30 117 211 107 -174 -50 203 -252 -179 -65 -371 86 146 253 -175 82 -19 124 -33
2360c3nM0j59N5r1L22j85J8q0K75l25Q6k28L96J03M6j72J5j29J71q3j84n0Q5Q4
2385b8j95R9p2L39j76J78r4kr1J07NQ7j63L1j13J33k26J8J38J24k56L54l57L79
2409B19l08R1L41l27K23l21J59K58j92m8l38J62p0K23J30j27j29J43j0r6l9pO9
2432FJ62j12k46K35L6M4k44J95k15L81m16N4J33J12Q6j11j47L89n05O5L74j83
2454I3k02M1K40j11R2j13j94m1Q6Q6K01k70j81L29J23k0l76L20Jj23K01m89L10
2477Cj2m2j89K6J60q6L45j16PK2k49K90k41J4J44L6k84L19o2n6k64M56j79k77
2501b35J8J1L01oj72L6O6k60J39J19K18n18L96p4j63K36o8J46j99m9K12k47m9
2524a42J27K05j12m7j53O9K46k98lM9P7j18L29m3l21L67j06j94p2J67j71M9lj55
$$ plain form
2360 -33 -38 2 -157 -102 -193 129 -56 -38 -118 157 -168 -82 -310 86 189 235 63 78 -51 120 37 -147 -197 -112 -28
2385 -28 -223 -124 -196 143 -33 145 51 49 -42 65 70 157 -6 25 -88 45 -181 -163 -25 99 -157 197 -160 219
2409 219 -89 2 343 16 239 -82 77 335 143 95 -243 -81 -151 72 202 75 -54 89 79 -17 -56 -63 6
2432 6 168 56 -190 45 81 125 -119 76 -139 242 -174 -120 13 125 211 100 -47 342 -163 -98 276 93
2454 93 -109 -68 172 61 153 40 -154 -195 -109 -23 178 -92 -273 56 179 159 -217 103 104 -19 182 -307 3
2477 3 -9 -51 -240 -214 -54 -140 205 89 96 118 -131 159 -82 -68 76 112 -172 147 85 29 -235 221 42 -235
2501 -235 -217 -206 95 89 -83 -47 19 -241 -102 17 235 -283 113 39 -124 112 44 190 -9 -58 154 -93 -142
2524 -142 -15 190 78 31 -122 -53 193 -105 -108 -59 18 -100 229 186 -135 232 126 -68 -140 27 -144 -95 -98 -253
2548b53O9j38N20k0k27k8L85l64k7K26j44j06k60L99K04j47k1j37J73j42J12j06
2570c2J91j88K7J80j73j49J76j25L51m53J98Q3m9J98j13J00j71M8j18J93l43P8
2592i1M26j26l27L17k42J49J29K4j85k53K13l53M00k60k6K55mn5r8K44j7m88P8
2615b90K38k26J89j36Q1n9M11r0o1J14k48J57q9Pj00qJ37oj58Q8L2J2J40k34J00
2640Am6j03K82R4k13Q2k79K0R4k14Q7J27j5l62M07P9M70p22L12qJ49m82M11k13
2664d2o6L67k09J41l42J71q4L29m43J73q2Q5ok5k85M31q2k10O0oJ78N6k20J21
2688A0j28m4J91j58J9N1P2o0r3J03J03l09K87P7%K04m52N2P1j48p2J64j78L61
2712A23j97nJ73j09J28L8R2k14J76k54K92k47r3L53m06K71k9J37j79N8j13j61
$$ plain form
2548 -253 -184 -322 198 178 -49 -77 308 -56 -83 143 -1 -107 -367 32 236 89 68 -69 104 -38 74 -32
2570 -32 159 -29 -2 178 5 -144 32 -93 258 -195 3 86 37 235 122 222 51 99 -19 174 -169 -91
2592 -91 335 209 -118 199 -43 106 235 259 74 -179 34 -319 81 -179 -205 50 46 -9 -107 137 120 -368 -290
2615 -290 -52 -278 -89 -225 -144 -203 208 118 57 171 -77 80 -9 -2 -102 -110 27 21 -137 -49 -17 -5 135 -99 1
2640 1 -45 -148 134 228 15 97 -182 -162 -68 -282 -195 -68 -83 -445 -38 41 511 -211 101 93 242 -240 171 -42
2664 -42 -108 259 50 191 -151 20 -64 265 -178 -5 -87 -2 -8 -33 -318 113 31 -179 -119 -125 53 109 -111 10
2688 10 -118 -162 29 -129 -110 -59 13 -47 -140 -37 66 -243 44 121 121 325 -127 -75 -4 -152 -224 -60 -238 123
2712 123 -74 -79 94 -15 113 151 243 29 205 -49 243 -4 -97 256 -150 121 92 229 50 108 -5 -166
2734a66J77m9k0L09k00K9k60J70j50J49J00n9k10M07j73O6q1l38L44k0J65l31
2756a41J29k5J23r0K9lJ03j05k51M00k11J30k99K48j28NL44j10m03J9L57j4k69
2779a62j59N33m69L79p4l46L14k03J03N2J34r1L2l06K13l9K00J2l86K75k02K16
2801B6J28j13j15l8N0j32L06l85M68j93nO3J59j37J08n48J98L84k02k01M8K21
2823I0j44K47k93R2J18j54L7j39K77lk74J31k7j1J25p4K02q9P3l07n4R7J10J02
2847A32k42Q6j98L59j23J93l79r4K85r3K39K24k78k21OkQ3O1Q6j81R7j67k8L5
2871a20J3L60k24j16RK01k93Q8N4O2N4j14p1j5J88k25M5M6R7k29K29j12N6N9k24
2896a82J23J82j76L3J89J60k74rJ02q2l8k36j9M01k70K03j81j4j65M30l12j17
$$ plain form
2734 -166 11 -38 -58 251 51 80 -180 -10 -160 -11 89 30 -180 227 54 120 39 -299 45 25 190 -141
2756 -141 -12 -37 86 -4 25 22 125 20 -231 169 -42 88 -211 37 -91 -86 258 148 -255 -236 121 107 -162
2779 -162 -321 212 -257 122 48 -298 16 -187 -84 -32 102 11 43 -263 -50 -89 111 123 -263 12 -190 26
2801 26 154 41 -74 -112 -62 -194 112 -273 195 2 -3 60 219 82 190 -358 -160 224 22 -179 -131 90
2823 90 -54 193 -100 -8 110 -44 -7 -146 131 128 -146 -15 -42 -53 72 -2 200 111 184 -123 -177 -80 30 132
2847 132 -110 -24 -222 137 14 207 -172 -266 19 -74 165 389 111 -110 -104 -106 -23 38 124 -57 40 -127 -155 -120
2871 -120 -107 253 29 -87 -78 123 -170 -82 -28 34 88 -26 -97 -112 76 -149 -104 -58 39 -190 39 -73 -17 42 -182
2896 -182 -59 123 -53 -20 169 329 55 46 148 66 28 -208 -227 174 -96 107 -74 -88 -253 177 -135 -252
2918b52K88J82j14k33L62r0l64J62M5M4J00k15L10n4mj97m2K83k75K50l39O1M14
2941C22l16l94L22k23M46j88J20J7m17K71J92l92J89o7p5K79j66R0M1j88J8Q6
2963c3J21p7R7j16J53k0r9K16k58j90M88j36PJ2j57k35M22J01m00J77n1j8K64
2986B68m56L92j43J44m27M96n11L53j22O8J80j29r9K6j04M7J21J17k44j06M19
3007B90l57J33J04k08k28L58k35L25l35J51K15m63M26j51L0j49J51j80J53J45
3027A75K9l65J88P0N8o5j17p2K14j34l6J13J23j59m08L69o4K2l75J90O4M95l08
3050GO0J26k21N15m87k56N03j23j3J61Nl45o8j7L15j72K21l48K10Ql95J13K78
3073G7m5P4o0j81K1QJ89m63N20Nk14J02j9N2L7l34J67j51M03j49K27j24m2k50
$$ plain form
2918 -252 36 218 104 -129 233 143 -221 -59 -14 30 130 -85 225 171 167 -30 -72 211 -64 186 -153 -92 322
2941 322 6 -388 -66 -289 157 -31 89 106 -311 -40 152 -240 -51 -118 -193 86 -80 10 51 -137 -119 -33
2963 -33 88 11 108 -8 145 125 26 242 -16 -206 282 146 153 165 8 -227 195 296 -104 73 22 4 268
2986 268 -188 204 61 205 -222 274 -237 116 -6 62 242 113 14 40 -64 -17 104 221 -23 -129 290
3007 290 -67 66 170 -38 -266 92 -143 182 -153 -2 213 -250 176 25 55 -94 57 -123 30 175
3027 175 204 -161 27 97 155 90 -27 -99 115 -19 -55 58 181 22 -386 -17 -81 -59 -434 -244 -180 315 7
3050 7 67 193 -28 487 0 -256 247 124 111 272 277 -68 -136 -153 162 -10 211 -137 73 81 -314 -201 77
3073 77 32 106 46 -135 -114 -106 83 -380 140 145 -69 33 14 66 103 -231 -64 -215 188 39 266 142 100 -150
3097a50J42P5M2m9k91K04J44K1O7j05k08J05N1k48K86j39R3j02n3J16J42l2%k80
3121a69M02j03p9Q0l3P5l5k22l0j11L61k12K58q1k45L22j97q9P5N4j88L71k38
3144c4m2J98O9k70r8O9K6M2p1J81j9J00k31q9J41K09k89J79j2N0j8l62K04j07
3168a74JM17j48j05J47o5j66K85P4m59K71l75L87Kj19P1r1K4K35l15q9K30j76
3191a38j20K04j65L10j96l23L90J16j53J15j6M0j40L17l25J18k8j16J34r8J3r3
3213a54J98K4l8k57L80j86NJ58j6K0j93j4n2K70m4q2l4P4o6l8j34M42m01J07j86
3238b17M77j99k43Q2O4M7K52k81q8K41p3M52o37L12l18J55O3l38M04j42J5O2j66
3261g6O0P9j79j11P7J58m8p9J46k5K76k55j04J25k16K40k52J23P9J20l02J46q9
$$ plain form
3097 -150 -8 67 109 60 -231 -27 117 138 205 100 -108 -3 48 -200 86 -53 40 -62 -115 1 143 111 111 -169
3121 -169 233 130 51 131 98 173 138 -84 -114 -225 136 -76 182 101 -144 178 -19 -108 -33 21 -167 204 -34
3144 -34 -76 122 191 -79 -177 -108 -82 -40 -111 70 51 151 -80 -169 -28 181 -108 71 59 109 91 -271 -67 -174
3168 -174 -173 244 96 -9 138 73 -93 192 266 -193 78 -297 90 92 -27 44 -47 -23 212 -103 -192 38 -138
3191 -138 -258 -54 -219 91 -105 -428 -38 78 -75 40 24 64 -76 241 -84 34 6 -110 24 -74 -61 -154
3213 -154 44 68 30 -227 153 -33 -28 130 114 134 -59 -73 -125 145 101 19 -15 59 -7 -45 -179 263 -138 -31 -217
3238 -217 260 61 -182 -100 -36 11 263 -18 -106 135 62 514 -123 189 -129 26 89 -249 155 13 28 90 -76
3261 -76 -16 63 -116 -227 -150 8 -40 -119 27 2 278 23 -81 44 -172 68 -184 -61 18 138 -164 -18 -107
3284a07j54N03p3k06j2j19rJ32J20l87L48Q2J0M3k01j03K69k69J2J72l2J79j89
3307IM8j4Q6o1j67n7J77l7j02o3M32k56j43L05Pk04M6p1K5K96l73J28J36j63p9
3332i5Q3m9p3K77m42K17O9k2j12K16j83K78l10nlO6J80k7j52R1M1j90K25J22j93
3357Iq6K98p3j24k07L09k40J07L23k89o2m9N2J03k90J3R8P5L0K04k82j89L1L80
3381A41m8l17K43k14L54k50K84k34K41j02l5J55n33J40K35m18N45o4N0j32p1J5
3403a5J36k75J23j95l1K0L27l11J97P3L50l27l05K11j44Q1o2K82P8m88J71j6J6
3426a04K01j04K1j8J5j01J01l33N66j52K7o1L69P6l81j74Q4n5k9q6k8L17k37J92
3450A06k15J36k66K64K07j71R5l73mK68J26j38j64J05k32K66j49J49k24R8J03
$$ plain form
3284 -107 -261 242 169 -37 -49 -168 -177 -45 75 -312 36 118 128 171 -30 -133 136 -133 -121 51 19 198 9
3307 9 57 43 129 68 -99 -156 21 -16 -118 -181 251 -5 -148 157 164 -40 6 -65 -40 256 -117 11 147 -16 -95
3332 -95 -12 -61 -134 143 -299 -82 -13 -35 -147 69 -114 164 -146 -151 -154 -88 92 65 -87 4 45 -145 80 202 9
3357 9 -77 221 148 24 -183 126 -114 -7 316 27 -35 -84 -32 71 -219 -206 -108 -33 -3 201 -81 -270 -239 141
3381 141 93 -224 19 -195 159 -91 193 -41 200 98 63 218 -315 -175 60 -358 187 123 173 41 -30 -15
3403 -15 121 -154 -31 -226 -257 -237 90 -221 -24 49 399 72 -233 -22 -166 -85 -147 135 213 -275 -104 -120 -104
3426 -104 97 -7 14 -4 11 -90 11 -322 244 92 119 58 427 503 122 -52 32 -23 -52 -138 -166 151 -86 106
3450 106 -109 27 -239 25 232 61 156 -217 -221 47 173 35 -129 -24 -256 10 -139 10 -214 -116 -13
3471a3n1R8p5L5J03Q1j56k14j6M12r8k63Q9Q1J6j07J87j33l7l7N6K31l2Q6j54
3496H9j4j45M6p8n4MJ29L3j46M8J18Q5om0%j8J24j52K1m1Q1k43k7O3J38J45p8
3523H2k2k14p3M23lj49k98K53j8J42l15J08M4n7M55m50O5k15K66k5j3r9l2K54
3547A09k89K22J84m15n3M18r4j46L63l89K41J30l51J73k55K28j98K9l82M07o4
3568a32l0K34n0j70K16j74O2j54J86K06l29J42j29J20k14L88k18O5n1Lr8K0j9
3591a26P6p9M68k68j60o3J65J65j29n1l30M55m22M15k13j06K96j9l48J83K25P4
3613B08p6k34K36M0j54J17j98K30J42k37M1o2J99l30K7j1J48O5j96K12k13L20
3635B74l57L54r7j70n7m3Q4k5m2j42Q8L2L4k50K18J92l0J2p6Q1O5p1l49K12J67
$$ plain form
3471 -13 -64 34 -41 -6 97 178 22 -192 -208 204 106 -157 -68 13 29 -78 109 -24 -61 -98 -42 189 157 243 89
3496 89 75 -70 -24 -102 -156 -152 -23 10 -136 -88 30 115 109 69 69 51 175 23 44 3 84 -159 -186 -123 15 160 82
3523 82 60 -154 -227 196 193 44 -254 -1 -19 123 -192 -84 -40 -97 358 -92 -27 -242 24 -1 -14 -113 -145 109
3547 109 -180 42 226 -189 -242 176 82 -64 299 -90 151 281 -70 103 -152 76 -122 -93 -475 -68 -132
3568 -132 -162 72 22 -148 68 -106 -44 -198 -12 194 -135 7 -122 -2 -216 172 -46 19 -32 -29 -127 -107 -126
3591 -126 -50 -129 339 71 -89 -152 13 178 49 -2 -332 123 -299 116 -97 -203 93 74 -274 -91 134 208
3613 208 132 -102 134 174 20 137 -61 169 311 74 115 53 252 -78 -51 -62 86 151 -45 167 -46 274
3635 274 -83 271 174 4 -53 -96 -12 -37 -79 -221 -133 -101 -67 -317 -99 93 63 75 -1 80 145 74 -275 -63 104
3660A04j54l0L11j71j88Rj01L62q5k2R9j76j09J46J2rM3L25j39m08R6o7J90j7
3684B1J49J25n7j76J5j20J17j85J70j99K67L4n7n5N6k2j64J04q4j90L53j3j63
3707g4Q2j37j36J91k41L45N6pJ06l1j62O4j61r3K49O0K0pj96O3K65j70N1j29k49
3732b41L36k91J33O2j8J61l66J76N5j67L8nJ85l9j87J51%k7J58j52j08K50r3j32
3756a21K55j12l85L59O4j70J27J67m31K89j81MK05k01J88MP9J24l45R1q9r1n7
3779b27J64K84l58j0M5K24M3mq9O7o3r7k78M21o0j14R8q8K05l36M5L6K62l27J21
3804c6r3ol8J70M8j84K03j58j04K57j14J63k84L98k39M2k44L64k07m14M49M4J1
3827B8K5m7p1l4N6K88j36j47Q8j31j58M08l12M34m02J60p8Oj56K90q6J89k39K11
$$ plain form
3660 104 -50 -80 231 60 -128 -119 -220 142 57 35 134 -42 -151 -5 7 -2 41 366 227 -181 -85 -152 38 21
3684 21 170 295 238 62 77 -43 74 -111 59 -140 127 161 104 49 105 83 -81 23 -61 -251 102 89 -74
3707 -74 8 -129 -265 -74 -315 30 86 79 185 154 -8 56 -105 -198 51 111 131 124 -72 -9 256 86 137 8 -241
3732 -241 95 -196 -63 -1 -19 142 -224 -48 7 -160 -122 -127 58 19 -168 -17 -17 -44 114 -38 -146 104 11 -121
3756 -121 134 22 -363 -4 60 -110 17 184 -247 42 -139 -135 70 -131 57 61 140 264 -81 10 -79 -170 -227
3779 -227 -63 221 -137 -147 -102 122 165 161 72 139 76 -21 -299 122 62 -52 46 -42 163 -173 -128 -92 170 -157 -36
3804 -36 -129 -135 -173 -3 45 -139 64 -94 -198 59 -55 108 -176 222 -17 25 -219 145 -62 -476 -27 17 28
3827 28 53 6 -65 -99 -43 245 109 -38 50 -81 -239 169 -143 291 -111 49 -29 -23 -179 111 25 214 -25 186
3851A86l99L73j86K36j62M0L4n20M11P0m6Q8k54L74k47j55Q3j82L21l03R4R5l70
3874d19M93k14k06L40K40m20O3J33j04J77k10Q8K21k71k03M47j76L9l14J87j55
3895b64M04k10l2J07Qk5j24J61j99L32k13J98k78j9L10j80J83j09k02p1L07l61
3917b77K46k1K36l16K56l55L78k30J23m5L0Knk12L34j49j08K63r3j04J0L8j56
3940a55j7J37o6j57N7R0J37r9m1P1q8J03j35L54k79K86j64O9j5L42n52J39Q1q3
3964A5q2J8J05Q5O4k28J75J26m20K55l47J95J06o5j03j67J3R7r4K77j31M1J12
3987D7j9j23J25j62o5K81n7r4P4k22J80J18J8J11L0N9m73n3J77J5N4q7l9J62m77
4012d20N93m19L16n2M3Pj79M3J21j7P6J4l32K32J30j81j66O7K82j66j58L68j72
$$ plain form
3851 186 -213 160 -26 210 48 88 122 -398 13 83 37 125 -129 245 -2 -157 -74 -256 65 -238 -144 -49 -419
3874 -419 74 -140 -346 -6 234 -186 -123 10 -94 83 -127 -39 182 -89 -292 155 -21 18 -296 -109 -264
3895 -264 140 -70 -102 5 13 -12 -136 25 -174 158 -55 143 -135 -154 156 -24 159 50 -152 -223 84 -277
3917 -277 -31 -52 184 -132 124 -231 147 -83 40 -5 25 27 22 -190 144 -5 -113 150 57 -47 -37 1 -155
3940 -155 -172 -35 -101 -258 -201 -111 26 -73 -114 -43 -131 -28 -163 191 -88 198 34 103 88 430 -122 17 98 15
3964 15 -67 -49 56 141 205 -23 152 278 -142 113 -234 -39 67 2 -101 -268 -255 -158 -252 25 -106 -65 47
3987 47 28 -95 30 -132 -197 84 27 -67 7 -215 -35 83 101 212 242 301 -172 -225 -48 -33 21 -66 -105 57 -420
4012 -420 173 -246 70 18 61 68 -111 -68 53 36 112 126 -206 26 156 -25 -191 -124 158 -8 -166 202 30
4035C0J2Nj65k4J73J94j68Q8j90n8Kj40R5K14L5l18R7J10Q2k17J45P4q7j24K57
4060A22q1k22J31K43l78O2J05n1RL04J18m20l6J57J19q2k05RJ43P7p4J93Kk12
4084C3Q8j66k1rJ25j49J36j84n3M77k10k73O7M3J75j13j12J80N6r8N0j53L38k76
4108d9r5L60k24j3k38M75l99J50m7k84M34m0m6j40J84l6LJ18m06L65k09J44Qr2
4132g7k02J23K46q1O8j12J16M5q0LRl31N61k31R6j69k48M12l39J03J49J14k19
4155d4M10n09rJ60k07p2K95k1K8L85o49J01J03Q4P8k50k17K15J52J34o7p4Or0
4179e8N5K31l28J9k2K2o9J85p9J23k5J58J17j99p5j33K41o3J74jj25j94J40p4
4203B0l9P0j57J22k00J56K31nl15K38r5L7j6j9R4k42K08m9R3j14J05J35m35L07
$$ plain form
4035 30 42 47 -118 -142 31 225 57 145 -45 -103 -101 -241 -146 68 103 -215 -118 -8 74 -143 2 76 -11 -135 122
4060 122 41 -181 -50 193 -185 -123 -18 -69 -60 244 362 -58 -94 63 182 100 -105 -96 47 124 50 243 245 33
4084 33 121 -45 -66 -75 50 -99 37 -147 -200 277 67 -206 -139 -96 79 -34 -146 34 90 -8 42 -111 227 -49
4108 -49 -144 216 -8 -21 -259 216 -183 -33 -80 -364 70 30 -16 -156 28 -8 -5 113 -293 72 -137 7 15 -77
4132 -77 -279 -156 90 9 77 -35 81 126 46 49 58 -273 288 57 153 -16 -264 148 -191 -88 61 175 -44
4155 -44 366 -143 -152 8 -199 -271 24 3 31 416 -233 -132 -29 55 133 -117 -334 -119 33 167 100 26 32 -58
4179 -58 -3 228 -100 -81 -103 -81 -150 35 -44 79 54 212 329 130 55 -78 163 100 274 273 148 -46 94 20
4203 20 -19 51 -106 16 -184 -28 203 198 -117 121 26 63 47 28 122 -120 88 39 132 18 123 258 -177 130
4227A30l0k33K71j12k2j9O6L4j22N2l1K4m0J04o2J1L28l83lK66j92k29L61k18
4251d9q5J00J49j03O4K7k67K08q2mP7n7k59L00L9J7mo5l5K63q2j98K52j69J80
4276B17J5j33L6l0j56k6K03o7K55n03J97l1N2n4r0K03R3l29K17l8J89k29L25k59
4300E7k03K53j59J92k04J40o4j87j37M26j58j94N1L00N4j10J24m4k65Q3L99m30
4322g6K07R6n0j88pJ72k49o6J17j35k3K65L2r0L1j3j13OJ68J1J87l80K53J9j38
4347C6K1j29J12k86k6K40Po3L73m00K11K5j26k08L67k59J70p3J34rm06K15QK8
4371c8m4J5P4J8L2k61k9J43l1J14P4q1J15k65K74l12L49j86P1J46m66L21k9J34
4395A38j43j65K59J13k65j69J94J81j99J85r3l13L75j20K27j88J25o3L5k08n3
$$ plain form
4227 130 100 -133 138 26 4 -15 51 85 -37 15 -16 8 -32 72 10 21 349 -34 -37 229 37 -192 169 -49
4251 -49 -134 -34 115 12 76 103 -164 44 -38 -42 35 -22 -281 19 58 75 71 6 -29 234 152 -46 206 37 217
4276 217 232 99 135 105 -51 -77 126 59 314 -189 8 -23 29 -25 -115 88 181 -148 69 31 220 -9 316 57
4300 57 -146 107 -52 140 -64 76 12 -175 -312 114 -44 -238 -187 113 167 57 181 137 -128 -45 354 -76
4322 -76 131 227 177 -11 -18 154 -95 -161 -44 -179 -202 63 95 5 36 23 -90 -84 84 95 282 -98 155 174 36
4347 36 57 -72 40 -246 -272 -32 -25 -88 285 -115 96 121 -5 -213 154 -105 65 -8 126 117 -289 -74 -66 -38
4371 -38 -82 -67 7 25 57 -204 -233 -90 -121 -7 67 -14 101 -164 110 -202 147 -39 32 178 -288 33 4 138
4395 138 -5 -170 89 202 -63 -232 -38 143 -56 129 36 -277 98 -22 205 17 142 79 114 -94 -147
4416a47K13N0j58k5J02%Q2j48N9j37p6J44K30j01k35K45k77Q9K4P5o1P3m4n1j07
4441a81q0L94k73K45o8j58J46K75m69P7q2o1K01J00JQj59K0K50k49J61nn0k49
4465b06R6K0M6j98K25j0l1j56J57j33L34k78K06P3j68j73p0J49L63k60M4J24k18
4488f4L63k00J44l85K54K28l06n3l2l5K71j23j88m9K81J76n65K91R8j76p1K78
4510A37j32j05L5J37J99m62J99j8NO3k59L00k1j50J84n6J73k68J75j12j55M7m6
4533a30R5k2M9o0P1L9J05k59L0N5o3K8J96j94O1nJ2J29l72K49k09L50j73j54K61
4558H9o7j24P1K8J05k6k54O8O3J03K2m8l2L05k30N2k88L64j54Q3k46L37k22R7
4582I6L26m48Nk9R4j1L14l74j29J62J79p2j34L5m1k0o0K2K00l3l45K13K9P1n5
$$ plain form
4416 -147 66 116 -42 -67 35 35 117 -31 28 -109 -185 -41 189 88 -147 98 -179 -90 -66 9 -52 21 -23 -74 -181
4441 -181 -261 133 -140 105 37 -121 25 300 -169 -92 -174 -235 -34 66 67 75 -84 -64 186 -63 98 93 43 -206
4465 -206 -110 -90 -44 -242 -17 -27 -58 -214 -57 -190 144 -134 72 145 -23 -196 -266 -117 246 -14 30 154 -64
4488 -64 299 99 243 -142 112 340 34 -19 -51 -86 185 62 -126 -175 106 282 -283 8 106 -70 -141 137
4510 137 5 -100 -65 72 271 -191 8 -10 -5 58 -201 99 78 -72 112 56 229 -39 136 24 -131 -84 -130
4533 -130 -35 -57 -8 -68 3 42 147 -112 -82 -27 -90 -62 134 -60 1 -4 8 137 -235 14 -195 155 -18 -172 89
4558 89 22 -102 -31 -3 102 76 -178 -110 -47 56 78 30 -2 303 73 125 -163 201 47 130 -116 221 -1 96
4582 96 422 -26 -21 -50 44 33 347 -27 -156 6 185 113 -21 14 -27 -47 -107 -85 115 82 -263 -50 -21 50 -5
4607eL9j30M7O3J11j36L5l66L55j63M21j35l54J81J04pJ34j46k0r5O9J42k02o8
4631a26K12r5J72j01k9K19k55l2R1j55J87O0n5J74j69J27j03l9k2N2j12K55k49
4654GM2J55k17j64J55j72Q5K91k14R0j73J69k66J26J83j84l29M03J56n67M37k02
4676a89J27K25p3m58L29J75k81J26PQ8k52L66j09j04j7J34p6R5lK38n06K77k87
4699a68K56P6M6o3k62J75r3j81K33k23L57Pk41o5P1M85m71j0R0j34P9J70J5j61
4723a2L09j36Q0k49j54J6O7l3q7K47k35j05J54J72j08J20R0k1k38K21L4q3j73
4746a24O2R0Q7j79L29k31q1L92m30l48L47K01j03o0K6K23l66L0R0l1M89m30N4
4769C7j36RL6P3J16l56l2q6J62M8O8M0Pj47R3R5M0J0m3O0j47L86j52m0m08K83
$$ plain form
4607 -5 34 -96 -49 14 125 -11 24 -342 13 -150 271 136 -218 -37 67 60 194 48 28 -67 2 144 -58 -126
4631 -126 86 -9 163 62 33 252 -3 -35 56 -99 88 148 93 267 98 225 122 83 61 113 1 256 7
4654 7 49 204 -13 -177 -22 -194 -109 182 -32 58 -115 54 -212 -86 97 -87 -416 -13 143 -424 13 -189
4676 -189 -62 163 90 -368 -39 136 -145 -19 -12 76 -176 190 81 -23 -40 94 18 113 110 348 -158 119 -168
4699 -168 88 164 210 147 -115 60 -33 -214 19 -204 153 160 -81 -146 -75 410 -61 -71 19 -115 -36 134 149 -12
4723 -12 297 161 241 -8 -162 -146 -79 -112 -199 48 -187 -292 -138 34 -74 46 136 115 -123 98 132 49 -124
4746 -124 -62 28 115 -64 265 34 -47 345 -85 -433 -86 115 12 -48 -22 201 -165 -135 -45 -76 413 -17 37
4769 37 -99 -90 -54 19 135 -221 -253 -339 -177 -129 -61 -21 -14 -161 -68 27 67 77 34 94 -53 333 181 141 -267 16
4795A6m4j51J71J81j88K0j26K2Rj53J69J55p4j87N6J38k24L65l20L34N5l20O4
4818c2k92K05K7K15k67L9K33j7j32j3o1K07j44M8r2K55l75O9J22J4k97K28R3R3
4842A26ok82L24J2n8k10%K60j69J29k22p0J49j88n1J79j28J97pJ42j45p4J94k91
4866a89oR2J6n3m4mJ42J40Q9k64J04k6O2l6j29K09o8m9O3R9l91K66K33j82K15
4891B89j15j36k1n8p8K76j7L8l38K12o2J20j19K5%k6J37J9j41k3J37q3j28K77
4915A85j29l65L13J44k06%o4K01J53p7k71N1J38j8j78J90q1k00J67K1j09M3j04
4938a96J16N8J8J40l07K95l25J39L6k9M3j20J03J01l74P9N73m05K18j28r3K7M5
4961A4J65L9j59N5j77J41m9o6M44k50M9m82M48k9j17n4N8j71J52K87n02K72j44
$$ plain form
4795 16 -28 -179 -8 173 -15 5 -121 -99 -90 -243 -74 81 7 -180 -124 14 -210 155 -165 169 224 -96 -32
4818 -32 -324 -119 -92 123 -144 -105 128 111 -21 -34 -95 112 -32 16 -76 179 -196 -127 -5 9 -288 -60 33 126
4842 126 120 -162 162 174 116 -94 -94 166 -3 126 -96 -166 -17 -205 -256 -77 -205 -8 -15 127 -18 -92 102 -189
4866 -189 -195 -103 -87 -140 -184 -188 -46 94 183 -81 23 -3 59 23 -106 103 35 -14 49 148 -243 23 256 74 289
4891 289 174 38 17 -41 -119 157 140 178 -160 52 -10 110 -9 16 16 -10 127 146 5 -18 119 36 -92 185
4915 185 56 -309 4 148 -58 -58 -122 79 232 155 -116 -65 73 55 -123 67 -14 -214 -47 -26 -135 -92 -196
4938 -196 -80 -22 -4 136 -171 124 -201 -62 -26 -55 -12 -132 -29 72 -302 -223 350 -55 163 35 -58 -31 14
4961 14 179 218 59 114 -63 78 29 -37 407 157 206 -276 172 143 26 -28 30 -141 11 298 -204 68 -76
4984g6O2j14J86n8p3J13o4j79L48l79M38l26P4j02J9Q4m1n2Q4J34m37M30j58n9
5008a46K14j04pK21K36l54l12K61J40l67J71j55L27j87J7K17k52K51j52J53k41
5029f9q2J03jp3J60L3L1m1J00k08K86j74r6O6J7rl56M46k78J87o8J78l62K54q
5054C6N6j45J5k3j55L13k48K09lJ44k54Q9k1N1j02J88r9j93J90J11k40N7o0M6
5078c8j9rl62N11q6o2J48k12M72n64M1J81J03k04K10j8k51L57n29K43K95l3k90
5101a16J05K85m11K22mj24L38j96m89L66K34k70K27o3N8r2r6j59N7K19mQ1r9o
5125F3j26N5k50N57k52k4kJ3n3J50qn01K08k3L53k75O1J8k1l9J36K35k70k89L90
5150A06j56J23m3j32M1J11k0k34L58q1k3p1rK33k12RK16k38q3K60jj98J75m7j17
$$ plain form
4984 -76 -14 -128 58 0 -73 40 -24 -203 145 -234 204 -122 -48 -150 -131 -47 -88 -140 -56 78 -359 71 -87 -146
5008 -146 68 -36 -43 178 414 60 -252 9 149 -218 -47 -202 125 -62 -45 172 -80 171 19 172 -69
5029 -69 -151 -48 -49 -122 38 71 102 61 161 -47 239 65 -31 35 52 43 -313 133 -145 42 -26 152 -210 44 36
5054 36 92 -53 -38 -61 -216 97 -151 58 55 199 -55 34 13 64 -38 150 51 -142 48 159 -81 -24 -84 -38
5078 -38 -57 -66 -428 83 -3 -65 83 -129 343 -221 -180 1 104 -100 110 92 -159 198 -331 -88 207 174 -116
5101 -116 -11 274 -137 85 81 -43 295 99 -390 -24 210 -60 167 104 162 70 -26 -185 -128 91 87 168 69 63
5125 63 -63 -8 -258 299 47 23 21 34 -19 131 123 -378 -170 -193 160 -115 -54 -36 -57 -96 40 275 5 -284 106
5150 106 -50 73 30 -102 -61 50 30 -204 154 73 50 -21 -30 203 -9 0 216 -22 -105 155 154 -44 131 84 -33
5175c3J0J82j32r6K48l60J40K20l00L87k69J2P4q6j76NJ78N8K64o76L09K10n62
5198c93L81j76K53r9j2M7oK0k6l8K6K43k61j59J39Q7j16J06j23J83l9j06K53l64
5222a80K0J59J86k83j06J60J32J48k49j54K46k14J03L3j74L29l21K10J6O5q5m8
5244gj37K26k70K21L15l36O0j19L5q4L35l54J15L1j65m0J66J42l15K16r3n2L18
5267B08k40J16Oj02l4K99l21n4K84m87K45J46k88J21J18N7K23j90p5J03p2O0k32
5290a09J9P6j02J51K12l49R1o9k15L09J64o5j29l6J48rl41L30k38P1j66M7L1R6
5314h3K8k68N72k21J31j52j85J79K37l05J15k15L06l27Q4p4P8K79l48j49L24J43
5336A49k22J36J66l48N2n5K16j53j1J20j83K10L7q3M9j54J39j11m4k2K6K47m5
$$ plain form
5175 -33 -23 159 27 -69 179 -181 -41 179 -121 266 -3 9 83 -3 -179 -174 4 62 326 -350 -41 169 -393
5198 -393 -12 -188 65 -34 -46 1 -5 15 -11 -49 -23 220 -41 -200 -61 26 -90 16 -107 76 37 -69 184 -180
5222 -180 -160 -1 185 -98 -204 -44 88 236 -13 -167 79 -135 -32 1 -173 156 -165 45 61 126 41 -7
5244 -7 -144 82 -188 33 348 12 72 -47 -12 -96 239 -115 0 31 -134 -174 -8 134 -181 35 -58 -110 208
5267 208 -32 84 90 -12 -46 253 -68 -122 162 -325 -80 66 -222 -101 17 74 297 107 32 135 63 123 -109
5290 -109 -90 -14 -116 35 247 -102 -11 -80 -295 14 178 113 -16 -52 96 87 -254 76 -162 -91 -257 -210 -179 -83
5314 -83 -55 -323 249 28 159 7 -178 1 238 -67 48 -167 139 -188 -104 -178 -100 179 -169 -318 6 149
5336 149 -73 63 229 -119 -67 -122 94 -59 -70 50 -133 77 114 31 80 -74 65 -46 -90 -112 -86 161 116
5359A16l39M01R8j73R0o5k15J68l67J53J81o5K12n46K90J08J69p4j63j1J04K4
5381I6j24K52k06K52k37O0J74o2j42j16K10j22R6M9j34j76P9j72qP3J75J06j10
5404A3k43K44J22j02N2p4j35J27K5l14K42j4J10o5K10l0j16k34J82L19r2k42L2
5427A7J28o17J31M3J75K24j4l08K83K4n31M70j21j14Q8M56m51L44k59J4K44l19
5449i3O4K47J20l15L31m71O1p6K03K9J3j5k22O3J80j98K08l29K54o7J11m00N21
5472B19N1l69K41k46J68N1lQj02l4q1K4k2J48j04J96k76O2K12k60J11k8J45k80
5496a69J50j87L13q2j73on1J59M16l37%pQ0M7j30j66J11P7J4Q7j25L2k40P6K38
5521A27j82M5J07j12R9L9k12J11J8J50k14J49k26J48k36J47ok98K98K40l82J39
$$ plain form
5359 116 -223 178 276 103 193 128 -87 81 -286 -133 48 -17 195 -351 -61 47 216 142 -21 -32 72 96
5381 96 -28 224 18 270 33 93 267 205 63 -53 157 35 131 180 46 -130 -51 -223 -231 -158 17 123 13
5404 13 -230 14 136 34 86 12 -123 4 29 -285 -43 -57 53 -12 198 168 52 -182 0 319 227 -15 17
5427 17 145 -472 -341 -298 -123 101 87 -221 62 86 -445 25 -96 -210 -122 334 -117 227 -32 -18 226 -93
5449 -93 -29 218 338 23 354 -117 -56 -132 71 100 113 98 -124 -61 119 -79 129 -200 54 -13 98 -302 219
5472 219 270 -99 142 -104 64 115 112 120 18 -16 -97 -73 -95 53 -51 145 -131 -69 143 -117 -6 -34 111 -169
5496 -169 -19 -206 107 25 -148 -154 -205 -46 370 33 33 26 106 153 23 -143 -32 45 59 146 21 53 -187 -111 127
5521 127 -55 -10 97 -15 84 123 -89 22 40 190 -24 125 -101 47 -189 -42 -48 -346 -48 192 -190 -51
5543e1K63j81r7J24J8q5J0oj82K81k68L9K99j77L26j67J34q0Q1n88K54Q2J4j39
5567i6J19l11K41R1L5j62M6J38Q6l82O6m7L01k27J56k00o1M38l1n7k04M2jj5j65
5592b00Q9L81l45L18j27l4J34r0j18j33J58p1L12l65Q5K37m35K48J1R6J54m08
5614a03P3J34L9k20j22J77M1Qj13K18j60K21k31j52J40Q1l9k41k7K73l17L58j7
5637B1j09J81j62J43l96L28q1J57j75N2J18j85L92l18L06m80L52j22K5k0J5R8
5659A40k0j78j85J94j81J08K98K7l03J04j78K10pk40J84P6R6k08j27N03m11K55
5681A57l00j98L85l40K86K58n28L67L5p8p6k92L12r5K47l69J28J94k47L06qj50
5703fJ86l25K7J54n8nJ05k81K79k34R5K13n08K33J36l0J2J08P0j20J90m0n7n04
$$ plain form
5543 -51 212 31 -66 58 76 -9 1 -5 -187 94 -174 -135 164 -13 313 146 280 200 281 -307 -53 29 43 -96
5567 -96 23 -288 -47 44 79 -83 -37 101 187 -195 -129 -176 125 -102 54 -146 -207 231 200 143 -61 -19 -20 -35 -200
5592 -200 -111 270 -75 243 116 82 216 126 8 -125 33 -38 274 -91 -6 231 -204 44 55 151 305 -103
5614 -103 -30 104 143 -77 -199 -22 19 27 -86 132 -28 193 -38 -190 -50 31 -8 -249 -276 -3 -320 38 21
5637 21 -88 93 -69 74 -322 6 -75 82 -93 -41 77 -108 284 -34 272 -208 144 22 47 27 42 140
5659 140 120 -58 -243 -49 -230 -122 176 203 -100 4 -174 36 29 -211 -27 49 145 -63 -190 313 -98 157
5681 157 -143 -341 44 -296 -10 248 -280 87 122 44 -32 -324 -12 -107 140 -229 -101 93 -154 152 144 -6
5703 -6 180 -145 -118 36 -22 -27 78 -203 76 -158 -63 150 -358 -125 11 -19 -7 101 171 51 241 201 144 -360
5727c60N53k80J29K11m38R9J14j32Q3J63k42j7J19j78K58m76M03K32k07l53N19
5748B00j13j49J95k34K09L1M6m29J50L79k43K48k63J12k74J26J07j39K78o26M00
5769A1k2O0K8MO7N0j59j1r7j3J70O3n2k92J04N4J32k18J89k2J86l19J5Q8n7L4
5795gN7j90J16K5MJ62j91J91j07P7k56J02O1k27J97Jr4N0O7P9l13L94o5j33O3
5820F3K6k9k4n5K84j73j01k34M72k96K63k13o9K76k45n6m0K74k94L84j53L1J70
5843B61k38m8n4J25l5J81j89p2J10j1j75L30k6N2l0j37j62J89j98J72k26M24l96
5866a53K99K34n28K57R6j18l29L07J71n41rK86L6J02j6n5j39J55j30l1K11l9q3
5889a7j21P4K42R2k25k36K07m7R0r3K5k1l7L3K54k94J80q1o9K13k84l13O60j20
$$ plain form
5727 -360 193 -87 42 253 -185 -86 28 -104 -21 142 -100 -117 2 -176 82 -394 9 241 34 -319 200
5748 200 87 -62 133 -101 108 139 185 -244 -94 285 42 290 27 139 -135 -9 98 -41 237 -389 11
5769 11 -11 49 77 81 148 198 39 28 -69 -82 88 151 99 -193 -89 -35 97 -121 68 46 232 -87 -72 16 -41 -7
5795 -7 50 -140 -24 1 5 167 -24 167 60 137 -119 -17 44 -183 14 15 -79 -29 38 117 -196 198 133 0 63
5820 63 89 60 36 -19 265 92 -9 -243 229 -67 196 -17 -86 190 -55 -111 -151 123 -171 213 60 91 261
5843 261 23 -25 -79 46 11 192 3 -69 41 30 -145 185 159 211 181 44 -118 71 -127 45 -181 243 -153
5866 -153 146 380 -148 109 205 87 -242 65 236 -305 -314 -28 8 110 94 39 -100 55 -75 -106 105 66 -17
5889 -17 -138 -64 178 270 45 -191 16 -31 59 -34 -9 -30 -67 -34 220 -74 106 25 -44 169 -115 -428 232 112
5913A12l1j44r7J62j40O2M02k22o5M6M4l46K65l36J9L6o2R7K10j54J77P7rl24
5937b21N2K58j08J7j24L09k31N3m5K38M2m06J15Q4k97J58m5R3p5K53j21L4J90
5960B23p6k54K03r4l15L84j25j66L24k64K10k04L99k00l5L20k48j34M2P4L3j49
5982e2L78j67K8l16K17J10j99j19j6K55n0j20J19K2l52M69Q2k45o8j03N2j11K82
6005I6l04M06j18k05J11q8l18N05k05K94j87j25J56o3j46J10M12k97M7j25K39
6026A95l11J97k21l0K36P4l09M7l0J10n0j51N5J61k05L29k92L33l83J86k4J96
6048A13k2j6L02m97N7j82J79RKK88j12j48J53j67N6Rj85PJ3l6J63L12j73k38J32
6073A9K6q6k8J90P5l18J96K0R7j43Q9k53J83k16K29j38J85l5l53R5J6K64k73K43
$$ plain form
5913 112 81 -63 -160 2 -138 -76 326 104 39 85 129 -217 48 -288 -269 -233 -295 -198 12 -142 35 112 103 -221
5937 -221 -169 89 -19 -2 -126 183 -48 5 -40 198 240 -166 -51 33 -264 -106 -151 -58 -133 120 -1 33 223
5960 223 147 -107 96 2 -313 71 -54 -220 104 -160 50 -154 245 45 10 330 82 -52 -10 64 97 -52
5982 -52 326 159 187 -129 88 198 -1 -120 -136 119 69 -51 68 90 -262 207 289 44 -24 -127 -75 -186 96
6005 96 -208 198 80 -125 -14 -102 -420 85 -120 174 -13 -138 18 -45 -191 -81 331 34 81 -44 195
6026 195 -116 81 -140 -170 66 140 -169 -122 -152 -42 -92 -243 -188 -27 -232 97 -195 138 -245 -59 -83 113
6048 113 91 75 377 -120 -63 -245 -66 -57 -55 233 121 -27 126 -41 15 24 -161 -154 -141 -177 -14 298 125 -113 19
6073 19 45 -41 -69 121 196 -122 74 94 191 48 137 -116 67 -149 80 -58 127 92 -261 -166 -150 114 -159 84
6097H4j89q5M21K9l27J94q9L1o1k6J21k22M9M6K4r8J3Q5Pj44L11k5j80K0N8k3
6123B4j75q7J54K7l4N1K77j06j31J30r6l0j61O6J55p4J25m34K07L1J91j97j7R7
6147gJ68L7j97k8qn6K20k08K11J37l66J63r4J25k30L75k86%j04M05k76J13j10
6170a6k4Q7J17k3j75J72J04m28J8O5R0N5k5j37J98K0r7p3k50L74p5J94k65L88
6194B94p37M77j56J01j27J87J23k72r8N3K10k08L12j98p2J24K00l82L90j27J15
6215B09k95N8r6R5j61n9K40n0J48n8q7o8R3kj28k43N66o5k33J00l2L9%m0l9j65
6241b73L28J25o4k17P5J11q5ml41K37O5K04j17J32j45k2j5L03l57K91m2l92J72
6264c1j10K62J75j88j72K44k39J0K82q4j78o0J73K18k26j2n8M6j10j0L7mj35J28
$$ plain form
6097 84 -105 -190 231 260 -67 127 38 69 8 -18 103 -119 -70 -24 0 -98 -85 0 7 -137 174 149 -31 -11 47 24
6123 24 -151 -238 -84 -57 -91 -40 237 131 0 130 34 4 -157 -91 64 -10 115 -319 -112 -81 110 -87 -104 -7
6147 -7 161 198 1 -27 -35 -91 129 -79 132 269 -97 66 -28 97 -133 242 -44 -44 -148 257 -19 94 -16
6170 -16 -40 47 164 141 -34 138 242 -186 -168 -103 -13 42 17 -120 78 98 1 -72 -322 52 -23 171 -94 294
6194 294 -443 34 -122 -21 -148 39 162 -110 -208 -155 55 -153 159 -39 -111 13 213 -169 221 94 209
6215 209 -86 -28 -124 -29 -190 -249 -9 -59 89 31 -56 -124 -31 -33 -161 -404 162 97 -136 -36 -68 -29 -29 -69 -108 -273
6241 -273 55 180 116 -101 -26 85 0 -4 -345 -108 -43 161 44 176 31 9 -6 297 -60 231 189 -203 -31
6264 -31 -141 121 296 108 -64 180 -59 -49 233 149 -29 -89 84 302 76 64 6 52 -58 -68 -31 -35 -170 -42
6288d2M0o7m8J68jo6K77m50M77r4j61r6J29k7R6Qj50k0K0J24j02j03P2j41P5M10
6314C28l92J09j06Q6j30J09j80J77j84K12K6m6J88j88j65L41n2k4k67M6K52k60
6336a20K95k85R3P0O8k51J76J9p3mJ07k69N7J92k02J49p5l3L62j20l2j22O7J33
6360B02k31J51k57L08l08J77J53o3j59K48k04j21J25j52Q6q9m7J03N4l9J83k43
6382a23j07L85k94J05J79k57pK2N9N4o1l4L59m49R9Q4j23L14K7K0j43k03M86o29
6406b37R5R2j31K07j78J99n2p4K22n27L51rm7m5M38l36K51j81J84m34O4L70k89
6429f7j2j27Q4K90j18J7j2J8j05K12k18PL6j91R7l4L71k46J4j24M2M05j62k06
6453b9J42j34J2N6r4K52m85K31J18j05J45m8m67M61o8O8M0l25L94k80J96O6m4
$$ plain form
6288 -42 -2 -69 -117 51 50 -16 261 -189 288 194 33 -63 66 39 135 143 -7 -27 -7 117 15 -88 -16 -157 -82 328
6314 328 -64 45 -61 25 -105 4 -176 1 -183 29 55 9 197 9 -156 185 133 109 -158 -112 140 -120
6336 -120 175 -110 -17 53 121 -130 46 65 -8 -12 95 -174 -117 75 -127 22 -53 -86 276 156 124 2 69 202
6360 202 -29 122 -135 173 -135 42 195 132 -27 221 17 -104 21 -131 -45 -134 -181 -78 -24 -63 120 -123
6382 -123 -230 155 -139 -34 145 -112 -119 -97 -38 16 -45 -79 280 -169 -70 14 -109 205 232 252 109 -94 392 -237
6406 -237 -142 -50 -181 26 -152 47 -5 -79 143 -384 -33 -42 -89 -134 304 -32 219 38 222 -212 -148 222 -67
6429 -67 -79 -206 -122 168 50 67 55 73 -32 180 -38 -31 5 -186 -89 -123 248 2 16 -108 -66 339 177 -29
6453 -29 113 -21 -9 47 -47 205 -280 -49 69 -36 109 61 -406 55 -13 55 95 -230 164 -116 80 146 102
6476A02k19L73l86R5k36lL58j88kK0rK30j75P2J24j79L02m84K59Q9k57J26L7L4
6500H3j67j0o8K19k06K34j08k10K71N3j5k67N38m53K12N7p1k76pK87k79J30p5
6523a28J10K2J38j56K38m17J86L6L4l04M96j22J33p1Pk72J53k4Mo8j7P7j6J15
6547A54j86l8Kj51L51p8j89J07N06l42j12J43j89L5m5o6J41m4P5N2k35L33j73
6570E1l5O2j53K20j90K14r5jj63J76k84K48K46j83k96J91Rk6j34R4m6k29M30O5
6594A71J40m30J51l40L13P5J20m52K89j29K26q6J23j79j69K27R4k45L20k77K88
6615B30j10k1k78j5M11j50lq8J04k05J04K14k76m1oj02R7l66L57L2P0k46O92k74
6639A30j27P7m4L8j20J68j76J09l8n4O0R0l84K75J6q1j78K80j05L04j60l76L50
$$ plain form
6476 102 -117 256 -130 -35 -271 -274 84 -104 -106 -86 -95 135 -40 32 156 -23 279 -205 54 143 -114 12 49 83
6500 83 -84 -94 -162 57 -149 85 -23 -233 38 91 76 -191 347 -106 106 163 92 -184 -191 96 -183 -53 -128
6523 -128 -18 4 142 -14 224 -193 -7 29 63 -241 255 133 266 195 202 -70 83 59 63 -5 -22 55 39 154
6547 154 -32 -70 -68 -219 132 54 -135 -28 478 136 24 167 -22 13 -32 -98 43 -1 74 126 -109 224 51
6570 51 16 78 -75 145 -45 169 74 73 -90 86 -198 50 296 113 -183 8 17 -9 -143 -49 -95 -324 106 171
6594 171 311 -119 32 -308 5 80 200 -252 37 -92 134 48 171 -8 -177 50 144 -101 219 -58 230
6615 230 120 99 -179 -194 217 67 64 -24 80 -125 -21 193 -83 -124 -130 -232 -135 -501 -144 -112 -42 -288 404 130
6639 130 3 80 36 74 -46 122 -54 55 17 -37 23 113 -271 4 20 -61 -239 41 -64 240 80 -296 54
6662E4R9l88N13j06j23J19j47l9J04r0o1K90m65L55Rk01jo4J77L9l2N1P5k90J55
6687C3j18k9K54p4Q0o6j93J46m5p5J23M5l18L52l76K18k97K13J75Q5m6N3l52L09
6711I7k74J44K36m63L68q5r6j38L07j73L0J57q1J58l10k27K20J46J86m44J23P
6733a12q7M16l0k49K6o6qN8J38n7k18K50n1j19J39R7k07J72q9Jl0K82j27j20r4
6758h5j10R2Q7j37P2M4P3j17L35k08l71M7M00k05K42k05k13R7J73K9j22J95p4
6781C9R2j63m7K52j80J65j91n9J12N7l19L45l19L86q4k0j90J98j55J18j03K19
6803A53rR7k38J88j72N1K05l45q2L7K24k94L12J43k92l0Q4J35o0j87J09K45J32
6826D06l28Q8q5K6%l0K42j45O2k28K0J36j45j87J47RR0k20M3K06j47J00J10l69
$$ plain form
6662 54 153 -235 278 172 49 168 21 -18 86 -4 -65 225 -240 115 124 -77 -78 -142 35 74 42 93 168 -122 33
6687 33 -85 -114 140 66 146 80 -113 33 -12 -87 36 81 -237 115 -261 -43 -340 -127 48 133 87 140 -212 97
6711 97 -177 -33 203 -260 108 23 -73 -211 96 -77 -47 110 29 187 -123 -350 -130 16 202 -242 -119 -112
6733 -112 -199 217 187 -62 -36 -102 -110 -52 86 29 -189 61 10 -109 30 127 -80 92 3 4 -26 256 129 9 -85
6758 -85 -195 -103 -16 -153 -81 -37 36 -81 254 46 -325 -278 122 -83 159 -46 -259 -162 11 40 -82 113 39
6781 39 131 -32 -79 173 -7 158 -33 -92 20 77 -242 103 -216 170 86 66 -124 74 -81 37 -66 153
6803 153 144 241 3 191 19 70 275 -70 -152 -115 109 -185 127 270 -22 -52 32 167 107 -80 29 274 406
6826 406 78 166 81 107 107 77 319 174 236 8 28 164 19 -168 -21 -12 78 -142 -99 107 -40 60 170 -199
6850a99m5K76mm73M88J1l52K99K59l49R2J41l38K35N1k70K41k49R3J0k4J24k79
6873b62L77J14k60N4l1J91n5j89k7r8J96J45n00M83k23J02K15j78q1kr6J89j15
6896e1N7L0j72K12j10M2r7O8L47l57L17l66j47M71k90P3L36l17k1Q8k23L80j24
6919A46r6l8K0j40J67k64L59Nk87K74j40K60m49R2Q3K12k24R3j05J39j00k33K48
6942B2%mP2j28Pj72J98j49J72j94K50k21K35jo9J09j02j33J51m6%k20m4K46K5
6967Dj60K09j71RK35Pr3k22n2J32J72j87J31K1L9J0p2p3L81k65j49j1K48k08M00
6992C35k92K7j70J98j73J04r1j07M10m12L15j26Q8k01J76L0l18J35J12M1k43L59
7014A97m0m0M0J03m8k88k25J18K32j83K26J55j28j11k86M73M6k71J45%j80J01
$$ plain form
6850 -199 -244 32 28 -445 43 54 -298 1 260 -89 3 144 -194 41 92 -178 63 -186 -93 -83 -107 17 -262
6873 -262 115 229 -31 23 -8 183 128 -61 -88 -186 10 155 -345 138 -85 17 232 54 -27 -29 -125 64 -51
6896 -51 6 36 -136 76 -34 8 -89 -21 326 -31 286 -80 -227 244 -46 27 363 46 25 113 -110 270 146
6919 146 50 12 32 -108 59 -205 154 159 -128 146 6 266 -183 -91 -8 204 -20 73 -32 107 7 -226 22
6942 22 22 18 90 -38 -31 -203 -5 -154 18 -176 74 -147 88 87 18 127 25 -108 43 -3 -3 -223 -267 -21 4
6967 4 -156 53 -118 -109 126 133 40 -182 -234 -102 70 -117 14 35 74 84 12 -61 320 55 -94 -105 143 -65 335
6992 335 43 70 -100 98 -75 29 -62 -169 241 -171 144 18 106 -95 81 111 -207 -72 40 81 -162 197
7014 197 157 117 157 260 212 -76 -301 -183 49 -134 92 247 119 8 -278 195 241 -30 115 115 -65 36
7036C6J57l11n1L62r1l34N24l83K65k52J17l94L63J92m46J03J66k09M3l8J25J71
7058A15p9j23J69j12m6R3p2o0J54l05L15r6q7J03O1O0p6j23R1K71k81J16K3m2
7082F9l7p0N6m9n4Q3O2mk23K60j36o0o8M1K5J41k19K85L9j50O6k82L43oJ44k12
7108D4j65o1K13j73N7L39j53p8k46L90P5k79L64q1k68l14K24K70o0k42K61k46
7130a29K4o9K72r8J53j90J22p1N5j31J22%K77o09K84m7Mj0m9P7Q6l68L43J09j25
7155C2j16K54k37M0j20m3Q4J41j61L74m14L52k12k4l5Q5K77q7l62J74K53k94J30
7178I1p9j4j73L00l48K92q6P5q7J20j21M15m17R8k23K81R9k76k6NJ19j29O7K11
7202A94j43q1k5N6P5l11K86j35j91K34k9M0J41k9k97J59j42M8N8K70l50L8L22
$$ plain form
7036 36 193 -118 -169 193 102 -232 292 -91 174 -78 39 -355 8 200 -246 -143 23 -186 -143 -181 -56 115
7058 115 36 -87 82 -30 -76 17 -55 -115 39 -266 49 -47 -134 -31 30 90 14 -109 -18 253 -28 88 111 69
7082 69 32 -38 18 -31 -85 -2 60 56 -167 93 -43 -103 -171 -130 -105 36 -183 102 141 -9 57 -225 118 112 256 44
7108 44 -121 -182 31 -142 -85 254 101 23 -223 167 242 -37 327 246 -22 -336 -112 158 98 -144 117 -129
7130 -129 -105 -174 98 0 153 -37 85 14 69 -62 60 60 337 -272 12 -35 -31 -41 -90 -13 73 -295 48 157 32
7155 32 -84 170 -67 -27 -147 -190 -106 35 -126 248 -166 186 -26 -50 -85 0 277 190 -172 2 255 -39 91
7178 91 12 -2 -175 125 -223 69 -17 58 -29 91 -30 385 -32 66 -157 124 223 -53 -79 -74 45 -84 -17 194
7202 194 51 -30 -55 1 76 -235 51 -84 -275 -41 -70 -30 111 82 -215 -56 -198 -150 -92 178 -172 -134 188
7225A88j60M9k25J32j49K25O0J11l11R9MK51k69J77p2k33P1m4J15n1j16P7K4k3
7249g0L67l84N6J58j44P9k27J62M7Q8j20k17M00l07kO4r3j43J45J62N7m08J34
7272a96RJ17r3K88l32K77j45Pq1Q5J20o3K52k92K55j85K18l44P1l0J05mJ52m46
7296b55K60M2k55N04k29j29j52K53J51m9J16o6Q3j27k06j68K83j01lJ46r4R0l55
7319b61P0Q3r6K08O3J21l81K20Q1J17k53R2o5o5K25k37o4K41j37j54L72J67m10
7342f3o7L80j94J36q3j73L17l43J6J44qj46K04j88M9k18m1L10p9L1j28L60j37
7365G9J10k29J77k26N04m63J38l00J93K5k39J33lj11K55k52L81l46K92j54l15
7386c51L79K06l16R4K02m84J85J60k88L40j73r2L30m09L55k48J59Q2j78J81j76
$$ plain form
7225 188 28 77 -148 -16 -165 60 120 231 -80 19 23 274 5 182 110 -123 -52 -96 19 -32 -148 -71 -47 -70
7249 -70 297 -87 -31 127 -17 62 -165 -3 44 132 12 -205 195 -112 -114 -50 -143 -286 -141 21 78 -330 -196
7272 -196 -187 -70 -163 125 -207 70 -75 -68 -149 -64 56 -7 245 -47 208 23 241 -103 -32 -62 43 39 191 -255
7296 -255 5 47 -208 296 67 -62 -214 39 190 141 257 191 274 147 -59 -227 56 -45 -48 98 4 94 -261
7319 -261 -191 -108 -204 4 67 188 -193 27 108 225 -28 64 -1 -66 159 -78 -142 99 -38 -192 180 347 -63
7342 -63 -130 250 56 192 109 -64 253 -90 -74 70 62 -84 120 -68 -19 -237 -278 32 -47 -16 -144 216 79
7365 79 189 -40 137 -89 415 -48 90 -210 -17 8 -231 -98 -101 -212 43 -209 172 -174 118 -36 -351
7386 -351 28 234 -82 12 214 -270 -85 75 -213 127 -46 -138 192 -217 138 -110 49 131 -47 134 -42
7407d2M9J77m64M74l92K52K74n08J72l89L91o6k2J20m5p3L51m29K36k0L6r4k30
7430b42L23j84J11l21J04N45l10j19J47J46l44K17o3J1j20K35p8l4j63J64k6j3
7452a4m4KK71j63K12k25n0J50m02L42L8l8j38j98K22K6l3k19L15p7O5R1j20j28
7476a15J87j30O6l6q8J59J19j69M0p5j50o9L64k77K91P0k34OQ0M4J7l53M27m55
7500b81J47K73R8k74k01K52k48K33O1J0J22l43j90L42o1Q3R3j04J89j41O2n0L56
7523D28n78Oj5n3K79l01L54l94K88kM6q0R3k85K22j3j7K67j79q2J71k3j41R7j8
7548G0Po3l0j0M5k0k20J51j17j8J08M17n73M03J18p2m7j81J55l02K79j51r6J38
7572ij31O3M41l36J6J92j47O9k16j11J64n4O0j78J01K3PJ44j70Q5O7q0L6L5j38
$$ plain form
7407 -42 7 184 -280 194 -198 54 328 -180 -8 -397 -6 -72 -94 26 -19 -92 259 -170 66 46 82 -12 -242
7430 -242 81 -103 8 -313 -209 336 26 -93 54 200 -144 73 10 21 -99 136 58 24 -139 25 -1 -14
7452 -14 -58 -56 215 52 264 39 -11 139 -263 79 117 79 -59 -257 -35 -9 -42 -261 54 -23 42 133 13 -115
7476 -115 72 -58 8 -28 -116 43 162 -7 33 -42 -192 -261 103 -174 117 187 -47 -41 39 83 100 -253 174 -281
7500 -281 -134 139 237 -37 -238 14 -234 -1 60 70 192 -151 -341 1 -60 23 116 12 201 60 122 72 428
7523 428 -150 -144 -159 -212 67 -234 120 -274 14 12 58 -22 71 -214 8 -5 -22 245 66 -16 155 132 -9 88 70
7548 70 77 14 -16 -26 19 -1 -221 -70 -187 -205 -97 320 -253 150 268 196 149 -32 123 -179 100 -51 -147 -9
7572 -9 -140 -77 364 28 44 236 89 158 -58 -169 -5 -59 1 -177 -76 -53 -46 98 -72 13 80 0 36 71 -67
7597f7R8k3lnJ54O1j24l30L05j99L05l20K33j24q6J64n6Q4J77k14j7j72J34M7
7621B2k94L32j07pJ39k98K68j23J3L5N1j50J02k45K99J23j75j53K21Q8j13j6K81
7644B93l51k66K87k10J25L86j27k16K28N1q3J34k2m49J03J58l09L09JL6j25J56
7666A09J24j57o1O2q0k77N33k68J27k22K69j71k3K23k76K08q0jN7j06Oj81M61
7689B76n98L74k2p1J84o3j12J9J9J5j12kK40l03K83j22j06R5j25K60k18K13k20
7712i6K50k68P7k47K71K24j46l66J29n7J64R0j96K31n1j77J73j06j1K02p3j48
7734a31J49j18J93j95p6J66l1J10k07J93J71k09j63J33J53r2k52L36k84J86k19
7755a87K68n92M57J52ln8P9r1M8M9k58L45j84k1k74N65o8j84q5k11K82j53N2J82
$$ plain form
7597 -67 31 8 5 0 154 215 91 -239 66 -133 172 -148 85 -39 -125 39 -17 67 244 30 13 -159 -25 22
7621 22 -272 60 -47 -54 85 -213 55 -68 -55 -20 31 -119 -17 -262 37 160 -15 -168 53 141 28 12 293
7644 293 -58 -324 -37 -247 -122 264 137 -79 149 200 117 251 229 -220 -117 41 -268 41 42 78 -47 109
7666 109 233 76 15 77 -3 -280 253 -15 112 -110 159 -12 -35 188 -88 120 40 39 96 -10 -4 -185 276
7689 276 -322 52 30 -41 143 80 -32 -13 6 21 -91 -93 147 -156 127 5 -101 -6 -131 129 -89 124 -96
7712 -96 154 -114 -37 -284 -13 211 65 -301 -172 -229 -65 25 -171 60 9 -168 5 -101 -112 90 17 -131
7734 -131 18 -100 93 -102 -178 -12 -43 67 -140 53 224 15 -148 -15 138 46 -206 130 -154 32 -187
7755 -187 81 -511 -54 98 95 37 116 25 73 122 -136 209 25 4 -270 295 227 43 -42 -253 29 -124 -72 110
7779A10J24j29l58L35N1m7K0j75J18J26K1j02j54N9l6J39Q3k60j24o4K39j70N7
7802a37J38N4k35M7r5K27M06m83M7k08K94J53l28K35k7j87K28j45nm3J81k58J04
7825c7j27Q0K57j60j66O6M5J11O7J31Nk20k2j35L02L9j26k58K90q6n8N2k05J91
7849C6j13l20K57L24j97p2l6L66o8l00ljO6R5ML5k52j09M12r9k28J57o0J66P3
7874A33r5K29j35p2j24j51K20q3P3k0p7L13k37j40kK47k03R3q0j56L35l40K52
7897b0j53J48j69%P4j0J5j7o1J73k58M69r3n0j84k24N62k19n0k9K08k1l0N2l7
7922G6q4j84J14q2L70k88K31L1n3j62K13l43J95j57L04l25K10l2j3L8j86K83j72
7945a6j81M14j54n6Q5l50M81k71J54N8k24K39k54J13k21L48j48j3j40J06j97K82
$$ plain form
7779 110 234 105 -253 82 133 86 106 -69 49 175 196 94 -60 -1 -37 102 185 -75 -199 -263 -24 -194 -137
7802 -137 1 55 -180 -133 -228 -1 405 -78 -31 -239 55 208 -120 115 88 -99 129 -16 -21 -64 117 -141 -37
7825 -37 -164 -84 173 13 -153 -87 -42 69 136 267 272 52 30 -105 197 236 110 -148 142 56 -2 50 -155 36
7849 36 -77 -397 -140 184 -13 -85 -121 245 177 -123 -126 -127 -61 34 38 73 -179 -288 124 25 -203 -46 -106 60 133
7874 133 38 267 132 60 -64 -215 5 -78 -5 -25 -102 211 -26 -166 -168 79 -124 -31 -111 -267 68 -272 -20
7897 -20 -173 -25 -194 -194 -120 -130 -115 -132 -193 -20 -278 191 98 48 -136 -360 202 -17 -67 -96 112 91 61 113 76
7922 76 -8 -192 -78 -160 210 -78 153 184 131 -31 182 -161 34 -123 181 -144 66 34 21 59 -127 156 -16
7945 -16 -197 217 63 7 92 -258 223 -48 106 164 -60 179 -75 38 -183 165 17 4 -136 -30 -227 55
7967E5J71j33O4k65K77k73K60j26l16LK53J02k24J18j29L19k19J20R2k52J01J01
7989I9k82J58J75q6M4k13K54L1j93L18l23%L5J06l35J96p9K96k84J27L5n8n7j02
8013a38l8L10j47k76L26p7n5L62l33j93J87j80K03P6k04J69O4J08l05J33O5K34
8035B91l38O8j8m1k35K01K82l35L86j68Q8m78K83J06o3J8%%l02J53K49k8j31j7
8059b9O1M7K61m39J59J32k27q2M9K88m17J04J7J34j84l4L98k89L5j00j90J88K71
8082A53j00k10L96l19M1p6M0N4j16J21K1LL5j01L20m89J36J49j75L67l78J54P3
8105I9nj45k89O98l42J61o3l84L34k49L21n8j61J09j25O4O9j6K3MO1P2m53m9L70
8130D6M9k36K73l16K94Jn5m7k01K23k2l9n5M12j89m09K76m2L61o57L40k31L82
$$ plain form
7967 55 226 93 157 -108 169 -104 156 30 -286 -283 -30 72 -152 -34 -163 156 -63 57 149 -103 -2 99
7989 99 -183 -25 150 64 108 -105 149 180 -13 305 -18 -18 17 123 -212 -16 -95 201 -83 44 79 21 -36 -138
8013 -138 -176 134 -13 -289 37 -40 -95 267 -66 -259 -72 -252 -49 27 -177 -8 56 164 -141 -8 57 291
8035 291 -47 21 3 -38 -273 -72 210 -125 261 93 181 -297 -14 92 29 47 47 47 -255 -102 147 119 -12 -29
8059 -29 32 79 340 -99 60 192 -35 -117 -68 220 -197 -93 -76 58 -126 -160 238 -51 -16 -116 -306 -118 153
8082 153 53 -157 239 -80 -39 -115 -75 -21 -137 -16 5 8 43 -58 262 -227 -91 58 -117 250 -128 26 99
8105 99 94 -51 -340 358 16 177 114 -270 64 -185 136 78 -83 26 -99 -35 34 18 41 45 106 178 -275 -324 46
8130 46 95 -141 132 -184 110 111 56 9 -192 31 9 -30 -85 327 138 -271 5 -37 324 -333 7 -224 158
8153A58l73K51R8Q7m2o7n0j06m0K47N2n29L43n31N31j14J66J17n0l93J61o3K86
8176A39q9j03R6l00L56J10k68R9p8K1L9J62k18l49N37
$$ plain form
8153 158 -215 36 134 221 179 112 62 -44 -84 163 215 -314 29 -502 29 -85 81 198 148 -245 -84 -147 139
8176 139 50 -53 43 -257 99 209 -59 40 -38 -17 22 184 -34 -383 154
8191A54
$$ Imaginary data points
##PAGE= N=2
##DATA TABLE= (X++(I..I)), XYDATA
0@%%%%%%%%%%%%%%%qJ6j6J6j6K0k8L2l6M4m9N7p0P9q9J04j20J36j53J73j96K20
37A16k45K73l07L44l81M23m70N21n74O33o99P71q50R36j031J136j254J385j534
56h07J700j890K111k368K675l046L508m104M902o032P776j0842J7842o8706R536
71d7745R6643j6703k6258p294J7630r300k684j233j3135k3292K2460M2347L110
84C4546m4425j3450K8417K0791j6073j5088n552r749l253K9219K4753k2645l9774
97c2283R596M1026P901k9308j3531J3529R987N5L208p169k3521m824L4632K8360
111C7658j8753l4267O71K0405K366j4280o045j181n80J5292K6200q49l2716j7323
125b3402K0956J8418j4422k0088L369J5391R306P255K712j5669k2224L210K2861
$$ plain form
0 0 0 0 0 0 0 0 0 0 0 0 0 0 0 0 0 -8 8 -8 8 -8 12 -16 16 -20 24 -25 32 -38 41 -48 56 -64 72 -81 92 -104 116
37 116 -129 144 -163 181 -200 223 -247 274 -300 333 -366 405 -445 491 -540 596 -658 727 -807
56 -807 893 -997 1114 -1254 1421 -1625 1883 -2221 2681 -3351 4425 -6417 11425 -57281 -47745
71 -47745 48898 32195 5937 -1357 16273 6973 4289 3056 -10079 -33371 -10911 31436 34546
84 34546 -9879 -23329 5088 25879 9806 -5282 -10834 -20583 -23836 5383 30136 7491 -32283
97 -32283 -22687 18339 26240 -3068 -16599 -3070 6917 6972 10180 3011 -20510 -25334 9298 37658
111 37658 18905 -15362 -14691 5714 8080 -6200 -12245 -13426 -14006 1286 27486 26637 -6079 -23402
125 -23402 -2446 15972 1550 -18538 -15169 222 9528 16783 19495 3826 -18398 -15188 7673
138G673L503k1828j0658J7479J8840O36q576p985q227j137J3274J0350j1799j8308
152a6763M985K3429Q000j4088j3379J07N515N286L523m582j3534l984J5862J5667
166A6044p061j8251k863J3572R263l644q328o805k258Q933J3377M92j4878q852
180a1259J0476J3331k951j3882p398K992Q156O828O52p966q277M214J3043K862
194A0821j2676j1326L636J1900O385l188o556l907K888Q254M102q118j1668m11
208i864J1619P816m897r118l148N292P154K462o005r243j307Q661Q571k367j0066
223d440l739O838Q039J017o381o854m99O325O640j487q344m748M881Q118J830
238G196o189o896m65N906N477r40p192m062L868Q116L011n833o713m01O395M843
$$ plain form
138 7673 11176 -10652 -21310 -3831 15009 15645 7069 -916 -9143 -10280 2994 13344 1545 -16763
152 -16763 -11778 11651 19651 5563 -7816 -7709 -2194 3092 6615 2033 -11501 -15485 377 16044
166 16044 8983 -9268 -12131 1441 10704 7060 -1268 -8073 -10331 -1398 11979 12471 -2407 -11259
180 -11259 -783 12548 9597 -4285 -11683 -8691 -535 6293 6945 -1021 -9298 -5084 7959 10821
194 10821 -1855 -13181 -9545 2355 8740 5552 -1004 -4911 -2023 6231 10333 2215 -9453 -9864
208 -9864 1755 9571 4674 -4444 -7592 -2300 4854 7316 1311 -7932 -9239 -578 7993 5626 -4440
223 -4440 -8179 -1341 6698 7715 1334 -5520 -6019 306 6946 5459 -2885 -7633 -2752 5366 7196
238 7196 1007 -5889 -6354 -448 5029 4089 -3103 -7165 -3297 4819 7830 1997 -4716 -5117 1278 6121
254F121j993o279l853K959P117K318m624o351o17N724M252j879n883l247L146
269c089N927K603l754n539l59M781M853j162o047l508K392N877K399l686n077
284c389o01M525L952j112n526l324K015N150K169k479m664l25M170L751r31n021
300a640k805J999M471K260k833l918o78L606L999j195m608l417J721M480J730
315C172k519l322m35L300L525o83l697k980J428L499J904j752l762l47L419K868
331C618n42l926k550P20L545J779k212k568q90L256L000l00l378k357J080K663
347I38J609j799k545o83K768K677K0l020k100J93K674J326j693k616p58K240L109
364B340R4k672k044O18K384J216j421k596K50J806K192L42k203j982N40K066R78
$$ plain form
254 6121 4128 -2151 -6004 -3045 4072 6390 1766 -4585 -5202 522 4774 2895 -2988 -6235 -3089
269 -3089 2838 5441 1687 -3852 -4211 570 5423 4261 -1786 -5294 -2902 2975 5374 1688 -3389
284 -3389 -3990 535 4487 3375 -2151 -5475 -3460 1690 3859 1380 -3284 -3609 561 4312 3381 -1640
300 -1640 -4445 -2446 2025 4285 1452 -2466 -3144 462 4461 3266 -1342 -4759 -3038 1442 3172
315 3172 653 -2669 -3104 196 3721 3038 -659 -3639 -2211 1288 3192 1440 -2322 -2669 750 3618
331 3618 3076 -850 -3400 -2680 865 2644 432 -2136 -3026 230 3230 2930 -448 -2805 -1725 938
347 938 2547 748 -1797 -2480 288 2965 2985 -35 -2135 -1942 732 2058 365 -2251 -3009 -769 2340
364 2340 2434 -238 -2282 -1664 720 1936 515 -2081 -1831 -25 2167 2509 306 -1676 -1136 930 1908
381A908j824j907l82J668K374N8j588j871j53J988J296j264j869q43J629K326
397A546J85j545j317M64J539Q29n47k041j058J363K367J82j955j058L2J812M50
414A248n99j722r23J122J658P74j149j397L12J278O78r71j439k36R60J535M42
431A571q67j447K10Q25R66r60j319l21P80J100J97n75r56j1J168Q95q27j352o94
450a617J107J510n00p29m4J75R04m2L57j818m90M74J156M40j095p33M26J238o
469G13l86j86r22q2R85O96n95j032L37J384P4r80l16p1l78L83M26K83r88k38J151
490B58J046p12j206k04P46M7J25j12m6j76M51N61K2j253m46P67O16j62n40j47
510c65J33J54M19K18n90p33K14Q82j06o18l10N29N36L5M2O4m00j83L09L96n81
$$ plain form
381 1908 84 -1823 -2205 -537 1837 1895 307 -1564 -1717 271 1567 303 -1566 -2409 -780 1546
397 1546 1731 186 -1131 -667 872 1701 1154 -887 -1945 -582 1785 1967 12 -1046 -1014 798 1248
414 1248 649 -1073 -1996 -874 784 1558 409 -988 -676 602 1280 309 -1130 -1366 -406 1129 1571
431 1571 704 -743 -533 292 1258 298 -1021 -1342 -562 538 735 160 -796 -807 361 1256 429 -923 -1617
450 -1617 -510 1000 500 -229 -273 -98 806 764 1121 -697 -1187 -713 443 883 -212 -945 -519 719 713
469 713 327 141 -781 -863 122 818 223 -809 -472 912 986 6 -310 -381 -759 -376 50 333 -655 -893 258
490 258 1304 592 -614 -818 -72 -25 100 -12 -58 -234 217 778 800 -453 -899 -132 484 322 -218 -365
510 -365 -232 -78 341 559 -31 -764 -550 332 226 -392 -702 -173 363 398 440 504 104 -79 230 626 45
531D5p78J02R81K96m57l79R8J00k98N7M07q07j1O75M14k3l86j31M06j27O0j76
553F8m68PM63L14R5m57n65O62Q0l83k01j5L93J81j04K66k99Rj86K15K58m71m6
576a84L13j26j35K75j29o1J29k61P00m93m02J40L54j15k10k8J0L14N6M5l01k89
598c98K5K62j6L39j99k5M02K5n76K06j47k18P0K73j0J33j49j08J59J22M5m84j18
621c87J60J42J15P1J98l07M83n06M2k85N6M80k49j70P1J09p0K0p2p4K71l34J55
644h1J27j6J27k62oJ65j17o5K37l16J22J03Q3q2r2L94l86q5Q4N23n06p3j8P6J71
669A07k21K83j61K4J9J51j99j69l2J47j7K7J34j40J02L7p3k5l18K05k4K88k33
692h8J7J95k31J84LJ49j23J49M9j37l32Q0l6q8L93l75J63J31N2l36K96j04rj55
$$ plain form
531 45 -733 -631 350 646 189 -190 -92 8 -290 -233 174 -633 -644 31 445 422 36 -95 311 184 244 68
553 68 -400 -393 70 384 479 22 -543 119 199 -184 -385 -400 -7 174 70 336 37 46 -140 75 333 -138 -184
576 -184 129 3 -132 143 14 -47 82 -179 521 28 -374 -234 120 5 -205 -233 -223 91 147 192 -109 -398
598 -398 -373 -111 -127 212 13 -12 390 415 -161 45 -102 -320 -250 23 13 146 -3 -111 48 170 215 -269 -387
621 -387 -227 -85 30 101 299 -8 475 -31 11 -274 -218 262 13 -157 -86 23 -47 -27 -99 -173 98 -236 -81
644 -81 46 30 157 -105 -111 54 -63 -128 109 -207 -85 18 101 19 -73 321 -65 -150 -66 457 -49 -122 -140 -64 107
669 107 -114 169 8 32 51 202 3 -166 -198 -51 -68 -41 93 -47 55 92 19 -6 -324 -119 -143 145 -88
692 -88 -71 124 -107 77 80 229 106 255 304 167 -165 -85 -121 -209 184 -191 -28 103 155 -181 115 11 2 -153
716a53L07l21M0L07k15K79m63L6K62m24N22k64nl0K43n7j72K52J1j80r9k7kK08
740E5R7m02J17qJ64Q8k70l0L48k32J64j91L63j0n33J38P2J61r0j40OK7K19j87
764g4KJ09%K70m25L18j12j39j57J40J16R2k46lJ11m8j47K02j76L36j26l6k01L20
788A26k29PJ4J89N1j01J12l99P8L31k97J88P9J35k26m5j01J14J03j86j16Q3k3
811a13J29J2M1l8J44k40L1O0j15O3J04j72O2K1j8k02Q0J28J29m22J77K33k26K05
835G3J66k52j26K24o9K70l49J50j39Q9P8j00N0j18r3M8m7J56J70p9M3o3p7n3k66
860c14K42R8J71j42j60J7J25k55J32L50k76J14Nj1r5j66O19o01J8rJ67jk17O1
884a28j71P6R0M6kK24l47K27J71l25NJ7j03N3q1M62k18k73m5O02j46r9J36l9m5
$$ plain form
716 -153 154 -167 -127 180 -35 244 -219 -183 79 -345 177 -87 -92 -122 121 64 -108 144 155 -25 -124 -151 -153 55
740 55 152 -250 -133 -141 23 111 -159 -189 159 -73 91 -100 263 253 -280 -142 -70 91 1 -139 -133 -106 113 -74
764 -74 -72 37 37 307 -118 200 88 -51 -208 -68 48 140 -106 -109 2 -46 -193 9 -167 169 43 7 -194 126
788 126 -103 -96 -82 107 158 57 169 -230 -152 179 -118 70 149 284 58 13 -88 26 129 -57 -173 -90 -113
811 -113 16 28 69 31 175 -65 -34 26 -89 -26 78 -94 -32 -11 -29 -231 -151 -23 106 -316 -139 94 -132 73
835 73 239 -13 -139 85 16 286 -63 87 -52 37 115 15 65 -53 -146 -98 -145 11 181 102 145 82 5 -48 -314
860 -314 -72 26 197 55 -105 -88 37 -218 -86 264 -12 102 107 96 1 -165 454 -147 -129 -138 29 28 -189 -128
884 -128 -299 -223 -133 -87 -89 135 -212 15 186 -139 -134 -117 -220 -167 -248 214 -4 -277 -322 280 134 35 171 132 87
909H7j76J33J61k26k23J21K75m48J85L0k4J25k0j96lK07J0k8j4J56j94o1J19K3
933A9p6L60j27j84j38K43n40M21j3L21k16k32J73J51k1r6r8m7PJ0n9L01j68j22
957a31L32r1n7m08N23l28K26J23P6l00J58j05k8J84N6k82L5R8J45k83J37j40N5
980ej55K56j36j15R9l93M08J81l26Q6L12k64j78Q1J35J43l98L99Jk4J32l85K4
1003a22J66j32N1M7J38j33lj60j31K13n6K50k77L68k96On0J83j52M7j22K20J77
1026B32o9m14L93r5n2m0j70k3L32k43K26k24L08J9m0Ro0l5j49J28m00L46k52K43
1050c0J7j21L9K97k61J42J29j4k19m8N5J18J25k33m5K45Q1l14O0OQ3r9j15J44
1074D2k01J93q7J48m94M72o1k14N6K03N9j26P6p4j25J85Q5k71J20R1k90J38P6
$$ plain form
909 87 -89 44 205 -21 -244 -123 152 -296 -111 -81 -105 20 0 -196 -199 8 18 -10 -24 132 -62 -123 -4 19
933 19 -57 303 176 -8 -146 97 -443 -22 -35 286 70 -162 11 162 141 45 -53 -100 -93 -83 -142 159 -9 -131
957 -131 201 110 53 -355 168 -160 66 189 265 -35 123 18 -10 174 230 -52 -17 81 226 -57 80 -60 -5
980 -5 -160 96 -40 -155 -56 -449 -41 140 -186 -100 212 -52 -230 -149 -14 129 -269 130 131 107 239 -146 -122
1003 -122 44 -88 -37 10 148 15 12 -148 -279 -66 -122 128 -149 219 -77 -71 -121 62 -90 -43 -165 55 232
1026 232 163 -251 142 47 -5 -45 -215 -238 94 -149 77 -147 161 180 140 149 89 54 -95 33 -367 -21 -273 -30
1050 -30 -13 -134 -95 202 -59 83 212 198 -21 -69 -14 104 229 -4 -49 196 277 -37 23 29 112 13 -102 42
1074 42 -159 34 -53 95 -399 73 12 -202 -146 57 116 -10 66 -8 -133 52 137 -134 -14 77 -213 -75 1
1097Aj29L92j01j52l3P0j96L56k65M2K78n05N28o2k52j62%K03J56k4j88K6l5J75
1121A23k38o7K26Kj43k0K42J27m18K27n8j25P2K40l84L8K83l12J92L9l40L64k40
1144a70M35j54K5n6k70J69Q4j93P2R0j12M9k40M93l49P9J06j06M85l98m8j27M7
1167h9K21Q4n4j24j65K21j20J3j7o0K92J95l53Qk66K57J79j09j56J73K7pj37j32
1191a19j90N8njL08k49K49K59l78P9L8j55lJ16K1j19K34j62N1k69K41K22k07O8
1215H7J73pk80N3J09j68R6k49N2M17j39j83J6L5j98K30l3k7j93J88L56m98M79
1238C16m44MM5J31j08K8O5j46J69j12K04m45M32j48k30K73M5j40R2L2n3j80M51
1261B81j27l82L83j52R3l26Q7R1j46K49j66O6K23l29J09J39j16mQ9J8k38M23k28
$$ plain form
1097 1 -128 264 163 11 -22 48 -148 208 -57 -15 263 -242 286 224 -28 -190 -190 13 169 145 -43 -17 -52 123
1121 123 -115 -182 44 46 -97 -117 125 252 -166 61 3 -122 -50 190 -194 -156 127 -185 7 46 -294 70 -170
1144 -170 265 111 136 80 -190 -21 63 -130 -58 32 -80 -31 -271 222 -127 -48 58 -48 437 39 -9 -136 -89
1167 -89 132 216 162 38 -127 94 -26 -13 -30 -90 202 397 44 52 -214 43 222 113 -43 130 157 150 13 -119
1191 -119 -309 -251 -256 -257 51 -198 51 310 -68 11 49 -106 -109 7 28 -91 143 -19 32 -237 4 226 19 87
1215 87 260 253 -27 26 135 -33 63 -186 -134 283 144 -39 -23 12 -186 44 11 -16 -209 -21 335 -163 316
1238 316 -128 -124 -79 52 -56 -28 37 -109 60 -52 152 -293 139 -9 -239 34 79 -61 31 63 10 -170 281
1261 281 154 -228 155 3 96 -230 -143 -52 -198 51 -115 -49 174 -155 -46 93 -23 -27 62 80 -158 265 37
1284C7j4M7j23j06J98pk27J05j4L55n86L4K57M9j49K67k52L56J81m76K58j08k09
1307a27K03j93K21q0j50P2MR7O0k49L1j74L30J08j69j4mK13j28lj54L47Kq8k45
1332i0rL4RJ60K1j33K58j78J80l84J39q3oP3K18j06j22J47j06q7L48j46J05l37
1356i5k0J19N9q9j07q8J80j47J79L46n42L19N1J36j76j02J57k20j95K93M2k42
1378a42r3k3N13j92j52r1J54J13Q2q9J2j92nJ76k07J34K29j27k57L45j85J89l12
1401a20K7J66k67R0K73k64K60j16l3j9j91L55k41N4J14l18J41J13O8L3j96j88
1423b59N33o98P44k27P1j71R1l8j38M10m16L40j54k29K20j81L89o00K38M21j27
1444B19j18m2o0r0J63jl6j80L68j40j46K85j23k32L7K44l94O71m24K06j89k7O3
$$ plain form
1284 37 23 70 -53 -159 39 32 -195 -90 -104 251 -335 -301 -44 5 -144 123 -129 227 408 -68 190 82 -127
1307 -127 76 -117 104 24 -126 -54 -50 47 107 -142 -111 -285 45 153 -16 -30 -34 179 51 48 -106 241 243 155 -90
1332 -90 -99 -65 -56 104 125 -8 250 72 252 -132 7 -76 -82 -9 209 103 -19 128 22 -65 283 137 242 -95
1356 -95 -115 4 63 -26 -133 -221 -41 -188 -9 337 -205 114 165 301 125 23 180 -40 -235 58 100 -142
1378 -142 -235 -258 255 63 -89 -180 -26 87 169 80 92 -100 -105 71 -136 -2 227 100 -157 188 3 192 -120
1401 -120 -93 73 -194 -104 169 -95 165 49 16 -3 -194 161 -80 -26 88 -230 -89 24 92 125 -71 -259
1423 -259 274 -424 320 93 164 -7 84 46 -92 318 -98 242 88 -141 79 -102 287 -313 -75 346 219
1444 219 101 59 -1 -91 72 71 35 -145 223 83 -63 222 99 -133 -96 148 -246 425 1 207 18 -9 54
1467E4j6lk92M25k41Q7K14p4m2Mp3K12j48p1J45l74K26p1J03k44M33k54r2l6L32
1492B04M5l89R0m0K26m1k0j80K30p7J24l94N05l93j00J51Lj85K44J55k02o2J12
1515FP5q9j08m28N60R7k14L99m26J2O8J0J18J72l90n2K93o4j15K3Oj14K77k85
1539a69J91J96l75K04j37j03M32j37k29L90k74J45j19k62K39k02M59j36j05j45
1559a37rQ9l2qK81j35j06o5O2L13m07J04j01J12L4J29m7k06K8J3n4K15K19k33
1583E9j63RK8Q0M0J12nm7N3k53L6m8O1j03K2M5LK52j65j24k6J12J07j45r0J20
1609c0k24L97j75j1L7j00j1r0J16J04P9P4j20j61N9r0L75k44J5J88k07J10p5K92
1633C08k53R8l63R0k7L77M3l06pm5K06j48j42L0J41J62k30j51J63j6J29j71K39
$$ plain form
1467 54 38 35 -257 168 -73 14 228 154 112 116 43 255 107 36 181 -193 33 -38 65 -179 254 0 -92 -128 204
1492 204 249 -140 -50 -90 136 95 75 -105 125 48 172 -222 283 -110 -210 -59 -56 -241 3 158 -44 -106 6
1515 6 81 -8 -116 -544 16 113 -101 298 -128 -116 -48 -38 80 252 -138 -190 103 39 -76 -53 -47 -161 116 -169
1539 -169 22 218 -157 47 -90 -193 239 102 -127 263 -11 134 15 -247 -8 -210 249 113 8 -137
1559 -137 -146 -57 -89 -97 184 49 -57 -122 -60 253 -154 -50 -151 -39 -5 124 77 -129 -101 -88 -142 73 292 59
1583 59 -104 -95 -67 13 53 165 160 113 166 -87 -51 -99 -38 -141 -119 -74 -71 181 16 -108 -134 -22 85 -60 -150 -30
1609 -30 -254 143 -32 -43 -6 -106 -117 -207 -91 13 92 166 46 -115 -56 -146 229 -15 0 188 -19 91 16 308
1633 308 55 153 -210 -120 -147 230 273 -33 -40 -85 121 -27 -169 -139 2 164 -66 -217 -54 -70 59 -112 127
1656A27l60L50k61K50R9j50k02K36p1O1o1R3k31nR6k70K81r6J30J67j71j1Q0J33
1680B14m13L75J73n35J78j94L15j42j36K45k15K78k9n8j2Oj71K27J10l45J51p6
1702e4J62J1j57rM13m88m3M35m16J08J84j24O3Q3o1J1k59J73J5K57j71k27K78
1725A84k57m81N15n3M1J33j82k1m6K16j40J54l5m1K1K2O4R9j58MJ20l25J50J63
1749A47j7O4m73M30l17M64l94K51j58K19m8M4o1k36J97Q7k61K02k47R8n4K97l09
1772g5O8L6pM3k36k04K72L38l29l0Q9L5j49q6L71q6o3k2j7p9L51k79p4J02K55
1797B24l91QQ1j13J78J37K1j47P7k8K29k67J13k00o1N0P9N9r9l9K79k04q9N5j8
1822f6K67n47N58k35K49r1q4J8k83O4M1K56k88K57j61K45o8k14J10L0J07j68J36
$$ plain form
1656 127 -233 117 -144 106 205 55 -147 89 18 79 18 111 -120 -125 -29 -299 -18 -114 16 183 12 1 81 214
1680 214 -199 176 349 -186 -8 -202 113 -29 -165 80 -135 143 114 56 44 50 -121 106 216 -129 22 -54
1702 -54 108 119 -38 -47 366 -122 -165 270 -146 -38 146 22 85 168 107 118 -141 32 47 304 133 -94 184
1725 184 -73 -554 -39 -92 -51 82 -100 -121 -167 49 -91 63 28 -13 8 30 94 193 35 39 159 -166 -16 147
1749 147 130 194 -279 151 -166 298 -96 155 -3 216 168 212 151 -85 112 199 -62 140 -107 -9 -63 234 -75
1772 -75 -7 29 22 65 -171 -375 -103 235 -94 -124 -35 0 -149 -235 136 50 -13 -35 -52 -131 220 -59 -133 -31 224
1797 224 -167 -159 -78 -191 -13 124 145 -2 75 47 276 9 122 -78 -139 -89 -10 49 -50 -89 190 -14 -103 -48 -66
1822 -66 201 -346 212 -23 226 135 51 69 -214 -150 -109 147 -141 116 -45 200 132 -82 28 58 165 -3 133
1845A33n1j47K23KP7k75J8J28k22R7k78N39l0l53K6o7J60J11J52k24p9M5o4J09
1869C0j21r2k34M17P3l1J10m41J97L72j71j7J83k09j74L67k76J03K4k46K81L8
1891A83o7m0K4J56k59M2L1j75K4J08k22oL38l06K81j77K35j92J34l86q2K81J94
1914A19l19L99k81R4j53J49l3j8J38k16J44J42l2j06k4J71j23k64M96k10K83P
1936C63o19K54L8J63m09M0J20j72L29m16O2K63J90m29J9K20j25Ln0p5M40m74m1
1959c06K92j56M60m45J16J06k24R1J42k4PJ3r4k8N6K11k02n8j5l3O5q8N5K36l13
1984a36N5R3J71l61J73O4o0rJ94k33j03L83l35M7o0J75J66p0k9r6M8k43L80j2
2008B02k85J39k2J00l8l7l3m6J87J1k60J41J5j67M6oOj11J87K59k91%J43j11j55
$$ plain form
1845 133 82 -65 158 160 237 -38 -20 108 -114 -17 -295 244 214 -139 -113 -180 -20 91 243 19 -60 -15 -79 30
1869 30 -91 -183 -417 0 73 42 152 -289 -92 280 109 92 275 66 -108 259 -17 86 110 -136 145 183
1891 183 116 76 100 256 -3 39 70 -105 -81 27 -195 -201 137 -169 112 -65 170 -22 112 -274 -356 -75 119
1914 119 -200 199 -82 12 -141 8 -25 -43 95 -121 23 165 133 27 3 174 51 -213 283 73 356 363
1936 363 -256 -2 36 199 -210 -170 -50 -222 107 -309 -247 16 206 -223 -204 16 -109 -106 -156 -231 209 -265 -306
1959 -306 -14 -170 290 -155 -39 67 -157 -66 76 52 59 72 -22 -50 6 217 15 -43 -58 -91 -26 -114 -59 177 -136
1984 -136 -81 12 183 -178 -5 59 -1 -10 184 -49 -152 231 -104 -57 -117 58 224 154 125 29 77 -166 214 202
2008 202 -83 56 34 134 96 59 26 -20 167 178 -82 59 74 -93 -47 -53 -47 -158 29 288 -3 -3 140 29 -126
2033a26OJ03K30m56R3L42k38K13k54J04J52j15R6k92l5K33j35J48J57j28J1j24
2055a5k28K20m31L03j4M37k37j04m6m2K97q8l87K90M97k94k7k17N7j08K37J56
2077B56m4m71J74q8J86oN3l1j29J71j26K11l87N35l95J07K2k40k8K57j98J04N
2100f2k3J1P3r7J68j67J15q6O9N2o4M1j72j65j5M69j55R4Jm41N85k36J68q6j83
2125a06K19l8JK05k28J46j80J01j49K92l49Q6j46j8K87j99K6L6K5j14O1J64j58
2148c6k1M97n20L1J32L37l40l11M03k4k00j9K9L5l7nJ68j36K07j89j8LM05l71
2172B0M7K20n38l1M23p5j14j09K24L16m90J6K1n0J01P5p9q0L78j27n7J20j81j43
2196a13p0j44N36J13o57K75j48K26j26J6n0M6N09o13L39j0o3R3j07K05l60R0J35
$$ plain form
2033 -126 -120 -17 213 -243 -150 192 -46 167 -87 17 169 54 150 -142 -177 56 -79 69 226 98 109 -15
2055 -15 -243 -23 -454 -151 -165 272 35 -69 -115 -157 140 52 -335 -45 452 158 131 -86 -29 -137 100 256
2077 256 212 -259 -85 -173 13 7 60 29 -100 71 -55 156 -231 304 -91 16 38 -202 -230 27 -171 -67 -62
2100 -62 -85 -74 -1 -98 70 -97 18 -68 1 53 -11 30 -142 -307 -322 147 -8 86 87 -354 231 -5 163 77 -106
2125 -106 113 75 76 281 53 199 19 120 -29 263 -86 0 -146 -164 123 -76 -50 -14 11 -103 -42 122 -36
2148 -36 -57 440 -80 -49 83 420 80 -231 172 148 -52 -71 -42 -7 -44 -49 119 -17 190 1 -17 -14 391 20
2172 20 67 287 -251 -282 141 66 -48 -157 67 383 -107 -91 -70 -120 -19 56 -23 -103 275 148 91 211 30 -113
2196 -113 -183 -327 209 322 -335 -60 -208 18 -108 -92 -142 -96 413 -200 139 129 66 159 52 257 -103 -13 122
2219A22nk24K53k13L03m45K90j3j3j38r3K78J7l0l0l41K89m66O13l8k28Q8K58
2242B34l39J19m6Ok9K11L2k18N0j58Q1j09J95j64K08k49J72K36k28j30J70j3P5
2265A06L5j36o4j21J08J16l63J84pN10j96N0m10K24mj82L42m73M75k01p4l6J02
2288a5J9j05j32J85Q2P5j59J27p6j48J70j28K30k44K95n2m7l36K16N2j78K52j2
2311G1R6k52L46j16j03R6o35M63MJ05M9k22P8J4K42l72RR6j19L71l79K72k32K94
2335A76k70K38m1l20L62k67k45L72kl1n4J94k47O8m7L3K7K06qk96J68q3J71q0
2359B4j49J88J24n32J98R9J91l77J72K16k15J78L0k25LR4n2J32l33K04l75M62
2381E7j27N4J52k28J58J24j8n4j85mK35k44l2J64k81K23qNJ61k63J68j04j80K84
$$ plain form
2219 122 117 -107 146 -67 236 -209 81 68 55 -83 -176 102 119 89 59 -282 7 -459 154 116 -112 -24 234
2242 234 -105 14 -32 -26 -55 156 188 -30 20 -138 -57 -166 29 -135 73 -176 -4 232 4 -126 44 31 106
2265 106 141 5 -59 -180 -72 44 -319 -135 -142 368 172 222 -188 36 32 -150 192 -281 194 -7 -81 -117 -15
2288 -15 4 -101 -233 -48 34 109 -50 77 1 -147 23 -105 125 -119 176 124 77 -259 -43 9 -169 83 71
2311 71 167 -85 261 145 42 138 -497 -34 -30 75 124 -98 -20 -6 236 -136 -127 -31 -150 221 -158 114 -118 176
2335 176 -94 144 103 -217 145 -122 -367 5 3 -28 -82 112 -135 -67 -114 -81 -54 152 144 -152 16 -67 104 24
2359 24 -125 63 187 -345 -147 -48 143 -234 -62 154 -61 117 147 -78 -75 19 -33 99 -234 -30 -405 57
2381 57 -70 -16 136 -92 66 190 172 118 -67 -71 164 -80 -112 52 -229 -6 -14 -9 152 -111 57 -47 -227 57
2405E7o8K13j15j70J19m8O2J70j08N6Jj44J88k04j27L73j20M0L5j57M8k36L8J30
2429C3j23Qk2J51q9O3l25L70j3j71m6K43j40j47L76k91K72l72K43nl76p2M66R9
2453A32l07K10k8l04L07q1K55o3k6j1l76M59l96L87k94K92k74K39l26j43r8M61
2475A5K91l97K15m34K41J37j96p4J11K21K2k73J8nL34j26p7J88l44l1M01l50L58
2498B45l98P7k1j80L28O2l34J85P8o1k96J5K82K8k55J09K65k66K86k09Q4K98l94
2521g2j89K13K6j71j09K96j37L55q7n6j73K46k14L97n28J96j62M5K16j64j33M89
2543B84j19k11k28J04K19j35J35K1j38mJ81o9K18l72L76p9P5j11j28Q9o3n3r5
2566a03O7j00K47j56%j4K27P9j16j09k5K24l14N0q0j26M10o9n2j35K40j31O7j67
$$ plain form
2405 57 -11 202 87 -83 36 -12 50 220 112 168 169 25 213 9 -118 255 135 175 210 53 101 -135 -97 33
2429 33 -90 -82 -104 47 -42 21 -304 66 53 -118 -164 79 -61 -208 168 -123 149 -223 20 15 -361 -433 33 132
2453 132 -175 35 7 -297 10 -71 184 121 95 84 -292 167 -229 158 -136 156 -118 121 -205 -348 -446 15
2475 15 306 -91 124 -310 -69 68 -128 -202 -91 130 152 -121 -103 -108 226 100 23 211 -133 -164 237 -113 245
2498 245 -153 -76 -97 -277 51 113 -221 -36 42 -19 -315 -300 -18 10 -245 -136 129 -137 149 -60 24 322 -72
2521 -72 -261 -48 -22 -193 -302 -6 -143 212 125 69 -104 142 -72 325 -203 -7 -169 -124 92 -72 -205 284
2543 284 165 -46 -274 -170 49 -86 49 70 -68 -72 109 40 258 -114 262 183 258 147 19 108 45 -8 -103
2566 -103 -36 -136 111 -45 -45 -59 168 247 131 22 -3 221 -93 -43 -123 -249 161 92 40 -95 145 14 81 -86
2590h6J95N4l87J5J27J97p3Mk3L2j53K89k74rJ39k40L38j50K3J33j26N8L41n10
2614h6L5j2J4o7JR9q6K23m23K90j27K67j85Q9j25r8L08r5L2k95P2J10p4n7K94
2639A04q3J1k54M54k06K19L6Pl41J36j2l36K87k10K60%j98M07m29K54j65N1p1
2662g9P0N0O4j42j65L20k92J86K13m46L6M48j96j77K44p1qk85K32J5J86j83m5
2685b5J8M55k90k68J48M7M6J90k21j24j35j34N26k29O8j18J07k0l23J72R3k34
2707b51j5N25l53m6J70k34N05l52j84L85m06J70k41M43j35K12n8j03p5J8J14j76
2729h7K41j67M0k51J28J89nP1J7m09L96k99K37m8K2p0n7j5q7K6J42L1P8k0l82
2754b79J83L75Jm37L3k36M14j40N0L0j65n6o2N16o0m8m3o8J56O5k77l7K27q6J43
$$ plain form
2590 -86 109 163 -224 -209 -82 115 42 46 23 55 -98 191 -83 -92 47 -193 145 -5 18 151 25 83 424 -86
2614 -86 -51 -63 -49 -116 -115 -16 -102 121 -302 -12 -139 128 -57 32 -93 -191 117 22 54 -241 -169 -59 -133 -190 104
2639 104 21 32 -222 232 26 245 281 288 -53 83 71 -265 22 -188 72 72 -126 281 -148 106 -59 -8 -79
2662 -79 -9 41 105 -37 -202 118 -174 12 225 -221 -185 263 67 -110 134 63 55 -230 2 17 203 20 -25
2685 -25 -7 448 158 -110 38 85 131 321 100 -24 -159 -293 233 4 72 -46 61 41 -282 -110 -17 -251
2707 -251 -266 259 -94 -140 30 -204 301 -51 -235 150 -256 -86 -327 116 -19 193 135 32 -43 -25 89 -87
2729 -87 154 -13 27 -224 -96 93 88 159 176 -233 163 -136 101 53 75 5 -52 -67 -154 -128 14 45 123 103 -279
2754 -279 -96 279 280 -157 -124 -360 54 -86 -36 -6 -171 -227 -289 227 167 119 76 8 164 229 -48 -85 142 56 199
2779A99k17n%J81j57r6J32j27L00j93J52j46M20o46k42L38L11q6j48Qp7N1K88
2802B40L8k79J28j04L8K6k47j0K35J58m31J56K1m4O0R1q1J21k7L5k40O6J83j32
2826Am00L41k00K66J34k4R4k98qR8l8qO0n1K98m17O7R2K1j06K65l12K73k88K68
2851A28r8j00P4K73m90J32J24k1k6j20J57j57lL75j78m0p0K20k66K93j87P3P2
2874A65J7k75J18j04j4J18N0l67K28J51K00m58J85m8M8p0M4K15R7m09M00m95L97
2897A93m04J30J8K59J1o57N15k7J67o2p2k07K41j91n4K68Q9j08k3j53K09r2P4
2920A24j55O4J11K2j35NJ7l7J76k50L5J7k46L49J8p9k58Q8J39J19k72j49L13j2
2944Dk14L26q7kQ2j82L59m01k1K27k91M11m05J11J3KJ90k95P1J81j75J33J53j66
$$ plain form
2779 199 -18 -23 -23 158 1 -95 37 -90 210 17 169 23 443 -203 -445 -107 204 118 -30 -22 -99 -48 240
2802 240 278 -1 127 23 61 87 -160 -170 65 223 -208 -52 -31 -75 -15 76 -5 116 89 124 -116 -50 133 1
2826 1 -399 -58 -258 8 142 118 212 -86 -94 4 -34 -42 18 -33 265 -152 -85 7 28 -78 187 -125 148 -140 128
2851 128 30 -70 4 277 -213 -81 43 22 -4 -124 33 -124 -127 248 70 30 -40 180 -86 207 20 93 165
2874 165 182 -93 25 -79 -93 25 75 -292 -64 87 287 -171 14 -34 14 -56 -12 203 300 -109 291 -204 193
2897 193 -211 -81 -63 196 207 -450 65 38 205 143 71 -136 105 -86 -140 128 217 109 86 -67 142 50 124
2920 124 -31 33 144 166 31 36 53 16 192 -58 -23 -6 -252 97 115 36 -222 -134 5 124 -148 -297 16 4
2944 4 -210 116 29 27 109 -73 286 -115 -136 91 -200 211 -194 -83 -70 -68 122 -173 -102 79 -96 37 190 24
2968B4J95j33J5j04J83j24M6j0j24J21j95K35K1l05K32j46j22K44K2j10J58Mk0
2991A07n3n8R5k14L1L49j50r6j91N45l80r0Q1j53K84l5Ok1k85J86J30k19K65j04
3015C0P5j43K17m2k63Km6J14o9J89mJ52m04L89n42L68O2Q1j15J16J36m62J33J14
3039H8L12l53J8j99L30r7k30K57P3m24N51l49J02k58K20mj91j31K72m5l9k3Q6
3062c4Q4J30j09j3N9k91J71N3k01L0K06j55M1j79L04L1J09n08K79K06l17J65J34
3085A95j66Q3j17j41L71m11K94n3r8R7J8k36J19J98l33M37q6J4O7m42K92m4P8
3108A36k53J83P8j23r6L58k70J58j49Q5j69M9J04k29m2J20Q5j49K69j51P9p7O9
3131F5J29j10J53n9j12k44Q1k8k3K8J14L34k62j8K84j92p1j72L75k06k43j8J57
$$ plain form
2968 24 219 86 101 -3 180 56 102 92 -32 89 -106 129 150 -155 77 -69 -191 53 75 -35 123 127 107
2991 107 54 -4 91 -123 -92 257 107 11 -180 365 -15 -105 -24 -177 107 72 78 57 -228 -42 88 -131 134 30
3015 30 105 -38 179 137 -126 -124 -170 -56 -125 64 60 212 -192 197 -345 23 85 166 51 167 303 -159 -26 88
3039 88 400 47 65 -134 196 99 -131 126 199 -225 326 -23 79 -179 41 37 -154 -285 -13 -58 -97 -120 -34
3062 -34 50 180 71 58 117 -174 -3 50 -151 -121 85 -70 -29 -208 96 127 236 -272 7 213 -104 61 195
3085 195 29 112 -5 -146 225 -186 108 55 -43 54 72 -164 -45 153 -180 257 171 185 252 -190 102 58 136
3108 136 -117 66 144 21 -75 283 13 171 22 107 -62 -13 91 -138 -180 -60 25 -124 145 -6 73 -4 65
3131 65 194 84 237 178 66 -178 -97 -125 -148 -120 -6 328 66 48 332 140 69 -103 272 66 -177 -195 -38
3154c8Q1R9j90q4oj8J94j04J79J00m69J97J44J43k77J01kO3j7l99J49J91k96J12
3178a47L76k41j71P1K60p1j99K51Oj15q1J20n0r2Q3K03j15j74J40o5J75n8j77
3201g1N8j82M01L0j80k28K22n7j87K76m2L7P1K69l07p6k4R4j80K53l41K73j16
3224gJ48k27j64J44NPK71k88k6J04N6R3O2j94k26J76k7k29N65m98J34J25J41n2
3248I3j95K82p6j73J56J01m42kP5K63l59J92OJ25L13l27J79k82L22l06K67k42
3270c0m0L47l44r9N4J79J18o5q0L4k89K7K31m8k40K88K38k6k25j10P3J05j21k24
3294b47O5J70k24K60j85J68j6J30p3l7q1J9q6k01L95N3N6j61O6k87K00J10j67
3317g3J89K3n11M48MJ29k17L1J7L5j29r2j27J63K74n7n0J78j97j2k26K77j94K23
$$ plain form
3154 -38 43 142 -48 -132 -138 -156 38 -66 113 213 -256 -59 85 228 -49 52 50 113 96 -303 -154 37 -259 -147
3178 -147 229 -12 -183 -112 148 77 -122 129 135 20 -61 59 9 -83 0 203 88 -86 54 -11 164 106 -71
3201 -71 -13 -195 206 236 56 -172 50 -7 -194 82 40 77 148 417 110 34 10 104 -76 177 -164 109 -7
3224 -7 141 -86 -250 -106 -101 -94 177 -111 -137 -33 23 116 178 -16 -242 -66 -93 -322 243 -255 -121 4 145 93
3248 93 -102 180 104 -69 87 188 -254 -256 -181 82 -277 -85 -79 46 359 32 211 -71 251 -55 212 -30
3270 -30 -70 277 -67 -166 -112 67 185 120 40 74 -215 -188 43 -5 -245 43 281 255 30 -80 -7 98 -23 -247
3294 -247 -182 -12 -236 24 -161 7 -9 121 48 11 -70 -51 -137 -338 57 110 166 5 71 -216 -16 94 -73
3317 -73 116 139 -372 76 80 209 -8 23 40 75 -54 -146 -273 -110 164 107 57 235 38 26 -200 77 -117 106
3341A06J22l05J62O4k87J20o9L57l70K98k00j47L00k31L8j37K24k14K28j07K07
3362A59j95j61N19l88J27j39O9m8L52j41j35m68J98K83M8N8K2n7l27M5K79j02
3384bk02J26j4K10Kj83J16Mk7j83L04k27J16j15N7J30lk60J79l26L17o5q6P6J66
3409A10K15k26j75J12l7N1J55j41j10J18R3j98j87J36L9J68k93q8N91m13j80J65
3431i5J66j42K09l52J45j54K81j26k35M77k70L18k36j83K04k80J86K20p3O0J73
3452B93l89M1P3J1J90k45N4j31J17p9J93l48M87j63J02l58J8K04k08O0o4j4L53
3475A97k76J39M0l3o2j97L81R9k11p4J36l64J96J53k36j38L99J20l93L7J80k19
3497a26O3O2p1j95L76k54L75m64L45P4j38Q5k18K81k04j40L22j14k01J80K0J39
$$ plain form
3341 106 228 -77 85 149 -138 -18 -87 270 -100 198 -2 -149 151 -80 -42 -179 45 -169 59 -48 159
3362 159 -36 -197 322 -66 61 -78 -9 -57 295 154 19 -449 -251 32 80 138 160 103 -224 -179 100 -2
3384 -2 -204 -78 -92 118 120 -63 53 57 30 -153 151 -76 40 -75 -18 112 109 -151 28 -298 19 -46 -132 -56 110
3409 110 325 99 -76 36 -1 50 205 64 -46 72 165 -33 -220 -84 -45 123 -170 -258 333 -80 -260 -95
3431 -95 71 -71 138 -214 -69 -223 58 -68 -303 174 -96 222 -14 -197 7 -273 -87 133 60 120 293
3452 293 -96 -55 18 29 219 -26 28 -103 14 -65 128 -220 267 104 206 -152 -134 70 -138 -78 -142 -156 197
3475 197 -79 60 100 67 5 -192 189 288 77 3 139 -225 -29 124 -112 -250 149 269 -124 -87 93 -126
3497 -126 -63 -1 -72 -267 109 -145 230 -234 111 185 47 132 -86 195 -9 -149 173 59 -142 38 58 197
3519A97j06j05m6Oq8K50p2Ql78L23j68K32K54l37q1r0K72K54k99m7J79q3j12p9
3543a16n1L19m3N6l56J97J84m28M53j81n7K8j37K19k91P7M3k63K27r7L54r1Q7
3566A33j44K2K4m5L3pKj4k26J93K0K8j42l05L23J27j96R1j00O6j78J81J14R2m19
3591c27K87k9l32N10R4j21j53k9rO1j37J90K0J15k12j4J34o6N3O6J60l08K45j56
3615D2j09QK52k31J30o4l52L74kM02n82J29L8j39J87K7J00m53L76m60L09j73L41
3638A50j4P7j44K79l55L53l67K04o4k03o3P6L9j95L43q0R9n04L88K9J73j70j95
3661a44L16r3j22J99m03K60R8j39N4j33O4N59n88j2K45l38M21j54l5J85m82L1
3683b11O2J69k74L22j19J39j31J02p1J33k25k78M62N1l60J84j6K88j50j36J41
$$ plain form
3519 197 91 -14 -60 -54 -142 108 36 44 -334 -11 -179 53 307 -30 -111 -201 71 325 26 -21 158 75 -37 -116
3543 -116 -167 152 109 165 -191 6 190 -238 215 34 -23 5 -132 87 -204 -127 -84 -347 -120 -217 137 46 133
3566 133 -11 11 35 -10 23 16 18 4 -222 -29 -9 19 -123 -428 -105 22 -174 -83 -183 -117 -295 -114 0 92 -327
3591 -327 -40 -69 -401 109 203 82 -71 -100 -109 -48 -185 5 25 140 -72 -86 48 -18 35 101 261 -47 198 42
3615 42 -67 -59 193 -38 92 28 -324 50 48 450 -132 -3 35 -104 83 110 210 -243 133 -327 -18 -191 150
3638 150 136 213 69 348 -7 346 -21 183 119 -84 -147 -71 -32 -227 116 36 135 -369 19 48 221 51 -144
3661 -144 172 79 -43 156 -247 13 111 -28 26 -107 -43 516 -72 -84 161 -177 244 90 55 240 -242 -211
3683 -211 -149 20 -254 68 -51 88 -43 59 -12 121 -104 -382 80 131 -229 -45 -61 227 77 -59 82
3704H2k50M03j95j97K86j0j14k55M27oo0j07K47j69j17R3l21M87m20qK45J76l48
3727a31n8K48k85L94m07L12K28l82J69j33J22j53k80M23J9J8j32Q5j09mR5l09
3749b70L70o2J46j97lj88K09R3J47j89k49K18j8M7n7L72m94K15k98K84n9K14j98
3772C3j13k3M3J55j11N6L8m07P2K72K6k04J08J37L27k24k7k58J77j7p8j13M8R7
3796A4J25%l99K92J08j72J36j94j83J95J6%R0O3k24O4k1J13r6J05M1Q5k19J40
3820G9jl17L05l10L98l5l89K75q1J74O1j3j08m8K39k85J17l31L57j97K84k62J39
3843E1j67J68Q1k14K27k05Q3N9qj89M9K00J32k42L17k21j23MJ61l16J12j17K95
3866A37p3l08J43L58k34r3J38P7l17K51r1J63J13k29j38k18M01k8J09j82k23K84
$$ plain form
3704 82 -168 235 40 -157 129 119 5 -250 177 171 111 4 251 82 -35 58 -263 224 -196 -204 41 217 -131
3727 -131 -189 59 -226 168 -239 73 301 -81 88 -45 77 -76 -356 67 86 104 -28 57 -52 -56 39 -270
3749 -270 100 38 184 -13 -16 -204 5 98 245 56 -193 25 7 54 -3 369 -125 90 -208 76 17 231 33
3772 33 -80 -103 -60 95 -16 40 78 -329 -257 15 41 -163 -55 82 409 185 158 -100 77 60 -18 -131 -83 14
3796 14 139 139 -260 32 140 -32 104 -90 -273 -78 -62 -62 28 91 -133 -69 -90 23 -73 32 73 158 -61 79
3820 79 78 -239 66 -244 154 119 -270 5 -76 98 159 146 38 -10 229 -56 61 -270 87 -110 174 -88 51
3843 51 -116 52 133 -81 146 -59 24 83 75 -114 -65 135 267 25 342 121 -2 2 163 -153 -41 -158 137
3866 137 64 -244 -101 257 23 -70 68 145 -172 79 -12 151 264 35 -103 -321 80 52 161 -21 -244 40
3888D0J75k30J51n49O61n18j6K48m5K18Lj58k0j03K20j04L20j59L4K8l88J95L
3911FL6N9nj02n4J63j71j14K86m8j29J42K7m9j79Q3R1jK08k15j25L7K22K21r0
3936B99l50R6j47J18l51J78L02P9o4q5N2k49K74o5j85J80p8q4k06K87LM5j22K33
3960A60k56j07K04RQ4J5j56N1jj03K0K71k23Q5m44O17j7l84L86l30j7j7j32N47
3984B62m20L15l6l3J31p1J04j69q5Q3k24p8Q0n0N4J35M3k64M56k25j46L60j28
4007I4j34J05J46k23J72o6j38R2k68L86m9l4j38K1k5j16J1K98k15J29j13J60k54
4030a59M83r4m88J29k7K96j64rk8L41m38J36K4l3n0J58j80L60k85J6J6o3J43P4
4054A58QL3l69R6J74J23k79j46L01j76J23j9Q2k95J58K72j93Ql1j17K30M5j40
$$ plain form
3888 40 215 -15 136 -413 248 -270 -286 -38 -83 135 138 -20 -40 -143 77 -27 293 134 168 196 -192 3 6
3911 6 42 101 96 -6 -60 103 -68 -182 104 56 -73 69 96 47 -132 -49 42 41 249 34 -91 -54 168 389 299
3936 299 -51 45 -102 16 -335 -157 145 224 160 75 127 -122 152 87 -98 82 4 -80 -286 1 4 49 -73 160
3960 160 -96 -203 1 10 94 109 -47 4 3 -100 -80 191 -32 53 -391 226 209 -175 211 -119 -136 -153 -285 262
3984 262 -158 157 121 88 219 148 252 83 -2 81 -143 -221 -141 -191 -137 -2 41 -223 233 8 -138 222 94
4007 94 -40 65 211 -12 160 94 -44 48 -220 166 117 83 -55 -34 -59 -175 -164 134 -81 48 -65 95 -159
4030 -159 324 230 -258 -129 -156 140 -24 -33 -61 280 -158 -22 2 -31 -81 77 -103 257 -28 -12 4 -59 84 158
4054 158 166 199 -170 -74 100 223 -56 -202 99 -77 46 27 109 -186 -28 244 51 59 28 -89 141 186 46
4077D6O4q5k09L21j57P1L23m91K13n6o8J83J9j82J63j29k3M9J10l13J60R2j10
4100iR1j30Q9j14J51k1j18k45K65k07O4L16j54j36J37MJ30o0j87O5J98l25J71
4123b5j10K79r1r2K09k06k9rK27jk84J71j87O1o5M02j20k63P3K42j85J74r7k87
4147b13K99j27O8l9mj42J98OM7k20N6j41j58M07k95J97Q9j2k14L58k29K56k02
4170a5J92K4j78l60K76j26K22j3O8m52J70K95j50L2k2J12k38L78k04p3j70K85
4192E3K1j94J85K2Q7N5o0k13K09r4K4j60j02K31o0K30k93Q6r7J00K4M0j2k3k52
4217a93P8m2k7pK07q4O3J19K22k78J61k52K9J94k34o5m9J84O4m5r1J61k48K41
4241A08J1K1j13N7n1kk4L7n4p6M57k24j5l7k1j51J0K44j89j33J76O3l15M42k84
$$ plain form
4077 46 110 25 -184 137 -20 51 374 -117 96 40 -28 155 174 -8 155 26 3 52 162 -151 9 101 -9
4100 -9 82 -48 41 -73 78 57 -61 -306 -41 -248 -184 132 -22 -158 -21 -17 113 53 -134 -69 129 -196 -25
4123 -25 -135 144 53 -39 170 -36 -65 -74 153 152 -132 39 -148 -87 -152 250 130 -133 -60 182 -3 171 74 -213
4147 -213 86 -41 27 -12 -16 -158 40 46 93 -127 -71 -212 -370 37 -258 -61 28 16 -198 160 -69 187 -15
4170 -15 177 201 23 -337 -61 -187 35 22 90 -362 -192 103 -47 -15 -37 75 -163 215 11 -62 -232 53
4192 53 74 -120 65 87 174 229 169 -44 165 71 95 -65 -167 64 4 234 -59 27 -70 30 54 94 82 59 -193
4217 -193 -115 -157 -184 -191 16 -68 -5 114 336 58 219 -33 -4 190 -44 -109 -158 26 90 45 -46 115 -133 108
4241 108 119 140 27 84 33 31 7 44 -10 -86 371 147 132 95 74 -77 -67 177 -12 -145 31 94 -221 221 -63
4266f3J54J58j61j57j95J46L3o3K95k27P0P4l84L98k77M9J32l3k7L32k44jj71
4289a62K27N4j82J93k73l0J41k66L51k87J58M3N1k81J97m4L64k52J62K41m26J25
4311A04p2J59j54qJ98k41o6K42r9j97kkK62p8J14k30K93l37p1L64j10j35K27J37
4335B98l0l61J23Q2k58L9j32L24j13O5J36k25o5j9K40Kl48j72K14M9M2R0q8k78
4359c85M72r1j56JO5J94j7k7L8r3J34JN4K4l41K38j08j33J92j84K63R3l09K1j03
4384a57J21j08J65J02r4j52K78L1k4l48Q8L48l06o0K73Jp8J18l59J10k68K82q
4407d5Q4r6K46o4k20J78l45K19J30J53j31j54kJ32j23RK42p2j17O3Q6k54lJ40
4431E6n8K40kj31M2J30j34J19m08l5J97j12l8J22L9j39J52j01Q6N8j7P4k47K00
$$ plain form
4266 -63 91 249 88 -69 -264 -118 -85 -148 147 -80 -10 64 -320 78 -199 -150 -18 -51 -78 254 10 9 -162
4289 -162 65 119 -63 130 -143 -173 -32 -298 53 -234 -76 -33 18 -263 -66 -110 254 2 164 405 -21 104
4311 104 32 191 37 29 227 -14 -80 162 63 -134 -136 -138 124 46 160 -70 223 -114 -185 179 69 -66 161 298
4335 298 268 -93 30 112 -146 -107 -239 85 -28 37 173 -52 -117 -136 104 106 -242 -414 -200 -151 -109 -19 -107 -385
4359 -385 87 -4 -160 -159 -94 100 83 56 94 1 135 136 190 214 -127 111 3 -130 62 -122 141 234 -75 -54 -157
4384 -157 -36 -144 21 123 29 -123 155 186 162 -186 -98 250 -56 -116 157 158 80 198 -161 -51 -319 -37 -45
4407 -45 39 -57 189 125 -95 83 -262 -43 87 240 109 -45 -47 85 -38 -29 213 141 24 87 173 -81 -84 56
4431 56 -2 238 236 105 147 277 143 262 -146 -181 16 -96 -134 -12 27 -112 40 -61 25 83 66 140 -107 93
4455I3j43Q4k72J73r5J19Mr7L67m70J51K27l49L62jl63L98l71K83k37K68K3k65
4478a11Q9K78j18m44K72K80j13j85P0r4P9Q9k01n6N5Q5k5k25K50J36K0l04L7M22
4502B86m29J59j92J75o2o6Q3J09m85L33N9N9j80NJ26N7j79M03m09J75j7K26j7
4525B19k86k25K71J66l67Q1J10q1J01j04L02m27J66j10L12L43k7l90m08N80k78
4546e2N5J65j6l59K70l38L84j22r9J28j44J49k34J23KK88j61l7k00K94j23K05
4568A78j40n0j39L60k00j44M4j0J89k09j55L07J23k89R6J81n7K2L5j12l34M87
4590A83j56r4QL54l39rr0J19K15j73j65j49J30j3L28l29J42K65m12K51M4k03L09
4613B16k91M4M5O3j49j06j07L05j95K78j28J75k98J25j29J46p3j46M13j76j03
$$ plain form
4455 93 -50 34 -238 -65 -160 -41 -37 -134 233 -237 -86 141 -208 154 153 -210 188 -183 100 -137 131 154 -111
4478 -111 -22 256 138 -306 -34 246 133 -52 18 -76 3 92 -109 -165 -110 -25 -50 -275 -25 111 131 -173 -136 286
4502 286 -143 16 -176 -1 -63 -129 -46 63 -422 -89 -30 29 -151 -146 -20 37 -142 261 -148 27 10 236 219
4525 219 -67 -292 -21 145 -222 -141 -31 -112 -11 -115 187 -240 -74 -184 128 471 444 54 -354 226 -52
4546 -52 3 168 152 -207 63 -275 109 -13 -112 16 -128 21 -213 -90 -88 200 39 2 -198 96 -27 178
4568 178 38 -12 -151 209 9 -135 -91 -101 88 -121 -276 31 154 -135 -39 142 85 107 142 30 -304 183
4590 183 27 -67 -59 295 -44 -53 -143 -24 191 18 -147 -296 -166 -179 149 -180 -38 227 -185 66 110 -93 216
4613 216 -75 -31 14 77 -72 -178 -285 20 -175 103 -25 150 -148 -23 -152 -6 -79 -225 188 12 -91
4634i1J71k30j44K92j00j7J78J1p2m6l7r3J74L4J85j20k64L45k84L44P4m68R7
4657f1J01kn3J18j98J64O4l75J76r6K3j33R0k64L57k38M47j51j26J1J37J05O1
4680A57k85J40M8j46K77l83K23k82M13j28j03j61M09Q0k01l99M20o4L19m79O4
4701h1L5J92l44Q4L6K42j53l64N24r4j88rJ58q5k6l5J23l3j62pJ7m5k5K07L55
4726C22l69J08Ok91P9N1j03K10k63L19J04j24L64m34j48K39N6J5j01q1L22m88
4748b07L89j91L10o0j80j9k53K62K1k03k39L19K70j93J40m4j65J84k7p9k30K49
4770E4j26RR9M3k27J93J49k57k4K4K61j63q4J31%J09L1m50J39p5P9L3l9q7K19
4795D1L3j58J50j01O4R1n6J05j35l07nK99J36OP2l30K43j89L9p9j7K35r3K23j63
$$ plain form
4634 -91 80 -150 -294 -2 -102 -119 59 70 -2 -48 -85 -178 -4 30 215 95 -169 176 -108 236 310 -158 -61
4657 -61 40 38 -15 103 -95 69 133 -242 -66 -162 -139 -272 -182 -446 -89 -327 120 -31 -157 -146 -9 96 157
4680 157 -128 12 60 -86 191 -192 31 -251 162 34 -69 -230 179 259 58 -341 79 15 334 -145 -81
4701 -81 -46 146 -198 -114 -78 164 11 -353 171 77 -111 -120 38 -47 -73 -108 15 -18 -180 -187 -170 -215 -240 -33 322
4726 322 -47 61 67 -224 -145 -94 -197 13 -250 69 173 49 413 -21 -169 70 126 141 40 -41 281 -207
4748 -207 182 -9 301 241 61 42 -211 51 72 -131 -370 -51 219 26 166 122 -43 141 114 35 -195 54
4770 54 -72 -63 36 79 -148 45 194 -63 -87 -63 198 35 -49 82 82 191 222 -228 -89 -164 -85 -52 -91 -178 41
4795 41 74 -84 66 -35 29 120 64 169 34 -273 -278 21 157 163 235 -95 148 -41 -2 -81 -98 137 44 267 104
4820A04p5k05R9o6J50j9O6k10P6J17O5o3k4K1j60L18k42r0L4J29pK5O8N7k71j03
4846b06M10j8j30j11J9M7o3n5L7%j2Q5J25l00M5O0j24J68R8k52J71q5L9K94l65
4871a23J42j71K32J44l12J32K1K6l04J32K91k67j48K86k0L8L4k59J40k06J16J92
4893A16j25l6o0K3k17N41j9k0j99J06m97K17J63p4j18k9L00j74J27LJ25j58j2
4916a7p1M7m8j74L14j46K30j9o2j61M4j23N57l35K25p06M50p1j02M4L05J03n34
4939b50M86k90K1K13j42k41K01o6J89R3k21o4K90j12j21J62j37J3j39L66k31O5
4961H5r6j87L58j21Q5l34M38l09O2J97r8m13L62K57Kl39P9r1N6j2P1NL7j42K55
4986B07m8k51J02m4l4OJ60j54k4k08L58j72j42k2L36o2K0l7j6K90l37J09r7K90
$$ plain form
4820 104 29 -176 -77 -143 7 -12 54 -156 -80 37 102 39 15 36 -124 194 -48 -138 -104 25 18 43 111 168 -103 -206
4846 -206 204 186 56 -55 -36 11 -52 -107 -70 -70 -82 3 128 -172 -127 -67 -191 -23 75 -177 -6 -91 -52 242 -123
4871 -123 19 -152 80 224 -88 44 65 91 -213 -81 210 -57 -205 81 61 99 133 -126 14 -192 -76 116
4893 116 -9 -45 -105 -82 -299 242 223 203 4 110 -387 -170 -7 -81 -199 -228 72 -102 25 28 153 -5 -17
4916 -17 -88 -41 -89 -263 51 -95 135 116 54 -107 -63 -186 371 36 261 -445 5 -66 -168 -124 181 284 -250
4939 -250 236 -54 -33 180 38 -203 -2 -68 121 214 -7 -71 219 107 -14 148 11 24 -115 251 20 85
4961 85 -11 -198 160 39 124 -210 228 -81 -19 178 80 -333 29 286 288 -51 28 -63 -7 -19 52 57 94 -48 207
4986 207 159 -92 10 -34 -68 -62 98 -56 -80 -288 70 -102 -244 -266 70 8 28 -9 -25 265 -72 37 -60 230
5010B30k94n9lP8j97L05L2p8Lj59P8J9M8R9m3J30j21k29J26K5j31K64k84J64R9
5035A02k81K78r1L34m80J41K15l61N4J56P3k22L14k33L5R3J2m7k66K08j6J26m5
5058I9l02N52m95J54j24M4q8K12k4K7q1K24j94K4k65K00J62q4J12l60N18k15J01
5081A97k83j60K17J60j26J09k0l56K44K4P1Jk64L01J14q0J4m7k0k1N8l14Q7J88
5105I4l47L21j84O7j07L22k56J94k26J90M3j82J20J95l44o2J21K41k05j10K12
5126I7k3j82J37K02k13j07J57j56NL4j90O07l44m7R3j95M08m31jL26n8Pj42j19
5150a35L60j87j07n5L00k61L3Q0M0j2o7J55K5N7l07J63PJ98m35L2j44N12j90J62
5174B24j60J37k90J21J37l50M43l65M18k30j23K7j21j97K25K25L9l02J94K29l90
$$ plain form
5010 230 -64 -123 -126 -48 -245 60 92 14 17 -142 -64 -45 3 102 59 189 68 -161 -35 -10 -141 123 -161 3 102
5035 102 -179 99 8 342 -138 3 218 -143 -89 67 140 -82 232 -1 34 127 139 92 -174 34 18 144 99
5058 99 -203 349 -146 8 -116 -72 -160 52 28 55 -26 198 4 28 -237 -37 125 41 153 -207 311 96 197
5081 197 -86 -246 -29 131 5 114 94 -262 -18 6 77 78 -186 115 229 149 163 116 96 75 133 -181 -94 94
5105 94 -253 68 -116 -49 -156 166 -90 104 -122 68 111 -71 49 244 -100 -162 -41 200 -5 -115 97
5126 97 74 -108 29 231 18 -89 68 -88 -83 -49 -239 368 24 -23 70 -125 283 -148 -149 177 119 126 -16 -135
5150 -135 225 38 -69 -124 176 -85 -52 28 68 56 -11 144 169 226 -81 82 89 287 -148 -116 -260 252 62 224
5174 224 64 201 -89 32 169 -181 262 -103 315 85 -38 -11 -132 -329 -104 121 160 -142 52 281 -109
5195a09K91r4k93K09j40J2o2J4J21k27K67mo6L33k27P8j55k9Lj16K70O5j68P6
5219D9l5l72L15O9J98j50l4j28l1L15j50k53L41l8l45J60R4m7r1L03l83J79j31
5242a65N4O9j09K18P0q7j57J14k23L67k1k76J79Q7j66K14k3j14P9Q0m36J61k4
5265a09K02j85k4J76q0j09M08l81K49l81J03J96l31K06L43m25L72j42j46NN2K3
5287B2l68L99j28J09J68j10j21Q8j45J71o4k3q5J17m8M4J2m34M78P1j13p3K7o6
5311g2J51j45J73L2k33J4J14k00j6L41m6J89l76N3k01J02L29n02K97j78K16j05
5333f3L14k69Q3j46N7K48k30Q8J26j90l85L76M9m8R0j56q3q7OK00J01O7k04j5
5357g1j33L13M7k21p1J15lL35k95J54k15n0j4J77j51J82P8j08N9K6j24p5m68M20
$$ plain form
5195 -109 182 88 -205 4 -136 -124 -186 -172 -51 -278 -11 -15 -81 252 25 103 -52 -81 -78 -194 76 141 -27 49
5219 49 14 -358 -43 26 224 74 40 -88 -119 196 46 -207 134 96 -249 -89 5 -42 -133 170 -213 -34 -165
5242 -165 -111 -42 -151 67 137 50 -107 7 -216 151 130 -146 33 120 -46 168 145 31 110 190 -246 -85 -109
5265 -109 93 -92 -116 60 -20 -129 279 -102 147 -234 -131 65 -266 -60 283 -142 230 88 -58 -53 -1 22
5287 22 -346 53 -75 34 202 92 -29 59 -86 85 21 -2 -87 30 -18 26 38 -396 82 153 40 -33 -6 -72
5311 -72 79 -66 107 139 -94 -80 34 -166 -182 159 113 302 -74 -21 -222 -120 209 -293 4 -174 42 -63
5333 -63 251 -18 65 -81 -24 224 -6 82 208 18 -367 9 58 10 100 -56 -139 -226 -220 -20 81 148 -56 -71
5357 -71 -204 109 156 -65 -136 -21 -24 311 16 170 -45 -95 -109 68 -83 99 177 69 128 154 30 -45 -513 -93
5381i3q2J27K94l63J0J68j2L7j48K67m53K24J44l79L23n9j8j72L10l4P4l37J17
5404e5J48m9j1K62k62k56J72J80r5J3J94k99J36k17J34Q3l0K5j95K0J46K3j29
5427f2O4Nq5J69k87J91R1O4k88J89M1K7j82P1K20j69J71k73o9J21J0j18J08k4
5451a5J03K67n66J32J01%P0l25J5M30l83J66J23j43n8j3K42q1k5%j6j84K78j0
5475A08j59J67R3j81l8K03k01J90l79j35L41Pj26K77j77k31L93k62K67k3k15J88
5497A07o0k01J47j33J18Rl41M28k90O5L24J31n68M56k22j39M08l65J64O4J15q6
5519A31l93R1L24k40J25L1j60J97J09n7j47K17j94k9%J19k11M3O4K06r1k75j92
5542c32K52J52j60L20k04j10q6K15k46L19r3k8K48l13j15J80o0j24K85m4j33p6
$$ plain form
5381 -93 -175 -48 246 -117 -107 61 49 86 -62 205 -248 -24 120 -259 64 5 -13 -185 125 91 165 -172 -55
5404 -55 93 44 33 295 33 -223 -51 129 34 47 241 -58 78 -139 -5 78 48 73 -122 -102 44 67 -62
5427 -62 2 7 -78 91 -196 -5 86 150 -138 51 92 119 -63 8 228 59 230 -43 -112 9 19 -99 9 -15
5451 -15 88 355 -211 -79 22 22 92 -233 -218 212 -171 -5 118 -25 -83 -96 146 65 40 40 24 -160 118 108
5475 108 -51 116 209 28 -10 193 -8 182 -197 -332 9 16 -110 167 -10 -241 152 -110 157 134 -81 107
5497 107 47 -154 -7 -140 -22 -13 -354 74 -216 -151 173 304 -264 192 -30 -169 239 -126 38 102 217 131
5519 131 -262 -171 153 -87 38 69 -91 106 215 158 11 228 34 5 5 124 -87 -44 20 226 135 -140 -332
5542 -332 -80 72 -88 232 28 -82 -168 47 -199 120 27 -1 247 -66 -181 -1 -61 -185 100 56 -77 -153
5564a53k7R1l1o4K67m6J62o7j6l02K63k3R7r5j2K5J96m02n6J95j11J08j31K31
5588I9l54N11l09j81K34K43j83q8R7K5j73j8OJ82k28M79m29K08J51k36j62J63
5610C7p9R3q9K19k80J48k00P6L41j05k35j25L63k43j61N40k14j30k59K65p9q7
5632b04L00l1N3j44M5K17q9l90K32k79n0M75l31O5J4J46j78K12J33j17l41K60
5654bN5J91j86r0P5j32j82K09J71o4j4k4K31o9j48N5k61K02l2k39L39j9k61O6
5678a29J06P7mk21M24l60K36n9J05l09J86J6j01j49J69O7k92J43M84k93l89M63
5700A70r4J8j94P6J2J98j68k59J88M4j65J46jj77K47Ql8j56j9K6L23ok33J5J06
5725F7J20K1j05j67J7k45K70k05J54K03q5J2J02n9J5k7p1QL19m04L09k54q4K6
$$ plain form
5564 -153 -180 -89 -120 -184 83 37 199 132 116 -186 77 54 151 56 44 69 265 -137 -193 2 -109 -1 -132 99
5588 99 -255 256 -53 -234 0 243 60 -28 69 94 -79 -97 -91 91 -137 342 -87 121 272 36 -126 37
5610 37 -42 51 -38 181 -99 49 -151 -75 266 161 -74 -199 164 -79 -240 300 86 -44 -303 -38 -117 -204
5632 -204 96 65 118 -26 19 236 147 -243 -11 -290 -340 135 -196 -131 -117 29 -149 63 196 79 -262 -2
5654 -2 53 244 58 -32 43 -89 -271 -62 109 45 31 7 238 169 21 76 -185 17 -15 -254 85 66 -195 -129
5678 -129 -23 54 50 -171 253 -107 129 70 175 -134 52 68 -33 -182 -13 54 -238 -95 389 96 -293 170
5700 170 76 94 -100 -24 -12 186 18 -241 -53 -9 -174 -28 -29 -206 41 49 11 -145 -164 -138 185 179 -54 -39 67
5725 67 187 208 103 -64 -47 -292 -22 -227 -73 130 45 57 159 100 115 88 17 25 344 -60 249 -5 -89 -63
5749f3j50L34j75j3L75k35k39L44l80J29o7J30l59L20l1M8N4m07L97q6J92k31
5771a13J16l41L10j4K43k06K74n67K00L76m05K38k73j3L01j66m26N40Nj49R9q2
5793e3J94j58L2J07q9M7k5Q9m0j62O5Rj7J01k41K79P8M9k11K6j52N2o7j53K39
5818aJ01k47j79L60j87P0K79Om03L19k05M8O1k91L15kLL9k70K3Q3M6Q3j96l7J95
5844A3m1J54m45P2P7L38k70L05K3l75J71j17O9J29P5l24K18%q4J35q5J31K07m20
5868d4O1O4l7M0P2j27M0o6m0j33J5m27N85k07J21J70o8K17l0q0m14N11l34K68
5892A57k94rK75J52l75J66n1j88n1K66J18k14j32N0M36k70J5J40M2j92j61J14
5914fK97j85j62L06q4j52rK10m39K22j2K76K9n08K70j28K69J5j79j96L02o0k63
$$ plain form
5749 -63 -213 121 -54 -67 308 73 -166 178 -202 -73 -140 -10 -369 -49 -80 -32 22 -385 12 -74 118 -113
5771 -113 3 -338 -28 -42 201 -5 269 -298 -98 278 -127 111 -162 -175 126 -40 -466 74 79 -70 29 -53
5793 -53 141 -17 15 122 33 80 55 144 104 -58 7 16 -1 100 -141 138 216 265 54 80 -72 -20 -87 -240 -1
5818 -1 100 -147 -326 34 -153 -83 196 202 -201 118 -87 -39 22 -269 46 44 47 86 -184 -161 -78 -32 51 -145 -182 13
5844 13 -28 126 -319 -247 -170 168 -102 203 226 -149 22 -95 -26 103 178 -146 72 72 -12 123 38 169 376 -44
5868 -44 17 81 44 84 156 29 69 3 -37 -170 -155 -582 3 -204 -83 87 19 236 206 126 -288 223 -111 157
5892 157 -137 -146 129 281 -94 72 21 -167 -218 48 166 -48 -180 -130 306 36 51 191 233 41 -120 -6
5914 -6 291 106 -56 250 166 14 5 215 -224 -2 -14 262 291 -217 53 -75 194 209 30 -166 136 76 -187
5937a87O8L24k53k6J68O9j24j02J48Qk12J92j56mK08n8K49m20J80Q7l38K54q2
5960gOO6q3r5J65q3j14N1J03k93L09J10k9j29k1MJ03R3J52l11R7L4m51L30j90
5985a83J48j67J52KJ5l56N39k78Q9r0j30M46k12K24m8l79K23K20j1k68r3N8M4
6008e5o7j02M45l06q0K97j30K8j23J98R2j43n9M22n61L32J53n37J83j56M50j74
6030A07j23R6m6j8m1J49k93L24Rk48R7j20K18j83P7J43j30L8J25m0j97O5j21L2
6054h0K4L1J82k87J83r9J4l6M4r3j05K19L1j81KK62j01O5j59M14l64J34m6j53
6078i9JJ55J85j45J41k93Q3p5J87q4j97n7K2J99R7N7p3m85L21j13L80j81N2L3
6102A11K6k30L9K03k1k38K5J09k77L08J47j54j91J50P5J84k91J10O1O7k20K38
$$ plain form
5937 -187 -119 205 -48 -74 94 163 39 -63 85 93 -119 73 -83 -87 121 63 312 -108 72 159 -179 75 -7
5960 -7 -1 65 -18 -113 52 -31 -145 -94 9 -284 25 135 106 -23 -44 -40 63 156 308 -3 94 128 -323 7 -183
5985 -183 -35 -202 -50 -48 -33 -389 150 -128 -39 -129 -259 187 -25 199 151 -228 -5 215 204 -64 -157 -99 -55
6008 -55 -122 -224 221 -85 -165 132 2 30 -93 105 197 54 -5 417 -144 188 341 -196 -13 -169 281 107
6030 107 -16 80 34 16 -25 124 -169 155 164 -84 13 -107 111 -72 5 148 18 56 181 141 -56 9 -112 -80
6054 -80 -56 -25 157 -130 53 -46 -32 -68 -24 -117 -222 -3 28 -153 -151 111 10 75 -84 330 -34 100 54 -99
6078 -99 -98 57 242 97 238 -55 28 -47 140 56 -141 -198 -176 23 120 177 104 -381 -60 -173 207 26 78 111
6102 111 137 -93 -54 149 128 -110 -85 24 -253 55 202 48 -143 7 82 266 -25 85 146 213 -7 231
6124B31k56q0K32M0j63N8J98k16k6l79J97P3P8j84J43J52k57J02K68N7k73J12
6146A07j45j97L58j56K98l45K06j08m1J45j29NM8K10k95j40j5J81J6NJ7K5j08
6169e8M37l09k68K55rj05N6k42K79M0l59K06K00O5l12P2r9K43j73J12K39l80K19
6192A09n9K72l07L5P3M2k19J26k01K16j83j3N2k23K4J85j2P5lk32K61k00M28l21
6216g5P4R1j65J09l8J17M6k56l2K17P7p7k6k37J0J63n2J56j44K82j60j9k1k01
6240a61L57j04k74J23J81k83J54J49Ll78J42K09l22O1K81j17K77m66L52k93K04
6261I5K24l61M0M8k27K09l60J98L67k06k87M23l26J17j2J89k2m2J22k11J48j05
6283B1j66K08m3m8J5j13J56j47K23j93N2p5L08j23M6L6l71L36k10l3R3J1J19r6
$$ plain form
6124 231 -25 -105 127 167 4 62 260 44 18 -361 -164 -91 -13 -197 -54 98 -159 -57 211 268 -5 107
6146 107 -38 -235 123 -33 265 -80 126 18 -23 122 -7 -2 46 256 -39 -179 -194 -13 3 8 25 50 -58
6169 -58 379 70 -198 57 48 -57 -1 -243 36 76 -283 -77 123 188 -124 -52 -151 92 -81 31 270 -110 109
6192 109 50 322 15 50 123 165 -54 72 -129 87 -96 -109 -57 -280 -256 -71 -83 -8 -11 -243 18 -182 246 -75
6216 -75 -1 90 -75 34 -4 113 159 -97 -129 88 165 88 62 -175 -165 -2 -54 102 -42 240 80 61 40 -161
6240 -161 196 92 -182 -59 122 -161 -7 142 145 -233 -91 118 -204 -143 138 21 298 -168 184 -109 95
6261 95 319 -42 -2 46 -181 28 -332 -134 233 27 -260 163 -163 -46 -58 131 109 67 189 -22 126 21
6283 21 -145 63 20 -28 -13 -126 30 -117 106 -87 -35 -110 198 75 121 157 -214 122 -88 -121 -28 -17 102 6
6307Fk41J92PK64k81J52j27KJ60q6l30L98j8r3j80J94Q8l1j65M9q1J47j26J25
6331B5k31O5P5J15K15j63k4J85k73O3J29K7j21k59J75k47K84R4l4k66K29j45N
6354g7J38PP1m6L1j23J59l44J59q5J56o2l5K50k6j80p4L69k29k07J25o8K37q5
6378F1p1j06K00m4j40K91j25k27j60L95j77j27K4J46O4J50k85K10j79k12J93q1
6400b00KL86m07K25j26L25l03L10k74K65l34Q1N2Q3k58J30k2L30l08K29j98r4
$$ plain form
6307 6 -235 -43 -36 228 -53 99 -28 -26 134 48 -282 116 98 5 -175 19 107 76 -89 -40 -121 26 -100 25
6331 25 -206 -141 -66 49 264 101 77 262 -11 52 181 208 87 -172 3 -244 40 134 100 -166 63 -82 -77
6354 -77 61 68 139 93 124 1 160 -184 -25 -110 46 -16 -51 199 173 -7 -81 288 59 -148 -23 -91 146 61
6378 61 -10 -116 84 40 -100 191 66 -161 -321 74 -103 -230 -206 -60 4 154 -131 79 -100 -312 -119 -200
6400 -200 -198 188 -219 6 -120 205 -98 212 -62 203 -131 -50 2 85 -173 -43 -65 265 -43 186 -12 -106
$$ [...]
8191I
##END NTUPLES=NMR FID
##END=
