##TITLE=1H_DE-22_oil
 CDCl3
 8 sc, 
 3.11.2023
##JCAMPDX= 6.0         $$ Bruker NMR JCAMP-DX V2.0
##DATA TYPE= NMR FID
##DATA CLASS= NTUPLES
##ORIGIN= UXNMR, Bruker Analytische Messtechnik GmbH
##OWNER= root
$$ XWIN-NMR		Version 3.5
$$ Fri Nov  3 14:49:35 2023 Russian Standard Time (UT+4h)  she@DPX200
##.OBSERVE FREQUENCY= 200.1313
##.OBSERVE NUCLEUS= ^1H
##.DELAY= (6, 6)
##.ACQUISITION MODE= SIMULTANEOUS
##.ACQUISITION SCHEME= undefined
##.AVERAGES= 8
##.DIGITISER RES= 18
##SPECTROMETER/DATA SYSTEM= spect
##.PULSE SEQUENCE= zg30
##.SOLVENT NAME= D2O
##.SHIFT REFERENCE= (INTERNAL, D2O, 0, 15.7039)
##AUDIT TRAIL= $$ (NUMBER, WHEN, WHO, WHERE, WHAT)
$$ ##TITLE= Audit trail, XWIN-NMR		Version 3.5
$$ ##JCAMPDX= 5.01
$$ ##ORIGIN= Bruker BioSpin GmbH
$$ ##OWNER= she
$$ F:/spectra/data/she/nmr/H-F/1/audita.txt
$$ ##AUDIT TRAIL=  $$ (NUMBER, WHEN, WHO, WHERE, WHAT)
(   1,<2023-11-03 14:48:43.42 +0400>,<she>,<DPX200>,
      <created by zg, POWCHK disabled, PULCHK disabled
       configuration hash MD5:
       00 E9 B6 7A A2 85 ED C7 34 08 36 98 17 FE 4E 26
       data hash MD5: 16K
       73 37 5F 60 26 F1 C6 F8 11 68 C8 D6 9C AA D3 F9>)
$$ ##END=
$$ 
$$ hash MD5
$$ 45 29 5F 6C A2 5B B3 3B 4B 45 9B 53 05 51 E3 EC
##$RELAX= 
##$RELAX= 
##$RELAX= 
##$RELAX= 
##$RELAX= 
##$RELAX= 
$$ Bruker specific parameters
$$ --------------------------
##$DU= <F:/spectra>
##$EXPNO= 1
##$NAME= <H-F>
##$PROCNO= 1
##$TYPE= <nmr>
##$USER= <she>
##$AMP= (0..31)
100 100 100 100 100 100 100 100 100 100 100 100 100 100 100 100 100 100 
100 100 100 100 100 100 100 100 100 100 100 100 100 100 
##$AQSEQ= 0
##$AQ_mod= 1
##$AUNM= <au_zg>
##$AUTOPOS= <>
##$BF1= 200.13
##$BF2= 200.13
##$BF3= 200.13
##$BF4= 200.13
##$BF5= 200.13
##$BF6= 200.13
##$BF7= 200.13
##$BF8= 200.13
##$BYTORDA= 1
##$CFDGTYP= 0
##$CFRGTYP= 5
##$CHEMSTR= <none>
##$CNST= (0..31)
1 1 145 1 1 1 1 1 1 1 1 1 1 1 1 1 1 1 1 1 1 1 1 1 1 1 1 1 1 1 1 1 
##$CPDPRG= <>
##$CPDPRG1= <>
##$CPDPRG2= <>
##$CPDPRG3= <>
##$CPDPRG4= <mlev>
##$CPDPRG5= <mlev>
##$CPDPRG6= <mlev>
##$CPDPRG7= <mlev>
##$CPDPRG8= <mlev>
##$CPDPRGB= <>
##$CPDPRGT= <>
##$D= (0..31)
0 1.2 0 0 0 0 0 0 0 0.06 0 0.03 0 0 0 0 0.0002 0 0 0 0 0 0 0 0 0 0 0 0 
0 0 0 
##$DATE= 1699008522
##$DBL= (0..7)
120 120 120 120 120 120 120 120 
##$DBP= (0..7)
150 150 150 150 150 150 150 150 
##$DBP07= 0
##$DBPNAM0= <>
##$DBPNAM1= <>
##$DBPNAM2= <>
##$DBPNAM3= <>
##$DBPNAM4= <>
##$DBPNAM5= <>
##$DBPNAM6= <>
##$DBPNAM7= <>
##$DBPOAL= (0..7)
0.5 0.5 0.5 0.5 0.5 0.5 0.5 0.5 
##$DBPOFFS= (0..7)
0 0 0 0 0 0 0 0 
##$DE= 6
##$DECBNUC= <off>
##$DECIM= 32
##$DECNUC= <off>
##$DECSTAT= 4
##$DIGMOD= 1
##$DIGTYP= 9
##$DL= (0..7)
0 120 120 120 120 120 120 120 
##$DP= (0..7)
150 150 150 150 150 150 150 150 
##$DP07= 0
##$DPNAME0= <>
##$DPNAME1= <>
##$DPNAME2= <>
##$DPNAME3= <>
##$DPNAME4= <>
##$DPNAME5= <>
##$DPNAME6= <>
##$DPNAME7= <>
##$DPOAL= (0..7)
0.5 0.5 0.5 0.5 0.5 0.5 0.5 0.5 
##$DPOFFS= (0..7)
0 0 0 0 0 0 0 0 
##$DQDMODE= 0
##$DR= 18
##$DS= 0
##$DSLIST= <SSSSSSSSSSSSSSS>
$$ [...]
##$SUBNAM2= <"">
##$SUBNAM3= <"">
##$SUBNAM4= <"">
##$SUBNAM5= <"">
##$SUBNAM6= <"">
##$SUBNAM7= <"">
##$SUBNAM8= <"">
##$SUBNAM9= <"">
##$SW= 18.0517328524113
##$SWIBOX= (0..15)
0 0 2 0 0 0 0 0 0 0 0 0 0 0 0 0 
##$SW_h= 3612.71676300578
##$TD= 16384
##$TD0= 1
##$TE= 0
##$TE2= 300
##$TE3= 300
##$TEG= 300
##$TL= (0..7)
0 120 120 120 120 120 120 120 
##$TP= (0..7)
150 150 150 150 150 150 150 150 
##$TP07= 0
##$TPNAME0= <>
##$TPNAME1= <>
##$TPNAME2= <>
##$TPNAME3= <>
##$TPNAME4= <>
##$TPNAME5= <>
##$TPNAME6= <>
##$TPNAME7= <>
##$TPOAL= (0..7)
0.5 0.5 0.5 0.5 0.5 0.5 0.5 0.5 
##$TPOFFS= (0..7)
0 0 0 0 0 0 0 0 
##$TUNHIN= 0
##$TUNHOUT= 0
##$TUNXOUT= 0
##$USERA1= <user>
##$USERA2= <user>
##$USERA3= <user>
##$USERA4= <user>
##$USERA5= <user>
##$V9= 5
##$VALIST= <valist>
##$VCLIST= <CCCCCCCCCCCCCCC>
##$VD= 0
##$VDLIST= <DDDDDDDDDDDDDDD>
##$VPLIST= <PPPPPPPPPPPPPPP>
##$VTLIST= <TTTTTTTTTTTTTTT>
##$WBST= 1024
##$WBSW= 4
##$XGAIN= (0..3)
0 0 0 0 
##$XL= 0
##$YL= 0
##$YMAX_a= 48765
##$YMIN_a= -59363
##$ZGOPTNS= <>
##$ZL1= 120
##$ZL2= 120
##$ZL3= 120
##$ZL4= 120
##$ABSF1= 10
##$ABSF2= 0
##$ABSG= 5
##$ABSL= 3
##$ALPHA= 0
##$AQORDER= 0
##$ASSFAC= 0
##$ASSFACI= 0
##$ASSFACX= 0
##$ASSWID= 0
##$AUNMP= <proc_1d>
##$AZFE= 0.1
##$AZFW= 0.1
##$BCFW= 1
##$BC_mod= 2
##$BYTORDP= 1
##$COROFFS= 0
##$CY= 11.3945322036743
##$DATMOD= 1
##$DC= 2
##$DFILT= <>
##$DTYPP= 0
##$F1P= 15.7292609196834
##$F2P= 12.9074282941183
##$FCOR= 0.5
##$FTSIZE= 0
##$FT_mod= 4
##$GAMMA= 1
##$GB= 0.15
##$INTBC= 1
##$INTSCL= 1
##$ISEN= 128
##$LB= 0.24
##$LEV0= 0
##$LPBIN= 0
##$MAXI= 10000
##$MC2= 0
##$MEAN= 0
##$ME_mod= 0
##$MI= 1.114404
##$NCOEF= 0
##$NC_proc= 0
##$NLEV= 6
##$NOISF1= 3.799351
##$NOISF2= 2.8
##$NSP= 1
##$NTH_PI= 0
##$NZP= 0
##$OFFSET= 15.70392
##$PC= 1
##$PHC0= -23873.32
##$PHC1= 11.65269
##$PH_mod= 1
##$PKNL= yes
##$PPARMOD= 0
##$PSCAL= 0
##$PSIGN= 0
##$REVERSE= no
##$SF= 200.130013532006
##$SI= 16384
##$SIGF1= 3
##$SIGF2= 2
##$SINO= 400
##$SIOLD= 16384
##$SREGLST= <1H.CDCl3>
##$SSB= 0
##$STSI= 0
##$STSR= 0
##$SW_p= 3612.71676300578
##$SYMM= 0
##$S_DEV= 0
##$TDeff= 0
##$TDoff= 0
##$TI= <>
##$TILT= no
##$TM1= 0
##$TM2= 0
##$TOPLEV= 0
##$USERP1= <user>
##$USERP2= <user>
##$USERP3= <user>
##$USERP4= <user>
##$USERP5= <user>
##$WDW= 1
##$XDIM= 8192
##$YMAX_p= 0
##$YMIN_p= 0
$$ End of Bruker specific parameters
$$ ---------------------------------
##NTUPLES= NMR FID
##VAR_NAME=  TIME,          FID/REAL,        FID/IMAG
##SYMBOL=    X,             R,               I
##VAR_TYPE=  INDEPENDENT,   DEPENDENT,       DEPENDENT
##VAR_FORM=  AFFN,          ASDF,            ASDF
##VAR_DIM=   8192,          8192,            8192
##UNITS=     SECONDS,       ARBITRARY UNITS, ARBITRARY UNITS
##FACTOR=    0.0002768,     1,               1
##FIRST=     0,             0,               0
##LAST=      2.2672688,     0,               0
##MIN=       0,             -59363,          0
##MAX=       2.2672688,     48765,           0
$$ Real data points
##PAGE= N=1
##DATA TABLE= (X++(R..R)), XYDATA
$$ [...]
1774A65K58j36o34O25R0n15j47J52J54k20j61K71J54l14j14L08J06K22m51K52
1794F5M09Q0p66K00K29J19n35J53QK41n76J08J49J64k17j93N38n4j01l5K42L10
1816E38k31m23J88M79o83K98k20K04k39q1J9K2p8k4OJ81m19pL80J52M04m78M6
1839C4J83J81m45j11J07R6J61m77J70N6k94k15L70O1J02l06M54K4l6L5r9M54l36
1862A69l06K17Q4o5j94o5K97j22j61j61L55k16j68l2K51M88j45k50J44K88n21
1883a13L13j04J35l2p08N77K00l97m29L54K38j05l01J77N30m94L3J01K22J30l57
1904c0j77M73Q0k55j48J69l55L15k74J39Q0m29J88K60j92J46r0J85K07k62N4o8
1926A6%K40l91K18K17R5n66R4L09m63J41J81j35mj72j40L00J17Pl21M03K3k88
$$ plain form
1774 165 423 287 -347 278 368 -147 -294 -142 12 -208 -369 -98 56 -258 -372 -64 42 264 -187 65
1794 65 474 554 -212 -12 217 336 -199 -46 -38 203 -373 -265 -116 48 -169 -362 176 122 21 -14 228 538
1816 538 307 -116 72 551 -132 166 -54 150 -89 -170 -151 -129 -207 -231 -225 -44 -463 -470 -90 62 466 -12 34
1839 34 217 398 -47 -158 -51 45 206 -271 -101 -45 -339 -554 -184 -123 -21 -327 127 151 115 150 51 505 169
1862 169 -137 80 164 99 -95 -160 137 15 -146 -307 48 -168 -336 -368 -117 371 226 -24 120 408 -113
1883 -113 200 96 231 199 -509 68 268 -129 -558 -204 34 -71 -372 -195 335 -159 -126 -25 197 327 -30
1904 -30 -207 266 346 91 -57 112 -243 72 -202 -63 17 -412 -224 36 -156 -10 -100 85 292 30 84 16
1926 16 16 256 -135 83 300 395 -171 -77 232 -231 -90 91 -44 -48 -220 -360 -60 57 64 -257 146 169 -119
1949a19J32r7O52l04k98J47J57k74k44J16L10j82m35N03k65J07M4l57M31K31l37
1970h2J00K47j39Q1k03M7K04n61L23N4K73l37m52K66J91K5m43K81J61l9j41j15
1992b59L20L00o45L46L98l93k82K37J12l27L2J18n8q2J28l48N22j73j89K45j40
2013a38L55l2l75L83M56o41N3L2L74m01k47r9K30j53L5JL96j56l74L71J8R8r8
2036H8k41N14N4l39J9K88j33l19k50M06n1P6n79N66j05k34j33R7K88Mq0J74nJ6
2060A21j77q8L61k22J22k50J72J13l81j28M83l12l5J52K81m01j23K45J43K2or3
2082aP6o3K17n47K75M0j27l2N4L81m00n9r1O6K10k97K59K38o0l45nM36J26k91
2106F0O7J81R6m07M1J14k14Kk35K42L8p1Pj4J79k04k05M19J95l24j50K49J86j71
$$ plain form
1949 -119 13 -84 568 264 -34 113 270 -4 -248 -132 178 -4 -439 64 -201 -94 -50 -407 24 255 -82
1970 -82 18 265 126 207 4 51 255 -306 17 71 344 7 -445 -179 12 37 -406 -125 36 -3 -144 -259
1992 -259 61 361 -284 62 460 67 -215 22 134 -193 -161 -43 -101 -183 -55 -403 119 -54 -243 2 -138
2013 -138 217 185 -190 193 649 8 61 93 467 66 -181 -280 -50 -203 -168 -167 229 73 -301 70 88 186 88
2036 88 -153 361 415 76 95 383 250 -69 -319 87 36 112 -467 99 -6 -240 -373 -276 12 16 -64 110 105 121
2060 121 -56 -144 217 -5 117 -133 39 152 -229 -357 126 -186 -221 -69 212 -189 -312 -67 76 98 92 -1
2082 -1 75 12 229 -318 -43 -3 -130 -162 -108 273 -127 -186 -277 -211 -1 -298 -39 199 139 -206 -211 225 351 60
2106 60 127 308 404 -3 38 152 -62 -60 -295 -53 -15 -86 -79 -93 86 -118 -323 96 291 -33 -183 66 252 81
2130H1q6J24ok06jk3J01j23k22K6L56J01l77J38K02J20j94J89j04R3j01l73N85
2153C00l1m39J93o6M7K20m95o5L43j50k25R5M31k69n1o4M18M2j07j19j9M90m90
2176a1m0K32O1j70j26J63M9k98m2O7L78o7k48J3K16j77j69%K58J26K1Jj78K07
2200B66l90MK13r2l0l83M74O3k54j23K80L6M1k3R8j0j1j33L31q2p6k90L00jm43
2225b35O7K7N4k75j99M02K63k34j27K87n3Q0j39J30L66j88Jj98oR6j13k99J34
2248a59L78l86m6M1r9J32j9J39R9o2n2q4M07k08l8J43j56J63m67K8L58j24j64
2271a76k0L04j70k57L64q5j2N2k93N38j12p9j80L07O7j85lj93jK50l49JK72j98
2295a58m7J94k6n6J00Rm9J35k29pL67K3l16K30j05J36r3j61P0q6K79l58K89m98
$$ plain form
2130 81 -5 119 113 -93 -94 -117 -16 -139 -361 -335 21 122 -255 -117 85 205 11 200 96 189 88 -285 300
2153 300 269 -170 23 -43 4 224 -271 -336 7 -143 -368 -273 158 -111 -162 -226 192 234 127 8 -11 479 -11
2176 -11 -51 181 242 72 -54 109 158 -140 -182 -115 263 196 -52 -39 177 0 -169 -169 89 215 236 237 59 266
2200 266 -124 -120 93 1 -29 -412 62 125 -129 -252 28 64 105 82 180 170 159 26 357 275 199 -91 209 208 -235
2225 -235 -168 -141 -87 -362 -561 -159 104 -130 -257 30 -23 57 -82 48 414 226 227 29 23 119 6 -293 -159
2248 -159 219 -167 -213 -172 -271 -139 -158 -19 80 18 -34 -118 289 81 43 186 30 193 -274 -246 112 -12 -176
2271 -176 -196 108 -62 -319 45 -40 -52 0 -293 245 133 54 -126 181 248 63 60 -133 -134 116 -233 -232 40 -158
2295 -158 -205 -11 -37 -93 7 16 -33 102 -127 -134 233 256 -60 170 65 201 108 -53 17 -69 210 -148 141 -357
2319c57L03j96L53k20Qk70L45L17j61l35K40K00Rk45J41p2K5J6j01K8K2l8j91
2342a79K44k7j25J3K89k27j39J67o9L13k32j20R1r2l9j17K40J23k16j20N2M22
2364B52j47j44l85K91K29k19J73q1L1L6K02l7j21K4j20J72k2l56j50N13j07k17
2386a83k28N26rok93J5L82k16J78n5j61J82j66N2m9n2J88k11K3J61j02k28J76
2409g6r4K66P6o0j57j21J20K71j9l8k07n8K99J36p15L17K40k3m12R6J23P1j72
2432a37j36L84J0j96j1K5L06j97m0M06k39k91J87qK4%j99J88nm18L31k7J32k43
2456a54p5JM38L5j44K44l08L20k67K03l17Q2p0j02j02K59Q5l74L56o4j56J40J88
2479B18j00m2j43L17j85R4k68K98j61j22j74J94kP4k9l01J20m2J9Q1K94l22K02
$$ plain form
2319 -357 -54 -250 103 -117 -109 -379 -34 283 122 -213 27 227 236 -9 132 60 85 101 0 28 50 12 -179
2342 -179 65 38 -87 -74 215 -12 -151 16 -53 260 28 -92 -1 -93 -132 -249 -9 114 -102 -222 -170 252
2364 252 105 -39 -424 -133 96 -123 50 -31 0 36 238 201 80 104 -16 156 134 -222 -372 141 34 -183
2386 -183 -411 115 106 100 -193 -178 204 -12 166 111 -50 132 -34 18 -31 -83 105 -106 -83 78 -24 -252 -76
2409 -76 -170 96 172 112 -45 -166 -46 225 206 168 -39 -97 202 338 -377 -60 180 157 -255 -159 -36 35 -137
2432 -137 -273 111 121 -75 -86 -61 245 48 8 414 175 -116 71 63 87 87 -112 76 71 -347 -16 -43 89 -154
2456 -154 -229 -228 210 245 101 345 37 357 90 293 -24 58 -12 -114 -216 43 128 -246 110 46 -110 30 218
2479 218 118 76 -67 250 65 159 -109 189 28 -94 -268 -74 -76 -2 -31 -332 -212 -254 -235 -154 140 -182 20
2502B0l0K07pj87J4J88k4M7j44K3P7k07n2J10L18l67l42L56Q3j57J29J26j74l6
2526b9J35P6K09k66K3j46J43K66l49j46K06J7k29K73k07j07o0J17O0P4k12L16
2548A64o5On7l37M94j11k97K35K7j69LK15n13K05K29k68K04K30l33l19K41L54
2570A38j14l01O03r9o1Q2m38J48K66l56K04k00l10L22p2J77j14j11o2J95m0k2
2592a65Q5J49%j74P4j53M37k34J66m85K30R2j87K5J58j04k09K14M20k07L7k11
2614d2L3L6k2j42L44j57oJ3N6j07p0J30j55P6q5R7k98L0J89p2O5O0J69j1j53L23
2640C01k43M4j62J67m5k35P1J53k17q4J25%lJ00j15K1K79k77K42N0j4j08k72L60
2664A38k2l1O9j50L22l88j02Q5J86k29k4J31q3P6R3j31K62j03Q5l56L29r4j34
$$ plain form
2502 20 -10 197 190 3 17 205 181 228 84 107 184 -23 -75 35 353 -14 -356 0 83 -74 55 181 7 -29
2526 -29 106 182 391 125 148 2 145 411 62 -84 122 139 -90 183 -24 -131 -191 -74 -14 60 -152 164
2548 164 99 105 48 -289 205 94 -203 32 59 -110 -107 108 -405 -200 29 -239 -35 195 -138 -457 -216 138
2570 138 24 -277 326 227 166 248 -190 -42 224 -132 72 -128 -438 -116 -188 -11 -125 -236 -298 -103 -143 -165
2592 -165 -80 69 69 -105 -31 -184 253 19 185 -300 -70 22 -165 -140 18 -86 -295 -81 339 132 169 -42
2614 -42 -9 27 5 -137 207 50 44 57 113 6 -64 66 -89 -13 -98 -1 -299 -269 -80 -152 -87 -27 142 131 -22 301
2640 301 58 102 -60 107 62 -173 -102 51 -166 -250 -125 -125 -128 -28 -143 -122 157 -120 122 172 158 50 -222 138
2664 138 116 85 154 4 326 -62 -164 -79 107 -122 -146 -15 -98 -22 71 -60 202 99 184 -172 157 63 -71
2687g1L35k42j80MO7K21j57J47j39Oo6K8j68P1J33R4j95J00J41r2l06J03K16Q4
2711A34N1j57J99l24j31Q8q6K28r2J71j46o3L43k46q7J23O0k05L33P3l41l8K66
2734A53O2j91k75%J93J66j12o7M0J11k95K31nr5k43M02M7L5l08J31J53j97K25
2757A61n45N63J33j26l10K67k94J12j39J13J97j69l2L78j24j24LQ3M9j42j04k19
2779b69L34k48p7K74pk0j99j6k3K46M5P7j11j28L15j24q2J78p8n8J51l8k31j88
2803b77K48J79kl69K77j33mkP3Q8l25m6L55o5L36k92J66l4j53l6L5M3J11j73k02
2828b02L9J09J03j86J95p7L8k92K61J74M8j63J15j70R0j8m4L2K9j27O3j08L14
2851B23l80K97k01k8K26j96J58k27NK77j77J79j29j02K62J51l58J29j78M8Q6M
$$ plain form
2687 -71 264 22 -158 -154 -87 134 -23 124 -15 -9 -75 -47 -215 -144 -11 83 -112 -12 129 37 -269 -166 50 134
2711 134 185 28 227 -97 -228 -140 -226 2 -90 81 -65 -128 215 -31 -118 5 65 -140 193 266 -75 -113 153
2734 153 215 24 -251 -251 -58 108 -4 -71 -31 80 -215 16 11 -84 -327 75 122 157 -151 -20 133 -64 161
2757 161 -384 179 312 186 -124 143 -151 -39 -178 -65 132 -37 -69 309 185 61 64 147 196 54 -50 -269
2779 -269 65 -183 -260 14 7 -13 -212 -228 -251 -5 40 117 6 -122 193 69 -13 165 87 29 180 142 -89 -277
2803 -277 -29 150 148 -221 56 -77 -81 -83 -10 78 -247 -293 62 -3 333 41 207 173 20 -16 19 62 173 0 -202
2828 -202 -163 -54 49 -137 58 -19 19 -273 -12 162 210 47 162 -8 82 64 20 52 81 -46 17 -91 223
2851 223 -157 140 -61 -89 137 -59 99 -128 -123 154 -23 156 27 -75 187 338 -20 109 -69 -21 65 69
2873F9k75J15j63J43N9J81j4k26m4J40N7l06K3L35J5j47j68K98l2k13K53n3k9
2896A8O1n4j63J54j18J57k98L20K0J0j82J0J89j23K17j58L2Nj86K29n52M35J65
2919A88n10K61l2P7R6j74K16k46M3M08l33J8P7M7r4j61K27L9j81j83L75q4M9k45
2943a22M2P8M9J1j10K67j16p6r7J0j5J21r9K98J02j56k1m4j76l1r2j89K94p8J
2968a49J11P7j01j80L57q0J28O7j29P5O1j87j6L5j75R5l4K12k75L10j28j05K83
2991B52l0m35K74J20j29p1q5N35j15k74j57J09k99L44j31K29k7j02j2J17k49J14
3013b2r1K40j29l3j2K55r0M3k76k5K09j90P1Q5p3j33J2J96N9j92l4n9L22j54J8
3038cj37N21l69J26p5Rn5K8%j62K35n57N01l7n9k0Q1K8j9J61p3l53M34j76j27
$$ plain form
2873 69 -206 -91 -254 -111 -52 129 115 -111 -155 -15 42 -264 -241 94 109 -38 -206 92 60 -153 100 47 18
2896 18 79 25 -138 16 -102 55 -243 77 97 107 -75 -65 124 1 218 60 92 97 -89 140 -412 23 188
2919 188 -322 -61 -93 -16 80 -94 122 -124 -81 327 -6 12 89 136 42 -119 108 147 -34 -217 158 74 123 -122
2943 -122 -80 -2 47 58 -52 215 99 23 -74 -64 -79 42 -57 241 343 187 166 122 -54 -85 -177 -366 -72 -150 -149
2968 -149 -38 39 -62 -242 115 35 163 230 101 176 237 50 34 69 -106 -11 -45 167 -108 202 74 -31 252
2991 252 222 -213 61 181 52 -19 -104 431 316 42 -115 -6 -305 39 -92 137 110 8 -4 113 -136 -22
3013 -22 -113 127 -2 -35 -47 208 118 161 -115 -140 69 -121 -50 35 -38 -171 -159 37 96 -96 -130 -189 133 -21 -3
3038 -3 -140 381 12 138 63 72 17 45 45 -117 118 -439 62 25 -34 -54 27 55 36 197 124 -229 205 29 -98
3063i8K68l51J47l9j0K08j91J47j04m7R3j86J03J37j03k30K37j37P9q0J47K7K43
3086B60k52j28J70m2J60l4k14kj26J92J37l7n10L03j79K79K1J11o2PJ06j14r4
3109d8J16p5N3j9k0K39k84j07J13k2j45J57j19J47m1J3K75K29m96J43j52J35P9
3132A71k73M16k30q2p9K98l01M9j9j3L14l24J62o7N2Rl27L35M4J08k81J55j54
3155c7K48j08k33L48k16m5J2N2Q9j36J10O2j23j1j86L8L10j44j3j12J68K43l82
3178f6p9M34K2l68j58J28K25l64K33j08K68l08K08n0L27l45j28J22j14K97k86
3199a10k3K47j19N7J18m9k83o3K86k5P5k72L66k30O6j11O5j76J30J00j03K78o4
3222A60j7j73N8k97K47l5o2P0NL5m5j3L7K87l29R1j2J83l27L06J50k92J50j54
$$ plain form
3063 -98 170 -181 -34 -73 -83 125 -66 81 -23 -70 23 -163 -60 77 -26 -256 -19 -156 -77 -157 -10 17 260
3086 260 8 -120 50 8 168 134 -80 -82 -208 -16 121 84 -426 -123 -302 -23 -2 109 47 54 160 46 -48
3109 -48 68 -7 46 27 7 246 -38 -145 -32 -54 -199 -42 -161 -14 -55 -42 233 462 -34 109 -43 92 171
3132 171 -102 314 84 2 -77 221 -80 -31 -50 -63 251 -73 89 22 74 83 -244 91 135 243 -38 117 -37
3155 -37 211 103 -130 218 2 -43 -31 21 110 -26 84 146 23 12 -174 -136 174 30 17 -95 73 316 -66
3178 -66 -145 289 311 -57 -215 -87 138 -226 7 -101 167 -141 67 17 344 -1 -129 -7 -121 176 -110
3199 -110 -133 114 -5 52 170 121 -162 -225 61 36 111 -161 205 -25 41 -70 -5 -181 -51 49 -54 224 160
3222 160 143 -30 28 -269 -22 -57 -119 -49 -44 -9 -54 -67 -30 257 -72 19 7 190 -137 169 319 27 177 23
3246B3j1k0k9O8R2K43n01K08n2J60l13L2k5k36O08j7L9k97J53l41K11n0j03O1
3270i7L6R7l44K90L01p7m37o5M67j60k7m3K70j94q4L40k67J46l30J45K62K16k54
3293A91o7j13j77n3j44M15n2P9p5N1J42j79N2J8k66J50K24k2k1R7l10Q3j1K7j89
3318a50p8M17Jj04j63j2Pp3j6L21k2k44J75l5o5J90k21L0J38lk72J32L2M1Q4j19
3344ik1l62K59J06J88o2j61K14j40J30J78k22j55J92k48P2R8n3j13K23k51o4M78
3367B77j24k45J33q2Q0Q4l05M65k61J29n2k11k3J56J6q7m8K24k57j82N62l80J52
3390B1o0j6J8q1L31k57k1J81j21r1NK79k62Q7k65L22j48n1n0K19j28N9k08K8J93
3415a6Jj40k4J92R4j90j23L43P7m89K33K20k39j41j86Q7M15k71J31l2q2K13k42
$$ plain form
3246 23 12 -8 -37 31 123 366 -135 73 21 181 -132 -100 -125 -361 247 230 269 -28 125 -216 -5 -55 -158 -97
3270 -97 -61 36 -308 -18 283 206 -231 -296 171 11 -16 -59 211 17 -67 273 6 152 -178 -33 229 445 191
3293 191 124 11 -166 -219 -363 52 0 79 4 55 197 18 70 88 -178 -28 196 174 153 250 -60 23 12 39 -150
3318 -150 -228 189 190 86 -77 -89 -82 -155 -171 150 128 -116 59 24 -41 149 -72 -42 96 93 -179 -47 -15 26 110 -9
3344 -9 -30 -392 -133 -27 161 99 -62 152 12 142 320 98 -57 135 -113 -41 57 4 -109 114 -137 -201 277
3367 277 153 -92 41 -41 39 123 -182 283 22 151 99 -112 -135 21 37 -50 -98 126 -131 -313 249 -131 21
3390 21 -39 -55 -37 -118 213 -44 -65 116 -5 -96 -91 188 -74 13 -252 70 -78 -129 -179 40 -88 -29 -237 -209 -16
3415 -16 -15 -155 -179 13 107 -83 -206 137 214 -275 -42 178 -61 -202 -388 -301 114 -157 -26 -58 -140 73 -169
3438a69O4M6K06j81J97l2Q3j85OKM6o0O2k67L20l62L39j77j3NJ15k45J11MJ0L15
3464B40l5j57Nj1j41j07Q8J51N3l60J89m3J47j03p3J22J02j78j65Q4L70l49L45
3487A74r5j54M3r2J17l2J6J45k99P1r6R7k3R9J54k65J69j17p9K88l2mR7k91K00
3512I1k13M4O8j86K11Q2J29l06J68k27J1J76J40j72j4K54j70J10km2O0q2j11J16
3536A35nj90K45l19k3j9K14k48m9M14l47J22n2J5K6J04n4J09j05K85j33l1J0p0
3560C4k10J35K05k03L7j52J6J43k17O2n1K81j05J93k36Q3q0l7L90l37J46k01J1
3583i3J32K9l14J99K33j98j89K55j15J79n56K88L33j9j28j21L22p6m9j43n0R5
3605A4j89l5K19r5MK01K15m19J26j1k64K07J38j25j29J04J70n6n5J59rl06K36
$$ plain form
3438 -169 -105 -59 147 -34 163 131 214 29 35 37 83 23 85 -182 138 -224 115 -62 -75 -70 45 -200 -89 -85 -75 240
3464 240 205 48 53 42 -99 -206 -118 33 86 -274 -85 -128 19 -84 -157 -35 67 -111 -276 -192 178 -171 174
3487 174 79 -75 -32 -124 -7 -39 -23 122 -177 -106 -202 -105 -128 -29 125 -140 29 -88 -167 121 89 85 182 -109 91
3512 91 -122 -78 -10 -196 15 97 226 -80 88 -139 -128 48 188 16 2 256 86 196 194 152 212 130 19 135
3536 135 130 -60 185 -134 -157 -176 38 -210 -259 155 -192 -70 -122 -107 -81 23 -31 78 -27 258 125 94 104 34
3560 34 -176 -41 164 -39 -2 -154 -138 5 -212 -150 -201 80 -25 168 -68 15 -65 -102 288 -49 97 -104 -93
3583 -93 39 68 -246 -47 186 -12 -201 54 -61 118 -438 -150 183 164 36 -85 237 161 112 -31 -81 14
3605 14 -175 -210 9 -86 -82 119 334 -85 41 30 -234 -27 111 -14 -143 -39 131 75 20 179 170 -136 100
3628A00P1j45L6l12M67j39n3p3N2J01K3j53M7J41k65K33j4j76J74o1j95M76j52
3651A83l91Qm0M13l84K06J52j29q2J28J40m59qK42j13K35J13k94K3L00j33k88
3673a78J49j96J81k10n5K43K9O9j87K45j03M9o0r0J11N3R0l1j27Q1j83R5K30k55
3697e0J21n4r6J4L2j55J26P0k3l1Q6L6n8j10O8L03l48K4P9o8K23j36kj54m0J59
3723A6l9j47k6O6K41j18J27j11Q6P1j57j1J15n6J30j94k17M85m72M30Ql69J15
3746b7M3l27M32l7n0n3j31J66p0K4K04k55j9L05j92Q2k71J27j29K30k7j15j76
3769b66M88l80L26k7k49J04P9P1k36N8j27J54K00O1l42K28j34Rj19l1m7N38l99
3792d1J75l41J45J18P0k49L38l35L38k63j49K11k43L68j56j67P6L0J28j12k00
$$ plain form
3628 100 171 26 62 -250 217 78 25 -48 4 105 128 -25 22 163 -102 131 117 -59 115 54 -141 335 183
3651 183 -208 -200 -240 173 -211 -5 147 18 -64 64 204 -255 -263 -21 -134 101 214 -80 -57 243 110 -178
3673 -178 -29 -225 -44 -254 -309 -66 -37 32 -155 90 -13 36 -24 -114 -3 50 140 109 -18 63 -120 -25 205 -50
3697 -50 71 17 -79 -65 -33 -188 -62 8 -15 -46 40 76 18 -92 -24 279 -69 -45 34 -34 189 53 51 -103 -143 16
3723 16 -23 -170 -196 -130 111 -7 120 9 95 166 9 -2 113 57 187 -7 -224 261 -211 219 227 -142 -27
3746 -27 16 -311 121 84 34 -19 -150 16 -54 -30 174 -81 -100 205 13 95 -176 -49 -178 52 25 -90 -266
3769 -266 222 -158 168 141 -108 -4 75 146 -90 -32 -159 -5 195 256 -86 142 8 17 -102 -133 -180 358 -41
3792 -41 134 -207 -62 56 126 -123 215 -120 218 -45 -194 17 -226 142 -14 -181 -105 -75 53 -59 -259
3813b59M33j23J48j49q1O1j61K50R1j57Q1n3j35N3r0K41l25PK78k54j27P7J84
3836a0O9j64N2m5Q2K2j08L6p7L97l68J02J49l36Q8K42l0k32J45J08p9k03M04l64
3860a20j8L02KKk50J26k14K63k16Q6q9J83k24j1Lj4K09M6k21K45j81K36j15m5
3884a5P8J40j00j52J53k57K01R0k04M0p2K54p3r5k11K68k61J38k47J99ll3J53
3907ij55K16k77N66m72M07k69j78K4K57j73J19r5K76j84j47J57J02k35p4J51q6
3929g9K23Q2j34k18L18k09N0J33K72m19QK51n41J48P0K33k04M8j15J1l9J88q8
3952a1j09J46J78j07j06J8J43o3J57l77J29q6L1mK0k1j24q7J74L38j32O8j95J92
3976A72j12j47J72j7l94K87L5N00m65r3L39k60k38L25Kj78J03k08L41l97L42k81
$$ plain form
3813 -259 174 51 199 50 -31 30 -131 119 210 53 134 81 -54 -1 -91 150 -175 -168 110 -144 -271 -194 -10
3836 -10 59 -105 -53 -98 -16 6 -102 -66 -143 254 -114 -12 137 -199 -111 131 101 -131 14 122 43 -160 244 -120
3860 -120 -138 164 166 168 -82 44 -170 93 -123 -37 -126 57 -167 -178 -175 -189 20 66 -155 90 -91 145 30 -15
3884 -15 63 203 103 -49 104 -153 48 138 -66 -26 -98 156 83 -12 -223 45 -216 -78 -325 -126 -129 -162 -9
3907 -9 -164 52 -225 341 -131 276 7 -171 -147 110 -63 56 -39 237 53 -94 63 165 -70 -144 7 -79
3929 -79 144 226 92 -126 192 -17 33 166 438 19 27 278 -263 -115 -45 188 -16 32 -83 -72 -111 77 -11
3952 -11 -120 26 204 97 -9 9 152 89 246 -131 -2 -88 -57 -61 -41 -62 -186 -273 -99 239 107 175 -20 172
3976 172 60 -87 85 68 -326 -39 -4 496 31 -62 277 17 -221 104 106 -72 31 -177 164 -233 109 -172
3998a72K2Q6J55n6P6j13K54k97J87j08l05J04K35R3l32Q2j02M3M63o33L36K31
4020B49l87J20JJ1Nk91L03Jj6N8k24k8J40j84J78K76j11j44J32j28M6M7N9j43
4044c0O0L1R8k8q1O7j2j37ml5k7O1K5n8j86M00j57L56o41L32j1j24K95j57l7N3
4070E3j0l10J34J33L3k26J70p9j19L10l04M83j18j43J40l6O7j83J17j1j28K1P9
4093G3p0K2Q3K4j96r5M10k87R6R4j95p8K08k87J66j24pJ39m6p4L23j59j05L60
4117B75n19L87k61J34j07P6j31%J46K44j55r2n3p3L95k62N7o0K30r1Q7P7m92J02
4141h6K4J08J74j98l62L08j39K67k45K82q5L1j90J29M9nJ41j23J33k90K26j95
4163d6J52m12M90k20n4k0K39N5l28p0K54j18j58N82l63j6j14M14n67L97k19j53
$$ plain form
3998 -172 -150 -64 91 35 111 -2 252 -45 142 34 -271 -167 68 161 -171 -89 -191 -148 315 -318 18 249
4020 249 -138 -18 -17 -6 -1 -292 11 12 -4 54 -170 -198 -58 -242 -64 212 101 -43 89 -39 7 54 113 -30
4044 -30 30 61 159 131 50 117 105 -32 -36 -71 -98 -37 -12 -70 -256 144 -13 343 -298 34 23 -101 194 37 0 53
4070 53 43 -267 -133 0 33 -193 -23 -102 -221 89 -215 268 150 7 147 111 178 -5 112 101 -27 -6 73
4093 73 3 25 108 132 -64 -159 251 -36 60 154 -41 -119 89 -198 -32 -156 -163 -24 -70 -144 179 20 -85 275
4117 275 -244 143 -118 16 -91 -15 -146 -146 0 244 89 -3 -56 -129 266 4 61 1 231 140 227 304 -188 -86
4141 -86 -62 46 220 22 -340 -32 -171 96 -149 133 48 79 -111 18 67 62 203 80 213 -77 149 -46
4163 -46 106 -306 184 -36 -90 -110 129 184 -144 -214 40 -78 -236 346 -17 -33 -147 267 -300 97 -122 -275
4185b75K37j98P8k13K81L0J2K12j11o0k14J63j39p4J70P1K40j25j05L9o3J08K3
4208H7L4j0J59l15j58J07j6p4J05p9L30p3j01P4N7j46L5k32J33K80j13j24j77
4231b17L3k25N67k56j80L07rl5l51L55o5l1K11l13K14J74J93k88J22k80j87n3
4253c14J64J21n8J05p2j4JK46k51K24j13P1n1l1N7l12L57Mq1j51k4K19j1l84K18
4278h0j20K40k29K45j79K08j9j85m7K74%o6k09L14j22q7J16N8P0k56o3M26l02
4301a3k15j05K97Q1Q0j76oJ28j48J19L6p0L29n51N13k38J57J2m96K39l0M7k19
4324b29L99k66j4K5L9K1%j06J69j61K75m9J7R2l47K47Q0j81Q4m4J31m25K11Q2
4348E0M1k4k5r0o4N4N5L7j2K22K1k18rM8o6j71j86K54N8J06k36J22n2j6K15l15
$$ plain form
4185 -275 -38 -236 -158 -371 -90 -60 -48 164 53 -7 -221 -58 -197 -271 -101 -30 210 85 -20 19 -44 64 87
4208 87 121 111 270 -45 -203 -96 -112 -186 -81 -160 170 97 -4 70 127 -19 16 -216 -83 197 84 -40 -217
4231 -217 -184 -409 158 -98 -278 29 20 -15 -366 -11 -76 -107 104 -209 5 179 372 84 206 -74 -261 -314
4253 -314 -150 -29 -87 18 -54 -68 -67 179 -72 152 39 110 59 28 85 -227 130 134 53 -98 -122 97 86 -298 -80
4278 -80 -200 40 -189 56 -123 85 66 -119 -166 108 108 42 -167 147 25 -62 54 112 182 -74 -137 289 -13
4301 -13 -228 -333 -36 45 125 -51 -57 71 -77 42 78 8 337 -214 299 61 218 230 -266 -27 -57 -10 -229
4324 -229 170 -96 -110 -85 -46 -25 -25 -131 38 -123 152 103 120 212 -135 112 192 11 95 51 182 -243 -32 50
4348 50 91 67 42 -48 -112 -58 -3 34 22 244 265 47 38 86 20 -151 -337 -83 -25 81 -155 -33 -85 -101 114 -201
4374b01M1qJ58l5L29l86L1R2N7l0Km1N3k13L48r3K57k92J5m4k13J83j11r9J52
4399d8K39m40L42r9j1J69M9l26J20J6j59O4K10J60k86J8k11J84nj36L12j64k67
4422b69L34j25J9K3j14M67m22r3K40l2p9j52O6J46r1Mr5J27r5L69k19R1k77J96
4446A9K2j88N3K75k53l4J16k01K33j00N9m6K49k85R9k10K7J95j9K03M0j92k18
4469a56M36k46j38J32P6o5J26j30P0j70J89m3r1j95K61M0p8j31j33L39o3L7j5
4492E2j05Ln5K04O1n11M16l5j69J58k79J29J10r6K37j95O5K25k81rR5j59K40M3
4516A44j41m6m6J11r0j07M4J16j00j03K09K7k07J37J09m2J13kj38m6J96o02O08
4539A44k62J54q5M7j97K86o8N0k86K33j95NJ60m9n1RM27m19J78L28l26k30K22
$$ plain form
4374 -201 -160 -168 -10 -45 284 -102 -71 21 78 48 50 9 62 -151 197 104 361 69 84 40 -173 10 -101 -200 -48
4399 -48 191 -249 93 -6 -17 152 201 -125 -5 11 -148 -84 126 286 0 18 -193 -9 -14 -150 162 -2 -269
4422 -269 65 -60 -41 -18 -132 335 -87 -180 60 28 -51 -203 -137 9 -82 -78 -173 -46 -141 228 9 100 -177 19
4446 19 41 -147 -94 181 -72 -106 10 -191 42 -58 1 -45 204 -81 18 -192 -165 30 11 214 254 62 -156
4469 -156 280 34 -104 28 104 39 165 35 105 -65 124 81 -10 -205 56 96 18 -113 -246 93 30 67 52
4492 52 -53 -50 -105 99 160 -351 65 30 -139 19 -260 -131 -21 -117 120 -75 -10 215 -66 -75 20 -139 101 144
4516 144 3 -43 -89 22 -68 -175 -131 -15 -115 -218 -9 18 -189 -52 57 15 128 126 -12 -58 138 -464 144
4539 144 -118 36 -49 -2 -199 87 19 69 -217 16 -179 -174 -14 -63 -114 -105 322 -97 81 409 83 -147 75
4562G5K6J0j88M9k18K71J34k52LL34n60L64k21J35M9n2n2oK71q3j67R7l5K3O0
4587F7p0q3K69r6j63l08L71o8J85J64o2l7k59K00O2l28K38m5O2j65l9k15M98k72
4611i4J34N5K27l40j19q3K45k13K22N5k25j30J3K10K6K7k42L35k46J43K44k79
4633c5M5J36j86M8k45J83K77j37j75M15l25q5oJ52j88j5J64j48L84l90J66P6m5
4656F6J6j68j19J19P6J57k59P8q7JM54n50L15O7k24J22J06o07L96J86j04r0K34
4679A85j66l9k2L1l86L50P1k65K43j02J35l27L67K77l72m2K86o6k17L7J76R9k50
4702CK4l5J98l1p2j59K8J18j96J64o6L17j51j20M8Q7j24K8q6K5J84m04J74KMl1
4728g1q9L28k93K3J46J27l15M0k7m1L10j32j89L85k83q5m1J21k09L55j52J97O8
$$ plain form
4562 75 101 111 -77 -28 -246 25 159 -93 -90 244 -316 48 -173 -38 11 -41 -93 -99 172 89 -78 19 -16 7 67
4587 67 -3 -86 183 87 -76 -384 -13 -81 104 268 206 169 -90 110 172 -156 82 37 99 -66 -105 -320 178 -94
4611 -94 40 95 322 -18 -137 -220 25 -188 34 89 -136 -266 -253 -43 -17 10 -232 103 -143 0 244 -35
4633 -35 10 146 -40 8 -237 -54 223 86 -89 326 1 -84 -90 62 -126 -141 23 -125 259 -131 35 111 66
4656 66 82 -86 -205 -86 -10 147 -112 -34 -121 -120 334 -216 99 166 -58 64 170 -437 -41 145 41 -49 185
4679 185 19 -20 -42 -11 -397 -47 24 -241 2 -100 35 -292 75 352 -20 -62 224 158 -59 -22 154 253 3
4702 3 27 -8 190 159 87 -72 -44 74 -122 42 -24 293 142 22 70 157 33 61 -25 0 184 -220 -46 -44 -40 -71
4728 -71 -160 168 -125 -102 44 171 -144 -104 -131 -172 138 6 -183 202 -81 -166 -207 -86 -295 60 -92 105 173
4751A73j78p4LJ52lq6k25N14j61j98m9K26j15j6kO6j76L70k98K66k67J57j69K0
4775g0k2J38J33M4MKl98K44j52J02K3j02j19K85j02M3k32M1N17k11k5k11Q3n8
4799d3j59K45M4N5O3j52J80j31m3l6l7j76K58j75J2pJ93m3k99L65L9k89O2J44
4823G0Pj47K84r0l5j44j2o2O5O9q5L39l50J02j14j56J43K64j54J89k98N27m41
4846b9p0Q8J95l2N3k07j0J50j9k87J23M5r1K03l14N3p4L47n74N10k75Q9j26K66
4870A4j36m9J13N9J7R8J7j06k9m6k6Q2j1j83J68K94j91j65K01p1J2k4M4k68K13
4895B7k04J13J22J99q5k70L27k06J49o44M03J36j62l6n3J31J18k6j07J05Q8Pl8
4918I4O4k37J79j57J73l06J04J07j90J86J2j84K20kJ08r8j3q7k0q9K07m9L19k18
$$ plain form
4751 173 -5 -79 -76 76 73 -13 -238 276 115 -83 -132 94 -21 -37 -39 27 -149 221 -77 189 -78 79 -90 -70
4775 -70 -92 46 179 223 227 229 -169 75 -77 25 48 -54 -173 112 10 53 -179 -138 379 168 143 -68 15 -43
4799 -43 -202 43 87 142 205 53 233 102 59 23 -14 -190 68 -107 -95 -102 91 48 -251 114 153 -136 -74 70
4823 70 77 -70 214 124 89 -55 -67 -129 -64 5 -80 259 -91 11 -103 -259 -116 148 -6 183 -115 412 -29
4846 -29 -99 -11 184 152 205 -2 -12 138 119 -168 -45 0 -91 112 -202 -149 -223 124 -450 60 -215 -126 -252 14
4870 14 -122 -171 -58 1 18 116 133 27 -2 -48 -74 8 -3 -186 -18 276 85 -80 121 50 62 38 82 -186 27
4895 27 -177 -64 58 257 172 -98 229 23 172 -472 -69 67 -95 -131 -184 -53 65 39 -68 37 125 132 94
4918 94 158 -79 100 -57 116 -190 -86 21 -169 17 29 -155 65 63 171 73 60 -27 -47 -136 71 22 341 123
4942A23M1j91K56o3l30K11J3j27M49m39J81J51k54j84K71j07j35J34LM7j63j52
4964b65N75k97K34k02j7K0l37K32J3%R3m33M47k24J61R9r8R2j73K36j21nj24R4
4988@K39n1j07K50k87k68kQ5L76m29L95Nl15J70j71K54J54k50Oj52J2K79l29K59
5012A23k18K27j40k46L49J17k04k41K76k3J81l92K41j02k1L20m22K79k87Q0J90
5033H7k62K46K4j88l3j84L6N34q5j57m2J16L9k69J12m04M69kp2j69R6J14J18j00
5057B4j19P2j94K80l40M41j43q9o3O5J33k59O1j12J01QJ60j48j22M21k34r3J22
5080b8O6l30K90o9P7k70L65j97J39j25l3J86l09M81q7lj56P6J22l40J62m3J51
5103A25l36K01j63K58k15p5j1K94j98j61L40j15K02k16J3L1k9L2M5J28j29k5l7
$$ plain form
4942 123 164 -27 229 166 -164 47 60 -67 382 -57 124 275 21 -163 108 1 -134 0 3 50 -113 -265
4964 -265 310 13 247 45 28 48 -289 -57 -44 -44 49 -384 63 -161 0 99 1 93 -80 156 35 30 -94 0
4988 0 239 188 81 331 44 -224 -226 -141 235 -194 201 206 -109 61 -110 144 298 48 54 -98 -86 193 -136 123
5012 123 -95 132 -8 -254 95 212 8 -233 43 20 201 -191 50 -52 -73 247 -175 104 -183 -103 87
5033 87 -175 71 95 -93 -126 -310 -274 260 175 18 -24 92 131 -138 -26 -430 39 37 -35 -204 -108 6 124 24
5057 24 -95 -23 -217 63 -277 164 21 -68 -131 -66 67 -192 -131 -243 -142 -134 26 -122 -244 177 -57 -150 -28
5080 -28 38 -292 -2 -71 6 -264 101 -96 43 -82 -115 71 -238 243 156 153 -3 73 195 -145 17 -26 125
5103 125 -211 -10 -173 85 -130 -205 -216 78 -120 -281 59 -56 146 -70 -57 -26 -55 -23 22 150 21 -4 -41
5126d1o9K41mj98k23L0J76Q2l0M2J34Q9k22mo9j64n9J37N4nN8j32J79m9n5J93
5152I1j67J60k06L60l76O9K74m48J56J6OJ25o9o0K36l71J54Q3j62K18O4o9N4m8
5176I0k54r7K82k50K93j46K75j42m4K37j04K05k94J96k76Q8j52j5L49q6k11j4
5198g0J3o9K1L41m20J06J9Q8L6j29K22l0j85j31K10o1n3n2P0K00O4j98k25K73
5222D0K75m63j96J78K06j48o9L34j3k13N7l1J94k7k9m4p0O3K9l52K67J18n1j87
5246a32J39N9n3j49O3J25J55j79j85J63j36k8K29j14n6RK11o2j76K75k52k3K88
5269A71k5j8j85R5j20J84Pr3j22m6mL47k59L48j94j73l4L49k35j86m2J58J56J43
5293B22j88j59J89P6k03J87n5p2L78j76k40J14K7j40L8k68K12K1R2j41M9j26K88
$$ plain form
5126 -41 -110 131 127 -71 -294 -264 -88 -6 -36 6 140 229 7 3 -66 -230 -289 -152 -98 -103 -45 -177 2 -47 -102 91
5152 91 -76 84 -122 238 -138 -69 205 -243 -87 -71 -65 60 -9 -69 167 -204 -50 33 -129 89 153 84 138 90
5176 90 -164 -261 21 -229 64 -82 193 51 7 244 140 345 51 247 -29 59 -93 -108 241 155 -56 -70
5198 -70 -57 -126 -105 236 -184 -78 -59 29 65 -64 158 128 -57 -188 22 -39 -92 -144 -74 126 190 -8 -233 40
5222 40 315 -148 -344 -166 40 -108 -177 157 144 -69 -12 -43 151 124 95 51 -19 44 73 -279 -12 106 55 -132
5246 -132 7 66 13 -136 -73 52 207 28 -157 6 -130 -158 71 -43 -99 -90 121 59 -117 158 -94 -117 171
5269 171 146 128 -57 38 -82 102 109 16 -106 -152 -156 191 -68 280 86 -87 -121 228 -7 -193 -235 -77 79 222
5293 222 34 -125 64 140 -63 124 69 -3 375 199 -41 73 100 -40 -2 -270 -58 -37 55 -86 -37 -163 125
5316A25K2n24N24l3J00m33K61k4N33n18K5J19k36K12l61K9Q6k4j28K94j32l3J58
5339D2J90l49J49M9K7j71R2K3J11k86L78l18K51l87K0Q0j66L63k52J47J85k2M0
5362A96k94l4J46q3J68k62J92l8j80J32J68j58l9J03J42l83j12K33p6K55Q4j66
5384fJ0K7J09P2j69J68q4J63l95N7O0R2o8j36J50Q9l15m6K28j22R8P1N1r4J08
5409A18j3o4Q6o4j2J05r3m7l33K38k65K13m5O4R3J37k27K32Mq1l0j53K81k22O5
5434a3L84q8N0k68J7l3j82J5j99L24k25J76j28K22k84L9Q0J80k68L34k28K50j61
5457fL4J78l01L2k4N2j7N6j55J86N8j06N9j16J04k22J36m7L10q7j11N2j61J66
5481G0Q9o4p4J28k69q6M04j50k8J68j24oJ80l29Q5N0P0k9q0qO6k09K38j0P3k64
$$ plain form
5316 125 147 -377 147 114 214 -219 42 18 551 33 58 177 -59 153 -208 -179 -93 -117 -245 49 -83 -116 42
5339 42 232 -117 32 81 108 -63 29 52 163 -123 255 -63 188 -199 -179 -99 -265 98 -154 -7 178 156 196
5362 196 -98 -132 14 -69 99 -163 29 -9 -189 -57 111 -47 -86 17 159 -224 -336 -103 -179 76 160 -6
5384 -6 4 31 140 212 43 211 127 290 -105 -48 12 104 36 -100 50 139 -176 -222 6 -116 -18 53 104 10 118
5409 118 105 41 127 63 51 156 63 16 -317 -79 -344 -131 -176 -112 -19 118 -109 123 127 46 16 -137 144 -78 -13
5434 -13 371 283 333 65 82 49 -133 -118 -317 7 -218 -42 -170 52 -232 -193 -113 67 -201 133 -95 155 -6
5457 -6 28 206 -95 -63 -87 -35 -52 4 -151 35 93 -13 46 -70 34 -188 -52 -99 211 124 13 65 -96 70
5481 70 159 95 21 149 -120 -206 198 48 20 188 64 58 238 -91 -6 44 114 85 5 -3 63 -146 92 82 155 -109
5507a09k2j8M5o9J22j25L37J1l98K14J89j27l27L33K80n06J79j82J96o9O4j59
5529a41q7J88K52l14L0k00J67m9j20M14k26K23j5k42R4J42j07q0L01j02J02k73
5551d3j78L8K52k30K65j92L3Q2k00L53l8k38J63l3P0p5r2J9Q3j23k60M08k95p1
5575c02R5K00nj63J33q8J8L6J7J55N3o17M36j56L30ko0n2N2J86j75M1k08m9K46
5600A21j32kj07L41j52j05LN8J01l95L88L7m7O1j96p0M4J27L6m13K96k70M1K85
5624E0k74L63l62K27j63K00j97M19m60L58l55J69J25l13J5jJ69J34J1j6O3l06
5646a44K09J06q0j08j8J4j18J97nr9K4J89j86j3j5M3L4l2k11K01N7n5o7L3K5J88
5672A69k77O1L05l90M79j59k10J0P0j6r0J67k64M7j1J45j7j17K62l01J23q9K00
$$ plain form
5507 -109 -131 -149 -104 -173 -51 -176 161 172 -226 -12 177 50 -277 56 336 -170 9 -173 23 -46 18 -141
5529 -141 -228 -40 212 -102 -72 -272 -105 -154 -274 140 -86 137 122 -120 -26 116 9 -71 230 128 230 -43
5551 -43 -221 -183 69 -161 104 -88 -55 27 -173 180 142 -96 67 34 104 29 -63 -44 39 -84 -344 64 -231 -302
5575 -302 -207 -7 -12 -175 -42 -130 -112 -76 -59 96 149 -468 -32 -188 142 140 80 28 80 266 91 132 -76 -125 121
5600 121 -11 -13 -120 221 69 -36 -33 25 126 -269 119 156 109 170 -26 -96 -52 75 111 -302 -6 -276 -235 50
5624 50 -224 139 -223 4 -159 41 -156 263 -197 161 -194 -25 100 -213 -198 -199 -30 104 115 99 162 -144
5646 -144 65 171 91 -17 -35 -21 -139 58 53 -46 -22 167 -19 -32 -47 -4 30 -2 -213 -12 45 -10 -77 -44 -19 169
5672 169 -108 -47 258 -132 347 188 -22 -12 58 42 -48 119 -145 -98 -109 36 19 -98 164 -137 -14 -103 97
5695I7P3j90j85L57l8L7k21N9j1l1L6J41j62p1M4J26j64J92j31p2LK04j83J1J71
5720I2j18J19k01J07k13J29K12j01j6j04L2L16k37k04L20l15K57L0j45J45j29
5741b4J79k64J2N6J83j29O5j91J04K42l29J49m2MP6L0j98p7J49jJ75l09L74n87
5765c53M00M8OK36n53M00l65K55j2k78K22o7k25K37J33Q2l3P5j14j64K38J1k11
5788c2K01N3j55J75k09o2j0J45l27o9J43O0K73k14J22j72K04l49J56K5J09J21
5810A88K8j01k6n5M8J01k79K35k79j90M15J23O1j82k01m1j2j14L06k1J41kN8k02
5834aj3m8J33k7k04L20j66J34J74m74j00L95j4k15oJ85k68K45j18J84q7p6j58
5857b05N21o1n42M64k23j6P2R7j41k8k83K20l2J03p8R6j50L15j51k00K95k42J48
$$ plain form
5695 97 170 -20 -205 152 114 151 -70 -11 -22 -53 -17 124 -38 -109 -65 61 -103 89 -42 -114 -111 93 -90 -79 92
5720 92 -26 93 -108 -1 -214 -85 127 26 10 -94 -62 254 17 -187 133 -182 75 105 -40 105 -24
5741 -24 155 -109 -97 -41 142 13 78 -113 -9 233 -96 53 11 15 91 121 -77 -154 -5 -6 169 -140 234 -353
5765 -353 47 95 101 337 -216 184 -181 74 62 -216 6 -61 -286 -49 84 166 133 208 94 -70 168 179 -32
5788 -32 169 222 67 242 33 -29 -39 106 -221 -290 -147 -87 186 -28 94 -78 126 -223 -67 -42 67 188
5810 188 216 115 89 34 82 183 -96 139 -140 -330 85 208 269 87 -114 -155 -167 -281 25 4 145 143 201 -1
5834 -1 -14 -62 71 44 -160 160 -6 128 302 -172 -272 123 109 -106 -112 73 -195 50 -68 116 29 -47 -205
5857 -205 316 255 -287 177 -46 -62 10 107 -34 -62 -345 -125 -157 -54 -132 -36 -186 129 -22 -222 73 -169 -21
5880b1j85J44M6Q9j9O2p3p8k7K69l10J0J68j52L56m79OK47j09J94j16o3k0L04
5904B43j65Q0l18K51k64M25l75O2K21l05l3J61L4J45q4K01m82L75j03k16J57j47
5926a37L50k01n6k51K29J05p3N9j05N8J46No2k68K75L0q0j80L53k93l5K09l9r4
5950e5J10j60K30r8j33k00M43M2r6q5j53o4L42j53K88l62J94o7j29J31M9j07p1
5973a04L73k01k43R4L8L1o3p3J29m7K4j30L68K94n67O6J07J62l78J47k10M55l08
5996c6PJ56k10L55j63k99l7J25J6j1P2j63K60K79o2k66k50K93J32j68n4J58M6
6019A80j77j5K11l01K91l28P1K20l24J55Qk14L77k9o6M4K8j31o3J48O0l33L00
6042A12n2Pj02K6m3k07M26l74Q2m0K02qM5k06J71p2J09k13J72O4r9R8p9K48m64
$$ plain form
5880 -21 -206 -62 -16 73 54 116 43 -35 -62 207 -103 -93 75 -77 279 -200 -194 53 -56 138 22 -41 -61 243
5904 243 78 158 -160 91 -173 252 -123 -61 160 -145 -178 -17 17 162 78 279 -203 172 69 -147 10 -137
5926 -137 213 12 -44 -295 -66 39 -34 25 -80 -22 124 129 67 -201 74 104 24 -156 197 -96 -131 78 39 -55
5950 -55 55 -105 125 27 -106 -306 137 179 83 -2 -155 -219 123 -30 258 -104 90 23 -106 25 74 -33 -104
5973 -104 269 68 -175 -81 -43 -12 -75 -148 -19 -66 -42 -172 196 490 -77 -11 96 258 -120 27 -183 272 -36
5996 -36 -29 127 -83 272 109 -190 -227 -102 -86 -97 -25 -188 72 351 289 23 -227 66 198 30 -24 134 180
6019 180 3 -12 199 -102 189 -139 -68 152 -172 -17 -9 -223 154 125 59 103 131 0 -63 85 145 -188 112
6042 112 60 67 -35 -9 -52 -259 167 -207 -125 -165 37 29 74 -132 39 -33 76 -137 35 99 0 98 19 267 -197
6067a97K97k05J50k58o7K86J0pK69k33j93K64j59K34j71K5J55m15J88j10o0J72
6089b5j01J33K32q1j91J2j97N6J47o0N7j50J74J89j36k04J97k6j2J47p9K3k0L
6113H8k53N30n67K93Rp1K69m90J97J2K5Q4q8oj0n2k91K60J59p3j44J0R9j03k20
6138c33L81l39J42K44j77J80J27lk88j23J91K8R7r9P0l05J76J84j84J75j35L8
6160D7k7j34J23q3J76l92J78J69n9M0q6J76l8K9p4L7j80q7J92J48k29J63N4m7
6184I6j29K9k20l9L19j26N1L04k17K36n28L70m45M31K3l55L99r2k5M6j86j36M67
6207B73l21o6J69O0p2O1P2j29J19k18K04m21L95q6K97m99J34j8p8%J8K8J91j99
6231h6K33J5r7p9J52j32j26J13R2O8j30J33r0k27j55K52J65O9j85J27k22K21O3
$$ plain form
6067 -197 100 -105 45 -213 -280 6 16 9 278 45 -148 116 -43 191 20 45 200 -215 -27 -137 -197 -25
6089 -25 -126 7 239 158 -33 -21 -218 -162 -15 -75 -18 -168 6 195 59 -145 52 26 14 161 82 105 85 88
6113 88 -165 365 -202 91 100 29 298 -192 5 17 42 126 38 32 22 -30 -321 -61 98 25 -119 -109 -10 -113 -333
6138 -333 48 -291 -149 95 -82 98 225 222 -66 -189 2 30 127 28 98 -207 -31 153 -31 144 9 47
6160 47 20 -114 9 -74 102 -290 -112 57 -2 38 -48 128 90 119 45 82 -98 -185 7 155 -74 89 143 96
6184 96 -33 -4 -224 -263 56 -70 -19 285 68 304 -224 146 -299 132 155 -200 199 107 82 128 -58 -194 273
6207 273 -48 -114 55 115 43 104 176 47 166 -52 152 -269 126 40 337 -162 -28 -46 -124 -124 -106 -78 113 -86
6231 -86 147 162 65 -14 138 6 -120 -7 85 153 23 156 66 -161 -316 -64 101 170 -15 112 -110 111 174
6254A74j51M4r0j01K06j76N4kj6J73j88J03j8P9J14k68m5J71j28K90k03J6K1j12
6278e3M8R8r5q4m4L94k23k8p2n1K02j58p2K46j13L1L6k02L2l0P4N1N0r7L44l54
6304g0J48J35j38R3k40J54m2R7m2q5o1J86k1j84Om1M9k16M19O5k46n1J82p8j04
6329h5J23l5L00l29O4j0k50M15j58k64K76J82l26qo6J57L15k61l9K16l51MJ68
6352C8J4K5l45K83j30JL13n6k68k4j4K3P3Jo5J39k1j79L89l6P0J26n35M64k15
6377G1P2k30K2K73l52K7J20L3J21l36K60kj89K78m25M69l18j35L80K2KJ2j11k50
6401a86L9N36n18L72j25k36J28P0J49o4j51r2o7J87k99L40r5L9J6J71j39k02R6
6424c1j53J89j09j3J20p4K40m20L34l9j19j61Mj5L57n4j26klJ46k40K16jq2R8
$$ plain form
6254 174 23 67 -23 -124 82 -94 -40 -42 -58 115 -73 30 12 91 205 -63 -108 63 -65 225 22 38 59 -53
6278 -53 -5 93 -2 -86 -130 264 41 13 -59 -110 92 -66 -138 108 -5 26 62 -140 -108 -138 -64 -13 37 -60 284 -70
6304 -70 78 213 75 168 -72 82 40 137 95 10 -51 135 114 -70 -64 -105 -56 -272 147 212 -34 -85 97 19 -85
6329 -85 38 3 303 -26 38 28 -222 193 35 -229 47 229 -97 -105 -171 -14 301 40 1 217 -134 -130 38
6352 38 52 77 -268 15 -115 -114 199 143 -125 -149 -163 -140 -67 -66 -131 8 -13 -192 197 161 231 357 -178 286 71
6377 71 143 -87 -65 208 -144 -117 3 36 157 -179 81 79 -110 168 -257 212 -106 -241 139 161 163 175 64 -186
6401 -186 -147 389 -129 243 118 -118 10 80 229 165 14 -78 -145 42 -257 83 -12 27 43 214 75 -127 -31
6424 -31 -184 5 -104 -117 3 -71 169 -251 83 44 -75 -236 -232 -247 110 56 -70 -72 -75 71 -169 47 46 -36 62
6449F2j42J29j11k74K54J31j29K81j15o8L18k96j30K90l30M9K00k80K73j14j5
6470a7q1k30K02j63L04p2q1K09j19K33J37j10j34j21m0J63j45K47j36J8l3j23
6492i2J17K06k55J12o1J43j35l18K60J63l82L67OK4k83J21n8j0R2q2Nj16J33O0
6516A7J50j84J27j00J19o9l4J36k85K41m4k97K43k6r5J60l9j63n1K73q9L8r6n9
6540a27K56k0j22j39K10m2J23M1l69K98l9l40K87k32L74l10J09j3J57l19J59P2
6562A4J21k16J63j54mK88k27J59j23J95n4k35P2j48n5J01J19o3J29j89K37N4k15
6585c1j09J41J90k79J48j6r8N1P7j86j30L20r7j82N16j01j87L9J1J2j94j67M78
6608B06j5L5p1k15J92l82K52OJ73k20j11L48q8k32K09j43L35k56p0J24m17L15
$$ plain form
6449 62 -80 49 -62 -336 -82 49 -80 201 86 18 336 40 -90 200 -130 -81 119 -161 112 -2 -17
6470 -17 -98 -328 -126 -289 15 -57 -138 71 -48 185 322 212 78 -43 -83 80 -65 182 46 64 31 -92
6492 -92 25 231 -24 88 27 170 35 -283 -23 140 -242 125 131 155 -128 -7 -65 -75 17 -65 -60 -176 -43 17
6516 17 167 -17 110 10 129 60 26 162 -123 118 74 -223 20 -6 -101 59 20 -143 -194 79 -10 28 -68 -127
6540 -127 129 109 -13 -152 58 16 139 180 -189 109 70 -270 17 -215 159 -151 -42 -55 102 -217 -58 14
6562 14 135 -81 82 -72 -76 212 -15 144 21 216 162 -73 -1 -149 -204 -103 16 -47 82 -107 130 184 -31
6585 -31 -140 1 191 -88 60 44 -54 -3 74 -112 -242 78 -19 -201 315 214 27 66 77 89 -105 -272 206
6608 206 191 226 155 -60 132 -250 2 8 181 -39 -150 198 110 -122 87 -56 279 23 -47 77 -340 -25
6630b5l4m1j44J41K49l14K89L9Jk5j82K05k30J98k36m2K11l90J07L40k12J17J86
6653B08l85K40l4m0K05j52M5j72K4L70l80n6L28l59J29K09o72M05j67K46K69j98
6675F3J48m71K78k21M50l4m85J76L4r9J84p4RJ03j14K8J33l1J91k68K35j99O5
6698A01J17k49L87m00J98j57K6J75j60k58J43r0P1P6R4j86j60M75k40J60J37l13
6720e3Q1R0m1m5P7j38k11L94r3j94K75M0m31M93l27K53k11j2qJ19k6j19K56m0
6744A29L9m09M02k14l1J31k13o4K77l5l3l0J12J65j7K7m44N5P7J19J0M3K2K2m4
6769I6mr2MK02k76j9P9K42j91k48K17j27K21J83m01j14R6k8J91J07Q7q5K2o8j38
6794d4J22%j50l6K35J4o2j05l1j80J97M0J50o2m0r0J61j22l0J17k40J58k9N9o3
$$ plain form
6630 -25 -59 -100 -244 -103 146 -168 121 160 161 136 -46 159 -71 127 -109 -151 60 -330 -223 117 -95 22 208
6653 208 -177 63 29 -11 194 42 87 -85 -61 309 -71 -127 201 -158 -29 180 -492 -87 -254 -8 261 63
6675 63 211 -260 18 -203 247 213 -272 -96 -62 -161 23 -51 -42 61 -53 -25 108 77 268 0 235 36 101
6698 101 218 -31 356 -44 154 -3 23 198 38 -220 -77 -167 -96 -20 74 -112 -272 203 -37 123 260 -53
6720 -53 28 118 77 32 109 -29 -240 154 61 -133 142 182 -249 244 -83 170 -41 -53 -61 58 32 -87 169 129
6744 129 168 -241 161 -53 -84 47 -166 -230 47 12 -21 -51 61 226 209 236 -208 -153 -76 43 53 96 118 140 96
6769 96 92 0 4 206 -70 -89 -10 232 41 -207 10 -117 104 287 -114 -228 -132 -160 31 138 225 140 162 94 -44
6794 -44 78 78 -72 -108 127 141 79 -26 -57 -237 -40 0 150 88 48 -42 119 -3 -33 84 -156 2 -27 32 -31
6819c1K47k08L9j93R8L82m59L88j93j80p0L73j86l06L09j06Q2k37K54k6j05J01
6841b7J14r5j21K02j13j46qj05J25J88j06O5j11K01J06l87M20n4j81k5O3Q6o7
6864B4j66L73j37j08l6J55K4l30J44q2J34R5k46L69J4m23N3lJ88j25m2oJ75P0
6888A14m3J64k93k67M44k96k07M57o7j06J21m7j32L00k60J31k47P5J46m7R5m7
6910a2J50k46J65Q1P0l86L8j75J47J02J20k04K60l38K00M8m1j0j3J96k32o4J33
6933a1o1K24k44k6k57P10k11j66j46L41j39J11Nj23P6j63nJ49j26l1K72l60J96
6956A5R9K4j5l0k5j21j20K76k60K04k40M14l04p1N42k33J8j57n5k70J59K80r2
6979C8j80k29M64j27O5L0p1N4q6n2K12k80K32k5M49m87J4j37J39n8nQ5k27K19
$$ plain form
6819 -31 216 8 47 -146 -48 334 -125 263 70 -110 -180 193 7 -299 10 -96 -14 -251 3 -23 -128 -27
6841 -27 87 -8 -129 73 -40 -186 -194 -299 -174 14 -92 -27 -138 63 169 -218 202 148 -33 -58 5 91 24
6864 24 -142 231 94 -14 -50 105 129 -201 -57 -139 -5 90 -156 213 227 -196 -143 -146 42 -83 -125 -131 44 114
6888 114 71 235 -58 -325 119 -177 -384 73 6 -100 21 -26 -158 142 -118 13 -234 -159 -13 -60 35 -12
6910 -12 138 -108 57 138 208 -178 -140 -315 -168 -66 54 -150 110 -228 -28 20 -21 -31 -44 152 -80 -144 -11
6933 -11 -72 152 -92 -118 -375 335 124 -42 -188 153 14 125 130 7 83 -80 -85 64 -62 -93 179 -181 15
6956 15 114 138 123 93 68 -53 -173 103 -157 47 -193 221 -83 -154 388 155 173 16 -39 -309 -150 130 38
6979 38 -142 -371 93 -34 31 61 -10 44 -42 -94 118 -162 70 45 494 7 21 -116 23 -35 -40 45 -182 37
7003C7j33j41P5R8J35J10k21o5J0M6L0J42k4m5k50J72J20l21R8J14J24k39O0K67
7027A99n5j97L6J96q3j74Q9J40n6k22M76m67L88n28L24j12q2M14m34K26l89M08
7049I7j19L73k37j59k4m10L94m8n4O6JK07n8L8j39N4L05l54K76j92K3J2J08j54
7073FpNk08k7L17O0l61J91k44K48k8M4j46K09k4k13j4L76l85L11p5k02J63k32
7097b36K44j83J97l34L92Op6L7q7KJ16J7j27n1j85P4M40k21k7k94L31o5o7L03
7121B06j33k9p1j69K19j34J81P4j79K57k00p9q3J82M5l2p2k7j23J2k0J94m4R7
7145G2o5r5M5j37j0L16j30j2J0l5L2j54M13m69K84J1L9k90K49P1k87q0R4J97l3
7170C6l2L50l64N9k37J70J44L3O8l34L32k59P7K14k60j16R7K80m50R9P1J44J25
$$ plain form
7003 37 -96 -237 -162 -64 71 181 -40 -105 -95 -49 -19 123 99 54 -196 -24 96 -225 -127 -13 111 -128 -68 199
7027 199 144 -53 -17 179 96 -78 11 151 95 -127 349 -118 270 -258 66 -46 -128 286 -148 78 -311 97
7049 97 -22 351 114 -45 -69 -479 -85 -133 -187 -121 -120 87 29 67 -72 -18 287 -67 209 17 40 52 160 6
7073 6 -1 4 -204 -231 86 146 -215 -24 -268 -20 -48 -4 -150 59 35 -178 -192 184 -201 110 35 -167 -4 -236
7097 -236 8 -175 22 -312 80 86 10 47 -40 -38 78 95 -32 -83 -268 -194 246 25 -2 -296 35 -30 -97 206
7121 206 73 44 -27 -196 23 -111 70 144 -35 222 22 -57 -140 42 87 55 -17 -44 -167 -155 -175 19 -25 72
7145 72 7 -88 -43 -180 -190 126 -4 -16 -6 -41 -9 -163 250 -219 65 76 115 -175 74 145 -142 -222 -128 69 36
7170 36 4 354 -10 49 -188 -18 126 159 227 -107 225 -34 43 257 -3 -119 -22 258 -192 -93 -22 122 247
7193B47k44j56L21j49k47K83k25L72m0j80OJ17j23L50m30j89K75LM8J2q3nj48
7216a85l5Q2J94r3q2K60k50N6J99O3l52N3J9J40m1l9j0P8k34J12l9K16k7j62K9
7241d8LK26K6j88J6J76l73M69l42J22J29k01M0ok44J86r3q4L79k79Q9J10k5l94
7265c06M23n1p2J55m54L83j42L00m76K82k68K6K91j75O9J56L9r2K7j34P4J13j47
7288B1j23M21o5m74K76O0r2Lk79L26l59L13l1K78k13n8n8K2m1O8j3N8l20J80J50
7313E0K2r3r6j7K75r4L3k70J55rJ7OM5N8p7R5p3J44j94M4K35l30J28K03j27k25
7339i5K78k37J27l4o9k64J80K9nK26j50M1M9J61j41l9j79K89j01Q4l91M86l71
7362a26J1J78O7n2j78n0J5J84J30n1k95K00j72J53M2n92N55K6L11k60j97j62L65
$$ plain form
7193 247 3 -153 168 19 -228 55 -170 202 162 -18 -12 105 -18 332 -98 -287 -12 -9 39 51 -32 -37 -185
7216 -185 -220 -138 56 -37 -119 141 -109 -53 146 209 -143 -90 -71 69 28 -11 -21 57 -177 -65 -104 112 85 -77 -48
7241 -48 -45 181 207 19 35 211 -162 307 -35 87 216 15 55 49 -195 -9 -102 -186 193 -86 3 113 88 -306
7265 -306 117 66 -6 149 -305 78 -64 236 -240 42 -226 -200 91 -84 -15 141 180 88 115 -19 55 168 21
7288 21 -102 319 254 -220 56 116 24 27 -252 74 -285 28 -3 275 62 4 -54 -32 -73 -5 -18 40 -280 -100 50
7313 50 72 -21 -117 -134 141 47 80 -190 -35 -44 -27 -21 24 82 5 100 27 171 -23 21 256 -74 54 257 130 -95
7339 -95 183 -54 73 39 -30 -294 -114 -85 -90 136 -14 27 76 237 96 57 -122 167 66 150 -241 245 -126
7362 -126 -115 63 130 78 -100 -150 -135 49 179 128 -167 33 -139 14 56 -536 19 45 356 96 -101 -263 102
7385A02k95J88J00m3k21q5Q8K51j50K37k57J14J73k65K59nk04J68k65L6J88j88
7407g4J07o5j77oK59N6k94L6K14k51M05l44K32j76K66l83P9J30P7k28J34q6M8
7430d1K49m55K01j8pm1J90J38j98J2j06j7l3L41j15j35j1M2q0o8Q7J57l91K53
7454d6J37k34L2K37j03n5p0J38q4J49k8j51L63n9k80K96m32J24J06k86K4L04n4
7477B8j19J04K07k57J80j37M0j27k10K13L30l02P9o5q9L31j95l8J5l16O09j64
7499A17N8k67p3N92jj12j15l06L16j70m4L4J49j31j61Q8m7m7L43o6k57M54l31
7522B3l6j21K9J69Q1j07j18J24r3Nr9J62N8j14Q7J25m11M22m6N4l74r7R3M14m11
7547a81J2J56r0jK0J47j21k4L1k2k18L91k74J39K25l84L42j19j53L10j17R1l85
$$ plain form
7385 102 -193 -5 95 52 -169 -254 -166 85 -65 172 -85 29 202 -63 196 191 -13 155 -110 -74 114 -74
7407 -74 33 -32 -209 -215 44 100 -194 -158 56 -195 210 -134 98 -78 188 -195 -116 14 91 -137 -3 -89 -41
7430 -41 208 -247 -46 -64 -71 -112 78 216 18 30 -76 -93 -126 215 100 -35 -46 -4 -84 -152 -65 92 -299 -46
7454 -46 91 -143 -111 126 23 -32 -102 36 -48 101 73 -78 285 226 -54 242 -190 -66 40 -246 -222 82 28
7477 28 -91 13 220 -37 143 6 46 -81 -291 -78 252 -50 29 -36 -125 206 11 -27 -12 -328 281 117
7499 117 175 -92 -165 427 426 314 199 -107 209 39 -5 29 178 47 -114 -26 -73 -120 223 157 -100 354 23
7522 23 -13 -134 -105 64 145 38 -80 44 -49 -44 -143 19 77 -37 50 175 -236 186 140 194 -180 -277 -184 230 -181
7547 -181 -169 -13 -103 -104 -84 63 -58 -82 -51 -73 -291 100 -174 -35 190 -194 148 29 -124 186 69 160 -225
7570b25L84l69M76n11M87l57j3l9K63K9j77O8k37k9R8K60k48o5K56k3R9n8n7j69
7594a57K33r9J40K1k8l1o4l9J21j64J35k18J09L79n06J81P2j15J12p9j08J62K90
7617C47m85K37k2J39k01j37nJ93j6n5j57L09k37q4J19K65k64J56m23K80J2J65
7639A36o4j76J93j86j80J69J21r2k3J84j27kk7J0K76l18O9l5j73L91j49r9J63
7662F1L8q0m2P1j3jK40j26j46O7O0j01RRj80n0J60MK17K3n01M45q0j14j0j7j51
7689b08J70L2o9O1J00j00jJ25Ok76N5K85r3j39m8K30p1p6j8o4J91m3j18k0J89
7714A00k20n1J74p6%Q4l63K98j3K19k40j36P2L98m28N7J71O3k07M35m60J03Q0
7737F0j31J82k97L32l41Q6k3K03o6Q3j29M8n0O6j11J38k3J77k45n8J34j85N05
$$ plain form
7570 -225 159 -210 266 -245 242 -115 -128 -167 96 125 -52 16 -221 -250 -152 108 -140 -205 51 28 127 69 12 -157
7594 -157 76 -23 117 138 110 79 15 -24 97 -67 68 -150 -41 338 -168 13 85 -30 82 3 -105 57 347
7617 347 -138 99 77 216 15 -122 -127 66 50 -5 -162 147 -90 -174 -55 210 -54 102 -321 -41 -29 136
7639 136 72 -104 89 -97 -277 -108 13 -79 -102 82 -45 -47 -74 -64 212 -106 -37 -72 -245 146 -3 -102 61
7662 61 99 19 -23 48 35 34 274 148 2 69 129 28 37 46 -134 -184 -24 -20 197 220 -281 164 84 -30 -40 -57 -208
7689 -208 -38 -6 -75 -14 86 -14 -15 110 116 -160 -105 180 87 -52 -100 130 59 -17 -35 -99 92 49 -69 -89 100
7714 100 -120 -171 3 -73 -73 11 -352 -54 -67 152 -88 -224 -152 246 -182 -125 46 109 -98 337 -123 -20 60
7737 60 -71 111 -186 146 -195 -109 -132 71 5 88 -41 7 -43 23 -88 50 27 204 -41 -99 35 -150 355
7760C55l69J53j77J31k0J36k14Qj45m6J24J20j30P5n3%n9K5nk12M11k82J81Q5
7784I2Q5j91q4j00L8K05j94J09p1N1RL6k8J47j67J30k0q4R9j29J23Q7l32J09N2
7809b8q7L95k7k70P6l48L04N9k03K49j07K4r0k2j5J04j21K7k8N5j6J20K36m03
7833a16J78or5J8k05K88j84K37l67K65M8O3k76K06r2J42l27K77M8l59K16k99L26
7856a4k82K09j52K74k09J05K60l04j28P9L32k74Q6R8n1jj02J31n3O7J63j59k71
7879a96P1O3j27J09J34J44j30j28o3J58K68k73q2j0k0r2J62M9j68m8J27M6q1J57
7903G0k56L03j24oj64O8J90R0k36K6M6l71M31J88k37N8j0K8j91K39k54J52J4j16
7927f2N5j18j8K57Q2J48k84n2k28K71r9p9Q2r7J30p7J58N5J23j40j73K62k43P2
$$ plain form
7760 355 -14 139 -38 93 73 209 -5 3 -142 -188 -64 56 -74 1 -52 -52 -111 -86 -91 -303 108 -174 7 92
7784 92 177 -14 -98 -198 -160 45 -149 -40 -111 -60 -51 -15 -43 104 -63 67 47 -37 62 -67 56 143 -189 -80 -28
7809 -28 -115 280 253 -17 59 -289 15 74 -129 120 13 37 -53 -75 -90 14 -107 -80 -108 -53 -69 51 287 -116
7833 -116 62 56 -39 -21 -226 62 -122 115 -252 13 61 124 -152 54 -38 104 -223 54 102 -257 -41 -340 -14
7856 -14 -296 -87 -239 35 -174 -69 191 -113 -241 -162 170 -104 -18 80 29 28 -74 57 4 71 234 75 -196
7879 -196 -125 -62 -189 -80 54 198 68 -60 -123 35 303 30 -52 -62 -82 -174 -12 37 -131 -179 -52 -6 -87 70
7903 70 -186 117 -7 -13 -177 -109 81 171 -65 -39 7 -364 67 255 18 76 66 94 -97 142 -112 40 54 -62
7927 -62 -7 -125 -143 114 196 344 60 8 -220 51 -48 -127 -45 -142 -12 -89 69 124 247 107 -66 196 -47 25
7951B5J94l84K22n9k7o7R6j48K99l08L9K06l2Q5L3k03n1L0J75p3k09m3K04j89
7975a85J60J11p9R2j3j09j06JO3J9J67r2j90N7L6Q2J25j4k87J02K13k38J40J73
7999B28Ok51j20J1J69k93K79pK18k12J08O8k41K2q6J03J12q9J40q4J9J7k57K43
8023A03l14J11q3k4p7M51j10j37j22R4K15j11rj59J15j23j31N60l50l5m4K31K82
8046C33k93Q6j59PJ07J2j1k28J52J42n4j08M0P2j81J74r3Q9kpk40J58J09k10J45
8071D0J45j88r6J00M1p3j2N3Mq9K50k79J89k8l04M69k38j40L67j65R6r0r6k5K43
8096A74j81k73J45K54j88k7M3L9J49l10N1J56k88K86p3k18L58k70K34j48N1N2
8118A6k03K01M6J33j09O9O3l47N2q1k6J81m1k2p3K9K76j74R5n4m9j10L3J91k33
$$ plain form
7951 25 219 -165 57 -2 -29 -96 0 -148 151 -157 -118 88 56 141 174 -29 -80 -50 125 52 -157 -200 4 -185
7975 -185 -25 86 7 99 86 -23 -129 -128 -65 -46 121 29 -161 -104 -68 14 139 125 -162 -60 153 -85 55 228
7999 228 234 -17 -137 -126 43 -250 29 22 240 28 136 204 -37 -15 -101 2 114 25 165 81 100 117 -140 103
8023 103 -211 -100 -183 -207 -284 167 57 -80 -202 -108 107 -4 -13 -172 -57 -180 -311 249 -101 -136 -180 51 333
8046 333 40 126 -33 -26 81 93 82 -146 6 148 94 -14 26 98 -83 91 -2 87 85 78 -162 -4 105 -105 40
8071 40 185 -3 -99 1 42 -31 -43 10 14 -75 175 -104 85 57 -247 222 -16 -156 211 46 142 52 -44 -69 174
8096 174 -7 -280 -135 119 -69 -96 -53 -14 135 -175 -124 32 -256 30 -43 -261 97 -173 61 -87 -36 16
8118 16 -187 14 60 193 84 153 216 -131 -79 -160 -186 -5 -46 -68 -141 -112 164 -10 85 31 -18 -128 -95 96 -137
8143a37k05K89M4j31P5K31j94K31k95J0P5rjJ97k76n4J03j00L96n10K95m3L0Q9
8167A10j49J05l21L11j92J57L54p10K12J68q3k4mK43o8L1r4p1J38k30J0Q0l5J09
$$ plain form
8143 -137 -342 -53 -9 -140 -65 166 -28 203 -92 -82 -7 -16 -17 180 -96 -150 -47 -147 249 -261 34 -9 21 110
8167 110 -39 66 -255 56 -136 21 375 -335 -123 45 -38 -62 -66 177 109 140 46 -25 113 -117 -107 -27 -62 47
8191D7
$$ Imaginary data points
##PAGE= N=2
##DATA TABLE= (X++(I..I)), XYDATA
0@%%%%%%%%%%%%%%%%Qj6J6j6J6j8K6l2L2m0M8n6O4p2Q8j04J17j30J48j67J84k05
38a09K29k56K88l20L54l92M35m81N29n85O47p11P83q62R50j047J155j279J418
57G46j579J762j975K232k543K929l426M092n032O480r013J4753n5769J0067O0267
72B3991l8256Q122L1310j1293l5193K0802J4463p270J1331J7239k9978j8187K0736
85G817j169k8165J7257K4192k8264k4840K7082P457k4965J0427L4717j3075k6657
98a8186J5880J5125j2583Q120K2192j0005j6401N546j1437k4035J2928K1586j7427
111h697j2301K1809M98k6368J0606L1309o330j3278J8291M133k3747j468J7446
124A1903n292r696P927k224j5065L642Q955r347j96J7809l111j9166O101J6157
$$ plain form
0 0 0 0 0 0 0 0 0 0 0 0 0 0 0 0 0 0 8 -8 8 -8 8 -10 16 -16 16 -24 24 -32 32 -40 48 -56 61 -69 79 -88 96 -109
38 -109 120 -136 152 -168 186 -206 229 -252 277 -308 339 -372 411 -451 499 -548 607 -672 746
57 746 -833 929 -1046 1186 -1357 1572 -1854 2238 -2794 3686 -5327 9426 -46343 -36276 23991
72 23991 -14265 -6143 25167 13874 -21319 -517 13946 6676 18007 35246 5268 -12919 7817
85 7817 6648 -21517 -4260 19932 -8332 -33172 -6090 1367 -23598 -13171 21546 8471 -18186
98 -18186 -2306 12819 236 8356 30548 20543 4142 9688 -1749 -25784 -12856 8730 -8697
111 -8697 -20998 811 1309 -25059 -14453 16856 10526 -2752 15539 19672 -4075 -5543 11903
124 11903 6611 -3085 4842 2618 -12447 -8805 150 -9197 -9393 8416 5305 -13861 -7760 8397
138H397q271p253J7279O837j5151m138R617m487q437O821L720r095k095M161m885
153f980j472R385N69n272O877N989r625m269J2960K695j2999l23Q938n109j0217
168h853L515P069k589k501K149J82l6K085m22o63M983K266o751k673N885k36p984
185d574Q26O779k897p070K884N520k602k725M594K552j631j150J346O34J236j279
201B443k360M15J631k979l927K226L657l343m152L732M096l419k421M716M470
216D785k199k322L162K921k216l070q6R11j321l887k062J896J216k259j071M049
232a553K811j777m18M201K629l167j206K943O67l960k590K072K13k829j702K011
248a655R25j575j739J449K191o86j770K005L842J1k631J479L799m05m401o95K706
$$ plain form
138 8397 126 -7127 10152 16989 1838 -2300 7317 2830 -5607 1214 4934 -4161 -6256 -2095 -6980
153 -6980 -8452 933 1502 -3770 3107 9096 -529 -4798 8162 10857 -2142 -2465 6473 1364 -8853
168 -8853 -5338 1731 -858 -3359 -1210 -1028 -1064 1021 599 -64 4919 7185 434 -2239 3646 3410 -4574
185 -4574 -3748 3031 134 -6936 -4052 1468 -1134 -3859 735 3287 1656 506 1852 2486 3722 2443
201 2443 83 498 2129 -850 -4777 -2551 1106 -2237 -6389 -2657 1439 -1980 -4401 315 4785
216 4785 2586 264 3426 6347 4131 1061 975 1886 565 -3322 -5384 -3488 -2272 -4531 -5602 -1553
232 -1553 1258 -519 -937 3264 5893 2726 1520 4463 5130 1170 -1420 652 865 -1964 -3666 -1655
248 -1655 -730 -2305 -4044 -2595 -404 -1090 -2860 -855 2987 2998 367 1846 5645 5240 839 144 2850
265B850r77n090j117L075M9l766o04L985K435j695n09L189K474r67k642J299K272
282D261k169l206N37K554j602l229P81K839j253k776P61L080q81k435P99L292
298A353L34k583N55L106N67k332j507K652J073l210k896K485J812l397k159K831
314a316L019k137k019K217K865j547k711P44K577o27k834k3K870N87k109n72K723
331A707Q69k576j050K501L31k779j186J856M64k091p81K290J026r82r47J442J969
348B063j324j559J162K105j177k149J208K175j637k560J276J931j586k653L80
363b345K279o50k004L77K611P45j218j23K560J655k042j459J546J484k881k607
379b072J437J421k380k295K374J321j407j164J974J510m61m74J073J395L23j462
$$ plain form
265 2850 1873 -3217 -4334 -1259 -1210 -4976 -5580 -1595 840 -855 -1364 1825 4299 3332 690 1989 4261
282 4261 2092 -1114 -577 1977 375 -2854 -2073 766 -487 -3263 -2502 578 -303 -2738 -1939 1353
298 1353 1687 -896 -341 2765 3332 1000 -507 2145 3218 8 -2888 -403 1409 -1988 -4147 -1316
314 -1316 1703 -434 -2453 -236 2629 1082 -1629 -885 1692 1065 -1769 -1792 1078 1665 -444 -1016 1707
331 1707 2576 0 -1050 1451 1782 -997 -2183 -327 137 -1954 -2735 -445 581 -401 -1348 94 2063
348 2063 739 -820 342 2447 1270 -879 329 2504 867 -1693 -417 1514 -72 -2725 -2345
363 -2345 -66 -716 -2720 -2343 268 1013 -205 -328 2232 3887 1845 386 1932 3416 535 -2072
379 -2072 -635 786 -1594 -3889 -1515 -194 -1601 -2765 -791 719 258 -216 857 2252 2575 1113
395A113N8J483P8l017p52K301n77l665o86L512R5l409k17L721P20j786J73K680
413A825J412p54j835N41K164o37l071o05K510j083l767K37L067p02l239J646L185
430H94q42j813J667J987R6o66l24J005P3j083j607P26J617j542k643Q81K093k217
448a698k121K719K402k276j385K684J704j985n98K074J257j483j425J69P16N56
464A310j714j122J825Q65k531j686K915J907k473j193K674R93k815q73K761J024
480A867j677l64J022N5r73k66M19M91K65j140j229J627P3j702P8K388j24k987
498b177L60L079k73k922J574K951j200k690N00K246o67j121N50Q39K98j368j613
515a634K37K490l21k878K29L249j343l159J802L760j413k278K335J798k171r65
$$ plain form
395 1113 1171 2654 2732 -285 -1037 1264 687 -2978 -3664 -152 -57 -3466 -3683 38 758 -1028 -855 1825
413 1825 3237 2483 648 1189 3353 2716 -355 -960 1550 467 -3300 -3063 4 -698 -3937 -2291 894
430 894 52 -1761 -94 1893 1989 1323 999 2004 2077 994 -613 113 1730 188 -2455 -1574 519 -1698
448 -1698 -3819 -1100 1302 -974 -2359 325 2029 44 -554 1520 2777 1294 -131 38 754 1310
464 1310 -404 -1526 299 1164 -1367 -3053 -138 1769 -704 -1897 777 1770 -1045 -1918 843 1867
480 1867 190 -174 848 903 -70 -336 83 574 839 -301 -1530 97 170 -1532 -1454 934 810 -2177
498 -2177 -1817 1262 989 -1933 -359 2592 1392 -1298 -798 1448 781 -340 210 1049 1347 -21 -1634
515 -1634 -1397 1093 772 -2106 -1877 1372 29 -3130 -1328 2432 1019 -1259 1076 2874 703 -262
531b62J603O27j239m28n68j148Q13l12j526Q21K359j092k627K365K724k327j573
548a790L894J267l377p19K655O6k395N14J235j048m41o86j353N27J988j681k068
565c412L327J927k953j551M900J629l853M48L331j672l385J450J460k194n78R12
581b14j284l37P75l57r32K486J298k482k21L245m62l094K150L420k676k839K345
598H21J469k734j090K012j25j849l7L69n22J046K79j147R80K738j317k550K640
615I83K710k851j768K976R05l902j051K249K66k000M32O66m80K56J22p33R50J501
633A231j374j094J638J295k096n20L001J59l142K74K209o70k564P02J850r89j333
650a423K48O34K26j72l94O22J680k25j881K59K258l29k161N10K029r43k501O15
$$ plain form
531 -262 1341 1968 729 301 -267 -1415 -602 -914 -2440 -1619 740 -352 -2979 -614 2110 -217 -1790
548 -1790 2104 3371 -6 -725 1930 1996 -399 115 1350 302 -139 -825 -2178 -1651 337 -1344 -3412
565 -3412 -85 1842 -1111 -2662 2238 3867 14 462 3793 2121 -1264 186 1646 -548 -1126 -214
581 -214 -1498 -1835 -1060 -1417 -2349 137 1435 -1047 -1268 1977 1515 -1579 571 3991 1315 -1524 821
598 821 2290 -444 -1534 478 353 -1496 -1533 -1164 -1686 -640 -361 -1508 -528 2210 893 -1657 983
615 983 3693 842 -926 2050 2955 -947 -1998 251 517 -1483 -1051 -385 -865 -609 -487 -1220 -270 1231
633 1231 -143 -1237 401 1696 -400 -920 2081 2240 -902 -628 1581 911 -1653 -951 899 -90 -1423
650 -1423 -1175 -541 -315 -487 -881 -259 1421 1196 -685 -426 1832 1503 -658 -148 1881 938 -1563 -948
668i48K158p77j885Q05Q74k92j022L85L65Q78l91r99N70J274m83r25J057J648
686B292j408j507J209Q55j686j172J164J072k016o42J297M65m35j82L55J173R0
703I24j088K6J452K33j633o64J929J97k117m00J660P14j948p26J063N49j168n47
721a544J033L73P0p10Q62J012j86p66J64J379n79j326Q4J052o60j993N39J450
739B54r76q70L91J325M0j216P27J018M09j184l95J064R06j064j084J306J081j754
757b2r13P10R53j018j351Q74J321j064j038O08J688k83j349O01K074k11j042l66
775A72R43L12j551o78J112J62j335n37J080J46o22n48J010P10q37m83J268R94
793A318q84q94J005J259j356r09P65R75p55j309J15J074n19j488KJ380Q0r35P0
$$ plain form
668 -948 1210 433 -1452 -647 227 -65 -1087 -702 -337 541 150 -849 -279 995 512 -413 644 2292
686 2292 884 -623 586 1441 -245 -1417 -253 819 -1197 -1839 -542 -77 -512 -694 -339 834 924
703 924 -164 -138 1314 1547 -86 -750 1179 1376 -741 -1141 519 1233 -715 -1441 -378 171 -997 -1544
721 -1544 -511 -138 -68 -778 84 1096 910 144 308 1687 1108 -218 -134 918 258 -1735 -1196 254
739 254 -722 -1592 -1201 124 164 -1052 -325 693 1102 -82 -477 587 1493 429 -655 651 1732 -22
757 -22 -935 -225 728 -290 -1641 -767 554 -510 -1548 -940 748 465 -884 -283 1791 1580 538 172
775 172 1115 1427 -124 -802 310 472 -863 -1400 -320 -174 -796 -1344 -334 376 -461 -944 324 1318
793 1318 434 -460 545 1804 448 -461 304 1279 524 -785 -670 404 -115 -1603 -1601 -221 -141 -1076 -1006
812a006J451R27j343k39J592L92j184o70J000K31p91j237N51N17j048o43M47Q36
830b17j4q32N83J065l91o34M94J156l42p05L70J034m97j304O5O78O7j437m74J332
850cl5j057k94J004R51q57l96J019J044q36p15J007J150j132j344M81Q55q60r81
869i99L94P86j43j272K18J053J1p39L5J292J96j068J61J190J52j487m0Q35J77
888G52p32n22Q07L37j110k84L44O46p21p51R52R44l54j296O02J407j23j560O28
907c4J048L8j557J40Q49J98j269k12R16K49j080j54Q02N25o55o70N95R20m85q83
927g19P72Q43l57r05Q85O10n93o71J71L37m84m79jN20M3q25k4O47M65j011L49
948d27J200J82p56m89J414M6j383l18J255N0j108n03Q75K89p19p37L92P01p1q90
$$ plain form
812 -1006 445 1372 29 -210 1382 1774 590 -80 920 1151 360 -877 -326 191 -857 -1500 -1053 -217
830 -217 -231 -1063 -480 585 194 -440 54 1210 868 163 533 1567 1070 -234 -169 509 576 -861 -1335 -3
850 -3 -38 -1095 -1389 -385 566 -291 -687 332 1376 540 -175 832 1982 850 -494 -13 842 -18 -999
869 -999 -605 181 38 -1234 -1016 37 48 -691 -656 636 832 -236 -75 1115 1267 -220 -260 575 752
888 752 20 -502 305 642 -468 -752 -408 238 -483 -1234 -282 662 308 -988 -386 1021 898 -662 -34
907 -34 1014 1052 -505 -365 484 682 -587 -799 117 366 -714 -868 -66 459 -196 -866 -271 649 164 -719
927 -719 53 896 539 -366 519 1129 536 -135 36 373 -111 -590 -591 -71 -28 -853 -877 -230 235 -776 -427
948 -427 773 955 199 -290 1124 1170 -213 -531 724 774 -334 -837 38 327 -392 -1129 -737 -36 -107 -997
968i97N66N60K45n52J91J038nj211K82J084k7j480N0P39q74o37j50Q33n6m48j06
989i55R11K99m73k37R67R03o37q46M64Q45p19j253M62J130j072j058O92P54o40
1008d63r00O39Q71j70l94k73R65N65n38J01K79R90j079j126P23N95p16q65P80
1027a6K13j251n14J168M10l36j6P36K08o50K72J25N90p1p95r2L68K75j075k30
1047f81J067J51j206k98J228j91r38L94Q70L11r02j36O52J6l6n03N83M78j7j251
1067d09o7R69l82p99L45P97o19r70M73R04l01l83L42O33o12l75M10O23Nm50j54
1088b0P0M91p19k58P27N16r24n75N22N71r97m14P79O19p19l40P34N92n67M5L76
1109E09J77J08o38k78P18J74p56p08O48K83j027n12J177M45p74l88J085J6p48
$$ plain form
968 -997 -431 129 374 -178 13 1051 1046 -165 117 1201 1174 -306 -256 483 -391 -1028 -1178 -345 -401 -849 -955
989 -955 -44 255 -218 -455 512 1415 778 -68 396 1241 522 -731 -269 861 -211 -1269 -577 177 -463
1008 -463 -1363 -724 147 -23 -417 -690 275 840 302 403 682 1672 593 -533 190 785 69 -796 -16
1027 -16 197 -1054 -1568 -400 10 -326 -342 394 602 -48 224 349 939 868 73 -19 349 624 -451 -681
1047 -681 386 537 -669 -967 261 70 -868 -474 396 707 -195 -331 321 337 301 -202 381 859 842 -409
1067 -409 -476 493 111 -688 -343 454 -165 -1135 -662 242 -59 -442 -100 533 -79 -454 -44 579 584 134 -20
1088 -20 50 541 -178 -436 291 807 -117 -692 -170 401 -596 -1010 -231 388 -331 -671 63 655 88 133 509
1109 509 686 794 156 -122 596 770 14 -694 -46 237 -790 -1302 -125 320 -454 -842 243 259 -489
1128d89K35Q70L60n99j64P2J47k85l26L14J63l51p46J15P07j16j138M08J240r4
1148C23q27P9J361J94p76q0P06j29q12j11J49K48n83o64L45M48m54m31K32J040
1168B58k37o06N78Q66l02m97N42M32o82m87N40K20l55o35j01K65k16p21R1O66
1188c81N44n57j33J031K72n74P5M82N35j096k50P60j04o93o72O87r8l16k24J77
1208e35L85j59j20PQ32Jo16j33R70K21r95O5O96K9p58n4K01L3m81j8N51o1p64
1231g03K62M02K94k16l77L02Q29k83o92N17P39p24p76R4R67l04q45L92M48j32
1251A94q22J40P79j43o75k09P53M70m68n96Q37M76n36n26P20L92n43m02J05L20
1271B66n0o04O8N30l45n72N24J6j19l27K49O19n4m99K70K62N99p02KM25K60q90
$$ plain form
1128 -489 -254 616 976 377 213 285 432 147 -179 135 298 -53 -799 -684 23 -93 -1231 -823 417 323
1148 323 -504 -425 936 1130 354 274 980 851 39 -72 77 325 -258 -922 -577 -129 -583 -1014 -782 258
1168 258 21 -585 -7 859 557 60 602 1034 352 -135 405 625 270 -365 -466 -201 -417 -1138 -1047 -381
1188 -381 163 -394 -527 504 776 202 277 759 1294 198 -52 708 604 -89 -761 -74 -172 -488 -712 -535
1208 -535 -150 -309 -429 -422 410 411 -205 -338 632 853 -142 -77 619 648 -110 -164 37 70 -411 -429 122 61 -703
1231 -703 -441 -39 255 39 -338 -36 793 510 -182 335 1074 350 -426 -332 635 331 -514 -122 326 194
1251 194 -628 -488 291 148 -527 -736 17 487 19 -577 260 736 200 -326 394 786 243 -159 -54 266
1271 266 216 -388 -320 210 -135 -707 -183 -167 -286 -613 -364 255 201 -298 -28 234 833 131 133 558 818 -72
1293g2j41L43J13o76l71O90K26o13n34Q03O71p30P5N07O09l93m44K36N16j33n82
1314A00k82K76j05n43j0L31o8m16P6N11O7l63K44M53L64k84k20N47J67r09J2K68
1336B16L12m57n87M15L92o38p57M28R03m22l79N39P99l22k56O6O45m53m09k74
1356b39O60K9q17k56M17J44m66m02O73L32m47l76R60L9j22n04L20P48m80k26K73
1377B60N15n00m43L6K76j52m05m6N20N9q63M65N31k19j36k22O64Nk13j99P24J8
1399F75n81l80M18L31n84j39K09N55p15j13J66O08l64n51K29L20j54j96K03L37
1419B74j08j25j92M31J57m56k02N75J09p32k03N14Rl45k88O50J56n85q1M63L99
1440D20k55o15O83L23k81k06n3M06j77l04j9L08j77o02J9O36Q6q65J13O28o2j19
$$ plain form
1293 -72 -213 130 243 -433 -804 -114 112 -501 -1035 -232 439 -291 -216 291 900 507 63 299 815 682 100
1314 100 -182 94 -11 -554 -564 -233 -301 -717 -641 -130 -63 -426 -182 271 635 351 131 678 845 -64 -52 216
1336 216 528 71 -516 -101 291 -347 -1104 -676 227 -195 -574 -35 764 442 186 252 897 444 35 -239
1356 -239 421 450 -367 -623 -206 -62 -528 -930 -257 75 -372 -748 212 251 129 -375 -55 693 213 -13 260
1377 260 775 275 -168 -132 144 -8 -413 -459 61 120 -743 -278 253 34 -102 -324 340 345 132 -67 657 675
1399 675 94 -286 132 463 -121 -260 -51 504 -211 -324 -158 450 86 -465 -236 84 -70 -266 -63 274
1419 274 166 41 -151 280 437 -19 -221 354 463 -269 -472 42 51 -294 -582 68 224 -361 -442 21 420
1440 420 165 -450 233 556 275 69 16 422 245 -59 -78 230 53 -549 -530 106 192 -673 -560 68 6 -113
1462a13j00Q20j8o34J96L66N0l71k73M74j19l57l18J01L39j26n61%P22k66l71
1483e59O16O87n85l51O57M52n18j88K08K00m73j46m42J54k0j64l95P47L71m02
1503a51k51J83R02o02k01L75O64p86k93K43O09m71l52M5N5m08k04L3J95L71j15
1524a59j09N68K0m67m3J007J23j076J62M59k73m50r3L07O3o02J03n9J73k18K5
1545e39N66oJ22m40K6Q29j10l84J0O94m71p86M83K32j02k78J15K0p9m65L68j83
1567c78M99p8n69L38K71J23n56N45M52l72l50M79J18n80k18N44M0m33j75J68M06
1588B74l08k96J21K35J43l10k98O54J95k76j99L74M77p57k79O10J59m76l22L04
1608B5J31o23n3J92J85J16l14O8M20k3p4j28O69r4p12J87O24m68l16K30M54n22
$$ plain form
1462 -113 -213 607 589 -45 151 517 567 196 -77 397 278 -79 -397 -296 43 -83 -644 -644 78 -188 -559
1483 -559 57 744 159 -192 465 917 399 211 419 619 146 0 -442 -288 -308 -472 -867 -120 251 -151
1503 -151 -402 -219 683 81 -120 255 919 133 -160 83 692 221 -131 -86 -31 -439 -643 -610 -415 -44 -159
1524 -159 -268 300 320 -147 -190 817 940 -136 26 485 212 -238 -331 -24 39 -563 -460 -519 -346 -564 -539
1545 -539 27 21 143 -297 -271 558 448 64 74 768 297 -489 -6 226 124 -154 -39 -19 -98 -563 -195 -378
1567 -378 121 43 -526 -188 83 206 -350 195 647 275 -75 404 522 -58 -276 268 308 -125 -300 -132 274
1588 274 -34 -330 -209 26 169 -141 -439 215 410 134 -65 309 786 29 -250 360 519 43 -279 25
1608 25 156 -467 -520 -328 -143 -27 -341 -273 147 124 50 -78 591 497 -215 -28 596 128 -188 42 496 -26
1630b6l47J35N71p01J25l1R8M20j55l79L88J60j5k45J34O74m18m11j35M76l81
1651f3k66J21J05k66k09K89j9O1L9L24L9J32n7n8Q3K06l87qJ51K51m08m47O65
1674B78k65l16k35M19J74l47MM50J26l47o7L95J69l0l14Q8L12l60m66L77J13K62
1696D20j022M8M41o2r5k73N22J40l42M10j29L44l18k24O69k76N2k93l12L55n2
1717Ck52J01P2L10o92K28O28m58l59J22O20j34Pk54N71n15K52M7Q6k31L2j87J28
1740A25p3k82k11R4O20m73%J92M09n97m9J94M34k16j01r8L17j64j56N0K92k90
1762A7k0j59j13L40k71j40J12J03j83p9K93J03K13l38K46K36k92k67M35L38l91
1783A83m24J18L27n55j6L84k15K91o52K43L54r5m9R3J65K29k65k2J27K12n8k46
$$ plain form
1630 -26 -373 -238 333 -368 -243 -274 -176 244 89 -290 98 258 243 -2 132 806 388 -23 -158 318 -63
1651 -63 -329 -208 -103 -369 -578 -289 -308 -247 -208 116 155 287 230 172 255 461 74 66 217 468 60 -387 278
1674 278 13 -303 -538 -119 55 -292 -288 162 288 -59 -126 269 438 408 94 182 494 134 -332 45 158 420
1696 420 -602 -554 -113 -175 -270 -543 -21 119 -223 187 58 402 84 -140 529 253 305 12 -300 55 3
1717 3 -249 -148 -76 234 -458 -230 398 -60 -419 -297 323 189 196 -58 513 -2 250 297 383 152 184 -3 125
1740 125 52 -230 -441 -347 273 -200 -200 -8 401 -196 -245 -51 383 167 66 -32 285 121 -35 15 307 17
1762 17 -3 -162 -275 65 -206 -346 -234 -131 -314 -393 -100 3 216 -122 124 360 68 -199 236 574 183
1783 183 -241 -123 204 -351 -367 17 -198 93 -559 -316 38 -57 -106 -13 152 381 116 94 221 433 375 129
1805A29J1J15l11m3M4J08m81QJ73K23j08J31Q7L18J5m16K48J94R6m36%r6J3l33
1829c11J9K64m1l59K22K85J5m68J14P7M85n24L4M42J89k87JQ0O5m35N0K6O6k61
1853b52j52J18L46j39l42J99K78K15l08J70L82l58j14J44J29r6j65q6K31M8m28
1874a80j81J7K34l03L7L47O1l52L15k02O05k39j69L90p4l68j03J49J12M0l97O2
1896a99J28K14n97J59J41K72m16r5N79m1k94K53R7K76l67j75J43L86o04j73K81
1917c2K9nk72Q3L33k49j21M09j91j44J80j02L1L72m54L3N46l28k42j24L23j11
1939c6k14J9M50j01l14l77N65K0N0l31L61J42k94RJ7J01R3m25L99K39o9j53m9
1962A02r7K36l23j2pl2RK9K3J3l31O3N25J2j84j51N86l56q1k20L44r3k49j2K74
$$ plain form
1805 129 140 255 -56 -99 -55 53 -428 -420 -247 -24 -132 -1 86 404 419 3 251 445 541 105 105 9 22 -311
1829 -311 -292 -28 -69 -428 -206 79 94 -374 -260 -183 302 -222 -188 254 443 156 157 237 302 -133 -83 -57 9 -252
1853 -252 -404 -286 60 -79 -421 -222 56 271 -37 133 515 157 43 187 316 220 55 -31 200 248 -180
1874 -180 -361 -344 -110 -413 -376 -29 32 -320 -5 -207 398 159 -10 380 306 -62 -165 -16 96 136 -261 -199
1896 -199 -71 143 -454 -295 -154 118 -298 -393 186 145 -149 104 201 477 110 -65 78 464 -140 -313 -32
1917 -32 -3 -8 -280 -197 136 -113 -234 175 -16 -160 20 -82 -51 321 -133 -100 446 118 -124 -248 75 -36
1939 -36 -250 -231 219 118 -196 -573 -8 12 62 -269 92 234 -60 -51 -34 67 160 -265 134 373 304 151 102
1962 102 5 241 -82 -94 -101 -133 -124 -95 -72 -59 -390 -327 198 210 26 -125 461 105 24 -196 148 55 -194 -206 68
1987F8m5k10k89L23J74m7r2J23n0J26p2q1L78O9k98j39K24j0k36j06K40R5l21
2010a76k97L55J44j77k11J63L32k65J19J30K90l31J19K01p6m35r8L39L5J16k54
2031B3k36L48k95l17R5M93J8l09J03K44K5k04J32L8J31m4l67L7K23k05j60L00
2053G3J3j34j86R9M07k30l12L06K12m34L3j2M81p4j26k4K26K5j80k31L20o8j79
2076Ej86K18l2l59l5K66M4m8r8M28K58l03%j54M84k09j56LN3l07n5M5Q0Q2k51
2101b27J3K76qj39o2K0L74l20j81K69K13k24j97N33m02Kr2J94P9k07M2j55L01
2124A02l80K17J75M2j85l1J15L23j41k75P8L65k93n6L7K46r7j43l18K33k53R0
2146a49N6J00MR2k70K22P9k5O1J17j27j43j87K10K4n7j23j61J35m4J18k83L15
$$ plain form
1987 68 23 -187 -476 -153 21 -26 -118 5 -45 81 9 -72 306 375 77 -62 162 152 -84 -190 50 145 -176
2010 -176 -473 -118 26 -151 -362 -199 133 -132 -13 117 407 76 195 396 320 -115 -213 126 161 277 23
2031 23 -213 135 -160 -477 -382 111 129 -180 -77 167 192 -12 120 158 289 245 -122 -85 138 -67 -227 73
2053 73 86 -48 -234 -135 272 42 -270 36 248 -186 -153 -165 316 242 116 92 318 343 163 -68 252 184 5
2076 5 -181 37 5 -354 -389 -123 -79 -127 -225 203 461 158 158 4 488 279 123 126 179 -128 -183 -138 -58 24 -227
2101 -227 -214 62 54 -85 -147 -127 247 -73 -254 15 228 4 -193 340 -62 -60 -152 42 121 -86 -44 -199 102
2124 102 -278 -61 114 156 -29 -60 55 378 237 -38 40 405 112 56 93 339 242 99 -219 14 -239 -149
2146 -149 -93 7 11 103 -167 55 134 109 170 287 160 17 -170 40 64 7 -116 -277 -142 -186 -68 -351 -36
2169c6J51m29J8M48j09O5l37L41J08j72R0J30r8mm02K36J3r4m5r0M77m16K16n4
2193GJ07L5k09L1Q2J19n6j15L49J52o06j59K50Q2K6Q5lJ04o13O6J46J72Jj51L5
2218f3j99K11j18L84l03o1K02k3L09m14O3J34J46j50k80l8J06J90m21J06N07n85
2240b97J59k26O37o0p0j98J70N1J15n01J84P1m0n3j41L80l43m0K3K47j37j8L24
2263B37l67J91k73L7L06J97j37j38K26k07l55J10Q3K59l07j12M21j12k51N5M1
2284i6J5J32j45J52R5J9m24N77k44k6l79K70P2j76r6M18j77L06m01j82K11J95
2306A16j55k94M01K91j48k60L10k54j94J90J17j4j22k96N13Oj86k88O2L57m28
2327b76K30n0M18l46m3J92K58j65m38K11J56J17m73J51M4O8j49p3k5K92M4l23
$$ plain form
2169 -36 115 -314 -296 152 43 108 -229 112 220 48 138 268 170 166 -236 0 13 -81 -126 -216 261 -155 61 7
2193 7 114 149 -60 -29 53 172 116 1 350 502 -104 -263 -13 69 95 180 177 281 -332 -266 -120 52 53 -98 -63
2218 -63 -262 -51 -169 215 -88 -149 53 30 339 -75 -12 122 268 118 -162 -200 -94 96 -325 -219 288 -297
2240 -297 -138 -364 273 213 143 -55 115 166 281 -220 -36 35 -5 -58 -199 181 -162 -202 -179 68 -69 -87 237
2263 237 -130 61 -212 -175 131 328 191 53 279 72 -283 -173 -90 169 -138 -250 171 59 -192 -137 -96
2284 -96 -81 51 -94 58 153 172 -252 325 81 55 -324 -54 18 -158 -254 164 -13 293 -108 -290 -79 116
2306 116 -39 -333 68 359 211 -49 261 7 -187 3 120 106 -16 -312 201 207 21 -267 -205 152 -276
2327 -276 -46 -96 322 -24 -67 125 383 218 -220 -9 147 264 -209 -58 -14 54 -95 -168 -193 99 143 -180
2349a80J24P9K5j53J91m8P3j71J1Q3L12l77K26j8j57j37J84p7p1j13R3K26l01
2372a76j6m6K11J5q8J80l1Q0j46j87N39O2l95j20J01M91n61j12K4J93k36K21j76
2395a73K72Mk39L48m2j20K81k04r1J17nrk05K39l10J66l1L0m14K39K19J34l11
2418a05K22J41j18j87KJ40P5M2m9L4n9k02k41J26K55k64m6j82K80L6K01l53L71
2441A19L2j02j69J81j02O5j38L37J27l27N5l2oj50LpK02r9l06K46K49k93q0K69
2465G4K17j81l28K86m9J47j83l33L02l8l66N13k5j44q1l4J26L44j83l47M39Lm3
2488A16j23K30K32m72l8lM3P7q9P9k3p4k2l5K54j67j22J52r3M68k04o9j88J62
2512I1j65j6L30k75m6LJ20p2J01k27K71q4m9p9L2m6O3j25K41J60j81l0K0o9J24
$$ plain form
2349 -180 -56 23 48 -105 86 38 111 -60 -49 34 346 -31 195 177 20 -117 67 -10 -81 -194 -101 125 -176
2372 -176 -192 -238 -27 -12 -100 80 49 129 -17 -204 335 397 2 -118 -17 474 -87 -199 -175 18 -218 3 -173
2395 -173 99 103 -136 212 170 50 331 127 36 153 148 139 -66 173 -137 29 -2 28 -386 -147 72 206 -105
2418 -105 117 258 140 -47 -45 95 170 212 163 197 138 -64 -305 -179 76 -188 -234 -416 -136 -100 101 -252 119
2441 119 151 49 -120 61 -41 24 -114 223 350 23 78 46 40 -110 -107 -114 88 -11 -317 -71 178 -115 -195 74
2465 74 291 110 -218 68 19 166 -17 -350 -48 -86 -452 61 36 -108 -189 -223 -97 247 64 -283 156 159 116
2488 116 -7 223 455 -17 -55 -58 -15 62 -27 52 29 -45 -67 -102 152 -15 -137 15 -78 390 186 117 -71 91
2512 91 -74 -90 240 -35 -81 -78 42 -30 71 -156 115 31 -18 -97 -65 -111 -48 -173 68 228 47 17 37 -32 92
2537I2k54K91j88K17j31p2L71j09j95m3n8j66p4J86P9J78j80j6PJ81J79j39OJ08
2561B70k39j69K22j67O3j37q2K76l15K81J15O6k69O0P2j6p5P6M9K44k00Kj70L1
2585a2J49k50j90K88n1p7q4P4J58l0j64J85K44j85p4j30M79k97J1J37l0J7J2m26
2609b46K35m4j93K76L2l98K70p7L89N0l40j55L66Mj47L23j32mL4k92j2K01m8l53
2633b61J15K56k87j29M14Q2j45K6j01j75K70j45J65k24L21k00j84K02n1l1j83
2654b65J45K92k37k14J59L48l17J02J29k60J60j17K49k20R1J3j5J89k20q7l32
2675d07O06l37l1m4L66j32k63J60K44j74P6k41J97O3j4J93l6l0k85J11nl2n6j23
2699a94mK73j03k01J54k5n1n9K48k3K4q4j33K55l8r7r1J57J27r5n4J62n8j11K5
$$ plain form
2537 92 -162 129 -59 158 27 -45 326 217 22 -21 -79 -245 -319 -133 -54 124 -56 -72 -65 116 295 156 162 270
2561 270 31 -138 84 -83 -20 -157 -239 37 -278 3 118 184 -85 -25 47 31 -44 32 81 325 125 127 -43 -12
2585 -12 137 -113 -303 -15 -66 -143 -227 -153 5 -25 -189 -4 240 55 -19 -149 330 33 44 181 151 168 180 -246
2609 -246 -11 -55 -248 28 60 -338 -68 -145 244 294 -46 -201 165 169 22 345 213 209 243 -49 -61 140 92 -261
2633 -261 -146 110 -177 -306 108 190 45 71 -30 -205 65 -80 85 -139 182 -18 -202 0 -51 -82 -265
2654 -265 -120 172 -65 -279 -120 228 -89 13 142 -118 42 -75 174 -46 45 58 43 232 12 -75 -407
2675 -407 199 -138 -169 -213 153 21 -242 -82 162 -12 64 -177 20 83 69 262 226 196 -89 22 17 -15 -71 -194
2699 -194 -198 75 -28 -229 -75 -100 -151 -210 38 15 39 -45 -178 77 39 -58 -149 8 135 40 -14 148 90 -21 4
2724Dk56M47m34J41J8J15K1j33K34L5j92J92k20K00r1j53L8r1j29J78j85K32J77
2747A48l52O6N0J77l82K61N1P9J19k43J20m1J53j4n21M29k74P5l28N35j68o9P6
2770e3k07L78k24k8P4J39k6M6j93J82j45J65p7J6K27l86J73o4L2Q0j48PJ43j29
2794a8J64p7K6k64L13K2l82J57J2K56q4j2k89L58k3k82J22k9R8j92N3L19l46K40
2818A42l30R9O5J01n9J4O3j52K90q6m23K06J45m4m8J09l41j12L75O8K7k29K88
2841A68j78J9j16L33r2j99N8N7o1n3K13r1k32K82Q5Pql4k64J41J35l10J27p5q3
2866a71J11J97j68L50l27j28J41nj92L10k17R7J25k10k05%M90l73K48L7q0J3M4
2889H7l05K84j78L85J2n55K65j95L79o6m5k05o1M40k64j29Q0K18k18q3J15L30
$$ plain form
2724 4 -252 195 -239 -98 -80 35 56 -77 157 192 0 192 -28 172 81 -72 -34 -125 -254 -76 -261 -29 148
2747 148 -204 -138 -88 89 -293 -32 19 98 217 -26 94 53 206 192 -329 100 -174 -99 -427 108 -60 -129 -53
2770 -53 -260 118 -106 -134 -60 79 53 99 -94 88 -57 108 31 47 274 -112 61 -3 29 109 -39 -32 111 -18
2794 -18 146 69 95 -169 144 166 -216 -59 -47 209 125 113 -176 182 159 -123 -1 -30 68 -124 -71 248 -98 142
2818 142 -188 -89 -24 77 18 32 95 -57 233 147 -276 -70 75 31 -17 92 -249 -361 14 82 109 -120 168
2841 168 -10 9 -107 226 134 -65 -7 50 -11 -64 149 58 -174 108 193 200 192 158 -106 35 170 -140 -13 -88 -171
2866 -171 -60 137 -31 319 -8 -136 5 0 -192 118 -99 -2 123 -87 -292 -292 198 -175 73 110 30 43 87
2889 87 -218 66 -112 273 285 -270 -5 -200 179 113 68 -137 -198 242 -22 -151 -71 147 -71 -154 -39 291
2911B91m20L49l3q2r0P4J8J15K35o69P5K49j27Q9k43J93q9J01j45L8K51J81m59
2934i8J25o1L80k0j47j27L2j42J89p9kKn24L56K88k21j27J55Q9Q0n3qj76K76j10
2959G7N9r7K17k14K9J51k34l19J19P0J02J25J23j35N4j88j25L46k59o1J44O0k7
2982A7l0L4K35k42J69n6Ml13N1M3K00j46o2K27J3j58pm3K26k01J05j21j49K59
3006E5L8j62J11r5j8q4p9L32k05m1M1P6L6l6k44L10j02Q2M7l70K52K1J27k01P4
3031c5J7k90M74l69J36J05oj82J99j68K25Q4k87J20K06j67l16K18O3L02k70K31
3053B90k46r4J17k72j28L65l03Q0J44J03j76J42RJ59j47J20j53m1l3L20l32R2
3075A6p8P2m9p2J88qk01J51O0l59k3J04K00O0J8j20k9l1J5JM32J26o20q1J72n0
$$ plain form
2911 291 -129 220 187 105 15 89 107 222 457 -212 -137 112 -15 74 -169 24 -65 36 -109 -71 180 361 -98
2934 -98 27 -34 346 326 179 52 84 -58 131 52 50 52 -472 -116 172 -49 -176 -21 68 148 95 87 -89 187 77
2959 77 136 39 256 42 71 222 -12 -331 -212 -142 -40 85 208 73 127 -61 -186 160 -99 -160 -16 44 17
2982 17 -13 21 256 14 183 127 131 -182 -131 -88 112 -34 -96 131 144 -14 -21 -64 162 -39 66 -55 -204 55
3006 55 93 -69 42 -53 -71 -155 -234 98 -107 -148 -107 -31 5 -31 -275 35 -67 15 62 -308 -56 -35 92 -109 -35
3031 -35 -18 -308 166 -203 -67 38 32 -150 49 -119 106 190 -97 23 229 62 -254 -36 27 329 59 290
3053 290 44 -50 67 -205 -333 32 -271 -191 -47 56 -120 22 31 190 43 163 10 -31 -64 256 -76 16
3075 16 -62 10 -39 -111 77 69 -132 19 79 -280 -303 -199 1 61 79 -41 -70 -101 -86 -85 347 473 -147 -228 -56 -106
3101a06j88J46K44j90m1j72K94J12K12n03J50J81j03j48L07k07K71j95j45K54
3121A73r2j00k16J13Q7k6o5j4K96m44Q0J93J99n1k19J36J4n7j2q6K26j03kJ36
3145A66k25M0m0R0l7p8K13j60k25M00k66J44j68M29k40L0J23j94Q5k24K16j77
3167i8R3o2k4R5k30J98O7q5J87j93j16J91q3N5O0N6k36L18l05J30Jo8k6k7L43
3192B41l88K71k88K49j30J72j25J48n2k51J61j9k43K97pk5j86K68K6O8qm63L31
3215D7q5J1J51p3j7J0j5k19K21j96J1l5K31J1k49L58j98P3k43J70j10L23k40N0
3239a3j51J34L2o6J84j40l1m9K3J27J06j29m7j71J36L10l07lq9K30j96q8p4J83
3263h9Q5Q7N0j31j33K66r5P2k15K27J9k7j35N6j61L63p1l96J49P7Q1P1k42K72
$$ plain form
3101 -106 -294 -148 96 -94 -135 -307 -13 99 311 -192 -42 139 36 -112 195 -12 259 64 -81 173
3121 173 81 -19 -235 -122 -35 -61 -126 -140 156 -288 -208 -15 184 133 -86 50 64 7 -5 -91 135 32 30 166
3145 166 -59 -19 -59 31 -6 -84 129 -31 -256 144 -122 22 -146 283 43 73 196 2 87 -137 79 -98
3167 -98 -5 -67 -91 4 -226 -28 39 -46 141 -52 -168 23 -60 -5 55 111 -125 193 -112 18 19 -49 -75 -102 241
3192 241 -147 124 -164 85 -45 127 2 150 98 -153 8 -11 -254 43 36 11 -175 93 119 187 179 -284 47
3215 47 -38 -27 124 51 34 44 29 -190 31 -165 -154 -189 42 53 -196 162 -36 37 -206 -36 -146 177 -63 -13
3239 -13 -164 -30 2 -64 120 -20 -51 -100 -77 50 156 27 -20 -191 -55 255 -52 -55 -144 86 -110 -198 -272 -89
3263 -89 -4 83 133 2 -131 135 40 112 -103 124 143 116 -19 37 -124 239 168 -228 -79 -2 79 150 -92 180
3287A80p0j27m9L19n56K30J16K10n9m49J22M26j31k49J67j02n5m2j33P8J6K13
3309E5j35K44k61K14k6P2M3l60N2J8Q0P5j07r3L69j60M0k16J9R2L7j61N17k33
3333A75j2j77K9k1J40j16J26k5Mj70K12n00R6N05n15J26QK60j79M2l67M68j03
3356FJ0Qo1k6L1K48j33M1j88o1K68j55R7l17Q9R7L16j01j72KJ03j17L3O9k1r9
3382c3p3L51k33n3K56k85R1K05l75n3M6j68K26k4L24k55p0J11K08m19J45K0L9
3405a9K15l34J72N0j2J5j69j10K23N3n6k69J69l11M89l50J89k5J59j77J20NJ03
3428A30p2l33K58k2j29K96J3j00k92K98r8m8J19j16J71P0j13j17JJ00j94K87j44
3451c5K25m11J54K55j30j13l28L37o8R8k10P0Q8PP9j11M8L1Q6j10J25j20j14K55
$$ plain form
3287 180 110 -17 -66 253 -303 -73 43 253 194 -255 -133 293 162 -87 80 -22 -77 -119 -252 -174 -158 55
3309 55 -80 164 -97 117 91 163 206 -154 -102 -84 -4 71 -36 -129 240 80 120 -96 -77 15 52 -109 408 175
3333 175 163 -14 15 -6 134 18 144 119 123 -47 165 -335 -239 266 -249 -123 -115 145 -34 8 -359 109 6
3356 6 16 24 -37 -63 -32 216 83 124 -64 -125 143 -12 85 -232 -143 -46 270 169 -3 -1 102 -15 18 87 66 -33
3382 -33 -106 245 12 -41 215 -70 21 226 -149 -202 -156 -324 -98 -122 202 -53 -123 -12 196 -223 -78 -58 -19
3405 -19 196 -138 34 84 72 87 -82 -192 31 84 28 -241 -72 -383 106 -244 -55 -80 79 -98 22 27 130
3428 130 58 -275 -17 -39 -168 128 141 41 -251 47 -51 -99 20 -96 75 145 32 -85 -84 16 -178 109 -35
3451 -35 190 -221 -67 188 58 -55 -383 -46 -114 -16 -226 -156 -68 -61 18 -93 -45 -14 72 -38 87 -33 -147 108
3475A08j45J10k67r1K00Q1J36k06J34p3J05k98L31j46PQ8O7j01J06j35L6Q5m4
3498H8l21M17q2P4r2j16J14p6j13j11L22P3l28J87k9q0j35K76M6p1j44M06k78
3521B7o0J89N7l22Q4LQ7k17K94j21Q2J59k62L07m87J72j04K59j81M6N6j92P3J8
3545c3J31R8m33K26j29K38j78j92O38l42o0ML02l06J55Kp9J28k49j32K08J08J4
3568A19J6k00R0j38L2JJ27r1J54K4q8j59N2L15j50j54j89K53k9M0qo0J78k65k07
3593c37L67P5k43J13J07k28m3J80J16k16L22M1k56J43r7R2k3J59j92K15k05Q4
3615A74j40N9k17J78l0j18K81l34L22J61k88j63J63k02L60k93M8J27m6m8J18j05
3637GK3Lj65o9K97k06j33J49J58j70K50l21L46J6k68J84rk38J14j3Q3lk35M63
$$ plain form
3475 108 -37 73 -194 -285 -85 -4 132 -74 60 -13 92 -206 125 -21 -14 74 141 40 146 11 47 132 88
3498 88 -233 184 102 176 84 -32 82 6 -107 -218 104 177 -151 36 7 -73 -208 68 114 43 -101 305 27
3521 27 -33 156 213 -109 -25 -22 65 -152 142 21 103 262 0 307 -180 -8 -112 147 -34 12 68 -124 -51 -33
3545 -33 98 196 -237 -11 -140 98 -80 -272 366 24 -36 -32 270 -36 119 121 42 170 -79 -211 -3 105 119
3568 119 135 -65 25 -113 -81 -80 47 -44 110 134 46 -113 -61 254 104 -50 -239 14 -15 25 17 -43 135 -130 -337
3593 -337 30 105 -138 -25 82 -146 -189 -9 107 -109 213 254 -2 141 44 136 113 272 80 295 90 174
3615 174 34 93 -124 54 24 -94 187 -147 175 336 48 -115 48 -154 206 -87 -39 88 42 -6 112 7
3637 7 30 33 -132 -201 96 -110 -243 -94 64 -106 144 -177 169 185 -83 101 92 -146 -32 -45 38 35 -200 263
3661B63j75l31J35K02l3j63L56k56K26l64J97J2k76J26J53J52k40n8j24L66j9
3682A49M3j76p6K99m36M03l10m7K27q7O0r3J12j68J73j67J49J3K32o3k28j82P1
3705a02J39j71j46L43j04Q6P4j25j27L38m51M00j50J21K6O7j04m40M42k36K24
3726A04l87M04k92J19K7K31l04k2K87k2k16k55N52K3pL3l59K18m9l6p0j9M3j28
3750a25O0Q6M0j65P1l4M20k45K3j44n9k3K0J95j32J88k51K07m5k00k4M6L7j78
3774b32K98q1j04K77m5k66O5J99j12L2J3l6J75J00j05l8k71J51l38j32K89m2J37
3797f6m00M57J00N2j67k7o4L38j7k84K80P8j86l4N9k7j05j85J70J72k34q6L15
3820A39p1N2Q2l18j96K82J9K31k83jJ46J7M5j52j86K65j75K82j28j37r0K90n3
$$ plain form
3661 263 88 -243 -108 94 61 -102 254 -2 224 -140 57 69 -207 -81 72 224 -16 -74 -198 168 149
3682 149 192 16 -60 239 -197 206 -104 -151 76 -11 49 -44 68 -100 73 -94 55 68 300 237 9 -173 -102
3705 -102 37 -134 -280 63 -41 45 119 -6 -133 205 -246 154 4 125 151 218 114 -326 116 -120 104
3726 104 -283 121 -171 -52 -25 206 -98 -120 167 145 -71 -326 226 249 242 275 -84 134 85 49 -21 -40 3 -125
3750 -125 -65 21 61 -104 -33 -67 353 108 131 -13 -72 -95 -75 120 -12 176 -75 132 87 -113 -137 -91 -54 -232
3774 -232 66 -15 -119 158 113 -153 -88 111 -1 31 44 8 183 283 178 140 -131 20 -318 -450 -161 -203 -66
3797 -66 -466 -9 91 143 -24 -51 -115 223 206 -78 202 280 94 60 119 92 -13 -198 -28 144 -90 -176 139
3820 139 68 120 202 -116 -312 -30 -11 220 -63 -64 82 99 144 -8 -194 71 -104 178 50 -87 -177 113 60
3843F0Nj57K26j73n0J28Rl8J10P6m27L70k96J55O9k65K55rj62L08l95L47j22j6
3867HJ76Orm4m2j27J41j52n7J19R0L3j52K59n56L80j97L1k6J57k25P7J83K12m65
3892a80M58j5j02k09O2r0P4K64k00q2N2M8k77K93r1J07k10L24l16N5J85j50LJ37
3916A40Q0j83P8k28K19J01j05n3K5K9n27J52J78J38l17J98o7J68J31r4j61k6K33
3939A09j55R8J9j70Q8K6R2k15K45j82l1j53L6K68p1J19n2l83N26k21k5L06q8m37
3963b51L99R0k07k43J40L57k81K17q1j55J26n3p2q9J14j32K82k65K7L1J11k4R0
3986A31k23K28k4l84K29J62l73K92j3m6l6k5K44j45n8Q3J25j05N9k46J15l1K24
4009A83o4QJ05p4l04K17k28N8L7n6J98L5J4l04K41k0R9j69k2l4L7J18j17j9l4
$$ plain form
3843 60 65 -92 134 -39 -89 39 48 10 120 196 -231 139 -157 -2 67 -198 57 48 -114 194 -201 146 24 8
3867 8 184 190 181 137 95 -32 109 -43 -100 19 109 142 -10 249 -307 73 -124 -93 -119 38 -187 -110 73 285 -180
3892 -180 278 263 161 -48 14 -76 -2 262 62 -20 32 80 -197 96 5 112 -98 226 -90 -35 150 0 3 140
3916 140 220 37 115 -113 106 207 102 49 74 103 -424 -272 -94 44 -273 -75 -142 26 157 63 -98 -124 109
3939 109 -46 52 71 -99 -11 15 107 -108 137 -45 -76 -229 -193 75 4 123 71 -312 214 -7 -32 274 186 -251
3963 -251 148 238 31 -212 -72 285 4 221 140 -15 111 58 -14 -103 11 -121 161 -104 -77 -46 65 41 131
3986 131 -92 136 112 -272 -43 119 -254 38 25 -21 -57 -82 162 17 -41 42 167 62 121 -125 -10 -41 183
4009 183 119 127 232 158 -146 71 -157 -99 -62 -118 80 115 129 -175 66 46 145 -24 -46 -80 -43 75 -42 -61 -95
4034i5R0J88n5k51J28R7J73j73k00j16K80m7j24m4J0O2K97n7m0rj92P5K22j85
4058C4j72K1O6m2J01k37N15m27J86r0p9O4J31l2J60k58K31j65J45k46J13o4j16
4081a61L14k17J73j02k37K64j61J09J14o2j89J30O8%J20m1r8j03j72L81j22K0
4103B8j64J59k7j08k6L68k16j50K13q6K94l04j03j23K97j20M03n04R7j42O4J57
4125GkL0j41P4O7J14j80m3K98m65K69l9q5K33q4n9K67K9j61l07k33M32K24j44
4149A01j41N5j98K06j29K2M99l78m4j07K64N2n0l6k8P9j27p7k2J80j40j26M8R
4173h8q6L74l83rL12o5J3p6j12J88L9J72J28l83N6k40l8Q6J04J09N4k74K14p3
4197B2m5J53P3l30L37l04K14j21m8K21k56K84k98L58j82k8J97n3j43J98l37N8
$$ plain form
4034 -95 -5 183 128 -123 5 102 275 102 -98 -214 66 19 -105 -149 -139 -77 220 163 123 114 -78 -3 219 34
4058 34 -138 -117 -51 -93 8 -229 286 -141 45 -45 -124 -60 71 39 199 -59 172 7 152 -94 19 -45 -161
4081 -161 153 -64 109 7 -230 34 -127 -18 96 34 -155 -25 43 43 163 122 24 -79 -251 130 8 28
4103 28 -136 23 -4 -112 -138 230 14 -136 77 -9 285 -19 -122 -245 52 -68 335 -169 -72 -214 -150 7
4125 7 5 35 -106 -32 35 149 -31 -74 224 -241 28 -11 -96 137 53 -6 261 290 129 -178 -411 21 245 101
4149 101 -40 15 -183 23 -106 -84 415 37 -7 -114 150 202 152 116 88 167 40 -37 -59 121 -19 -145 -97 -88
4173 -88 -174 200 -183 -192 120 55 68 -8 -120 68 107 279 407 24 80 -160 -198 -112 -8 101 155 -119 95 22
4197 22 -23 130 203 -127 210 -94 120 -1 -49 172 -84 200 -98 260 78 50 247 194 51 249 -88 -30
4219c0Q7M1m7Q0n0J8j0R2m24K43j3N1k4l9J42j24M15n00Ln4J60j22j06J01o7J41
4245c6J47j91J60o9K5j61P3q8J60Q0k20M25n73K54K3q0J91k73R1qK33k16J35j75
4269i3J03q5K04r6k8J26j52j11K15j9J56k35O2r1L1rj22J68p2K14N3k46J47l06
4293a86J41j9N8J21j01kJ26k04K9J08n8N2j32N3L1Q3l00O9J31j12K41j85K10R
4317A63k85l8M75j55J05j93j31K24p5k34L3j08L34J51k71J87K7o0l53J8K50no9
4340a0j04J00J60l04L22k6j79o1L3m8p8K32O2j70P9q8P0N2P3j66L8m4J67j95L34
4365B49l34J26O5k59K68j08m2K4j00L9N3o1L1K06l32J63j9n9K55j10K99k82n5
4388A7L4K98j82J56l27o6O6j21j47K50L7j67J18N9q6Q0p1R5k4j63L3J66p7j45
$$ plain form
4219 -30 57 98 51 131 81 99 89 181 -243 0 -13 38 14 -25 117 -7 408 -92 -89 -143 17 -105 -211 -110 -177 -36
4245 -36 111 -80 80 11 36 -125 -52 -140 20 100 -120 305 -268 -14 9 -71 120 -153 -62 -70 163 -53 82 -93
4269 -93 10 -75 129 33 5 131 -21 -132 83 64 220 -15 47 -44 -13 -22 -144 24 -48 166 219 -27 120 -186
4293 -186 -45 -64 -6 115 14 12 138 -66 -37 71 13 65 -67 -14 17 100 -200 -131 0 -112 129 -56 154 163
4317 163 -122 -160 315 160 265 72 -59 165 90 -144 -111 -219 115 266 -5 182 209 149 -204 -186 64 59 -10
4340 -10 -114 -14 146 -158 164 138 -41 -102 -69 -117 -195 37 99 -71 8 -80 -10 42 115 -51 -13 -57 110 -85 249
4365 249 -85 41 106 -153 115 7 -35 -11 -111 -72 -19 -80 -49 157 -175 -12 -31 -90 165 55 354 72 17
4388 17 51 349 167 323 -4 -70 -4 -125 -272 -22 15 -152 -34 25 -61 19 -52 43 19 -144 -111 55 -22 -167
4412a67M96m44N7K82j33j3N7k29L2N6O8q8J80l25N7Qj74L14j06L18j46j00j7K50
4436B33k30N2L2l04M55j89k8q3K45n12J57K18j66K89k64K84p7j56j01m1K89k53
4458a50N7m1M3J38q3J11j84L2j04J67j9j00Q3K51m53K3L17k10K12j54J28M0M5
4481A49l17l6J10k7L6J94o9j37K06j62Q3j03n3j15K98R8q0K23n39K58j98K04J36
4504A59j01q9j71J42J59j07OoM6J90o2l72J39K4K74n7j81J54j61J02n4Q3j21J42
4528A38l6k08J87j39l04L33l0J11j44L66m94J66K10k76J76Jj39K54k85K12L7l17
4550a81K27J4l3j5j90Q5J45L8q9o1J51k58L04q3L2J16Lk22L21l29j01K63k7j00
4574A0O0j27m8nJ60J41l71J66n8L99m30K74k88J60j54J02J49j32P3Kk68J33J24
$$ plain form
4412 -167 329 -115 -58 224 91 78 135 -94 -62 -6 62 -26 154 -171 -114 -106 -280 34 -72 246 100 0 -17 233
4436 233 3 55 87 -217 238 49 21 -62 183 -329 -172 46 -120 169 -95 189 112 -44 -145 -186 103 -150
4458 -150 -93 -134 -91 47 -36 75 -109 -77 -181 -14 -33 -133 -50 201 -252 -229 88 -122 90 -64 64 104 149
4481 149 -168 -204 -94 -121 -85 109 40 -97 109 -53 30 -73 -126 -241 57 155 75 298 -241 17 -181 23 159
4504 159 58 -31 -202 -60 99 -8 -2 -8 38 228 166 -206 -67 -43 231 174 -7 147 -14 88 34 117 -4 138
4528 138 102 -106 81 -58 -362 -29 -59 52 -92 274 -220 -54 156 -120 56 57 -82 172 -113 99 136 -181
4550 -181 46 60 27 12 -178 -93 52 90 1 -60 91 -167 137 54 86 202 205 -17 304 -25 -126 137 110 10
4574 10 70 -57 -105 -110 50 191 -180 -14 -72 327 -103 171 -117 43 -111 -9 140 8 81 83 -185 -52 72
4597G2J53j27k11K30j2J6k54J22J4J71k55m6K27m3P1j97LP3k11L29l8k55N4J70
4621E6M0l86P25l49J3JM3j78K11l63L19k62l0K13r8k6Q6Mj76N8M9O8P7o6n3J39
4647A15r9J91%Q3k42j90J62K78k70k13L25M5r2l4k7p2q2J32k45L89k18j84K09
4670c9J7J28j52q2q0J43L87l66K97k50J56k33J59p3m3q0P4K33j39J7o9P7j31L6
4694a3J23j13k3J20r0L06q1r3k14J43mj06K34r9j95o2J4K35j1j82K2MP9q9K91
4719A96n0j81L7j50L26j90O7j17n5L9l4k7J93j18P6j06J55p8PM3J41k15N8O9k12
4744a26L18j42J31l55J27k07K44P3o4k57J21J33k16K64j08J14j85l9L70k68j00
4765a72J43r0N1J49m4k15K29p3j1N5k7O6M1k35K59k59r7K54j8rR1mk87J98J52
$$ plain form
4597 72 225 98 -113 117 105 121 -133 -11 3 174 -81 -127 100 57 128 -69 -66 7 -204 125 87 -168 -114 56
4621 56 96 -290 435 86 99 100 143 -35 176 -187 132 -130 -160 53 -45 -71 15 19 -157 -99 -50 18 95 29 -24 115
4647 115 16 207 207 290 48 -142 20 298 28 -185 140 185 93 59 32 -40 -122 10 -235 154 -64 -248 -39
4670 -39 -22 106 -46 -128 -208 -65 322 -44 253 3 159 -74 85 12 -31 -111 -37 196 57 74 5 82 -49 -13
4694 -13 110 -3 -26 94 4 310 229 136 -78 65 61 -45 189 90 -105 -167 -153 82 71 -111 -89 -85 -6 -95 196
4719 196 146 -35 2 -148 178 -12 55 -62 -117 -78 -112 -139 54 -64 12 -94 61 -17 -10 33 174 -41 17 86 -126
4744 -126 192 50 181 -174 -47 -254 -10 63 -1 -258 -137 -4 -220 44 -64 50 -135 -174 196 -72 -172
4765 -172 -29 -119 -68 81 37 -178 51 -22 -33 22 -5 61 102 -133 126 -133 -230 24 6 -3 88 84 -203 -5 147
4790A47L2M3k56K0j57J9P3K9nJ8j86L75J80m94K07j92J67j07J2J22K20j22j25
4813B0K3k97J78o9K58r9j61M4K5J07p6j15K65krj05k67K48J03r6J14j15N6l7J03
4838I6k04J62m60M98q1j83K24k35M83k32K0k77J23O1j32K54L8J7k05O2j14K1K61
4861A97k21r8K03j2N6k70O8M1L5k23M29n34K34j55K53K22J30k23j45K1J25j56
4883b3J8j6J74r6J61L5l90P5J30j98R3J35k16N1J52Q6N5j64n1K9j78L85nj96j99
4908a53J22k7Q4J7J7o7k02K40j32J05O2k91L39k36L80m32L47k45q2n7J35K16k53
4931a13R2L3q8j3J10l3K50n21L47j08n7J57J10J1k10K20K9l89J05J58M6k65L9
4954i0K07j22J03Pk87J53J1k48L15J17k5m78L90j5l9J75k74R2j34L28j83M7J93
$$ plain form
4790 147 179 222 -34 -14 -171 -152 -79 -50 -55 -37 -223 152 332 -162 45 -147 20 -87 -75 47 267 145 20
4813 20 43 -254 -76 -145 113 14 -147 -103 -78 29 -47 -162 103 101 92 -13 -280 -32 71 -25 89 -26 30 -7 96
4838 96 -108 54 -406 92 11 -172 52 -183 300 68 88 -189 -66 -5 -137 117 155 172 -33 29 -85 -64 197
4861 197 -24 -122 81 69 125 -145 -77 -36 -1 -224 205 -329 -95 -250 3 225 355 132 -13 8 133 -23
4883 -23 -5 -21 153 57 218 253 -137 -62 68 -130 -37 98 -118 -67 85 171 226 62 11 40 -138 247 242 46 -153
4908 -153 -31 -58 26 43 60 -7 -209 31 -101 4 66 -225 114 -122 258 -174 173 -72 -154 -211 -76 140 -113
4931 -113 -21 12 -76 -89 21 -12 238 -283 64 -44 -101 56 166 177 -33 187 216 -173 -68 90 136 -129 -90
4954 -90 117 -5 98 105 -182 -29 -18 -266 49 166 141 -337 53 38 -1 174 -100 -8 -142 186 3 50 243
4977B43j32k07J15q2Q0J69j23J58l30L38k18n8K77j98L6j14k7L4K14l4k88N7l3
5000a23J55O8j38o6J92K1k80L18j65K39j72L2P9k01l00K81J43m9K7J20k07J31
5022A05Lr4R1j21N5o3k46N35m91K73J45l5j80j28r0J70M1M5J53k42J3K1j42J26
5046e6j91J56J86j39M1j2N3Q4j81J9K18j29Q1L1j22q2j68J33J01o3R2j23M6rL08
5071B74j19l06J58r8J66K4k2k15L07j17L4L2m29J73N8p4O0rJ81j24J98k55M8P0
5095A5K06j97k36M7J39k44J56J51j90J51k4J71j82j21J09j28R5Pj12L76o2j50
5117b3p2J71K11o1k50R1J2J1j52K19Q2k66K36l11P7o7L17j87p3M9L92l22j36k20
5141b72K72j05L38j57k04j18L01q7r9L0K83k09k26j9J69L1P4r8J26J07k9Kj22
$$ plain form
4977 243 111 -96 19 -63 17 186 63 221 -109 229 11 -47 230 32 68 -46 -73 -39 175 141 -147 -90 -123
5000 -123 32 100 -38 -104 88 109 -171 147 -18 221 49 81 160 -41 -341 -60 83 34 61 181 -26 105
5022 105 108 14 105 -16 39 -24 -270 265 -226 47 192 157 -23 -151 -241 -71 -30 15 168 -74 -61 -40 -182 -56
5046 -56 -247 -91 95 -44 -3 -15 38 122 -59 -40 178 49 130 161 39 -43 -211 -78 23 -40 52 -71 -25 -34 274
5071 274 155 -151 7 -91 75 99 77 -138 169 52 86 118 -311 -138 -80 -154 -94 -103 78 -46 152 -103 -55 15
5095 15 221 24 -212 -165 -26 -270 -114 37 -153 -2 -26 145 -37 -158 -49 -177 -82 -75 -187 189 127 -23
5117 -23 -95 76 287 226 -24 67 79 90 -62 157 239 -27 209 -102 -25 -92 225 38 -35 14 406 84 -52 -272
5141 -272 0 -105 233 76 -128 -246 55 -32 -131 -101 182 -27 -253 -272 -103 -72 2 -96 30 137 108 110 -12
5164a2P2J23J16o6m6j60R4M3l63L30p2j78K67m33M13q6j14k14K79k8j88L29K73
5187C79l07r5L0n7R9k0L9M5k56M4K64k45k03q7N58m20K16J97m71K7J38j23K01
5210d7P0op7r5LM3K99m77J50J66P1P7J3m54L07n9J01j42L6j00M1L5J39L6k63N16
5236C83k53K7j06kj00o8J78jr9R0J46k24R1k99L09j93J55K81n93L88j84K5M8j35
5260a36J15r4m1K01m0L07m30K32o5j16N0r0K37j68L38q7n04K19J75j09r9L7L94
5283C26k48l1k82L18q6j60K34l5j72k3J54j50L25k32mJ66l3O3R9j00J35k36r6
5306f8N8k57M08j87j60J29j57K32l34K85k75L91q8j59O2J74j76K24j0l3j95J05
5328c1j96N26l61j65J77k17K60l9L2M9n1M5n0j32L99m6l35K56k17M8K14k29K22
$$ plain form
5164 -12 60 183 299 233 187 27 121 164 -199 131 59 -119 148 -285 128 42 -72 -286 -7 -35 -223 106 379
5187 379 72 -23 7 -50 49 29 68 113 -143 -99 165 -80 -283 -370 188 -232 -16 181 -290 -263 -125 -248 -47
5210 -47 23 17 -60 -155 -152 -109 190 -287 -137 29 100 177 190 -264 43 -16 85 -57 -21 -121 -80 -45 94 130 -133 383
5236 383 130 157 51 49 -51 -119 59 58 -41 49 195 -29 62 -237 72 -121 34 315 -278 110 -74 -49 -1 -136
5260 -136 -21 -115 -156 45 5 312 -118 114 49 -67 -17 -107 130 -38 300 213 -291 -72 103 -6 -105 -68 326
5283 326 78 47 -235 83 -3 -163 71 36 -136 -159 -5 -155 170 -62 -66 100 67 130 229 129 264 28 -68
5306 -68 -10 -267 141 -46 -206 -77 -234 -2 -336 -51 -326 65 -23 -182 -120 54 -122 102 92 59 -136 -31
5328 -31 -227 299 -62 -227 -50 -267 -7 -46 -14 35 -16 29 -21 -153 246 200 -135 121 -96 -48 166 -63 159
5351A59j44J03K28m99K84p9k53J8L49k25J00n3J02j72k24J73K01j22p2N8P0J5
5373A7j6j64K77m1p9l3N2L9k05K42M5m97J77L12j96K07l43M92l79R6MN0pj35%
5398h5J90j27l0l6R9ON8l94J23K76n0j16KK18J06pm26k29M57j09J77M7j56R6J19
5423B09m47K33j12J09k76L46K12l48r9J76K91m55J84N4J7L4j75N1J1N7J21o9l69
5446b45K01O3L1j50J12j11P1Q2Nj95L43Q5k73P5j80J38j62K49j5j04J7k00j55
5469c18L15Q9k17j12L84J15j42Q6m3j8j02n4Om3J05Q9l66M60j58j21k2J72k11
5492a06p5K56j57J9J72j29m0O0r8j21J54J4J60l05K98J61k33L2p0J58k59J25j13
5515i7L57j38j09J67l50K37L0q5j77K38J3L9j92L3K05J68m71j3K67l19J98J8r4
$$ plain form
5351 159 15 118 346 -153 131 52 -201 -183 166 -59 41 -12 90 -82 -306 -133 68 -54 -126 -68 2 17
5373 17 1 -163 114 73 -6 -39 13 52 -153 89 134 -363 -186 126 -70 137 -206 286 -93 3 7 57 50 -85 -85
5398 -85 105 -22 -52 -88 11 17 75 -319 -196 80 30 -86 -84 134 240 233 -193 -422 35 -74 103 150 -6 90 209
5423 209 -238 -5 -117 -8 -284 62 274 -74 -173 3 294 -161 23 77 94 128 -47 4 15 72 193 124 -245
5446 -245 -44 19 50 -100 12 -99 -28 54 59 -136 207 292 19 94 -86 52 -110 139 124 20 37 -163 -318
5469 -318 -3 86 -131 -243 141 256 114 200 157 139 37 -17 -11 -54 51 140 -226 234 76 -45 -67 105 -106
5492 -106 -181 75 -82 -63 109 -20 -60 0 -98 -219 -65 -51 109 -196 102 263 30 62 -8 150 -109 16 -97
5515 -97 260 122 13 180 -170 67 97 12 -165 73 86 125 -67 -34 171 339 -132 -145 122 -197 1 19 -75
5538g5j99K86j71J46l8J85k55K57j78k4L51j33l52L71o1q8M0R7J3k13J27Q1J0
5561A77l57J66k14J81J29m8j43J26j77J69rJ11m6K4l6R6k60K21j12k03J57j68
5583b16p3J19K95l62Q4K96q0n7J70k61M75m54M4J21j40o4R5K2k05LJ59J73k76
5606a32J72r7l00J68K31j63J88p0j15j97M37m1J12k33p1K83k17Q4L14m43J30K2
5628F2j0k14J33J80oR4k21J85l6P8m0k22J22l4o3N7k3m3J09j27J75m18K22k5J68
5653A03j70R5j43L64j45PJ31m77O7P4J95J71k09j65K71p4k41K22J75n0l34K36
5675A03j42J57k34K02M5m4lj81j81P27l45n6L77k61k69M78j87k72j83L74j62J3
5697d4K7Q1p5K40k4K8j95K44m37K41k7k50L49k55r3K43j10J09N5K12j08m41K75
$$ plain form
5538 -75 -274 12 -159 -13 -51 134 -121 136 -42 -66 285 152 -200 171 110 22 62 159 172 -41 86 167 177
5561 177 -180 -14 -228 -47 82 34 -109 17 -160 9 0 111 65 89 53 149 -111 110 -2 -205 -48 -216
5583 -216 -289 -170 125 -237 -153 143 63 6 176 -85 390 -64 -20 101 -39 -103 -8 14 -191 -188 -29 144 -132
5606 -132 40 -57 -357 -189 42 -121 67 -3 -118 -315 122 81 193 -40 -111 172 -45 39 353 -90 40 62
5628 62 52 -162 -29 151 145 239 18 203 167 245 205 -17 105 71 8 65 42 -1 108 -19 156 -262 -40 -65 103
5653 103 -67 28 -115 249 104 111 242 -235 -168 -94 101 272 63 -102 169 95 -146 76 251 201 -133 103
5675 103 -39 118 -116 86 131 87 84 -97 -278 449 104 48 425 164 -105 373 186 -86 -269 105 -57 -44
5697 -44 -17 64 -11 229 205 233 38 282 -155 86 59 -191 158 -97 -190 53 -57 52 107 319 211 -230 45
5720D5j10p2J28J86k44K48j33J3J8r4r9L6K61J4k40J31j57J3R9J19j74O8p7k9
5744e0j48K42J78k05K10k07LO7q2M4J40j26q0j62K72q2r3J41R6k35J70j65j91
5767b63J60j65M32P2j7k07J06m60K49o1K42m0Q7j77j11p1K92p2j85K77l28M0Q4
5790a16P9j3J3K98k5o5k46K14o9j54K67k69J61j19L7m8N9J54q7j43n3K4J31m0
5814a0L33j2o19L40n8P6J1J21j02q1J72l9j15K23k68Nj28K12J05j83j72L55n2
5837A14j72J84k68J10M30k41k54QL2M5l7o2K5o0K95j73q1n7J05Rm2K79m06K42
5861B5j30m4j49K02J23j85L93k59Pj24J08M33l49j72J65J23l13L1J07r8J42j22
5883h6l7K56j01P4j73p6M43j80j16k8m7J50l15J69j9N1q1J20J41l7j03r3K51k45
$$ plain form
5720 45 -65 -137 -9 177 -67 181 48 61 79 -15 -114 -78 183 197 -43 88 -69 -56 43 162 -12 56 -21 -50
5744 -50 -198 44 222 17 227 20 23 90 8 52 192 66 -14 -176 96 14 -79 62 158 -77 93 -72 -263
5767 -263 -103 -268 164 236 219 12 118 -342 -93 -154 88 48 135 -42 -153 -224 68 -4 -189 88 -240 -200 -116
5790 -116 -37 -50 -37 261 236 171 -75 139 70 -84 183 -86 75 -44 -7 -55 4 158 71 -72 -125 -101 30 -10
5814 -10 323 311 -308 32 -26 50 61 182 80 -1 171 132 17 240 -28 -23 -151 61 166 -17 -189 166 114
5837 114 -58 126 -142 -32 398 157 -97 -89 -57 -12 -49 -111 -86 -146 149 -24 -105 -162 -57 -48 -90 189 -217 25
5861 25 -105 -149 -298 -96 27 -158 235 -24 -17 -141 -33 400 51 -121 44 167 -146 -115 -8 -106 36 -86
5883 -86 -123 133 32 106 -67 -143 300 120 4 -24 -71 79 -236 -67 -86 -35 -116 4 145 108 5 -88 163 -82
5907h2L23k54K2o9R4j4J87l60L8J63k90L36j33J84J08l59K88k20j26O1J69jQ5
5930A50K0k14K46j36m7L15m09R3rj27K65k86L4K38mk11J13P5K8m67M84k01j41
5953a91J75M8L3k29N7J21J74j91j10J87j46K65l40J41RPQ3l19K78J85k24m5Q3
5976E1R6k05K36J39k28l90M08PJ20j84l2J14k76J74l81N67j65j26J39J65%K7n64
5999c08K31M31m15j39K13l3j4k5n7L5K92k07j44K74k89L03k6k00J48O5N7l11L53
6022B34p5j49R1r0J28r9j06J67m44M36j42PK47m09K36J54k23J4o8J99j0j92Q8
6045fj6j8K06j7n1k11K96m77K16m7j58K08N5N2k13k5J96m9N6N6K12l32J72j35
6069c0L3J60l17K3L47p2j84J40j97J29n1L8J75J04l10q5k8J90R2j10j21nR0J93
$$ plain form
5907 -82 241 -13 9 -60 34 20 207 -153 -115 48 -242 94 -39 145 253 -106 182 -38 -164 -103 66 65 150
5930 150 170 -44 202 66 19 334 -75 18 9 -118 147 -139 -105 133 129 -82 31 106 134 -333 151 -50 -191
5953 -191 -16 32 65 -164 -107 14 188 -3 -113 74 -72 193 -147 -6 3 10 93 -226 52 237 13 -32 51
5976 51 147 -58 178 317 89 -301 107 114 234 50 18 132 -144 30 -351 216 51 -75 64 229 229 256 -308
5999 -308 -77 354 -61 -200 13 -20 -34 -59 -116 -81 211 4 -140 134 -155 148 122 -78 70 135 192 -119 234
6022 234 159 10 101 11 139 40 -66 101 -343 93 -49 -42 205 -204 32 186 -37 -23 -91 108 98 -94 -6
6045 -6 -22 -40 166 149 98 -113 183 -294 -78 -125 -283 -75 -20 32 -181 -206 -10 -59 -3 53 265 -67 105 -30
6069 -30 3 163 -154 -131 216 144 -40 100 -97 32 -19 19 194 298 -12 -97 -125 65 157 47 -74 -79 11 204
6093B04l30J85j17J56j72j39J37m9J15m1q1R2J18j75J22p7N9L5j5J04j44k70K16
6116f7k50L25j17N6Q0j11K6o1J91l05J57K71k94Nk99N01J1j09Rl6o3J12j09R3
6140A6k07K97k02o1K10R7l2j14%l02K01j16L35p9Rj37K3L4j61K28J63j53l82O3
6164b70L48j25j00J89m0j7j05R4R5kK22n0l19Q5O8J79k28lk36M02l47J93p5K00
6188A58j78l9K77k23M0QK0r8j8Q4J43j79J4J74k94K55q1m2nN2J51l17K14r5p2
$$ plain form
6093 204 -126 59 -58 98 -74 -213 -76 -125 -10 -51 -132 -40 78 -97 25 -52 7 42 27 131 -13 -283 -67
6116 -67 -317 8 -109 -53 27 -84 -58 -119 72 -233 -76 195 -99 -94 -393 108 119 10 19 -17 -80 32 -77 16
6140 16 -191 106 -96 -157 53 150 118 4 4 -298 -97 -213 122 43 52 -85 -62 -28 -189 39 202 49 -333 -270
6164 -270 78 -47 -147 42 2 -15 -120 -26 69 67 289 239 -80 5 73 252 24 21 -215 187 -160 33 -42 158
6188 158 -20 -59 218 -5 35 43 63 -35 -53 31 174 -5 9 183 -111 144 63 21 16 68 219 -98 116 21 -51
$$ [...]
8191A13
##END NTUPLES=NMR FID
##END=
