##TITLE=1H_DE-21_oil_d6_TFA
 DMSO-d6
 8 sc, 
 6.6.2024
##JCAMPDX= 6.0         $$ Bruker NMR JCAMP-DX V2.0
##DATA TYPE= NMR FID
##DATA CLASS= NTUPLES
##ORIGIN= UXNMR, Bruker Analytische Messtechnik GmbH
##OWNER= root
$$ XWIN-NMR		Version 3.5
$$ Thu Jun  6 16:18:55 2024 Russian Standard Time (UT+4h)  she@DPX200
##.OBSERVE FREQUENCY= 200.1309
##.OBSERVE NUCLEUS= ^1H
##.DELAY= (6, 6)
##.ACQUISITION MODE= SIMULTANEOUS
##.ACQUISITION SCHEME= undefined
##.AVERAGES= 8
##.DIGITISER RES= 18
##SPECTROMETER/DATA SYSTEM= spect
##.PULSE SEQUENCE= zg30
##.SOLVENT NAME= CDCl3
##.SHIFT REFERENCE= (INTERNAL, CDCl3, 0, 15.7039)
##AUDIT TRAIL= $$ (NUMBER, WHEN, WHO, WHERE, WHAT)
$$ ##TITLE= Audit trail, XWIN-NMR		Version 3.5
$$ ##JCAMPDX= 5.01
$$ ##ORIGIN= Bruker BioSpin GmbH
$$ ##OWNER= she
$$ F:/spectra/data/she/nmr/H-F/1/audita.txt
$$ ##AUDIT TRAIL=  $$ (NUMBER, WHEN, WHO, WHERE, WHAT)
(   1,<2024-06-06 16:17:51.48 +0400>,<she>,<DPX200>,
      <created by zg, POWCHK disabled, PULCHK disabled
       configuration hash MD5:
       00 E9 B6 7A A2 85 ED C7 34 08 36 98 17 FE 4E 26
       data hash MD5: 16K
       50 F9 B8 DC 59 C9 C9 36 EE 71 88 E7 10 65 9D A0>)
$$ ##END=
$$ 
$$ hash MD5
$$ DB 2C 37 D7 9B EB A7 3B 70 4C 49 FE E1 58 CE 4F
##$RELAX= 
##$RELAX= 
##$RELAX= 
##$RELAX= 
##$RELAX= 
##$RELAX= 
$$ Bruker specific parameters
$$ --------------------------
##$DU= <F:/spectra>
##$EXPNO= 1
##$NAME= <H-F>
##$PROCNO= 1
##$TYPE= <nmr>
##$USER= <she>
##$AMP= (0..31)
100 100 100 100 100 100 100 100 100 100 100 100 100 100 100 100 100 100 
100 100 100 100 100 100 100 100 100 100 100 100 100 100 
##$AQSEQ= 0
##$AQ_mod= 1
##$AUNM= <au_zg>
##$AUTOPOS= <>
##$BF1= 200.13
##$BF2= 200.13
##$BF3= 200.13
##$BF4= 200.13
##$BF5= 200.13
##$BF6= 200.13
##$BF7= 200.13
##$BF8= 200.13
##$BYTORDA= 1
##$CFDGTYP= 0
##$CFRGTYP= 5
##$CHEMSTR= <none>
##$CNST= (0..31)
1 1 145 1 1 1 1 1 1 1 1 1 1 1 1 1 1 1 1 1 1 1 1 1 1 1 1 1 1 1 1 1 
##$CPDPRG= <>
##$CPDPRG1= <>
##$CPDPRG2= <>
##$CPDPRG3= <>
##$CPDPRG4= <mlev>
##$CPDPRG5= <mlev>
##$CPDPRG6= <mlev>
##$CPDPRG7= <mlev>
##$CPDPRG8= <mlev>
##$CPDPRGB= <>
##$CPDPRGT= <>
##$D= (0..31)
0 1.2 0 0 0 0 0 0 0 0.06 0 0.03 0 0 0 0 0.0002 0 0 0 0 0 0 0 0 0 0 0 0 
0 0 0 
##$DATE= 1717676271
##$DBL= (0..7)
120 120 120 120 120 120 120 120 
##$DBP= (0..7)
150 150 150 150 150 150 150 150 
##$DBP07= 0
##$DBPNAM0= <>
##$DBPNAM1= <>
##$DBPNAM2= <>
##$DBPNAM3= <>
##$DBPNAM4= <>
##$DBPNAM5= <>
##$DBPNAM6= <>
##$DBPNAM7= <>
##$DBPOAL= (0..7)
0.5 0.5 0.5 0.5 0.5 0.5 0.5 0.5 
##$DBPOFFS= (0..7)
0 0 0 0 0 0 0 0 
##$DE= 6
##$DECBNUC= <off>
##$DECIM= 32
##$DECNUC= <off>
##$DECSTAT= 4
##$DIGMOD= 1
##$DIGTYP= 9
##$DL= (0..7)
0 120 120 120 120 120 120 120 
##$DP= (0..7)
150 150 150 150 150 150 150 150 
##$DP07= 0
##$DPNAME0= <>
##$DPNAME1= <>
##$DPNAME2= <>
##$DPNAME3= <>
##$DPNAME4= <>
##$DPNAME5= <>
##$DPNAME6= <>
##$DPNAME7= <>
##$DPOAL= (0..7)
0.5 0.5 0.5 0.5 0.5 0.5 0.5 0.5 
##$DPOFFS= (0..7)
0 0 0 0 0 0 0 0 
##$DQDMODE= 0
##$DR= 18
##$DS= 0
##$DSLIST= <SSSSSSSSSSSSSSS>
$$ [...]
##$SUBNAM2= <"">
##$SUBNAM3= <"">
##$SUBNAM4= <"">
##$SUBNAM5= <"">
##$SUBNAM6= <"">
##$SUBNAM7= <"">
##$SUBNAM8= <"">
##$SUBNAM9= <"">
##$SW= 18.0517689322627
##$SWIBOX= (0..15)
0 0 2 0 0 0 0 0 0 0 0 0 0 0 0 0 
##$SW_h= 3612.71676300578
##$TD= 16384
##$TD0= 1
##$TE= 0
##$TE2= 300
##$TE3= 300
##$TEG= 300
##$TL= (0..7)
0 120 120 120 120 120 120 120 
##$TP= (0..7)
150 150 150 150 150 150 150 150 
##$TP07= 0
##$TPNAME0= <>
##$TPNAME1= <>
##$TPNAME2= <>
##$TPNAME3= <>
##$TPNAME4= <>
##$TPNAME5= <>
##$TPNAME6= <>
##$TPNAME7= <>
##$TPOAL= (0..7)
0.5 0.5 0.5 0.5 0.5 0.5 0.5 0.5 
##$TPOFFS= (0..7)
0 0 0 0 0 0 0 0 
##$TUNHIN= 0
##$TUNHOUT= 0
##$TUNXOUT= 0
##$USERA1= <user>
##$USERA2= <user>
##$USERA3= <user>
##$USERA4= <user>
##$USERA5= <user>
##$V9= 5
##$VALIST= <valist>
##$VCLIST= <CCCCCCCCCCCCCCC>
##$VD= 0
##$VDLIST= <DDDDDDDDDDDDDDD>
##$VPLIST= <PPPPPPPPPPPPPPP>
##$VTLIST= <TTTTTTTTTTTTTTT>
##$WBST= 1024
##$WBSW= 4
##$XGAIN= (0..3)
0 0 0 0 
##$XL= 0
##$YL= 0
##$YMAX_a= 76741
##$YMIN_a= -88314
##$ZGOPTNS= <>
##$ZL1= 120
##$ZL2= 120
##$ZL3= 120
##$ZL4= 120
##$ABSF1= 10
##$ABSF2= 0
##$ABSG= 5
##$ABSL= 3
##$ALPHA= 0
##$AQORDER= 0
##$ASSFAC= 0
##$ASSFACI= 0
##$ASSFACX= 0
##$ASSWID= 0
##$AUNMP= <proc_1d>
##$AZFE= 0.1
##$AZFW= 0.1
##$BCFW= 1
##$BC_mod= 2
##$BYTORDP= 1
##$COROFFS= 0
##$CY= 11.3945322036743
##$DATMOD= 1
##$DC= 2
##$DFILT= <>
##$DTYPP= 0
##$F1P= 15.6554695791079
##$F2P= 12.8336369535428
##$FCOR= 0.5
##$FTSIZE= 0
##$FT_mod= 4
##$GAMMA= 1
##$GB= 0.15
##$INTBC= 1
##$INTSCL= 1
##$ISEN= 128
##$LB= 0.24
##$LEV0= 0
##$LPBIN= 0
##$MAXI= 10000
##$MC2= 0
##$MEAN= 0
##$ME_mod= 0
##$MI= 1.114404
##$NCOEF= 0
##$NC_proc= 0
##$NLEV= 6
##$NOISF1= 3.799351
##$NOISF2= 2.8
##$NSP= 1
##$NTH_PI= 0
##$NZP= 0
##$OFFSET= 15.70392
##$PC= 1
##$PHC0= -25316.36
##$PHC1= 15.58748
##$PH_mod= 1
##$PKNL= yes
##$PPARMOD= 0
##$PSCAL= 0
##$PSIGN= 0
##$REVERSE= no
##$SF= 200.130013532006
##$SI= 16384
##$SIGF1= 3
##$SIGF2= 2
##$SINO= 400
##$SIOLD= 16384
##$SREGLST= <1H.CDCl3>
##$SSB= 0
##$STSI= 0
##$STSR= 0
##$SW_p= 3612.71676300578
##$SYMM= 0
##$S_DEV= 0
##$TDeff= 0
##$TDoff= 0
##$TI= <>
##$TILT= no
##$TM1= 0
##$TM2= 0
##$TOPLEV= 0
##$USERP1= <user>
##$USERP2= <user>
##$USERP3= <user>
##$USERP4= <user>
##$USERP5= <user>
##$WDW= 1
##$XDIM= 8192
##$YMAX_p= 0
##$YMIN_p= 0
$$ End of Bruker specific parameters
$$ ---------------------------------
##NTUPLES= NMR FID
##VAR_NAME=  TIME,          FID/REAL,        FID/IMAG
##SYMBOL=    X,             R,               I
##VAR_TYPE=  INDEPENDENT,   DEPENDENT,       DEPENDENT
##VAR_FORM=  AFFN,          ASDF,            ASDF
##VAR_DIM=   8192,          8192,            8192
##UNITS=     SECONDS,       ARBITRARY UNITS, ARBITRARY UNITS
##FACTOR=    0.0002768,     1,               1
##FIRST=     0,             0,               0
##LAST=      2.2672688,     0,               0
##MIN=       0,             -88314,          0
##MAX=       2.2672688,     76741,           0
$$ Real data points
##PAGE= N=1
##DATA TABLE= (X++(R..R)), XYDATA
0@%%%%%%%%%%%%%%%%%%Kj0J6j6J6j6J8k6L2l4M2m8N5o5P4q5R5j08J24j40J56j74
40i2J96k18K43k72L01l32L67m08M50m95N47o01O59p28Q02q83R75j076J190j321
60f96J471j643J844k085K379k746L215l853M886j3634J2974p9597J41486q772
74E5229j09864R9754j05417M0983O2878q4363O5998o4447j0958J26948o6585J7385
86B7541j7391n6167Q4007m1800l750K9243q0367N1776K6064l063L2702q0458R470
99b2193M2719l1574K4378l9033j3968M4272j3431M1916O45n1449J8447m915J8761
112A4575M480n3772J4346J1695Q165L4127k3902r397n492q773L6576j4790l1461
125b3623J069K028L6055P861k0753K800j3648Q158J8030j3942q774j8523L914
$$ y = [0, 0, 0, 0, 0, 0, 0, 0, 0, 0, 0, 0, 0, 0, 0, 0, 0, 0, 0, 2, -8, 8, -8, 8, -8, 10, -16, 16, -18, 24, -24, 31, -34, 40, -45, 50, -58, 66, -74, 82, -92, 104, -114, 129, -143, 158, -174, 193, -215, 235, -260, 287, -314, 345, -383, 419, -464, 511, -565, 625, -696, 775, -868, 976, -1109, 1270, -1476, 1739, -2114, 2772, -10862, 2112, -77485, 64001, 55229, -54635, 45119, -60298, -19315, 43563, -40800, 25198, -39249, -50207, 76741, 10156, 27541, 10150, -46017, 37990, -3810, -7560, 21683, -58684, -6908, 19156, 16093, 48795, -31663, -22193, 20526, -11048, 13330, -25703, -39671, 4601, -8830, 33086, 33731, -17718, 729, -4186, 14575, 19055, -34717, -20371, -8676, -511, 33616, 9714, 317, -5175, -13948, 22628, 7838, -23623, -22554, -20526, 15529, 23390, 2637, 5437, -8211, -53, 17977, 4035, -4739, -23262, -19348]
138a9348L2401P36p316j1065q571J8475M892m235q558k0397Q873J8300P936j086
152A1037j9758n44J7109O162l36j7118j2993P534R404J0981m486j6488J2J0038
166E54J3024o10j9708q659M208J1031J0038p785r750j291Q649J4832j561j4814
180a842r353J841J3199O197p959q273l110R232J1863j486j0526r812J090J1842
194B903M830n521r866l358J0318J0302J75r360r419K503R572M819m888j0590l058
209a0638R165J0023J013r472q602L538Q752M091n246r709k124P273R447J110q948
224c27o851K596Q481M191n881q517k197O233P937Q38o965n915J678Q446M040m913
240B874q135l363O066P390O59o113n459J831P685M413l755q316k958N289O769
$$ y = [-19348, 13053, 13789, 6473, -4592, -13163, 5312, 10204, 5969, -2589, -22986, -14113, 4187, 12123, 11037, -8721, -9265, 7844, 14006, 13670, -3448, -16441, -8907, 497, 11478, 6992, -9496, -9484, 554, 13578, 12968, -6740, -15399, -11191, -160, 9878, 2093, -7657, -8948, -299, 14533, 12972, -1842, -11195, -9354, 3845, 10042, 2083, -6190, -9300, -68, 11795, 10309, -217, -10029, -8939, 2903, 7733, 2212, -7654, -11012, -694, 9608, 9783, 423, -8996, -6493, 3079, 7898, 3010, -7580, -10638, -1473, 8550, 9563, 91, -8511, -4973, 3779, 7870, 2624, -7085, -9209, -1936, 7511, 8621, -327, -7178, -4582, 3899, 8090, 2209, -6308, -8505, -2272, 5665, 6503, -462, -6377, -4699, 3747, 7787, 2874, -5261, -8624, -2558, 4832, 5491, -622, -6081, -4250, 3435, 7848, 4093, -4223, -7181, -1892, 4877]
255D877O7n824m973K258P177L795l946p129l488M590O097L26o058m546K481O852
271B556L846l146o474k271M135N227M09n137m421K221O214L594k807n963k344
286d361L248M356P9n030m211J426N798L628j987n389k090L459M427J74m777m111
302e361J957N330L162j523m787j696K899M031n52m616m036J505M746K941k086
317A914m103j066L147L513m85m219l159J059M233K689j167l773q53K455L215j92
333C208l882l442Q93L457K717j202l329j336K766L614m59l476k965L63L395K644
349B966j611k648r68K260L189J08l260k936j08L270J773j216k662o49K405K921
365B834l8k610k400P9K488J492r99k634j65K244K598Q0k432k154m21K064J482
$$ y = [4877, 4944, -880, -5853, -3595, 3582, 7377, 3431, -3698, -7186, -2596, 3501, 3827, -2231, -6777, -4296, 2556, 6402, 3256, -3218, -5489, -1354, 3873, 4282, -855, -5276, -3055, 3159, 6753, 3946, -2017, -4361, -1113, 3243, 3322, -1708, -5919, -4493, 1305, 4933, 2946, -2443, -4533, -1074, 3353, 3527, -1250, -5361, -3404, 1926, 5088, 3565, -1222, -2918, -19, 4012, 3460, -1156, -5192, -3687, 1059, 4000, 1914, -2189, -3255, -108, 3405, 2920, -1299, -4458, -3399, 834, 3523, 2356, -1417, -2270, 185, 3400, 3208, -674, -4116, -3223, 234, 2951, 1749, -1580, -2916, -150, 3464, 3005, -471, -3436, -3073, 322, 2966, 1355, -1293, -2261, -1, 3188, 3296, 36, -2900, -3008, 262, 2035, 819, -1843, -2492, -87, 2834, 2796, 186, -2214, -2135, 353, 1845, 846, -1788, -1953, 291, 2889, 2969, 537, -1617, -2038, 26, 1508]
382A508q50k378p42J985K734J63k078k182N5J753J473m40k453r16K002K673L04
399B611j953k145J64J758R97q14k052p17J807K128K30j379j743K04J524Q84j245
416B59j618n29J126J750Q17j298k011N36J650O22r38j646l19Q84J613J037j352
433E83j043l68J043J333q15j627o95R43J660M31p38j472j55J323J131p92j685
450i43q23J109J706k8r03r28K65R15O91n6j122j447R83J301L77r49q41M28J172
469I07L66o46q41r29O19R79M55p82j200N42J056N71l42r94o05J23J223J95n42
488A55r27k05J559O22n17j316J10L56L85L41n59l76J24Q58Q94p17j117p2M30L41
508C69j56q18J96j54K86J102n23q41j12L88P79k01o85L4L23N73J98K27q53l32
$$ y = [1508, 658, -1720, -2462, -477, 2257, 2420, 342, -1840, -1785, -32, 1441, 1001, -1452, -2368, -366, 2307, 2611, 658, -1487, -1323, 435, 1432, 618, -1434, -2151, -344, 1784, 2014, 635, -1108, -904, 620, 1504, 259, -1359, -1888, -762, 988, 1805, 507, -1504, -968, 682, 1304, 366, -1280, -1599, -715, 898, 1935, 583, -460, -828, 215, 1548, 733, -894, -1589, -646, 1014, 1445, 707, -765, -920, 403, 1534, 742, -943, -1766, -657, 1049, 1021, 118, -810, -545, 370, 1061, 1005, -117, -1564, -581, 720, 1097, 148, -693, -265, 907, 1273, 627, -214, -1143, -524, 455, 910, 128, -1072, -530, 526, 1097, 755, -239, -844, -721, 502, 697, 155, -772, -977, 582, 1204, 687, -629, -519, -163, 222, 563, 4, -372, -248, 610, 1504, 787, -330, -402, 28, 369, 213, -605, -409, -563, -277, 825, 302, -539, -651, -263, 516, 315, -370, -336, -13, 560, 758, 985, 132, -200]
528b00J80L89K83o05r20M68O56L19o19q6m10J32N63J17k75n26K53L15O06m63o93
549e16M13L3O02R4l15n65kL33L93m83k07L54J07j39J62k00k99J97j53L28l15m
571a82j40O28p3K3k29M17n20l28J83j57J73l5q5O56J14m73j30j17K91K31l18J6
593e5QK15L39k08k32R6Rk51J30l89j25J88L92k05J90n6k31K31J14O4j39j80rK08
617A04L0L29j81l71K17k68J40l0o7J68j57J21k65M23j29J73j15j34j24j63M3J22
639a34J12j2K59k47k20L12J24k38m84K02N07n17L20K6K56m7J11k56J27k83O3P0
661E1k09K17OL1O4j71M4m5J65l30j57M06l06K29l0L10o3L15o62M04l10l0K4J13
685F6P0l19K85m3L00j19J49n24J28j72k09j44N41p9L6q9k03L56p7q0p2N2j28J86
$$ y = [-200, -20, 369, 652, 47, -873, -405, 251, 570, -49, -135, -545, -413, 150, 267, -8, -534, -281, 34, 640, 177, -516, -103, -70, 532, 626, 311, -254, -256, 77, 470, -13, -220, 134, 241, 102, 264, 64, -235, -38, -191, 137, -178, -182, -322, 306, 233, 256, 27, 444, -76, -404, -221, -378, -205, -240, -325, 331, 445, -28, -158, -275, 16, 247, -71, -55, -47, 168, 507, 299, 67, 163, 172, -79, 51, -338, -463, -275, 117, -88, 102, 46, -185, 46, 160, 224, 85, -95, -104, 104, 134, 463, 282, -89, 128, -140, 0, -30, -97, 71, -86, 35, -230, 193, 64, 237, 122, -12, -136, -299, -256, -134, -22, -34, 225, -22, -242, 70, 194, -44, -528, -326, 181, -336, -16, 10, 266, 219, 330, 74, 201, -82, -19, 51, -158, 59, 65, 96, 160, -11, 33, -12, 153, -177, -334, 72, -234, -5, -35, 275, 212, 527, -135, 269, -41, -71, -47, 66, 136, -183, 102, 59, 359, 240, 389, -135, -7, -179, -388, -532, 9, -70, -34, -123, -326, 30, -47, -127, -199, -147, -275, -89]
709h9j9k34L37j5qkj41J29j18K81m99K86J68J44j95L03m01j9J29k07L9J4p3J06
733h4K02j57j24J56Q8J67l58K82j72k97K88J08r0R4q9J64k96m1J43J54j43j93
755a98j0J89J45m6k86M25m60Q0M6K26l18L29P6k17K98l23J50o6N3j7r3j3k25K27
779b8K46l07R5J63m1m0J47l75P2p6J42j68J46K59j76m0k0l51K75R6mj54k8M7K08
804H8J59k56J82p1j44K77n90J50L4J00M32l78m6RL04l51J09k49p3J18K35k58Q8
827a31J55J22j29L8n0O9j62j0p6K95j96L29j84j22Q0mM2k49m6K72m54K24K24l2
851EJ27m2N8o8r2Q0j51N0l02J32K66j68L30o8j80k7J42k69R6K3p1J53j41J60J73
876B16m14J62k4PJ42j98J08l0q3J23j92J21N3J33j72K0J68P1k65N6m99P43l63
$$ y = [-89, -108, -342, -5, -20, -28, -30, -171, -42, -160, 121, -378, -92, 76, 220, 25, 328, -73, -92, 37, -170, -131, -117, -190, -84, 118, -39, -163, -7, 81, 248, -110, 172, 0, -297, -9, 99, 9, 103, 14, 178, -118, -159, -16, 138, -5, -198, -208, -19, 126, 80, -206, 219, -241, -161, -115, 111, -207, 122, 198, -19, 279, -44, 106, 40, 93, 76, -17, -30, -255, -28, 218, -89, 6, 169, 128, 88, 235, -140, -68, -144, -2, -170, -24, 235, 59, 19, -1, -352, -77, 19, 15, -139, -167, -120, 88, 247, -9, 173, 102, -42, 235, -355, -205, -171, -71, 361, -17, -63, -54, 250, -101, 8, -241, -314, -196, 39, -219, -131, 24, 146, 17, 55, 5, 74, -88, -98, -174, 121, -75, 254, 70, -52, 28, 24, 66, -183, -229, 43, -411, -187, 37, 5, 132, 90, 148, 80, -12, 68, -83, -33, -335, -203, 63, -105, 225, 157, -23, -50, 92, -177, -81, -58, -129, 24, -117, 43, 216, -198, -36, -60, -53, 89, -109, -1, -31, -114, 9, -183, -62, -9, 124, -48, -28, 140, 211, -54, 2, -497, 246, -117]
899a17K30j96j1J6N1j33K02K4j69J25O3P9j31j64K72l51M9K9J18J74j40J47M5
922B12L2l54l7K8K52j48q3L57k84J19j68J00Q7j63L20k96n6j14K93L0j64rJ67
945A21l21K4O6J70K1k62K35j21J97j87j25l6K42J40o1P2j32p2k06K04R0k13K50
968I6j64M02l03J05j11j16K08l82L28m63J78J0k9K41M8J21K27l01j64k34L56r1
990c8L1n8J91mm1m4j41J65J48j59k13J03R1M10l20M1j07J04k34K01n0k82J58J29
1014H1l64L08k4lP9k23P7K09j34q0m0K42o1n31P88l25R3j6m7J17j06J64k33j82
1038b11l4M98p5j46l1P9k13J60k36O2L40m99J56J32J44j70K33j20j61O8p7K82
1060A81j41j12K47r4M7O7k85J30L2o8K63j16k41J1j20J32N7n8j35K61Pj07K29
$$ y = [-117, 113, -83, -94, -78, -27, -160, 42, 66, -103, 22, 85, 164, 33, -131, 141, -210, -161, -132, -14, 160, 20, 167, 212, 244, -110, -147, -119, 133, -15, -98, 259, -25, 94, -74, 26, 113, -50, 270, -26, -82, -196, 97, 127, -37, -46, 121, -200, -176, -110, 60, 81, -181, 54, -67, 130, -57, -182, -218, 24, 164, 103, 175, 43, -29, -235, -31, 59, -154, 96, -68, 334, 31, 136, 25, -91, 117, -265, 63, -400, -222, -212, -241, 0, 48, 169, 396, 95, -69, -303, 53, -38, -7, -65, 126, 122, 81, 37, -104, 61, 209, 50, -163, -60, 31, 441, 121, 162, 55, 159, -75, 126, 76, -206, -48, 81, -283, 25, 1, -2, 77, -146, -69, 140, 6, -74, -114, 128, 67, -464, 324, -1, 92, 76, 29, 146, 40, 204, -29, -211, -245, 253, 178, 32, 1, 80, -133, 27, -209, -147, 193, -306, -150, -18, 126, -44, 189, 69, -92, -24, -101, 181, 40, -72, 175, 81, 128, 195, -90, 40, 72, 4, 267, 151, -90, -79, -199, -67, -10, -68, -203, 58, 65, -42, 187]
1083A87k27qK54k31R0k45L51j90j07N10m05j99L7L40k03J1K40j54k89M57j23j59
1105f3K36j77q6j45L04j42j84K93J0j95J34k64M43o7j09J05j78L07J16l35Q7k28
1127a38rK58m82J59J62j8R6M6Q1m11M2J58R4r9K5K15l25Q2L75p0l46K30o6j53
1151i4K63M1r8k39L47l43K58q1k71J45k1K65k39j32M1K30k6J39m66R8K15j05N7
1174a6K74k28m9K3K13l07J9L6M90l18j60k90L72j28Q4k24J25M3J72j07j29K09
1196A04O6j57l7J26ll12M06j98O1K01n35J90P3J78J28Mk06k64L67r3P4j38j53
1219a18J76j51j37N3m2r2L36J45j5p7j01M9PQ5k9K1%K3p6o1K09Ok87O8j70K9L53
1246B04l16N9K37l14Q2L2j12J07j65L60l7k06n7M63n40N3J38k5N7K8k83K44L0
$$ y = [187, -40, -48, 206, -25, 65, -180, 171, -19, -126, 384, -21, -220, -183, 157, -46, -35, 205, 51, -238, 219, 96, -63, 173, -4, -90, -235, 69, -73, -257, 36, 46, -149, -15, -279, 164, 97, -12, 93, -85, 222, 338, 3, 90, -138, -147, 111, -371, -212, -50, -68, 28, 74, 155, -256, -214, -56, 38, -61, -36, 179, -146, -64, 311, 241, -105, 125, 59, -94, 169, 210, 112, -127, 220, -123, 135, 54, -217, -72, -93, 172, -67, -199, -158, 72, 46, 185, -281, -183, 32, -73, -16, 258, 30, -19, 4, 217, -90, -71, -35, 455, 137, -23, -313, 59, -69, 15, -209, -84, -41, 131, 24, -105, 104, 170, 13, -24, 102, 99, -213, 193, -5, 56, 257, -278, -88, -15, 163, 291, 295, 89, -175, 192, 99, 173, 35, -118, 58, -93, -230, -177, -219, -311, 25, 170, 155, 78, -23, 26, 33, 118, 89, 110, 110, 133, 57, -4, 205, 211, -76, -8, -178, -149, 204, -112, -53, 184, -130, -48, -16, -128, -21, -186, 174, 137, -69, -126, 337, -203, -150, -12, -37, 20, 48, -235, 9, 39]
1269C9o0J04k89K84J84m26Q7L9J28O9m42K89m2m7J54R1j51J36j31J71l53J35J73
1292A42n2j94Q4j18J12m4L8%J4K07l93L02l02M01m1lk94m7K77k82L04k30J19j27
1316a27j64K81j4NJ25j91J12K27l01K13jK5m3l31J47J6K44k87L5L30p9l8m71K52
1340c5O7n3jn5M14k73j26J25N0l29K51j07L5J70N8k32k4J32K10m07L5N3r4L76
1364B40m90J56lJ95m4j90L1K68j71N4l9K74l56j60L26j58M1J1K49k69J73j88J45
1387I5p3K2k47jK8J98O9K5j99mJ98k80L20rl66L25k41J63J5n2K53k94KO3M5j95
1413a40L81l37K08r8j02K57Jl03O1P2j61J92K45k00J56l4n60L54K12j52p1M8r3
1436f4j87K22J09j76k8R7K82k91oN6m0J37j70J96ok97K27j61j58M05k34L16j74
$$ y = [39, -21, 83, -206, 78, 262, -164, -77, -38, 90, 159, -283, 6, -36, -83, 71, 162, 11, 147, 16, 187, -166, -31, 142, 90, -104, -20, -138, -26, -70, -32, -32, -18, 189, -204, 98, -204, 197, 156, 153, -141, -188, 89, -193, 111, -119, 0, -127, -291, -10, -24, -19, 106, -85, 27, 254, -47, 166, 165, 190, 147, -184, -37, -21, 223, -64, -29, 301, 222, 184, -287, -35, 32, -21, -22, -77, 337, 64, -62, 63, 113, -216, 35, -72, -37, 133, 191, -41, -65, 67, 277, -130, -95, -42, -136, 240, -250, -94, -97, 98, 54, -136, -105, 163, -8, 46, 7, 281, -75, -235, 91, -67, -26, -15, 234, -35, 138, -50, 95, 22, 44, -203, -204, -176, 22, 91, 116, -83, -87, 111, -169, 151, 142, -224, 101, -140, 23, 38, -14, 239, -55, -53, 10, 55, -140, 241, -96, 112, 14, -88, 169, 170, -133, -72, 0, -161, 31, 276, 76, 232, 198, -362, -8, 204, 52, -19, 29, -64, -251, -29, 80, -96, -124, -27, 255, -36, -42, 14, -26, 111, -59, 137, 131, -166, 61, -100, -258, 147, -87, 229, 55]
1459E5p2j4J35r4L0J96k19J95j79J05j17q1J73k07K71k50J73J60p9l28j03R8M8
1482a04j35K53m0l3Q8j51J9J21j33j1J25o8j96L25j48n6o1L08J32j57j42J9j78
1505b23K80n4K6J55j56K44j89J11j21K4k93J32J10K00k35J45k45j89K36o4k7J3
1527a20o4J96J04k65J84j34J74j86j3K71J28j64k2m52K91J00j57L29l48J89K1
1548F2j57J17j86K88k43Q5j11M37p24L34J30k17K04K27l15J19j6j2j60M0J35j08
1570g1k6J92j24R9j14j19M84o30K37J00j66K97k12K15l77j57Q04k91J30p64N61
1591F8j80J04j34j46M67j37K9l0qj20j61J67K12m07K00Q7l07J40K62j65N6J94
1613A91j80OR0k49j25K69k9qJ29j53L7R0J7k56L70k70J2lM3j02N1m6K79j81j90
$$ y = [55, -17, -31, 104, 10, 40, 236, 17, 212, 33, 138, 21, -60, 113, -94, 177, -73, 100, 260, 181, -147, -250, -152, -104, -239, 14, -26, -59, 29, -122, -103, 18, -115, -126, -1, -69, -265, 60, -88, -144, -205, 103, 235, 78, -64, -45, -223, 57, 3, 29, 184, 28, 272, 83, 194, 73, 97, -196, -64, 46, 246, 11, 156, -89, -278, -42, -106, -133, -120, -184, 12, 116, -149, 35, -99, 75, -111, -124, 147, 275, 111, 89, -363, -72, 28, -129, 200, -148, 41, 62, -95, 22, -164, 124, -119, -34, -145, 292, -432, -98, 32, -185, 19, 246, -69, 50, 34, 22, -138, -98, 37, -71, -97, 95, -29, 70, -44, -163, 321, -309, -72, 28, -138, 159, -53, 162, -215, -372, 432, 141, 271, -493, 68, -112, -8, -142, -288, 179, 42, 71, 41, 33, -87, -248, -81, 131, -276, -76, 11, -296, -156, 106, -59, -3, 191, 11, 17, 107, -142, -267, 2, -27, -35, 94, -59, -22, 68, 85, -171, 199, -71, -59, -62, -19, -121, -70, -116, 163, -18, -208]
1638b08J5J37J63k1J36k06q3k02L53r0J69k45K85pPl32J59j10K19k86K87P6J9
1661B35m51J34J98JK5k99J59K69l17P4p3r8p0J85M3M4q5J58j22p7J25p2J85k58
1685h7K10M3j79Q0k10J27R6l32L65j33j2j55K71J2j89oK15m35K99L09k88m1o4
1708a04L46l12k36K29L13P9k95J13o7k08K93k66k4k31K37J39Q3Q3j54q7j85M88
1730B34l76n5k4R7J42K57m13J15l05N56k04nM3J01j97J63K65k31k83Rl6q8L10
1753G5p1J4j46L16j85O7k34K9J93k95K89%j37J74k14K32k1m57L32j40o8K95o9
1776b1M9r6J87k76J22m9j31M81m54O7P0k61K63j59J66q4J19j32J72j58m4N7P2
1799d0J72L5l69k5J6J1J71J49j80J90j15j1R2O0m4K4k1J68l43J72J35m79K83J1
$$ y = [-208, -193, -56, 107, 86, 222, 16, -67, -269, 84, -6, 163, -82, 203, 196, 203, -129, 30, -80, 139, -147, 140, 216, 235, -216, -82, 116, 117, 142, -157, 2, 271, -46, 28, -45, -143, -213, -28, 15, 59, -26, 132, 10, -67, 58, -14, 171, -87, 123, 166, -13, 67, -143, -16, 80, -252, 113, -20, -32, -187, 84, 96, -93, -99, 116, -319, -20, 289, 1, -40, -104, 242, -70, -306, -77, 236, 315, 20, 133, 66, -142, 151, -115, -139, -370, -133, 6, 89, 172, 18, -69, -254, 234, -142, -197, -221, -124, 18, 275, -138, -23, -328, 228, 24, 19, 62, 163, -34, 129, 394, 163, -120, -111, -147, -235, 75, 4, 18, -128, 188, 3, 70, -164, -135, 58, -237, 52, 52, -85, 89, -125, 107, 86, -371, -39, -179, -247, 48, -21, 28, -68, 119, -157, -35, -84, -215, 266, -188, -121, -51, -312, -49, -208, -42, -126, -7, -139, 33, -125, -169, -112, -40, 132, 167, -202, -227, -211, -200, -29, 120, -60, 130, 15, 4, 96, 156, 112, 136, 115, 283, -60, 112, 247, -232, 51, 62]
1823F2l10K37j0k25K79n0N9k02l1K88j42o2R9K7j66J09n9L12k68j28O4K02l2j98
1847a45J27K4K24m26J31O4j97J17K72j28J7j54n2j23K87j39J94J44m46N13k48
1868E6j27L6J70L6J4Nl49j57K43M1o2m9K9K40j52j06q2l8K51J02j56O8J4j8J1
1893B0M6r1L08l14k30J09j12K15K05O8l54l07L71O8j09j38L90k9l6k42L2L29n7
1916A42k46K96l06K23j44K14m0r0p2L1k92L71j40N3M2J23j43j38K75l48J59L27
1938B97l21K68N6l45J37k07J05K4k71kL08J44k72P4J50j28m0j3J23M2o9j30L7
1961c3P3m85K47K84k27L14p3j95J11j54j19Q5K14k1l24O6L49k86K62n3j35J97
1983I7j15k97M13k38K9N9K08j12J43J15l60J06K8j06O6J2J23R8m08J10j60J81
$$ y = [62, -248, -11, -21, -246, 33, -17, 42, -160, -191, 97, -45, -107, -8, 19, -147, -38, -97, 215, -53, -181, -117, 85, 53, -145, -18, 6, 230, -196, -65, -1, -198, -81, 191, 63, 80, -74, -126, -249, 38, -101, 93, 237, -209, 304, 56, -71, -35, 135, 171, 185, 190, -159, -316, -73, -32, -94, -143, -114, 126, -26, -132, -214, -252, -1, 101, -55, 13, 27, 9, 20, 66, -25, 283, -31, -261, -152, -264, -49, 156, 224, -130, -437, -66, 2, -107, -245, 145, 116, 80, -162, -130, 199, 142, -104, 192, -114, 109, -35, 179, 139, 49, -23, 8, -284, 87, -53, 0, 42, 165, 22, -116, 159, -189, -30, 297, -24, 244, 300, -45, 92, -115, -10, 14, -257, -259, 49, 193, -79, -5, 145, 17, -23, -36, 87, 129, 60, -70, -33, 40, -445, -198, 86, -141, 173, 100, -95, 16, -138, -257, -172, 42, 21, -303, -237, 112, -174, 88, 35, -100, 97, -18, -315, 98, -140, -111, -52, 156, 44, 187, 302, -58, 48, 76, -30, 36, 48, 171, 269, -139, -29, -189, -8]
2005hL18N5m28j01R3R6K51k82J25j48j19P0j15K16k69R2j02L58P9j62J2j14j9
2028a02J59J3j70p2K02r0J52k75J27n5K30l40K78P8k20L4L3Q3J12k16K19l12J75
2051D3q1K20k97R7K0n1J65j27j80L74m11J03J00P1P8K89o32K8L27r6K2K14n53
2074b77K34J06O0mk69L72n25M60m08L52j99R8J53m56K86k7P4k0L55k29K20k66
2096I0j63r6L9K70j97L27j35k43P5j73L60k13M38j26j23k98J21J02k23J71p9k92
2118c68K7K68JP0M4j02K43K8k84J34j87m3q9K64R3o9J12k07K38j0r8j84J56J23
2142A60j85J81r7r1n0j18L88r8n1k6j10J65J12l88J7k6M82k41PQ2k56K21k00M66
2166C44O3k21K74o75m8L08J1j82K20j42K15k85j7L6l6L5n1K10J4K7%l98K16p6
$$ y = [-8, 310, 365, -63, -164, -71, 25, 276, -6, 119, -29, -148, -78, -193, 23, -246, -154, -256, 102, 181, 19, 31, -83, -102, 57, 70, -100, -172, 30, -60, 92, -183, -56, -111, 119, -221, 57, 135, -85, -51, -18, 65, 177, -39, 180, -132, 43, -38, 182, -115, -18, 2, -49, 116, -11, -191, 183, -228, -125, -25, 46, 124, 413, -219, -191, 136, 40, 62, 276, -277, -43, 63, 123, 119, -150, 222, -303, 157, -251, 101, -98, 0, 153, -303, -17, -44, 30, 10, 365, 136, 356, 90, -73, -169, -130, 140, -57, 270, 135, -108, -33, -206, 154, -59, 379, 253, 130, -168, -47, 55, -168, 3, -76, -368, -341, -73, -72, -2, 42, -60, 183, 211, -73, 61, -126, -169, -258, 6, 99, 30, 142, -65, 173, 163, 65, -119, 37, 160, -25, 156, 59, -32, -82, -200, 188, 90, 39, 13, -97, 68, 180, -208, -191, -217, 265, 24, 31, 113, -143, 78, -122, 344, 407, 186, 460, -215, -263, 45, 56, -126, 94, -48, 167, -118, -135, -99, -135, -100, -151, 59, 73, 100, 100, -298, -82, -158]
2190a58k7K18L6j3Pn0O5j7K1k9j31j20K80k99J21L84j66%n39N34On8j91L94j13
2215A55j31j22K3j36J47j20J60j36J80J11q6m24M58k25K6J16J52j62j94m8K34
2236b2o4K0K01j17l4J37j3J2j04j28L0J09j22M22l51k19J08k0K22J13k78L2k13
2259b79L03MK18k91p6J97l4N5k57O3j63J32M5J97O6r2j9j1j63j80N17l52j77K63
2283c4j07J36k74K74l9j03m1O9J11J19j40J16r7k12K29j0J50n34J70Q6n1J26K5
2306c1j3N5R1r8j9M6Q7M3l61J90p1O7O1k4K22l48l6K23k88L40Q8k10m8J57O5k84
2332i6j76K00j3J56r8ok42J31nM3P1J12j74J51kk0%k5Ml03Q4J15K02K1m3q9k54
2359b56L82r4qJ62j12k66J74lK06j65j24J84n9p7P4L8l3j33p2K44PM16n06q3O2
$$ y = [-158, -185, 33, 69, 56, 63, 13, 78, 61, 82, 53, -78, -198, 82, -217, -96, 288, 122, 122, -417, 117, 123, 65, -126, 268, 155, 24, -98, -75, -211, -64, -184, -24, -160, 20, 131, 45, -379, 79, -146, -120, -4, 148, -14, -208, -256, -22, -86, -66, 135, 18, -16, 121, 108, 120, 16, -112, -82, 27, -95, 327, -24, -243, -135, -155, 67, 180, -98, -66, -279, 24, 28, 246, -45, -121, 76, 42, 97, -160, -97, -260, -128, -83, 114, 180, 88, 69, 58, -105, -285, 232, -120, -297, -34, -141, -5, -279, -5, -44, -147, -188, -119, -8, 111, -29, 87, -10, -222, 7, -3, 147, -387, -217, -131, -182, -56, -31, -44, 11, 102, 4, -15, 31, 118, 161, -200, -10, -81, -14, 47, 23, 245, -103, -139, 84, -204, 136, 224, 14, -34, 123, 188, -96, -272, -72, -85, 71, -27, -33, -275, -144, -149, -106, -35, 77, -97, 54, 52, 32, 32, 7, 11, -292, -208, -93, 109, 130, 87, -2, -256, 126, 32, 24, 186, 74, -192, -18, -21, 185, 20, -104, 80, 21, -56, 18, 56, 23, -110, -182, 62, 69, 485, -21, -104, -42]
2384d2R2j71J34l36L00J57j40K72l17J70O5j22k8K8j94K13o7J02k24K10k88J98
2406A2J28n2j84J77k00K31J16k20m5J36k00J40N7j93rL97l09P2j63N5K44j80j39
2429a29J93J5l53M2m4M99R8j99l8k33j78L07j6j34J98j54K5L6Q4j17rJ74j19L41
2453B89k13m7j08R7k66M00k27M5J89k11OK10L3k14q0K1J96L2l10j09L24n1J48
2476A54j78K0K27n57M31l9j09m5K86j57J9j25J44P7k85K24qm76L10L62j69j81
2498g5J23J40J19l41j15J01nK45m55K38p0K97j41M8o0K1j24K04k58J20p8K07j05
2521C6o9M2J40k91j00K45j91K21L4k41J64k83J37K95j2J19j85j22P1j33L00k56
2543g9P4O0j40P8PN5n7J72o4j37j64J74J51k26M51j25m8k84n2q1L88k10kJ3J14
$$ y = [-42, 50, -121, 13, -323, -23, 134, -6, 266, -51, 119, 184, 62, 34, 62, -132, 81, 14, 116, -108, 102, -186, 12, 140, 88, -96, 81, -119, 112, 228, 8, -37, 99, -101, 39, 96, -97, -106, 291, -18, 54, -109, -54, 190, 10, -129, 64, 79, -274, -232, -276, 223, 321, 122, 84, -149, -327, -20, -36, -170, 28, -126, -101, -65, 19, -98, -107, 67, -52, 289, 76, 29, -79, 18, -248, 152, -75, -30, 159, -52, -46, 164, 197, -17, -97, -76, 120, 152, -158, -267, 57, 6, 154, -24, -4, 223, -334, 97, 58, -51, -96, 190, 33, 52, -73, 71, 148, -137, 87, 79, -397, -87, 275, 106, -75, 48, 188, 307, -34, -149, -48, -53, 192, -263, -25, -95, 202, 61, 109, 49, 70, -54, 150, -108, 12, -66, 141, 36, -33, 9, 149, -142, -242, 3, -188, 33, 67, -174, -10, -293, -156, 139, 127, 246, 61, -61, 10, -123, 177, -79, -5, 55, -85, -7, 0, 55, -2, 170, 106, -31, -195, -21, 130, -96, 355, 230, 182, -102, -154, -235, 153, -57, -59, -46, 68]
2568F8K10j61M4l26R0J01j47J29J55k7j80P9k12L22m76K66J82k17J21P5JJ12l21
2591a12J25j10J19n8J57j08Q1J2j54L3j42L19k59K71K7l83k1qK19J19K6k77r6
2614b20M34k84m6Q4R9j96J79L9Rr7q0J80N1l5j48J30r8k00J32J92j12j31J75J02
2638A59K0k24L9q3J43j07j22J11N2J02p4J91j2P7m63K78j79L94m4l26L13j73k30
2661a58L72m66L71j60q6p8K4O3j53L59j02m3O7K5j24P4J89j2O7k16M3l35R6J21
2685f2J85j62J99j42p7P5K09j41L4L5j19j70J07j13K91j23K07j89op4l08M45j57
2708e6O3K43k97j2K90l34M6N3K80n31M8J51L99k12j16j3K7k25K84K06j35j47r0
2731g8L03n11K71J12j79M9K01j98j94l2P0L80j86N8j71L9L39j49N0m54L19J49
$$ y = [68, 278, 117, 161, -165, -75, 26, -121, 8, 163, 136, -44, 35, -177, 145, -331, -65, 117, -100, 21, 96, 97, 209, -112, 13, -97, 22, -36, 121, 13, 94, 106, -48, -15, -157, 162, -97, 174, 201, -182, -203, -211, 8, 127, 153, -124, -220, 214, -70, -116, -32, 67, -129, 50, 89, 98, 1, -79, 101, 152, 117, -31, 99, 1, -199, -67, 125, 13, -118, 57, 159, 179, -45, -6, -89, 54, -53, -175, -64, -12, 90, 16, 207, 195, 272, -191, 87, -92, 302, 258, -68, 245, 72, -158, 214, -252, 119, -41, -127, -205, -181, -118, -271, 88, -14, -57, 10, 35, -89, -15, 174, 162, 229, 13, 56, -279, -183, -62, 123, -39, 160, 18, -59, 16, 225, 84, 118, 153, 34, -136, -29, -142, 149, 26, 233, 44, 38, -36, -344, 101, -56, 7, 250, -47, -59, 231, -103, -57, -4, 276, -255, -207, -56, 343, 131, 15, 2, 29, -196, 88, 294, 159, 12, -78, 225, -286, -15, 97, -82, -33, 168, -30, -224, -256, -186, 194, 8, 66, -105, -66, 273, 124, 174, -280, 39, 188]
2753A88j54K03j84O9k83J03p9N9M9l4k11J54K18l8N5l5j20P3O3k33L94l06j07
2776a56J58P0J45n02N31j28j23k75K91L0n7j20N4J06K66l79J17k19P3J59M5o3
2798B3J54k76J12j14J82J3k04L82l43j7j81L02K34q2k79j42M90j85n9J17k16k2
2820a11J14m1K40j0k04LL5M7J17m4j81R8k06j23J49J28j42J06j75L65j65L04m35
2843a31L20l2n33M90J76l48j04L12L58n28mL0N2l56K23j37j7K20l0N9k3r4j0N5
2867e2L34l57M5j55J42N6l2K69j77K4J11l85J39K7M4o9R3K19q2j26J7j4k28J19
2891c8q2L12k06P2j78n2l3O5J87j91M1J52j95K43j90L5K33j81O9JJ2k58K56N2
2915A26j31j25r1K56j57M4K0J10j51O7k55j11L55J25P2k98Q1N1O5M0K61m32R5
$$ y = [188, 34, 237, 53, 122, -161, -58, -137, -78, -29, -63, -274, -120, 98, 60, 115, 80, -40, 33, 96, -137, 257, -49, -156, 2, 72, 217, -285, 246, 118, -5, -280, 11, 41, -16, -136, -82, 24, 290, -89, 28, -191, -118, 41, 86, 23, 177, -99, 13, -101, 81, 94, -110, 272, -71, -88, -269, 33, 267, 185, -94, -236, 254, 69, 10, 127, -89, -111, 3, -38, 202, 192, -12, -9, 26, 73, 190, 146, -35, 63, -143, -266, -117, 11, -131, -25, -200, 165, 0, 304, -131, 189, 157, -376, 114, 290, -58, -162, 150, 508, -20, -24, 6, 58, -298, -75, -212, -229, -9, -39, 20, -3, -97, -107, -52, 282, -75, -30, -185, -43, 13, -19, 250, 73, 97, 208, -177, -38, -11, 33, -36, 57, 276, 194, 68, 85, 71, -157, -38, -120, 192, -14, 58, -120, -172, -205, -140, 47, -144, -103, 49, -146, 97, -93, -58, 175, -6, 63, 64, 76, -182, 74, 126, -5, -130, -221, 35, -122, -78, -58, 52, -99, -32, -287, -398, -43, 82, 154, -144, -63, -12, 53, 93, 354, -78, 17]
2938A7j73K9K13r3N6J6L8K9M6j55j40N4K53l30m5L24j63O1n76Q60k44m21M05j10
2962d9J18p5J15K32p12K63L7j9K52o9q3j65K55k38K61j21k92K89R1O7k5n7J37
2985B12k0m5j23k28L09l01K82k43N9K1K8j85L12j11j24K18J96l82K21k18j15M3
3007a94L96k77L0k4J83o5l89L20K66L0m47Q5p4K78k58K66L8j86J99J1M3p5j09
3030D7m2l30R1l1L94Kl57J89J2R7J38j79J47p7j11K33k15k32N0R6Q7J1J60l13
3054a33O3l3J97L2l43L77k55L4k06L77oo7j17m1L10j86k5j42J43q4J48J58j61
3077D0nJ31k15K07q9j18J30k14J91j96O3L38k50J97j37k21N8o4m0J40J13Mj89
3100a26L19l48QR4q4J60N8K3p1J70m37M71j01k28J88l53M70j96k8m9j11K23m9
$$ y = [17, -156, -127, 86, -7, 49, 65, 103, 132, 178, 23, -117, -63, 190, -140, -185, 139, -24, 37, -539, 321, 77, -344, 61, -49, 69, -6, 109, 341, -371, -108, -71, -90, 162, 93, 10, -155, 100, -138, 123, 2, -290, -1, 90, 157, 132, 75, 212, 192, 147, 24, -204, 105, -196, 86, -157, -98, -77, -49, -234, 78, -33, -157, 61, 257, -125, 96, -122, -237, -194, 202, -75, -45, -69, 114, 49, -340, -20, 246, 276, -171, -86, -160, 118, -140, 126, 164, -22, 177, 188, 231, 156, 47, 5, -325, -234, -265, 129, 131, -226, -37, -25, 72, 210, 31, 178, 101, -10, 223, 8, -224, -174, -78, 9, 20, 180, -133, -70, -103, 94, 126, -217, 160, -95, -61, -267, 110, 104, 37, -80, -121, 189, 3, -22, -164, -21, -105, 43, 201, 40, 35, 166, -49, 158, 69, -49, 81, -133, 58, -138, -75, 263, 13, 210, 73, -148, -90, -154, -194, -54, 59, 63, -126, 193, -155, -147, -53, -137, 23, 81, 104, 33, 203, -234, 237, 136, -92, 96, -257, 213, 17, -11, -60, -171, 52, 3]
3123Cp6n2J36J40j32j40J70k93L8L61Q5k50J52l35M22l42K3j15J12M80p47M73
3145A13K5o2j80L04j6j41j62J10K13m40K53J39K94m26m0m0lJ00J18j0j08j7J2
3168C6J75j74l77K54r9O6P0J71J39j18l27K6K5j2K20j3L8l4k61R2q3K47J78j21
3192A18j75j11J81j51M1NL85l17l3j6L0J32j44p7M2j21R1K75R7k87Q2PN1k26J94
3217G3j0l04%M03l4q1rj19J09j89K77j78J4L44m63K27J41n6P8m71K93k16k1K82
3241I0j99J73p0K06j67k45mJ88J13j73J38k15K57j37m1L71l30K6K0K42k94q4K59
3264A24n1k21J43LK14q4l29K22m5R3j88K12j08k3J9J0m6J44m06L00q2K50k17Q9
3288B3j07N9n7L33k24j14Q6L2l68K89L35l92N6k51K32M7j97K93M7l79K15l4MQ
$$ y = [3, -73, -125, 11, 151, 19, -121, 49, -244, -206, 155, 240, -10, 142, -193, 229, -113, -90, -205, -93, 387, -360, 113, 138, 76, -104, 200, 184, 43, -119, -9, 204, -236, 17, 156, 450, 24, -16, -56, -59, 41, 159, 149, 41, 24, 36, 211, 37, -340, -86, -185, -119, -49, 122, 261, 143, -184, -158, -133, -145, 75, 62, 100, 66, -195, -103, -186, 61, 239, 118, -57, -168, 13, -138, -97, -92, 293, -24, -57, -73, -43, 89, -55, -132, -90, -211, -120, 155, 252, -35, 47, 54, 105, -121, 73, 63, -241, -241, 162, 128, 47, 38, -81, 28, -161, 116, -62, -48, 296, -167, 60, 201, 145, 223, -248, 45, -171, -192, 90, -109, 64, -6, 200, 33, -212, -216, -28, 85, -88, 50, -165, 92, -45, -86, 285, -45, -19, 1, 243, -51, -135, 124, 73, -148, -5, -2, 212, 128, -201, 21, -24, 69, -119, 93, -15, -38, -19, -9, -55, 89, -317, -17, -99, 151, -66, 23, -84, -25, -82, 251, 27, -87, -1, 31, -337, -48, 287, -105, -49, -300, -68, -21, -218, 75, 122, -257, -42, -76, -72, -64]
3312f4j24K57p4L3n15N26j83r4K14O9k23K62QN7j74K56k13j11KL62j30pk7j45
3336c8P2k92L92N4k23O3k12M37m48R1K19j05L06l61j38Q7K30j02o7L1l7n3j32
3359b26K15k20j23N59j32j27n4j16j04J46R7J00n4O5j59J13N5k86L55K0k10j9
3381a05p1R5J37K8j2k5r6J83m9l56K5L70k71n3K37k01J62K05ql43L51j50j25L0
3405d2K63j82p8K09m20J43J75K3q0k0Q8j23K73q7j80Nk62L47J76j50p1rK4K8l4
3430A6J45n4k61k4R6P7k4P4J11k75R3K11l34K95p9J52j27j73j21L37j55K3j01
3453i8K21N2Q2k99J76mK7j40K13j35K3l03P7Q3m0J81J2j64K71j61J01n08L38M3
3477D8Ql12J67L09l02lJ39j16k56N40k90L2J67r0J41j20j5O1j28J88q8J80l01
$$ y = [-64, -188, 69, -5, 28, -487, 39, -144, -238, -24, 45, -178, 84, 92, 149, -25, 231, 18, -93, -91, 271, 141, 134, 107, -38, 34, -258, 134, 188, -35, 28, -184, 253, -195, -104, 115, 10, 316, -45, -183, -96, 134, 32, -35, -4, -41, -94, -226, -11, -231, -354, 205, 73, -54, -108, -224, -328, -182, -85, 15, -39, 26, -133, -20, 35, -251, 104, 124, -86, -105, -176, -81, 56, 84, 72, 47, -49, 134, 85, -271, -246, 124, -147, -200, 37, -164, -2, 203, 195, -148, 203, 53, -72, -42, 221, 39, -39, 170, -250, -107, 68, 91, 11, -9, 79, -44, 229, 142, -38, -33, -295, 52, 228, 78, 7, -2, 22, 50, 16, 161, 107, -154, -178, -82, -5, -29, 45, 156, -119, -26, 185, -149, 146, 67, 219, 92, -81, -202, 135, -20, 3, -98, 123, 175, 257, -42, 134, 130, 157, 17, 230, 95, 118, -185, -108, -25, -65, 116, 128, -36, 235, 74, 175, -333, 5, 48, 56, -256, -89, 220, -82, -85, 54, -62, -318, 222, -68, -36, 131, 41, 182, 62, 47, 108, -20, 168, 80, 260, -41]
3500d1O6l2O2J56m19K86k8j5J06j39N2O5k69M01k72K9J39Kk46R8L5j60J40R3k69
3525a60J91j29J04M45m87qR6j17j7J06q8O8j91L13l97M41j24l6j43J43Q9J75q
3548B66m72K82k62K77n8N8j87J90rJ79q0k73Q3j85K43j65j67K62N1j96n5J67J97
3571A46m80L66k3j49M01Ok05O3k37L4l3J97n2r7K25k43J90k44K95l25m7J09k5
3594a28K22jj46N9l6J85l08l9J43L53m09K65l03K18J37K4j94p7J81J41k34n05
3616d52N33j71P7m2j14j27K74O1k5K15j84J86q0k17J88j57j4l1L10j43M1j38N
3639eK74l33N0k16J43J78j98k59L64j80K66kp0j81J81j26J0o9J13L70m44J28p
3662a3p2j30J24rM38n26M65l29J91k03J33q0J72K62n02o9p0K06j32J34j59K80
$$ y = [-41, 25, -7, 55, 211, -208, 78, 50, 35, 141, 2, 54, 119, -150, 251, -21, 8, 147, 149, -97, 1, 36, -124, 16, 109, -160, 31, -98, 6, 451, -36, -44, 52, -65, -82, 24, -64, 4, -187, 126, -271, 170, 46, 10, -133, 10, 99, 274, 266, -206, 76, -186, 91, 33, 91, -96, 94, 85, 264, 184, -89, -6, -191, 52, -113, -280, -18, 33, -163, -218, -51, 146, -334, 32, 9, -140, 261, 267, 62, 125, -112, -78, -111, 86, 34, -63, 162, -81, 109, -135, 160, -165, -212, -103, -128, 94, 93, -53, 6, -30, 155, -153, -192, -49, 304, -105, 160, -143, 75, 212, 236, 42, -35, 146, 287, 53, -452, 81, -90, -13, -55, -169, -296, -22, 39, 14, 229, 45, 231, 151, -66, 122, -35, -49, -80, 230, 87, 128, -10, -5, 269, -64, -14, -230, -87, 91, -107, -366, -2, -182, 84, 82, 12, -169, 12, -114, -104, -173, -60, 310, -134, -6, -13, -85, -215, -91, -100, 338, -188, 277, -52, 139, -64, 69, -11, 161, 423, -79, -148, -218, -12, -144, -10, -169, 111]
3684A11o5k45K88r2m8J25j34l8K90j50P4J06n4k7j9k0k95J70M0k38L53k05QJ25
3708F0o4Q4j21k8m5J08P1L1n7j84OJ75J37k86K37J6j11r2M73n16O3J05p9J0k19
3733b26M90k96J94J08l38L09k40J7K27l61L41j59p4p8mJ78k54N5J7K87m05q5L53
3756E6l46J50K37j12k91Q7J21P5J79j29n6Q7k01J86O6l24j3J24Q4p3J59L04m84
3779a14J56K13l05P8l96L05K8k4q0J37p1j18L88k39j68L17k26n2P2K30j78R8j42
3802i1OJ83k77L38N9j88K94k80n3n9k9K9J70K04k34J95l91R9JL68k33O8j36J64
3826B07k00L5R0k66K8n4J45k5o8m4K48l3r6o5K29j34k24K20qL8J06k19LJ24j12
3851g5J66j71Q3J9m3P5k3j05K29j2m40K86j97R1K43j90o1Q0r4K95Pj45M7nj96
$$ y = [111, 46, -199, 89, -3, -51, 74, -60, -98, 192, 42, 116, 222, 168, 141, 122, 102, -193, -23, 17, -221, 132, -73, -65, 60, -4, 80, -41, -69, -114, -6, 65, 96, 39, -145, -139, 36, 173, -113, 124, 140, 29, -63, 410, -106, -43, 62, -17, -7, -226, 264, -32, 162, 270, -68, 241, 1, 18, 245, -116, 225, 66, -8, -86, -90, 88, -166, -111, -94, 193, -212, -297, 56, -290, -140, 97, -15, -306, -219, -98, -23, 156, 27, -29, 58, -143, 43, 109, -215, -228, -104, -20, -93, 66, 370, -114, 42, 255, -50, 28, -368, -63, -35, -59, -139, -2, -73, -191, 197, -42, -210, 107, -119, -171, -99, 131, -47, 51, -91, -85, 98, -179, 159, 218, 30, 324, 44, -9, -68, -97, -68, 102, 306, 72, 267, -124, -25, -24, 344, 111, 179, 43, 207, 7, 42, 132, -134, -106, -160, -15, -40, -108, -152, 96, 63, -33, -98, 131, -3, -227, -7, -15, 23, 129, -90, -87, 37, -75, 91, -80, 3, 22, -21, 54, 31, -74, 155, 143, -297, -11, -208, -117, 126, -64, -125, -45, -139, 156, 163, 18, 65, 60, -136]
3876a36J12J94j18o0N2rjj68J35j42m3L04l0p4K25l71L75r1o6q2M1N0j96J2k4
3901a11p8J78j91J73J19k97M1J08Q9J06K3j3j93k62L74j46qO7lk11L30Q4j54j05
3925h0N6j53K99k4J53j90jQ8k02n3K98j53N9k0k56K34J09k56j80J46R8O4j03N
3949f2M6K71k81k6j39M18q0k37K09J1R3j24j56R4J45k88M3q1O7L43p4j22J9j46
3973e7K49l58m2K50R7j90J68n8j45J01j25M7K6r3j9N4J64P8j17L4j12M2J46J28
3997B68l44O9n4J59k55J71m5n7rk3J31lK6O3k26K20O8J41j25k19j90K62J4m8k9
4022c5M0L05n29K08J4L00j36k22M7J80kl46J36n7q9K5p3Q3K68k63K73Rr1j46M52
4047C51l69K27l20J57m08K81L5R2r6l27N77j17j57p9L35j29j23K02k39n0J34J28
$$ y = [-136, -24, 170, 52, -8, 44, 35, 34, -134, 1, -141, -184, 120, 90, 16, 241, -130, 245, 154, 88, 6, 47, 97, -99, -87, -111, -189, -11, -202, -29, 90, -207, -166, -58, 31, 137, 160, 147, -46, -308, 66, -80, -88, -21, -24, -235, 95, 179, 25, -80, -24, -177, 122, 98, 251, 61, 60, 148, -54, -107, 191, 38, 97, 77, -179, 55, 164, -92, -272, -126, -28, 36, -67, -62, -16, 255, -26, -52, -191, 227, 147, -90, 119, 130, 223, 99, -57, 37, 182, -106, -63, -144, -77, 266, 192, 70, 89, -57, 192, -166, -208, 42, 139, -51, 117, 59, -86, 15, -110, -63, -37, -130, -149, -95, 69, 147, 30, 64, -48, -6, 140, 268, -76, -7, -61, 98, -157, 14, -31, -88, -97, -120, 11, 8, 34, 97, -129, 91, 159, 300, 175, -44, -234, 28, 42, -6, -35, 5, 310, -219, -11, 3, 303, 167, -55, -8, 172, 170, -176, -40, -97, -186, -161, -234, -151, 117, -146, 127, 136, 45, -101, 351, -18, 209, -111, 46, -362, -81, -46, 46, -50, -377, 200, 83, -74, -153, 182, 53, -70, 132, -107, -157, -23, 105]
4069A05k23qlL16k44p3L22l84J36K37o1k91J18L13j9rl95J54J14j06q0j28J39
4092g0n6OL21j80R9j2j48j90L56k62K91j68o8P5k55K29k5j17kJ81o7J50J16k22
4116a8k7O0Q4K43n59J43R7l0p2P0J02j6k79K21m2o3k3K01j60m4O6m3k2J15l6p8
4142a10k4J9J51j47K60j25j9M7j08J50K1n9k5p0j57L14n0j59L69k15N2k09k0J64
4166E0k26J89J5j96M56n08K25j78j39L26j66N5K7J11P6k46R3q0J34J64k35K89
4188B36j77m9m3J62k87l1K52k69k29K67M47j38p9l1J64j72j37K26k28n3J49j02
4210a22l09L71M32k29l77M7K38k29J90j17M5Qj07N5N2J44k44J21n7Q4J04P4p5
4233I9R0p5l32R0K37q4J33M0j73N7j37J35KJ49l81J6K00K5k4L54n37L8n7J65j09
$$ y = [105, -118, -126, -129, 187, -57, -130, 192, -192, -56, 181, 120, -171, -53, 260, 241, 232, -163, -9, 105, -1, -81, -209, -70, -126, -120, 201, 21, 120, 108, -40, -230, 126, -136, 155, -13, -81, -6, -261, -32, -57, -174, -176, 5, -62, 88, 204, -18, -45, 15, 99, 342, -217, -74, 23, -7, -79, -9, 93, 77, -202, 19, -23, -86, -109, 92, -68, -112, -46, -89, -111, 4, -32, -110, -134, -115, 36, -111, 149, 24, 5, 52, -56, 94, 115, 56, 31, -39, -196, 118, 68, -91, 278, 63, 115, -94, -114, 50, -176, 13, 28, -168, 288, -220, 5, -173, -312, 14, -152, -97, -70, 41, 117, -129, -36, -116, 18, 182, -53, 236, 59, 10, -33, 129, -158, -189, 63, -206, -435, -168, 279, 141, 62, 31, 195, 23, -114, 112, -116, -169, -20, -122, -431, -60, 372, 143, -234, -187, 51, -178, 12, -105, -60, -52, -159, -104, -52, 92, -152, -31, -88, -4, 100, 174, 99, 189, 114, -218, -128, 109, 25, 158, 198, 25, 82, -55, 80, 82, 231, -150, -134, 66, 91, 67, 421, -116, -78, -135, 30, -79]
4258g9J49j89K14k8k42J55J44j64J46j39k5m2p6J89mK77l44%o1L65j41j74jK26
4282A56k41m3J10jR9k2k81J8K11j74J16LJ90j08J77n2o9k24R1J41J8l22o6J04
4306a69J24p0N4j08L36q7J71o1j27m2q7L01r5Q1l43J16r6J84m15L59j54J12J76
4329A60k19O3k85J10QJ98j96J79j8J4r2N0L22k9j86P9m59J21nK70j10K09j89R7
4353I2p0k38J86Rm58P10j21j75J78J45k70m2J38j54l8J90J04l08N0Q8J23l55L04
4376H8m0j83L02k94K8j5J5R6n0R2l7j53J24j78J29P7j68J94j56K00j93J77Pl7
4400B5j06j95J99L27n55M65j48n7J59j46M7l04K44K67l34L22l11LM76m54k8L00
4422A96k66J77n25L17M84o79Q27o54q3P7MJ05k2J03n3k02J85o2M76l83N8k15L09
$$ y = [-79, 70, -119, 95, 67, -175, -20, 124, -40, 106, -33, -58, -100, -176, 13, 9, 286, -58, -58, -119, 246, 105, -69, -70, 156, -85, -128, -18, -19, 80, 58, -223, -205, 6, -168, -52, -49, 141, 33, 210, 158, 89, -135, -44, 97, 115, -207, -273, -169, -45, -115, -61, -169, 167, 80, 251, 190, 63, 21, -66, 235, 140, 221, -122, -6, -102, 82, -333, 26, -128, -16, 160, -59, 4, -281, -171, -163, 35, -161, 18, 0, 14, -78, -28, 294, 265, 79, 158, -301, -180, -185, 85, -25, 184, -5, 92, 22, -216, -30, -21, -479, 231, 110, -65, 113, 258, -12, -54, 84, -70, -108, 82, 186, -122, -72, 16, 139, -216, 88, 48, -135, 167, -127, -99, -114, -99, -3, -53, 39, 2, -151, -27, -205, -76, 1, -167, 27, -129, 71, -122, 55, 62, 25, -81, -276, -77, 250, -305, 160, 12, -45, 114, -32, 15, -289, -45, 222, -112, 210, -101, -98, 378, -76, -104, 196, -70, 107, -418, -101, 383, -296, 531, -123, -206, -129, -125, -20, -42, 61, 8, -194, -9, -71, 405, 22, 80, -135, 174]
4445A74k79K25k01K5j96M17N2k80K44m26N66j88j93J00K4k14J06K2k42M96p0l17
4467a55J88J40n4j67M26k54l8l14L20l25K78k53J58L53o9k76K12j47K68j60o4
4488F7J65m2k13Q8j39j1L22m10L88r5p0r6j60K21j82J9J05J22K65o80N69j93J84
4511B24l34n8K3M8J27J40k13n1o1J42J45j3k9r2j09Jo8N13k09l22J69P6m8j36
4535a35M38k57r0J46m2Q0P7l37K1j6O3J06l17K66O7k31J04K25j82j3J91k80J83
4558F7j61Q3r1j31M37l41K34J59j76J64j49Q1qk9k2q3p1K14j01j77J02l7p8P1
4582d3J33k98K56k59L39j09j00Q8n8j6q4J63k5o2K26j18j32J39j18J30l7n3J26
4605H8q8q3Q4L6J51n0j12j21J66j07k8J17N7J8l81J12K35O7j74J74k41J65j77
$$ y = [174, -105, 120, -81, -56, -252, 165, 217, -63, 181, -245, 321, 133, -60, 40, 64, -150, -44, -22, -264, 232, 162, -155, 33, 173, 119, -48, 378, 124, 86, -228, 92, -233, 45, -208, -50, 303, 234, -42, 170, 23, 291, 131, 67, 232, 190, -23, 65, -74, -85, 237, -173, 215, 120, 50, -46, -206, 15, -167, -148, -43, 79, 344, -336, 233, 40, 224, -110, -168, -145, -97, 30, 170, -43, -94, -155, -13, 132, 119, 90, -2, -111, -110, -178, 335, 126, -196, -27, 49, 1, -135, 303, 46, -44, 102, 60, 140, 217, -120, -99, -115, -52, 54, -263, 3, 70, -161, -57, 168, -14, -27, 164, -116, 67, -94, -11, -102, -233, 204, -137, 97, 256, 80, 244, 95, 176, 168, 139, 117, 34, -37, 177, 76, -101, 1, -36, -114, -43, 90, -208, 48, -211, 128, 19, -81, 7, -51, -67, -151, 12, -13, -75, 151, 33, -99, 40, -78, 52, 15, -38, 88, 0, -83, 1, 37, 188, 138, 26, -95, 71, -36, -64, 53, 110, 128, -253, -141, 94, 161, -13, 161, -80, 85, -92]
4628i2Mp3k58N17k19Q8r1J44J50l78K49N8j10P7j24j2J4J26k82K47K05l13Nj14
4652a82L60j77J39l87J50K45j13MO4k2j75J79q0J10j47L9k1Q7J82j45j26K14k18
4675b0j42J8J68K21o8m15P4L78j71J9L52m10J3k63K45K7J23k25M65n42K9rQ9J35
4699I1j87p8K57k71K19o6k18M04O3k1l18J60j35j02K53J53l60K61m13M4N6K56
4721D8N5m99M43J45k67j28K74O3K4l40K07K28o58M45p3k2Q8K7K1K46l00J41j45
4744B3m9q1k6k98M17J5kk6j86J4R8p9N7J28R6j45j74L26k15J83m3K54m93J39Q1
4769A4Jq4J17n4J24j62j22N34m44RQ3j8K11k80M3j05L78J40k27k90PL33l02J50
4793E6n2J51k40q3k38N71l87M27l35j00J25J57l40K09L57k94L2J72k88O0m2j31
$$ y = [-92, -88, -161, -419, 98, -121, -33, -124, 20, 170, -208, 41, 99, -11, 66, -58, -70, -56, 70, -212, 35, 240, -73, -68, -182, 178, 1, 140, -247, -97, 148, 35, 39, 103, 81, -94, 85, 5, 115, -32, 7, -14, 73, 255, 110, -16, 198, -20, -162, -144, 24, 245, 177, -238, -164, 214, 43, 62, 414, 4, 17, -246, -1, 26, 149, -76, 389, -153, -124, -133, -44, 91, -96, -174, 83, -188, 31, -35, -253, 151, 214, 193, -125, 35, -100, -202, 51, 204, -156, 105, -308, -264, -208, 48, 103, -396, 47, 192, -75, -203, 71, 134, 158, -182, 25, 253, -405, 40, -33, -55, 33, 60, 81, 327, 27, 168, 23, -26, -107, -133, -431, -14, 1, -1, -27, -213, -199, -101, -180, -123, 5, 101, -44, -218, 108, -107, 76, 33, 287, -206, -67, 14, 15, -69, 48, -6, 118, -44, -166, 368, -76, -67, 16, -2, 209, -71, -28, -133, 245, 385, 158, -132, -125, 208, -94, 56, 4, 155, -85, -168, -406, 165, -222, 205, -130, -230, -105, 52, -288, -79, 278, -16, 16, 188, -100, -40, -82, -213]
4815b13J36q3L43J6l20M3J92J6k09m2j39K95o9Ro6K24k66P8O3j71R7P0ML3j30
4840h9J44j70J46k86J33J53J13J3m07K13p7M00n45K78OJ6m4J00r1p2K7J79k61
4863a21K04j54J67k87K67j07K7k84K99K60m25K55r1pj27oK03J12k28j22l7J18
4885h4Q8J98l28J88M3l59K00J56k02K01m3J50k91J02p2k03K04j01M74k22J1j34
4907b4Q1j44p7J23O6j48J98j38n2K10J03k76R1J3k9K8M0j0j11N1K10R3k96J63
4931A65K7j48L4j91K53Q3m51K10R2J97m49L23J22j44q3M5k22o8K27K0J21O5m21
4954a93K91n0j47j08J42J16j22n8R8K49j07j17L1J59l15M7j83M5L24k93M70k57
4976B2j64J91J04k77q0Q7RP8k42L51k14K10m1j2l2P6m0j64K64j20j15RJ9J3K58
$$ y = [-213, -77, -160, 183, 199, -121, -78, 114, 130, -79, -121, -260, 35, -34, -25, -91, 133, -133, -55, 8, -163, -66, 4, 8, 41, -89, 55, -115, 31, -255, -122, 31, 144, 157, -250, -37, -114, 286, -259, 19, 25, 41, -3, 97, 6, -66, -39, 140, -121, 83, -71, 96, -191, 76, -31, -4, -288, 11, 271, -154, 101, 10, 3, -124, -130, 73, 185, -43, -165, -202, -84, 4, 202, -126, 62, 105, -254, -54, 102, -100, 101, 58, 208, -83, 19, -53, -256, -52, -153, 321, 99, 110, -24, 57, -87, -164, -41, 25, -123, 75, -63, -115, 95, 198, -78, 13, 26, -3, 25, 65, 55, -56, -5, 205, 298, 2, 165, 192, 44, 78, -113, 140, 223, -228, -18, 74, 271, -178, 145, 267, 123, 40, 85, -137, -205, 22, 42, 163, 228, -193, 98, 48, -99, -207, -65, 51, -71, -129, -31, 218, 111, -6, 25, 184, -131, -84, -267, -222, 102, -191, 279, 22, -142, 49, 153, -124, -204, -117, -108, -30, -272, 79, -135, 75, 34, 22, -10, 66, 26, -138, 126, 6, -109, -100, -81, -68, 190]
5001A90j48j46K15J12Pn48K59K41j48j12K42j16K9K1o8j44Q7n5K15j25j68K25
5023F5Lj1K39q8k06j88M3J24n0L30k97j02k3K44k30L23j37J0j07J92p8Q1j99p4
5047a36J9J07J7J31r6N4J1j28l1l04M88J01k51j2J88r4q4J89j1k33K21k1m03P3
5071b05K01J9j26K04L8j78L07j62j9k0J67k58O0Mj78K52k27J07L9p1p7J42k37
5094b18mj0L64m07N04Lm83M96l64K03k72K14j27M6K42Nj47r0L25k21j80J37R9
5117A15j6K0J50j11j76k7J37J20j75P5j91K35l31K26j04J74j19J68k76J84j12
5138c4P4j67J48%L71m84J1J93n6J67j0r3j40J17j63K50l35o2L25j00Oj15J71M8
5162A22l49J11J72m5P4J05N8j85m03M47k00J39q2j5q4K15K9rJ4k0m9pP6m7o4j58
$$ y = [190, 42, -104, 111, 223, 230, -318, -59, 182, 34, -78, 164, 48, 77, 98, 30, -114, -27, -82, 133, 8, -160, 65, 68, 57, 296, 208, 2, -186, -143, -19, -69, 261, -36, -138, -161, 83, -147, 176, 39, 49, -58, 134, 56, 137, -62, -136, -117, -10, 7, 138, 42, 96, 107, -21, -52, -356, 132, 233, -18, -30, 158, 64, -20, 169, 158, -75, 146, 125, -278, -205, -4, 15, -111, 93, 131, -47, 260, 98, 79, 59, 226, -32, 28, 32, -146, 106, -121, -14, 25, -46, -123, 19, -218, -222, -232, 132, -275, 229, 232, -251, 245, -119, 84, -188, 26, -101, -55, 187, 192, 45, -45, 280, 59, -121, 16, 115, 99, 119, 269, 158, -18, -45, 92, 212, 37, 112, -79, 156, -175, 51, -53, 121, 2, 170, -106, 78, -34, 40, -127, 21, 21, 392, -92, -81, 112, 56, 223, 213, 120, -20, 97, -66, 184, -151, -213, 112, 12, 18, -97, 74, 122, -227, -116, 56, 11, 85, 190, 248, 63, -340, 107, -93, 46, -36, -51, -135, 80, 109, 100, 114, 94, 45, 38, 114, 67, 3, -155]
5188a55K79k66J93o2K8o0r1J99q3J42O7O3j99k39R3J76k16J18o3J05j95J9L42
5211A95k17J02j16l82M95p8o6M83n12L59k89N0k35L91l42J81j30M2K20N6j17j63
5233g3j27L89j53J4K15l12J74r2k96K57R6l2J09o8J31n80O01q6j18P9j66j51J58
5256c1K23l00r3k5J47m0M2J07R9k47L42p9K1m3J63m09k7J22P7m0j88K80q4j15
5280i8J52k05O5R4j23p6K82l38L12k84Q6J55J54J40k19j98K70l51R3J80j11j62
5302a82M86J7k33j44R6j61K69r4q2m3K29Ok65l0P2J61j68J79J59l02j90K01O5
5325D6k5L3J71k98k16M97j89j38K67J8k60m5M02j57N5j51K7R3n4n0R4o6k68J50
5349f4K1J02K10k20j34K37Jj14j05J36K0r2J5K37l82J82K31j95m5j74K76N8k85
$$ y = [-155, 124, -142, 51, -11, 17, -43, -134, 65, -18, 124, 191, 254, 55, -184, -91, 85, -131, -13, -76, 29, -166, -147, 195, -22, 80, -36, -418, 77, -1, -67, 416, -96, 263, -26, 24, -211, 180, -162, 19, -111, -69, 151, 207, 90, -73, -200, 189, 36, 50, 265, -47, 127, 35, -261, -4, 92, 60, 169, 101, 232, -348, 253, 167, 49, 128, -38, -189, -31, 192, -108, -201, -226, -79, -119, -77, 30, 129, -118, 224, 145, 166, 123, 286, -123, -150, -28, 49, 9, -179, 101, 17, -98, 54, -151, -86, 8, -115, -191, 91, -247, 65, -219, -133, 22, 176, 316, 97, -101, 169, -182, -89, 91, -20, -182, 304, 321, 88, -56, 40, -121, 148, 54, -28, -71, 158, 164, -101, -131, -59, 102, -66, 113, 272, -30, -220, -19, 46, 21, 54, 225, -73, -289, 208, 19, -119, 148, 166, -94, -139, 263, 106, 161, 10, 37, 130, 76, 26, 120, 54, -214, -64, -43, 59, 269, 49, -85, 152, 153, 39, -66, 70, 90, -2, 13, 250, -132, 50, 281, 86, 41, -133, 143, 201, -84]
5372h4K13n6n2pj73L57k12m2k45L95j80j37K81K11l38K3JN7J28Oj71P7k6q7K97
5397B36j43j71Q8K3N6jp5K7O0j66j00J84K08l12l56N66Kj17k73k08N03m07M21
5420D5k08M10l71K2j9j28L62j80j96R9K95l47J24J46j43Q2J97k27L3J1J53k21
5442f1J58k54J08K37l8l25J48k21N1K18J85m22K99l2Q3j56L56l47j11K4J57j43
5464h6M1M79n58k09K66p4J11J15j75M26l92j21J44p7J89J5l81M55l94K54j91q4
5486b47K54k2j54J65m4J18j49K41K1j16O5K6j42J26o0k07p2J3K73j37l2K39k22
5509f3N2M3LJ22j06j97K69q1K4o3J34N4j02j13J64k80R6lJK2p8K21l4m35L76J89
5535B15k0j79J77p1j36L9p1K43l74r3M99J12n35m4L50k69K82j10m23K45L52k55
$$ y = [-84, 129, 73, 21, 14, -159, 198, -14, -56, -301, 94, -86, -223, 58, 269, -69, -46, -45, 12, 140, 146, -25, 52, 26, -61, 236, 93, -78, 10, 33, 89, 88, 13, 40, 100, -66, -166, 18, 226, -86, -442, 124, 126, 9, -264, -472, 31, -376, 45, -163, 247, -124, -102, -121, -249, 113, -67, -263, -164, 131, -216, -92, 54, -89, -7, 190, -37, -4, 7, 160, -61, 97, -157, -49, 188, 150, -175, -27, -248, -197, 21, 206, -216, 83, 51, 134, -22, 334, -13, -124, -100, 57, -86, -45, 434, -124, -333, -67, -141, -30, 85, -90, 336, -56, -177, -33, -110, 79, 94, -287, 168, -226, 28, -163, -247, 7, -15, -169, -4, -48, 70, -79, 162, 183, 67, 132, 158, 16, 142, 82, -125, -197, -184, 89, -48, -80, 159, -63, -11, 32, 35, 157, 51, -146, 123, 42, 66, 3, 137, 191, 89, -24, 140, -140, -44, -47, -46, -24, -102, 119, 85, -350, 26, 215, 195, 16, 193, 122, -14, 25, -46, 197, -177, -270, 229, 341, -194, -238, 112, -157, 125, 15, -408, -163, 189, -66]
5557f6J78j05k4M6k30N48l40j04k5O0Mj83L37k28qJ16l4L9M2J19P0l95K44n8n0
5582d7J59J54j14N7l33K04J18j08j50J61m4j22M4j59M87m82K07J80j46l08K81
5603C9J12j27J72k24R7K7k57K70k63L2J35J2R1j04M9j97M94l14n2k54L63K0R9
5626B20k16j77K39o3J48k49J76J30j92j79L00k04K96l55J75q1P8l8m2O6j6M1r9
5649d2O2k60M44p2m48K29K28l01J39J17l79K92n6p3K8k2L74k68j4j6k4n1K14k38
5673a37KL56j83l51L05n3J95n3P5R5k40k87J64Q1R1j76J6n7m2K74Q6l80L16k57
5697a60K67K14k85Nr9lJ07m5J39M4o8j00M9K3m1M9N0j83J3J81l36K67j64J27o8
5722a7L7R0pj73K1N2K1J30k38L17j66n9m8J01o3p7K55k55J46k87J11K76l50J66
$$ y = [-66, 112, 7, -17, 29, -201, 347, 7, -97, -122, -62, -58, -241, 96, -132, -140, -24, -58, -19, 23, 142, 212, -183, 61, 3, -47, 112, 266, 152, 209, -124, 80, 198, 90, -60, 101, 57, -65, -21, -180, 307, -175, 32, 212, 66, -242, 39, 151, 24, 196, -28, 69, 96, -161, 109, -154, -122, 13, 25, 116, 12, 61, -136, 358, 44, -8, -262, 101, 121, 220, 4, -173, 66, 3, 151, -98, 78, 208, 16, -163, 137, -67, 229, -126, 49, -32, 46, 8, -34, 32, 16, 57, -42, 20, -240, 204, 132, -316, -87, 141, -160, -21, 96, -283, 9, -47, -120, -92, -114, 260, -8, -22, -38, -62, -113, 101, -137, -135, 221, 38, -313, -8, -61, 134, 81, 156, 251, 11, -276, -112, -31, 60, -116, -100, -157, -199, 75, 161, -219, 97, -160, 107, 321, 36, 41, -58, -61, 46, 1, 140, 184, 116, 16, 65, 88, 47, 96, 146, -37, -24, 157, -179, 88, -76, 51, -17, 20, 110, 103, -70, -49, 3, 24, 154, -84, 233, 67, 8, -40, 61, -2, -79, 176, -79, 67, -220, -109, 167, -183, -17]
5746a7M1jj83K91j90J85r6n9Q2mR4k57m9J06l4K4Qj14K12Q8or8M8j15l3J20K28
5773B71n67K81J42k41J44l2J79j69J63j67Mq5J12j24K56O5k27l8J40o8j15J84
5795A08J85k29j93K78k62J91J4k92J04o8J36o6J99Q9pq8j34p1R0L6J96n6j88p8
5819a06J17J25l49N1M86l18q7r8M3L8K15j47K01k08Lm2r5N9R7K47l09J14j07j07
5843a77K08K3k81K61Q4J65j1l40R2K1p8l9k9J46j23J86j32M5j51N7J56j96R0k23
5867b46R7pK5J90k70J40r0K54l90L29j88J64j89K80k47K1J91m8J06J1j84R9j91
5890a43K57k9j96K83j03O0j20O7j61J39r4J25k51K56Nj03r5J54Q2j74M32j65j14
5913A12k90R0Pk12Q0K03J17q7k65J63J76K1j52K97R1p13K63J33j89K60m39K65
$$ y = [-17, 24, 23, -160, 131, -59, 126, 30, -29, 53, 49, 143, -114, -163, -57, -91, -67, -59, -173, 39, 127, 121, 23, 71, -44, -77, 43, 271, -296, -15, 127, -114, 30, -2, 177, 8, 171, 4, 8, -77, 35, -89, 167, 232, 5, -33, 107, 39, -76, 108, 293, 64, -129, 149, -113, 78, 92, -200, -96, -164, -28, -94, 105, 194, 187, 99, -35, -106, -16, 20, 216, 160, -28, -106, 11, 136, -213, -162, 324, 6, -81, -179, -136, -98, 117, -30, 171, -37, -34, -76, -171, -112, -15, 232, -77, 37, -70, -177, 31, 54, -227, 34, 118, 283, 272, -68, 24, 45, -33, -72, -101, 45, -78, 108, -24, 21, -130, -73, 83, -113, -23, -246, -149, -156, -131, 59, -211, -71, -161, 93, -297, 32, -156, 8, -181, 99, -148, -127, 64, 16, 122, 133, -51, 48, -143, 114, 85, -111, 172, 69, 129, 9, 76, -85, 54, -40, 85, -166, 90, 95, -8, -103, 51, 133, -41, 391, 226, 112, -178, -88, -81, -293, -213, -10, 107, 20, -245, -82, 94, 115, -37, 260, 351, -362, -99, 34, -155, 105, -334, -69]
5935f9J27k23K96l3j59o6J85J14m9p3k3K77l89K55j66l3P7k35Q1n7J91M6j98L70
5959B46j44P7l62Q5n6J62J6q1k09P7K22j5M6p3j51J40j40l0K77L11m77O1K58k87
5983d7P6q3mK40k10J28j41j25J07K49r2j50K01l29K19j43K00k7j23j58K17k83
6005b78K43K7k13J62M2R0k79K82k19K04J16j43j43L31k00m1j3k5P2o6q8L01j8
6028A44q7k52K43j40Q7k0j60j3J17OJ35j94L64k90j5J63j51l2M20k89O1p1j9j60
6052a53JK19K1j2p3J97l01K24r2j74j16K96L5k18L48j17N2J51j36J7j23k21K75
6075A00j12J62j31k27L64J75k58j03K64k95N8l6l4P5k40L7O37m23k74L27j00L2
6097bK69mm60K17J3N9Jj47J20Mp1n9J36J27J74o18N18l70J28r2N4l9k07L83k19
$$ y = [-69, 58, -165, 131, 98, -61, -127, 58, 172, 123, 50, 27, 304, -85, 170, 4, -29, 48, -187, -106, -163, 28, 74, -124, 246, 102, 179, -183, -98, -154, 8, 24, -57, -266, -189, 33, 18, 64, -9, -160, -20, -160, -190, 87, 398, -79, -18, 240, -47, 29, -54, -58, 182, -28, 100, -41, -166, -59, 190, 98, -52, 149, -180, 39, -104, 96, 69, -54, -212, 5, -278, -35, -8, -221, -59, -17, 73, -206, 76, -143, 61, 177, 34, -109, 222, 22, -19, -32, -57, 15, -51, -139, 162, 144, 57, -195, 48, -92, -5, -25, -185, -198, -81, -75, 60, -134, 230, -60, -75, 88, -63, -95, 325, 36, 97, 26, 7, -153, -152, 67, 88, 76, 3, 200, -101, 123, 31, -143, -259, 37, 72, -146, 202, 85, 137, 288, 152, 169, 46, -175, 100, -12, 150, 19, -208, 156, 331, 73, -30, 234, -61, -3, -39, -73, 2, -238, -201, 436, 13, -261, 66, -34, -2, 267, 263, -197, 20, 33, 92, 93, -54, 66, 70, -1, -60, 76, 203, 377, -241, 277, -93, 35, -57, -3, -42, -249, 134, -85]
6122h5L70j93n2l58kL04O9J22j91L1k02R5K45k88M69m64K13k74M03m06J44O0J11
6145A21j31NJ91m32K53Ll02O8K83J1j87J93j10l17K74j09K35j30J15l39K80N4
6167B9J50k73n6j00J1J75q0K19l46L68j42J52o6J55M2k67J0l2K18k08k36R0R5
6190i2J90r4j4J29j13J04J07j51j00P4Q9k49p9L60k59J13J73l14L99l73J66j10
6212d4L29k97j92J84J55j56J4l0J69j88l5Kn6J91p4M1m4J62l37J46j11K60j08
6235a9j7j59O2K97k31K30J75l02j15N5J32k69J41kj6J03k5k39k99M54J04q5J8
6258gKQ0l47N23l16K57j1j1k10J61k89K2o2K11k3m9J19l19M04m27J29M7J32j7
6282an5k45K26k20L91k58N7K61m6n5Q8k00J64q7NK89Mm04K13o1J46k70r4O1R5
$$ y = [-85, 285, 92, 40, -318, -320, -16, 53, 175, -16, 15, -187, -92, 153, -135, 334, -130, 83, -191, 212, -194, -50, 10, 121, -10, -5, 186, -246, 7, 10, -292, -224, 59, 70, -117, 76, -34, -351, -77, -186, 49, -81, 34, -305, -25, 29, 179, -94, -150, -250, -239, -64, -144, 75, -271, 97, -45, 107, 41, 196, 238, -29, -19, -51, 167, -41, -277, -187, -92, 98, 4, -10, 119, 6, 110, 217, 66, -34, 40, 129, -120, -199, 161, -98, 15, 188, -126, 273, -100, 66, -44, 285, -12, -204, -20, 135, -21, -7, -37, 132, -56, -91, -89, -145, 46, -28, 13, -31, 131, -206, -60, -171, 89, -19, -36, -195, -133, 164, -67, 163, 338, 36, -79, -24, 108, -161, -20, -22, -38, 65, 40, -199, -498, -44, 60, -25, -7, -5, 75, -272, 251, -65, 192, 181, 170, -40, 121, -168, -146, -208, 3, -20, -69, 50, -269, 135, -292, -163, -116, 16, -1, -56, -301, -75, -295, 96, -162, -105, 156, 110, 55, 143, -57, 107, 20, 25, 314, 318, -86, 127, 66, 212, -58, -152, -91, 4]
6307Dr5J47q0p7K2J36r9J06j89o7K30K30j73J15l75J73j00K55l13j03K52k1ll21
6331c46N51j41j38J0L45j09k60K5M03k66Pr1j44k0lR2jL7J14O8j56q5o7L07m17
6356b85J61K6j8N1j76K75m6J52n8J48L8j81L64m12K74k86l6l8K86l34K12l45J67
6379f1P1J20j75Rl7L2q5Q5j56o2J66MJ27J24o6l8j88k6L84k75l9M1R9l9l1j41
6405a57L55qj65K92n35J02N7K23j67J26j48J41l65J55O4J35k26j5J39j74K30m2
6427A7R9j69J83k50o0K59j49J11j85P8M54o43K58n6J3k4K58l22J78o4l05K38o6
6450a47J74K0l6J47j06l7o1J35j69P2J97j9p5p6Kl2p8K24j65K13l88M13j00j42
6474c4j39J7K4O2J30K8j45J16N9k30J8K00L4j83m8k30K85J28J71j47l1q6pP0j7
$$ y = [4, -91, 56, -24, -101, -79, 57, -42, 64, -125, -192, 38, 268, 95, 210, -165, 8, -92, 163, -150, -253, -1, -22, -25, -346, 205, 64, -74, -64, 281, 172, -88, -63, 340, 74, 81, -10, -154, -174, -177, -85, -86, -49, 65, 133, -23, -108, -175, 132, -285, -124, -98, -116, -65, -241, 34, -12, 140, 82, 230, 268, 87, 451, 39, 313, 27, -9, -47, 239, -95, 117, -228, -61, 10, 130, -45, -36, -73, -41, -126, -41, -197, -259, -93, -89, 38, 162, 96, 58, -130, -156, 228, -47, -86, -45, 54, 15, -16, -157, 198, 190, 25, 317, -218, -116, -59, 164, -3, 123, -25, 116, -249, -94, -30, 105, -121, -136, 3, -171, 59, 17, 116, -53, 130, -120, -180, 79, -70, 41, -144, -66, 388, -255, 3, -53, -40, -64, 194, -128, 50, -14, -319, -81, -147, 27, 47, 11, 158, 52, 15, -46, 89, -80, -8, 189, 170, 95, 19, 21, -11, -89, 135, -30, 183, -205, 208, 108, -34, -173, -156, -132, -70, 60, 88, -57, 59, 118, -112, -94, 106, 140, -43, -91, -321, -36, 92, 263, 116, 85, -1, -8, 62, 45]
6499D5j05R2j96J68J38k65J2k5K26m33M40k80L64j25j18j10K15j36L71m37K00
6520D1l6j28K05m14M27K8k77N0J20J60r5k4J8j67J83j46J72r5m1N3J36q6q0J77
6544A81l91N4L28k4p0l45K42k04J44R6l6j71J17J65j55j63R9Oj37L88k48K52n1
6567G7k46OO3j22Q2J41J1J26q6K23l69R9r8J16p0mk24M23l74L51m5o5n2J27q5
6592EJ63j60L2l8K95k28m06K93p2J06N3Qj64j05N4K46m5r4j1L90j99J79j55l13
6616a66j5L89k34J46k96m2K92o4O3J64m25K54J0M4K5n8p6m5K32j6j23q0M8K4Q3
6641A34r4k68M75l48r5K17j91Q1Q4R6p2L3r0K02n5m47M87r3lj2k2O5Q0j66l82
6666c84O63m23j05J87O56p42qP0j26K97l08K85NN7l77N37j97q9%L3j28j99M82
$$ y = [45, -60, 32, -164, 4, 142, -123, -111, -136, 90, -343, 97, -183, 181, 56, -62, -172, 43, -93, 278, -159, 41, 5, -123, 82, -332, 95, 123, -154, -104, 16, 176, 81, 57, 75, -92, 91, -55, 117, 22, -19, 34, 170, 84, 4, 181, -210, -156, 172, 148, 78, -267, -25, -229, -85, 11, -25, -196, -79, 86, -69, -232, -133, -127, -264, 124, -124, 128, 77, -169, -163, -100, -222, -140, 1, 12, 138, 52, 275, -94, 5, -93, 23, -47, -51, -275, 148, -226, 125, 80, 15, -37, 90, 5, 168, 8, 40, 2, 297, 69, -337, -44, -116, -10, 43, 51, -113, -218, -164, 82, 37, -57, -68, 322, 123, 302, 147, -166, -181, 208, -26, 120, -176, -218, 74, 10, 73, 237, -188, 66, 76, 120, 145, 87, 11, -34, 198, 182, 59, -21, 27, 51, 134, 40, -228, 247, -101, -196, 21, -170, -89, -5, 91, 19, 52, -38, 164, 109, -338, 149, 56, 53, 41, 19, 84, 164, -2, -384, 279, -144, -249, -62, 594, -148, -156, -86, -212, 85, -223, 62, 67, 124, -253, 284, 87, -2, -2, 31, -97, -296, 186]
6689A86J39l00J48j30J42l35j32M49l24J13J95q6K7J9J54m03J96j05J14J16k35
6710e2N2j5k3J88j59K42m7k52N2m18N87on49O24m88K26K2K14l21M4Q9K63m06k4
6734a57K22k99K22n3L47m98K6J11j24L52q1n4J71q5p2J7k74L17r2Q0nk5p4J14
6758H6J04k16j30j09J65J09n8l9rk1N18n02J79J3k37N11m36M26m12j6J47k08K15
6781H0j2j45O2Q6q1K3m0Q2p4l5j24K61j36L05O1l59p2J54l05O1K43J68k22m7J47
6806H1J70k32P9j26k18K08m6j7j14L67j02l05L05k00J7J18Lk35J12K48M3k63L06
6829A99p8l50R6K4N2K47k63j9K09Q3l21m3J26J5r9Q6J15k98J19J58p7R9j79O1
6853c8J01J89k27n0O0j49J64J7m4q5J9j75L28j87q4K42j99j2o3K55j17qK11j52
$$ y = [186, 325, 25, 173, 43, 185, -150, -282, 167, -157, -44, 151, 65, 92, 111, 265, -138, 58, -47, 67, 183, -52, 0, -15, -38, 150, -9, 233, 186, -66, -14, -432, 155, 149, -400, 224, -264, -38, -16, 198, -123, -79, 10, 273, -133, -157, 65, -234, -12, -65, 282, -216, -190, -79, -203, 149, 68, 14, 185, 100, 28, 45, -229, 88, -4, 76, 71, 46, -28, 86, 190, -26, -156, -265, -100, 9, -49, -88, -97, -118, 400, -102, 77, 90, -147, 364, -72, 354, -58, -74, 73, -135, 80, 68, -77, -15, 71, -10, 13, -27, 55, -19, -54, -178, 83, -53, 252, 313, -46, -118, 36, -269, -208, 35, 203, -19, -66, 81, 251, 19, 98, -28, -246, -38, -84, -101, -215, 152, 50, -255, 50, -150, -133, -15, -12, -247, -135, 113, 156, -107, 199, 121, -229, -133, -109, -57, 190, -73, -92, 117, 200, -121, -164, -38, -23, -122, -36, 79, -219, -100, 58, -19, 80, -99, -38, 63, 252, 25, -25, 35, -114, 50, 67, 23, -62, -43, -218, 110, -77, -161, 81, -118, -130, -193, 62, -55, -63, 148, -4]
6877dp9k0m2J85r3L0k83M11J84k04K39m11O4k46J12J29K17l5j86J84l16K57k33
6900a40K61j05j00P8j37J41j10pJ45J21l78M44j10m9m7J06j85j74L05Jj75K48
6922A33j4M1j70R9K1j48J05j45p6J94J30q2N3N4j7k00k08M00k36K08L7m6j67K13
6946A79j12l07L77k26J59J4m9r7o3M44l55j47P9J76q3j13J9K5j47R1L33k42J85
6969A40M3l86L13j32o5K2J85K36m04J62l14k4L3N25m37K12q8Q9R2R7k71l4L6j02
6993g2K33k05L02l42J04k9P8k6k81M24j03n7Q1j82K55j45p6j20N7pK56R4l22J22
7017C9O0N1O7m5l99j05K42m5J26N7j35M4n9j13J12J19j52K72q9p4k11K99R6j07
7041E0L94n88L5J9N3K22J14m46L11j95j86L72p5k04O3J03k42L07l6j90K33J21
$$ y = [-4, -83, -103, -145, 40, -53, -23, -306, 105, 289, 85, 324, -87, -23, -269, -157, -28, 189, 154, -32, 152, -164, 93, -140, 121, 16, -84, -6, -143, -2, -112, -119, 26, 147, -231, 213, 103, 54, 7, 113, -72, -246, 59, 60, -115, 133, 119, 160, -10, 89, 110, -38, 67, -78, -154, 40, 170, 88, 141, 195, 178, -22, -230, 170, -66, 142, 179, 133, -34, 179, 67, -240, 137, -89, 70, 84, 35, -62, -125, 319, -36, -183, -104, 72, -11, -124, -105, -80, -227, -136, 197, -45, 140, 183, -203, 110, -22, -87, -65, 120, 356, -48, 114, -200, -224, -191, 334, -103, 109, 21, 110, 202, 299, 28, -6, 30, -72, 161, -44, 258, -84, 20, -9, 69, 43, -238, 186, 83, 26, 107, -75, 180, 35, -41, -161, -104, -111, 145, 239, -83, 39, 99, 150, 217, 172, -227, -332, -90, -135, -9, 48, -87, -43, -102, -215, -103, 16, -136, 136, 47, -27, -238, 61, 157, 50, 444, -144, -109, -90, -37, 185, 299, -147, 164, -31, -217, 155, 80, -124, -61, 42, -200, 107, 71, -119, 114, 235]
7063B35l42K24k08R5K31l29J77K2j53o1n7J43j44Q2J18RO2j96K79J9l05r1L70
7086A80j5j71L16k67N8n5m1j63Q3j93M59l0j02l30L60J09l2j04l8J05j07J7n8
7109a9j03J17J33p6j01k05K26k03K0K66l0j28Q9j53J83j08J75k62L37j39n6j53
7131a90P6M16n6j13k46N4J75l68J27k3N74k57L2k72j52J84J19Rk13j4M60p6k36
7154A0J40l68M33k46J21j03j7k77L75P3J6j74L9k00K09j99K48j03p0J83K1j28
7176a7J22p4j32K08r6n9R0j73L4J76J8j79L2O9l55K37Q0l6j6Q9J57n6k70L19j72
7201do2J79J9j05M0l54O07j30p7R9J39m56M83l00N1j22K1J38j54j25j80J96M4
7224e3l4N7q6K21J29k76l06K87O9j68r4K71j50J60o1j72N02l58r4J23J29k57j14
$$ y = [235, -107, 117, -91, 4, 235, -94, 83, 105, -48, -109, -166, -23, -167, -85, 33, 42, 104, -92, 187, 206, -99, -190, 180, 165, -6, 310, 43, 101, 46, 5, -158, -75, -268, 191, 161, 59, -271, 89, 198, 166, 62, 24, 129, 22, 39, -19, -122, -5, 128, 52, -49, -254, -28, -231, -211, 55, 25, -103, -14, -167, 16, -92, 83, -179, 158, 19, -37, -190, -114, 302, 246, 133, -113, -59, 116, -252, -125, -148, 426, 169, 201, -71, -223, -39, 80, 89, -124, -138, 322, 246, 10, 150, -218, 215, -31, 90, -13, -30, -307, 68, 141, 157, -17, 22, -178, 31, -168, 80, -23, -93, 90, 111, -17, 105, 31, -101, 107, 11, -48, 42, -131, -97, 79, 97, -82, -50, 19, -336, -99, -19, -55, -71, 18, 175, 119, -151, 168, -4, -66, 113, 132, 27, 67, -287, 320, 190, 113, 212, 351, -105, 378, 78, 129, 7, 28, 166, 12, -113, -293, -97, -53, -87, -30, -116, 105, 234, -42, -348, -61, 8, -160, -254, 17, -133, 27, -34, -206, 296, -62, -156, -33, 96, -161, -275]
7247b75L44m0l71M38J8j12K87l41q9J91j28N56p14K62k0M3o1L6l8l66N78l9j57
7270Bl00K67L47k56J19k84j40N49j70k64L02m2j12r4l8o2J45L9j00K97k8k90J18
7293EQ9l20K12k20Q8K43l74L01j93k7K50j35J56k39K75j03k60M72j20k98K41j30
7315h7k19R9J72J33j53p3L39l43J09J48q8M6k14J56q2O8K06j64R0o2j86M6J08
7338D9k38L4K10m89O15n4l45K70J56m10J17O0J94m10j9N2M8J89n7k8M6J2j82O7
7362a13N7l98N99k94M2J15j9J56j80K13l30q8K24p8Qp2O4L03k25k29K22O0J35
7385A72N4l38K68j45L87m07n3K02N6k8j28J58m00L68k4k61K8L52m65J14J43j47
7407i4K45j42J92k86J07J4l05L16j9O1k19k6M4K1m5J66j28N6K48l13o2K78N4j08
$$ y = [-275, 69, 29, -342, 96, 114, 2, 289, -52, -141, 50, -78, 478, -236, 26, 6, 49, -12, 24, -14, -380, 198, 159, 2, -298, -31, 316, 60, 179, -105, -245, 304, 134, -130, 172, 130, 18, -76, -114, -176, -31, 8, -92, 205, 177, -113, 5, 94, -226, -14, -234, -146, 97, -277, 24, -169, -196, 54, -81, 75, -164, 111, 8, -252, 220, 100, -198, 43, -87, -306, -207, -35, 98, -55, -128, 211, -132, -23, 125, 37, 83, -131, 25, -57, 11, 217, 53, 143, 81, -105, -59, 49, -189, -155, 55, -434, 181, 127, -218, 52, 208, -202, -85, -25, 169, -241, -260, -208, -160, 29, -28, -56, -10, 2, -180, -113, -56, -454, 145, -149, -107, 8, -11, 145, -35, 178, -152, -240, -16, -94, -86, -158, -94, 209, -16, -245, -23, 37, 172, 226, -112, 156, 11, 398, -9, -62, 140, 196, 168, 40, 198, -202, 166, 142, -119, -91, 261, -204, -90, 53, -94, 151, 9, 201, -85, 22, 36, -269, 47, 28, 89, -130, -156, -112, -91, -136, 30, -98, -42, 206, -107, -169, 109, 163, 55]
7431E5k23K70jM7k88M93l65l58L05l54M60m7j19J18j03k63K81K27j65J88l39L72
7453A91l42k3O5L01j87k82K13p9K92l6O5m25K87j72J58j57J80j00J50k46J6P6
7475e5q1Q9J85j95j6Q9l1j60J56L5n2j04K29j46o8K05o1j73o4L23R1j81k3J50
7499A42k04o9L43J0m37Q2K33k12P7n5k0L29k93o5L13j44j72J37q5j19L29k03J22
7522C9M5J32j76j1k73L06j33j58J07O3L1J38m8m6k31K04P9p5K07j57L98m21N5
7545G5J74k17J3q9l2J74j29J56J15l15K28j11K21m12m1Q6L60j83j62L62j82k24
7567a33K26K6j15J94j06k92O6R2k95N62n05K39o2J02j2Pj08K9L43k19KK48k56
7590C3o6j7rJ05j41J57j08K96o2j39j06k20J96J53o3k69L06j14J01l93M89n5r0
$$ y = [55, -168, 102, 101, 148, -140, 353, -12, -370, -65, -419, 41, -6, -125, -7, -110, -373, -92, 135, -30, 158, -181, 191, -151, -174, -109, 192, 5, -277, -64, -143, 149, 113, 178, -247, 40, -132, 26, -131, 49, -51, 99, -147, -131, -55, -136, -47, 138, -57, -73, 16, -15, -175, -19, 16, -36, -140, 89, -57, -125, 80, 19, -154, -218, 105, 196, 15, -8, 142, -62, -131, 212, 222, -215, -133, 100, -112, -35, -90, -110, 219, -74, -139, 174, 30, -142, -5, -90, -209, 120, -83, 39, 84, 216, 40, 29, -244, 62, -71, -229, -122, -59, -28, 110, 62, 16, -215, -11, 68, -7, 200, 43, 441, 20, 75, 249, 32, 45, -44, -76, 98, -31, 125, 240, -75, 153, 42, 263, -149, -190, -104, 256, 73, -89, 273, 91, -133, 93, 119, 4, 198, 92, -200, -134, -42, -337, 225, -280, -41, -103, -1, -13, -6, -114, -85, 258, 39, 41, 289, 33, -33, -50, -59, 46, -95, 62, -46, 250, 188, 49, -57, -277, -81, 72, 9, -260, 46, -68, 33, -360, 129, 74, -16]
7613a6J57j47J4L0J23m2k68K68k52q7J89J57m7j66J14lR6j20K29m24J52k5j19
7636a87L79q2K74l37k17lM8J4L88l55k2K2j66J09J06mJ32k0M6J78r6k53P7k79
7660b48J47J6K70l60J97k3R1j86%J49r9p6M4j20Q6m2r7M9J61J99l75J50N8J81
7684A72l19J44K43j73M0jj39j53k6O6o7K80J4J35p3j74q0J85k82Q4J95l17M47
7707B01m39K37L9N0J26r1l53M13m11M30k35J15R7j08Qj25K12L0k30%J75j40P9
7730H0j06J47J32r0l6k46n0K8k26M99J32p6k02P4O0j30K17n20J98N52m92m3r3
7753a91J49j55N16j57k24k1J91p9j28K60p7j10J01o7j50K80j35Q5j14J42K50m48
7775h2J17J56j05j3k12J33j0L0J51p6k8j71J39r0p7N20n01N8K69j28j45Q9m2P3
$$ y = [-16, 141, -6, 8, 38, 161, 119, -149, 119, -133, -220, -31, 126, 79, -87, 27, 24, 120, 0, 229, -195, -43, -68, -187, 192, 110, 384, 47, -170, -173, -125, -111, 277, -78, -100, -78, -244, -135, -29, -33, 99, 79, 125, 303, 207, -46, 31, -248, -101, -85, 185, -175, 22, -1, 90, -96, -96, 53, -46, -122, -78, -198, -112, -154, -251, -202, -41, 158, -217, -67, -9, 172, -147, -3, 240, 67, 107, 106, -33, -186, -212, -146, -213, 67, 81, 216, 143, -31, -111, 74, -208, -124, 71, -246, 201, -238, -1, 38, 88, 214, 123, -230, 183, -228, 202, -33, 82, 179, 71, 79, -46, 166, 196, -34, -34, 141, 1, 80, -26, 121, 253, 163, 127, -119, -169, -141, -367, 132, 264, 188, -14, 60, 120, -10, 207, -313, -115, 437, -55, -98, -191, -42, -197, 319, 162, -62, -83, 108, 29, -99, 161, 84, -26, 75, 8, -142, 138, 3, 88, -26, 116, 366, -82, 35, 191, 86, 73, -139, -6, -16, 14, 165, 89, 61, -110, 29, -61, -138, 382, -119, -61, 208, 80, -65, 24, -18, 55]
7799E5j59m2J44J08J0Q0mj90k01L72l92L83j01k38R1K67M5l2o0k64J20j87R6j42
7823b41L60k88J02K94l23m4m7L91m1j02k50K00j53j16M68N9k70P5L3p9k71L06
7845F3j7k3k17J19K05k16qj65M73j92r8J68m61K30M33n09J0N0L63j95O5j28L8
7868a2j58L2K00R7m51K37J42j22rJ55J0j29J11j10J60l2j35k4K79k52k3J09lj18
7892d6k01j02M79o6p7K25n02L04J04m73L17J11k33J30j90J19p6J54j45K34J2j4
7914F4q8j15K72k89J73m9j5K06O7p7k52L68m2k72J60k14N7Nlk25O7K94j51J41
7938H2j59J74Q3l1j49j04R5j54J95p9P5J08k26m7o4K92j50K09j81q9k1M27k41
7961D5P4j59J22n1j16R9j2qj64K23K16l91J19J18J58l94J1R9Q8j7r1j44N54n20
$$ y = [55, -104, -146, -2, 106, 116, 196, 192, 2, -199, 173, -219, 164, 63, -175, -84, 183, 228, 196, 136, -128, -8, -195, -99, -241, 119, -169, -67, 227, -96, -140, -187, 204, 163, 61, -189, 11, -142, -258, 210, 269, -1, 74, 107, 28, -243, 63, 46, 23, -194, -75, 130, -86, -94, -259, 214, 22, -76, 92, -369, -139, 294, -215, -205, -155, 208, 13, 78, -50, -12, -170, -138, 62, 159, -292, -55, 87, -35, -44, 111, 121, -8, 103, -7, 153, 121, -14, -38, 241, -11, -34, 75, 72, -46, -247, -349, 130, 64, -13, 212, -290, 14, 118, -355, -38, 73, -160, -30, -220, -101, -177, -23, -168, 66, 78, 64, -24, -139, 133, -156, 17, -32, -47, 159, 226, 149, -103, 265, 223, -49, 111, -103, -46, -41, -44, -269, -202, 92, -59, 82, -77, 97, 180, 149, 0, -104, -9, -163, 32, -47, 28, 136, -90, -137, -201, 91, -59, 150, -31, -120, -141, 286, 45, 119, -40, 82, 31, -85, 14, 2, -6, -170, 53, 269, -122, -3, 115, 273, -121, -110, -11, 77, 60, -31, -175, 379, -141]
7985a41R4N6J59p7p0L8P7j82K30j04r2J59k59J22j23K29m3l26J93P9LmK06l08
8009h4K12j84J96l24K11M2j40k44J35L0J37J4l9l8K83o26O78k56R1n5j65oJ25
8032gO0j27J86k08l7J40j7k35L0J29j66J57l8j38K19J87l2L21m06k27J66K4K11
8055A92p41Q42l76K56r9j43M27l00p9N1j01K0K2pJ79k06Q7k03J71J4j4l03M51
8078A40j59j02J38J72m42J08K04q7J1k02Q2O9J65m9j94J09R4K36l63M82k04j18
8100I0j91J97j72J96j99K6On0K44j62m8M8M6R9N3l4j07j02LM12p06M75k64qM96
8125C48j30j04rl54M29l14j26N00k85L3M1pj5j37N0J79n7L7l74O01m91K71k59
8148a73m6N24l94p1L16J37n46L80l32K71k75K84l24k0K78m1K01j88L5l7K58n77
$$ y = [-141, -47, 9, 168, 91, 21, 59, 136, -46, 184, 80, -12, 147, -112, 10, -113, 116, 73, -253, -60, 19, 22, 18, 224, -84, 128, -56, 140, -184, 27, 69, -71, -315, -180, -150, -13, 1, -38, -76, 207, -419, 259, 3, 94, 39, -126, -132, -7, 53, -74, 112, -96, -133, 7, -10, -245, -215, -86, -252, -95, -133, -271, -52, 135, 103, 424, 18, -209, -43, -19, 192, -549, 293, -83, 173, 74, -69, 358, 58, -21, 30, -71, -51, -29, -36, 143, -63, 24, -179, -8, 6, -8, -311, 140, -19, -121, 17, 189, -253, -145, 59, -28, -17, -219, -137, -68, 97, 48, -146, -37, 57, 293, -70, 412, 208, 90, -101, 96, -76, 120, -79, -53, -47, -97, 147, -15, -63, -15, 31, 130, 183, 149, 42, -60, -57, 355, -351, 124, -140, -148, 348, 218, 114, 105, -249, 180, -134, -260, 240, -45, -12, 29, 22, 7, -130, -80, 99, 42, 79, -295, 306, -185, 86, -173, -219, 305, -89, -160, 156, 293, -253, 127, -205, 66, -209, 75, -249, -269, 9, -32, 169, -19, 16, -21, 237, -340]
8170c40L94M3l5k7J6j29K90m1l7k37RJ12P7j86pj06n8K32jJ20j92
$$ y = [-340, 54, 97, 62, 35, 51, -78, 212, 171, 134, -103, -94, 18, 95, -91, -98, -204, -262, -30, -31, 89, -103]
8191a03
$$ Imaginary data points
##PAGE= N=2
##DATA TABLE= (X++(I..I)), XYDATA
0@%%%%%%%%%%%%Qj6J6j6J6k4L2m0M8n6O4p2Q8j04J20j41J65j89K14k44K82l20
34a69L61m08M57n10N71o39P11p91Q79r72J076j189J312j448J597j759J937k134
52a118K352k593K861l165L508l899M350m880N510o271P218q427J0033j2285J5680
67H874k1458L3865j09595O7107Q0886j08816J11724j11706N5543O5563r6597P5379
79E0769o4818o7280J11011m5925N4357j3848p9308R3778k3719r947L4645r0327
91e0612L0749J13l648P2466o6585j3592M0020j0745N1915m4116l7466L4841k6781
104b3441L2844J2998l9458J7109j8791K7165L8851m7034p680r245K25L5677k4295
117e075m093M9j6861M1058J2144j4207j2582k7717K8097J8148k0432k932j6383
$$ y = [0, 0, 0, 0, 0, 0, 0, 0, 0, 0, 0, 0, 0, 8, -8, 8, -8, 8, -16, 16, -24, 24, -32, 32, -40, 48, -56, 64, -77, 88, -101, 113, -131, 151, -169, 192, -216, 241, -269, 302, -337, 374, -417, 462, -510, 566, -623, 689, -759, 838, -921, 1016, -1118, 1234, -1359, 1502, -1663, 1845, -2054, 2296, -2584, 2926, -3345, 3873, -4554, 5479, -6806, 8874, -12584, 21281, -88314, -21207, 59679, -49137, 62587, -49119, 6424, 71987, -24610, 50769, -14049, -81329, 29682, -16243, 38114, 24266, -55042, 38736, 15017, 5070, 39715, -50612, -19863, -19750, -23398, 49068, -17517, -31109, 8911, -1834, 50081, 5965, -31501, 3340, -23441, 9403, 22401, -17057, 52, -18739, 8426, 47277, 243, -7437, -16682, -16457, 19220, -5075, -9168, -9119, -25980, 15078, 27222, 13015, 433, -27284, 813, 18961, -1471, -4403, -20786]
130b0786J0214K5027j965N252j9934j8002K0350O197J627j4590j9798J8157J4156
143E905Q232K369k1363l084P561Q402P850k1414j3793R105J2942J5591q770j5733
157f200J88L304J1590Q34j6641r382K34J5931J5746q635j1465m210P686J4147
171A3127l354j2564r456n21J6048R471n404r967o805R601J1680k375j0668j1518
185a2705J684J2703O074k267j0026n333Q494J0111J742r592j1719J586J0747P216
199H715l456j1122k898P665R481K372r456r644N20Q871P552m256j0499k855P073
214a937J0184J276q733p832M32Q068O585m671r055l485O551J0222R77p894p270
229f582J232P577M717m074p711l780N533Q738J821n997o995M27P880M753m031
$$ y = [-20786, -10572, 14455, 12490, 17742, -2192, -20194, 156, 6353, 7980, -6610, -26408, -8251, 5905, 14137, 16506, -4857, -7941, -380, 8022, 15872, -5542, -19335, -10230, 2712, 18303, 9533, -6200, -6012, -2708, 8882, 9716, -6925, -16307, -16073, -142, 15604, 6969, -4496, -8706, -1020, 13127, 9773, -2791, -12247, -12768, 3280, 12751, 7347, -2620, -9425, 176, 11856, 9481, -1187, -12705, -11021, 1682, 7756, 5489, -4537, -9870, -1376, 8735, 10477, 885, -10834, -9248, 1499, 8715, 5259, -5863, -8761, -1096, 8385, 10757, 1301, -8343, -7823, 1048, 8600, 4344, -6155, -9010, -1937, 8247, 9523, 790, -7042, -6610, 1458, 8043, 3372, -5683, -9168, -2617, 7605, 8582, 688, -6582, -5350, 2227, 6944, 2870, -4841, -8621, -3088, 5650, 7471, 1474, -5521, -5094, 2786, 7539, 3508]
244C508p419l796N040P605K347n653o852Q62P130M518l310q432l585M749O858
259C570J708n290n491J067O485M766l064p618l056M342O724J064m585n012J550
274b840N819M224k861o585l530L359N275J172m603m300J062N630L701k198n679
289b354l305K810N084J469l899m045Q74N339M146j524n464k906K348M369L46l573
305b85l870M82N175L487j712m934k718K820L825N27l821l501R21M805L315j052
321C464m031k327J928L762K19l616l139K80M279L112r82l496k314J855L248M47
337B689k842l810N15L821L148j085k990j510J637K956M35k816l428L42K753K827
353B642n32k978j542K077K805K58k857k882q3L177K436m52k417j158J590K533
$$ y = [3508, -3911, -7707, -2667, 4938, 7285, 1632, -5220, -4358, 2772, 7290, 3980, -4452, -8037, -3288, 3570, 5278, -12, -5503, -4436, 2049, 6815, 3751, -3867, -6923, -2581, 4143, 5207, 622, -4390, -2840, 2979, 7203, 4342, -2243, -5773, -2414, 2861, 4033, -570, -4870, -3808, 1822, 5523, 3325, -2354, -5659, -2849, 2235, 3704, -195, -4240, -3366, 1973, 6119, 4595, -869, -3775, -1427, 2942, 3288, -285, -4155, -3673, 1502, 4989, 3277, -1657, -4375, -1555, 2270, 2797, -1024, -4525, -3604, 1201, 4516, 3464, -567, -2894, -966, 2796, 3015, -601, -3740, -3460, 819, 3931, 2949, -547, -2861, -1006, 2242, 2689, -153, -3963, -3448, 373, 3521, 2436, -554, -2064, -427, 2529, 2964, 148, -3280, -2938, -185, 2642, 2110, -868, -2410, -333, 2472, 2730, -127, -3009, -3092, 85, 2521, 2069, -348, -1506, 84, 2617]
369B617M46k651k718l80K393K005l54k262j013J586K290O53k484k791L81J896
385c86J488mj961o26J118K603O01k073k171n52J861J864m06k311q25J446K327
402A993M43j907k062k71J838J278m41j960q95J707J909M70j599j547j76Q76J239
419H95k93j437r95R65K413N59j380j727K98P71R71pj871o97P94J824Q37j169j759
438a008l7J302Q03o25j379p21O26J705R21j132j307l09J527P72o34j464k80O57
456e83J427M27p15j002k48R51Q64n33j342l35N56J037L10l07r43J5L87J152o23
475D95r86j038Q10J390j85m55p01N0P57O75o3j102r24M60J457N87q05q62O0J146
495G66N34o57o32p00K0J079N29o70j228q6J153N60n90p01J58j93N46M71k66p51
$$ y = [2617, 3063, 412, -2306, -2686, -293, 1712, 1358, -904, -1917, -331, 1959, 2612, 128, -2663, -2282, -386, 1102, 1098, -863, -1489, -371, 2232, 2833, 760, -1411, -1963, -102, 1762, 1356, -955, -1780, -334, 1993, 2436, 529, -1533, -1804, 34, 1312, 871, -1089, -1984, -277, 1632, 2102, 503, -1044, -1220, -344, 895, 602, -835, -1830, -865, 1548, 2107, 727, -1000, -702, 69, 1040, 1033, -838, -1535, -741, 1083, 1920, 751, -1008, -1045, 257, 1060, 435, -944, -1665, -1039, 666, 1587, 455, -852, -1161, 366, 1138, 504, -960, -1240, -583, 844, 1271, 556, -446, -694, 257, 1121, 588, -754, -1089, -533, 504, 814, 507, -436, -421, -34, 1118, 495, -491, -1529, -719, 671, 486, 31, -670, -620, 137, 812, 749, -353, -1277, -817, 640, 1227, 422, -440, -380, 766, 1300, 643, 11, -689, -669, 410, 939, 269, -959, -1045, 108, 668, 78, -623, -465, -658, -112, 359, 93, -658]
515f58j55J239P22l73q08q3L53j34M08m92l23n21Q08P66j36j013k51M41J22j10
535a98n32K70l6P93j8L80n73l62K81M13m8m82l09K3N11L29k20j87n4k30L85j61
557b5j29m77L26K93J70J94k75j71j9K36L06l28l84R8J63K65r8k62j2R9k44L53
579G9k56j6j19J33M29m2q8j27k8J93j96L15l47L3J87Q0l30nj20L29l5J17j98L6
603B4N7l3J16j19L8J9L6j60M28o2P5l69Lq2J08k22O3k56K40P8J50l42K05l28J91
628a42J73m91M8M60J93LQ4k16N0q9j5k38j0l83M50L87j74p4j85J88Qj4k02l0j55
653c74K84J61L2p3J01O9P6M6n65J28K00m70L15p9K46l0k12P3qJ24Q3l77J77N26
677D53k68p5M5j23J54k4k83J6Nk58K60k39J52O4R4J68j82J89n65M79o1K0q5o0
$$ y = [-658, -813, 426, 1148, 775, -33, -116, 237, 103, 511, 19, -304, -825, -17, 749, 613, -400, -651, -210, -88, -198, -730, -460, -496, 297, 279, 659, 86, -276, 5, 418, 370, -112, -421, -398, 113, 442, 222, 35, -19, -249, 136, -25, -154, -631, -305, -12, 158, 352, 77, -94, -113, 123, 429, 101, -283, -185, -22, 243, 145, -117, -129, -30, -274, 79, -177, -193, -312, -179, 250, 208, 120, -7, -35, 158, -38, 277, -70, -37, 150, 230, -100, -105, -225, 104, 69, 186, -12, 24, 81, 48, 164, 45, 83, 102, 138, -22, 406, 344, 419, 50, 53, -29, 79, -143, -80, -336, -96, -18, 132, -210, -5, -333, -142, 31, -460, -412, 48, 241, 244, 328, 112, 162, 73, 58, -180, -190, -573, -123, 264, 90, 16, -169, 19, 27, 13, -189, -219, -374, -90, 71, 103, 30, 131, 200, 276, 322, -243, -115, 85, -385, -70, -149, 97, 67, -145, -72, -80, 44, 127, -250, -73, 453, 185, 110, 155, 32, 186, 162, -121, -105, -100, -358, -98, -337, -185, -121, -27, 141, -41, 148, -417, 62, 1, 21, -64, -124]
701a24J83Q9P6k44K38l89J07O8j43J95j1J64j21M4k4m9r5K34k74k04M46l23J94
724C7j82L5J32L11m00K63l03j2J62k4oj24K07MM1j80n1j02L76k71kj70J99j12
748a72K61M1k86L03M7l93k1K06j60JL27j51P1M1L12J41q15l2K18j73J95o9j58
771b66qK24O8K03J59m76J71k35M9k8J23J03K05j99J1j39L2p3j41K70k93J63q3
794a60l8Q3p4K1L55q8r6j81m1m4K85j79M60j80j69l2j06M1J74J46k11j01K65j95
818f5O3q5J42Lj53P2j72K10K4jl05N17j57p6L43k06j49K5j62K33r8J10K64l17
842F0K42l38L34L8l75%j82l6K23M5q7L48l57J35J59m36RO4J64K04m44K88j95l
866a40Q7J29J0j34J58l68J70L06m00L49j34k76N33p3j37J95j68k57J79o9J41l5
$$ y = [-124, 59, 148, 224, -20, 218, -171, -64, 4, -139, 56, 45, 209, 88, 132, 108, 59, -36, 198, -76, -280, 166, -157, 37, -145, -110, 22, 333, -67, 196, -107, -119, 43, 19, 13, -111, 96, 100, 141, -39, -90, -192, 184, -87, -89, -259, -60, -172, 89, 130, -156, 147, 194, -199, -220, -14, -174, -173, 154, 3, 74, 115, 427, 568, -247, -279, -61, -234, -39, -108, -266, -274, -50, 18, 221, 380, -96, 75, -160, -111, -139, -16, 87, 292, 93, 104, -35, -3, -76, -217, 53, -240, -77, -160, -198, -115, -189, -168, 187, 99, 3, -178, -219, -263, 22, -157, 303, 123, -46, -78, -184, -143, 31, 177, -34, -135, 130, -65, -2, -87, 55, 58, -95, -23, -195, 15, 39, 38, -267, 250, 93, 17, 360, 154, 5, 30, -132, 101, 3, 113, 377, 60, 302, -36, 298, 336, -39, -39, -221, -257, -34, 11, -76, 272, -85, 50, 209, -227, -218, -154, 10, 214, -230, 58, -137, -140, -53, 76, 86, -48, 110, -258, -88, 218, -182, 167, 33, -243, 290, 217, 80, 275, 107, -150, 29, -40, 101, 66]
888F6L3l05M26k43R1k22L25o0j41K42l80o1M57l44O1lR3N1k42J07L6N3L7k70K42
913D9R8j34J64j85J18N4l58J39j21M85k44l0J16l24N5L27j44j02j87O3J46K15
935B00l61M3K28J7J6l62N15n40M23j8j60p1j61L62j87j4J68j71J06J75l68M9m2
958a53K71j14j3J51j53n0Oj57J90p3K51k49J47l09P6N1nj80L71k25Q4j87L14m2
982Bj48K64K4j37J7k75K45J34Q0j34k42M02l84J18L73m94J01j92n4P9J40M8j94
1005b27K15r3L36r2j17K63m72K65k1M8j91l10O37j81jk4k15J30j32J56O9k30J33
1028e4J09pk38K88j89l42L97J78r4K36k87m4O6J89k1k69r6K0L07j93J3J57j61
1051c5L04k61r1K4l9L75l83q0J47q3r0J61K17j61l1J82j44J54k98L75l18On0K16
$$ y = [66, 99, -206, 220, -23, 68, -154, 171, 111, -30, 212, -168, -229, 228, -116, -55, -58, 35, 86, -156, -49, -13, 40, 77, -193, 49, 147, 13, 177, -8, 110, 164, -194, -55, -176, 309, 65, 35, 151, -173, -118, 209, 65, -37, -224, -161, -15, 200, -161, -118, 110, 127, 143, -219, 296, -244, 179, 161, 1, -70, -231, 131, -56, -70, 98, -73, 33, 208, -160, -111, -153, 118, 4, -9, 142, -11, -61, -55, -212, -22, -95, 156, -93, 54, -255, -179, -128, -133, -313, 58, -167, -83, -270, 44, 2, -146, 118, 142, 5, 22, -253, -8, 126, 206, 72, -170, 232, -152, -34, 339, -155, -54, -246, -300, -221, -81, -33, -227, -12, -105, 231, 139, 22, 285, -187, 78, 57, 105, -86, -396, 241, 60, 59, 35, -180, -50, -182, -26, 43, -187, -54, 55, 48, -190, 98, -91, -433, -36, 142, 48, 284, -3, -47, 19, 208, 187, -82, -178, -158, 149, -44, -31, 126, -35, 269, 8, -83, -59, -98, 277, -106, -186, -39, -122, -212, -51, 166, 5, -26, 156, 12, 166, -132, 243, -75, -69, -119, 97]
1075I7l96K30K16J3j3l24j5J63K0O3j69K45k21P0N6k0J61l28K92p7m21J74L18
1098A34k74J18j45O40m39J1j16p2n7K02k8j24J39J75l07j31J20K2K28j07J69r0
1120F8p4k07N7K1R3j04L66k33L0L04n85J95q0K99k79l5j58L29j57J87J23j00j84
1143a24J68j16K39J12l53j13K83J02k76K32l02K02J22j43k58n2K06m5J08L2j34
1164a10J87l35L13l8J10K3p7M9J06m36M28k35pj70J36m2M6P6k33J85K47n82L33
1187b6k04L32J34j92r9K12j40J52mM0m6r1l86J00J84l1J50p4J25j49j23J86j06
1210e6k14M46n10K21J99j0R4m0p7j85O8J9J9MJ75l43M11l22R0o7o1J03J42k87
1234a81K03k77K84j11j15J69J05l63J30K10l7K9l22M53l28J01j7O5j36K21K28
$$ y = [97, -299, -69, 147, 160, 147, -177, -192, -29, -9, 54, -115, 130, -91, -21, 35, 15, 176, -152, 140, 63, -358, -184, 134, -140, -22, -167, 473, 34, 45, -71, -143, -200, 2, -26, -150, -11, 164, -143, -274, -154, -132, 96, -11, 158, 68, -6, -213, -156, -135, -42, -146, 220, -13, 17, 321, -264, -69, -149, 150, -129, -164, -322, 7, -150, 37, 160, 60, -124, 44, -72, 167, 279, -74, -187, 96, 198, -78, 154, -148, 54, 176, 33, -225, -277, -71, -116, -8, 24, -110, 77, -258, 55, 17, 127, 150, 73, 122, 228, -208, 220, -15, -22, -192, -56, -98, -52, 24, -209, -24, 223, -359, -26, -230, 102, 236, 44, -55, 157, 17, 169, 165, 205, 159, 68, -318, -218, -34, -65, 85, 11, 136, -13, -136, 50, -56, -270, 176, -334, -113, 86, 76, 170, 130, 53, -132, -64, -45, -26, -22, 153, -190, 221, -101, -11, -78, -139, -36, 106, -181, 22, -255, 29, -82, -197, -28, 77, -286, -156, 54, 17, 46, -276, 177, -151, -50, -67, -2, -138, 83, 311]
1255C11m1l11J3K32l99K07j83J02k36L30j55J06j32o9J53O1K31k98P1k07M22j62
1277D6j40J7N5P9j13K06k29M0J45Q3k71J9J69k69l6N02l51K59l25J11k11J65J4
1300c5j44L20j35J67r0k88K28n6j9j0n0J77Q0l4r5k5O2l5J95l64J97n8M7J93l29
1325a01R8j57J87j62j39J05K98l30M31k04J1p2K25k00K78l20p0J45j68K21j20
1346d4N1J74j66k44M31L5k19j0k01L52l56J39j18O2j09L95p2r2J1L77l4J6k80
1369I8j50K99m18L8J50j22MK64q2k04L63k05K6L7J1j92J78j72K02k65J29k51J77
1392h5Q7j16J62j47K14k13l7j7N6R2%Mp0mJ0M9rK5o3k9K88k15j13m3K67n8Q9J70
1420B94l78RK84l90K28k66K04J16k01J23q9l5J24K01m0k08J22j37l0J59pL4O3
$$ y = [311, 270, -41, -28, 204, -195, 12, -171, -69, -305, 25, -130, -24, -156, -225, -72, -11, 220, -78, -7, -214, 208, 46, -94, -77, -22, 57, -56, 150, -79, -39, 106, 189, -82, -63, 106, -163, -199, 303, -48, 211, -114, -3, -214, -49, -35, -179, 141, 6, 173, 83, -205, 23, -33, -52, -62, -112, 65, 145, 111, 16, -9, 53, 18, 213, -151, 46, -12, 35, 228, -101, -3, -160, 27, -135, -274, -169, 129, -201, 230, 26, 37, -35, 190, -10, 268, -52, -122, 23, -145, 76, -44, 7, 181, 15, -229, 202, 237, 18, 8, -193, 159, -197, -58, -176, -114, -223, 172, 100, 8, 19, 396, 362, 378, 98, -52, 247, -171, -133, 17, -105, -101, 163, 81, -123, 240, 35, 61, 98, 109, -83, 95, -77, 125, -140, -11, -262, -85, 2, -114, 48, -99, 115, -98, -135, -152, -96, -4, -4, 0, -70, -74, -64, -15, -24, 1, -62, -91, 197, -18, -131, -174, 93, 35, 124, 294, -84, -75, 209, -181, 47, -219, -15, 101, -100, 23, -66, -101, 23, 224, 184, -24, 98, -39, -69, 90, 83, 117, 180]
1443A80m8o1P2j7j76P0p5m9K63k48K1J22l49L41j58J53J40j63l10K86K52j95j44
1466i3j22k2K76j39J0K06l8J21j21l25J17nJ81j25p1K75j15k71n0M24O2k37jj16
1490a79K91q7l16K39k01K48k05N05j01j96J13o8m0k0j61p6K2J2K80m8j50J86J01
1513A49J5j36k05Q3K5l7RK24j87L3J25o0KR1j3K5j77Q8j20J35K2Pj80Q1J61j78
1539a8j39Q7L4l5L25k89JJ29k71J69J20m54L43j73J65J4k00L16j01K47j65j12
1561gk95M63k43Oj28J63R6l2q5K82k16q9m1o5M26k82R4jj64K59j21n8j86N11j91
1586I6k78N00k56j58J79o2K97l06p6P3K17l09J90n3j79P5K01k29k7J51p7Q3L1
1609H3oL5j45J0L1k08O7J71p5j2r4Q4R6l07J71JP4L8J33j28l7P3l01L21q6L28
$$ y = [180, 132, 71, 143, 126, -50, 20, -55, -104, 159, -89, -68, 54, -295, 46, -112, 41, 181, 18, -292, -6, 246, 51, -93, -215, -237, 39, -100, -90, 116, 78, 199, 78, -247, -130, -135, 46, -79, -150, 125, 10, -261, -311, 113, 175, -62, -63, -179, 112, 25, -291, -52, -253, -5, -210, 295, 194, -2, 111, 43, 3, -17, -178, -254, -232, -220, 60, 12, -138, 48, 149, 164, 28, -177, -94, -69, -106, -97, 127, -60, -27, 98, 38, 40, 131, 118, 143, -34, 54, -66, 69, 91, 98, -82, -1, 160, -18, -157, -70, -36, -71, 254, -35, -34, 95, -176, -7, 113, -341, 2, -171, -6, 8, -192, 124, 23, 270, 105, -7, -302, 161, -82, -76, -204, -41, 55, 23, -62, 220, 4, -85, -126, -191, 235, -47, 47, 46, -118, 141, 20, -38, -224, 287, 96, -182, 318, 62, -96, 83, 21, 318, 12, -64, 9, 226, -83, 107, 54, -125, -50, 151, -78, -105, 46, -31, 52, 83, 77, 112, -33, -23, 8, -200, -133, 38, -37, -49, -143, -59, 37, -270, -99, -98, -24, 14, 147, 19, -18, 55, -246, 75, -11, 317]
1635C17l87K28j70R9k33J30K95k39n5o4nJ76K5p0n0L9j56k05K14k3K11O2k12n1
1659a24J32K7R5j08J60o9K2n56K42O51m28L0RJ6K82l01J6j30j4R6m5P9J48m05
1683a75J05k5j6J14rK19m33N86m66K53l17K4J76k2M1m9J28k42P4j80M02n47M03
1706D4J56j36pl72M19j52K56j93o6q6k1K67p3j63J12J00J7p3K30l16j09M29k87
1729b4K08l89K70Q2n4k81L72k34ML12K9k65m7j52K31J64J17l37j51O1m4K37pk05
1753a03m5J99k21J05L03j02l27J58K28n5k33r5L7L83k39O6lm4J11M9k50J83r5
1776A0o7J39O8k91K11j2l31L34N7j97k9nL6lN5J69k43K58l9J10r5k70Q1o3K09
1801I2Lj66R5l05n7M37K95l03J14j62q7M6j1J07k56J86PN6j42J37l4r0q1J61m3
$$ y = [317, -70, 158, -12, 87, -146, -16, 279, 40, -15, -79, -84, 92, 117, 47, -3, 36, -120, -325, -111, -134, 77, 139, -73, -124, 8, 35, 130, 22, 182, 113, 135, -421, -179, 472, 44, 74, 83, 99, 381, 80, 96, -34, -48, 48, 3, 82, 230, -175, -70, -95, -111, 3, -6, 213, -220, 366, -100, 153, -164, -140, 36, 14, 55, 6, 134, -108, -34, -214, 188, -359, 44, 200, 64, 57, -315, 104, -48, 208, 15, -51, -137, -158, 109, 36, -127, -15, 85, 102, 29, 259, -57, -166, 263, -24, 184, -205, 65, 147, 93, -188, 184, -50, -46, 266, 295, 30, -17, -169, 62, 226, 343, 6, -145, -84, -128, 109, 102, -103, -148, 51, -170, -65, 238, 136, -191, -33, 195, 140, -93, -188, -151, 232, -7, 59, 56, 12, 123, 172, -78, 105, 10, -57, 82, 150, -141, 70, 58, -273, 61, 118, -79, -108, -113, -77, -80, -25, 144, -99, 159, 120, 230, 135, -135, -54, -117, 92, 95, -71, 24, -281, -338, 99, 394, 91, 205, 43, -44, 2, -9, 98, -158, 28, 35, 91, -51, 86, 52, -38, -119, 42, -1]
1826aNJ79j38k43J48j53K01L74l63J2n6N2k93J00R1q5K18J45qj44j66p3j09L42
1850C5K08n4k28Rm6K34j1j56RJ36j02N3k30J33N3j92L8j14P1J72l12J68kJ81j86
1875a33j17M97k66K04k94j0J78J36j4k89j37K58J3l10L00K69j08k87L42j20K7
1896A39Qj80l8J16l37J78N2j66J81J62J9p5j86J01K50j44k68K44j48K99k99P6
1918a6k90L93r7j43J62l35L29J32M6l47M07l08M9l2k28J44J48mj62KQ3J75k47
1941a39J60J47j19J11j38K9J35k07j21k71L53N4J36j00q1K1L3j20K28M6m43K07
1963g9L55j76k16L75j94l6j05m3K76j3Q4j40k78K21P9k60pJ54O3K56l45J16J9
1986A06j64K03k32P3j95P5l9J50k33K06j62K87P1k87K81m0j71J09J89j10j54p5
$$ y = [-1, 4, 183, 45, -198, -50, -203, -2, 372, 9, 21, -35, 17, -276, -176, -85, -170, 48, 193, 185, 41, -125, -198, -307, 35, 243, 189, -39, -30, -76, 158, 147, -9, 0, 136, 34, 87, -143, -10, 43, -149, -111, -225, -154, 18, -294, -126, -128, 53, -133, -250, 247, -19, 185, -109, -119, 59, 195, 181, -108, -245, 13, 26, -284, 16, 285, 177, -110, 232, 112, 139, 147, -33, -71, 45, -292, -114, -62, -228, -47, 115, 134, 59, -127, -26, 224, 80, -188, 56, -92, 207, -92, -16, -306, 87, -10, -153, 9, -326, 3, 135, 181, -166, 241, -67, -18, -50, -278, -134, 14, 10, -152, -150, -67, 108, -139, 21, 168, 49, 160, 22, 51, 186, -21, -142, -413, -60, -6, 130, 30, -51, -30, 3, -117, 111, 157, -286, -79, 276, 100, -116, 259, 65, 29, -76, -119, 157, 144, 228, 88, -190, 31, 110, -150, -157, -3, 60, 316, -29, 87, 106, -58, 145, -87, -14, -209, -134, -173, -23, -256, -50, -212, 75, 146, -141, 140, 100, -71, 38, 227, 117, -37, -112]
2008a12k28M21R1J3j56O5O3Q2k40j6J54j70P3n7N8K0J08j32J04j0k56J84j39J00
2032B0P5l54K31j43J67J29J6N1j7k10K65l34r7M45j34n0j3L31m79m0K40m10K04
2055a07J33k5L7k0QJ8J00l36J51J75j53q9O2N5j33q1J40J6K12l30P6mq7J17jJ9
2081d7o3J4J07j06K00R1j20l20K34j27J35l2Q3q5k91N11m4l08L05l62j3N2K78
2104I2k50L18l67J22K98j83j90K56j05N0M5j73j20J44r0K02J05j83K19l43k1j4
2126a88L50j84J31o4n7K9K40k28K27k87p5J92k06k07L39K90k76o1n3j32K81j66
2148a05p3J12K16j30K79o9j02j49Ok57L97l3k01rl4J77k17k07N25m7Mj51M3J09
2172H4j27j53j0M24n45J94J56J41o2K54m89K61Q1L2n03L37n3J82j67K14k63J24
$$ y = [-112, -340, 81, 172, 185, 29, 94, 157, 239, -1, -17, 137, -33, 40, -17, 41, 61, 169, 37, 141, 131, -125, 59, -80, 20, 95, -259, -28, -171, -4, 125, 141, 192, 175, -35, 230, -104, -201, 244, 110, 60, 47, 378, -101, -141, 99, -311, -107, 26, 1, 38, 18, 26, 44, 144, -192, -41, 134, -19, -108, -46, 9, -124, -205, -65, -49, 163, -167, -91, -95, -182, -65, -66, -47, -110, -96, 11, -95, 105, 196, 76, -244, -10, -137, -2, -34, 49, -36, -327, 184, 140, -168, 137, -225, -238, -186, 92, -158, 160, -207, -85, 213, 30, -160, 96, -9, 41, 86, -87, -207, -63, -153, 49, 154, -29, 190, -153, -174, -188, 162, -22, 109, 45, -12, 17, 257, 29, 256, -31, -106, 86, -120, -327, 12, 302, 26, -35, -88, -220, 61, -105, -178, -66, 150, 20, 299, 230, 128, -21, -15, -272, 125, 92, -109, -118, -152, 25, -192, -399, 126, 79, 83, -68, -25, 84, -43, -196, -206, 218, -327, -133, 23, 164, 102, 356, -133, 128, 209, 241, -262, 75, 22, 204, 37, 251, -12, 112]
2194A12k19L1J9p3K8K55j63L2R0j75J84l0r8M4L3k27L4J15k9J08q5j19J37k09
2218b05L52l03J54n5J09j47J88j78K15N4j78K03j66j81j01K36O4m8j4k18L43l0
2240I4J5k64j3J75K8L0q0j4J53k44q5J79l1j14mP0O4K09L42p19O3n2J11J50m9
2265A4r8O8k97M01q2J5J7q4J59J08j69n1o1n4K75j48J81k79J58J3j01K47l69N8
2289g9K96j49j44J72r8R9j56j6J61o3N0M0j03Q7j48K23j05L4j6J0j87L7L20p2
2313A93Q8k85J4J34K09k43q2j02O8Q3M3j05K54k54k37K19j0m7J08j24l0l1J26
2336a1L6L2k67J41K94m23K60R9l39J29n5L25k45K20k85j45M07l79K55P8rj94q5
2359a61J00lJ01j7l6Q1j59k22M68J32l44J40j37j5J25m1N7RN5o3l83L49M2K10
$$ y = [112, -107, -76, -57, -130, -102, 153, -10, 22, 112, -63, 121, 91, -7, 37, 70, -157, -123, -8, -37, 71, -14, -133, 4, -205, 147, -156, -2, -57, 52, -95, 93, -85, 130, 184, 6, 209, 43, -138, -239, -3, 61, 13, -1, -219, 124, 94, 109, -155, -168, 7, 35, 65, -15, -29, 124, -120, -205, -26, -57, -171, -175, -105, -41, 168, 510, -209, -146, -198, -87, 63, 14, -84, -16, -313, 88, 6, 21, 38, -46, 113, 221, 52, 1, -60, -114, 161, 13, 194, -85, 73, 86, -15, 232, -137, -79, 217, 68, -76, 96, -2, 97, -59, -75, 86, 23, 73, 113, 10, 97, -51, 172, 67, 101, 85, 95, -92, -55, 265, 193, 281, -4, 10, 144, 353, 110, 28, -74, -6, 77, 120, 15, 269, 15, -222, -3, -13, -60, 48, -76, -106, -137, -11, 25, 57, -210, -69, 225, -198, 62, 161, -178, -49, -104, 221, -24, 196, -89, -234, 173, -206, 49, 127, 118, -76, -161, -61, -64, 37, 20, -16, 65, -94, -316, 152, 284, -60, 80, -57, -72, 53, 12, 69, 78, 133, 70, -313, 36, 78, 288]
2383B88k26j47J54p2j47J46m9Q0m4J63ok34J28k50Q0MR0K26k16J34KO0j97K54
2407B21k53QK1p3L9J40j60J05J33m81J29L70k11k55K27J91r7j07L17j41j51j49
2429a77J34J00k10K99j85K93j13l41J08J77l0j07J05p5K07l37rM50l92J11j75
2450a67J28L3P0j74o4N2K93l44L50k65M55l11Rl35K84J18p5q0J69j25O0l96L72
2473E7p7J02K9m47m1J8J09L37J20n07K80j70J68kj94K23k9N6p9q6J93M9Lmj40
2498c2O6j41J55n8j65K44n8o1J21L8K27l75K51J3l20k2P6N3j00M5j75J46J99J43
2522B70l44K37j76k36K20j57L60J33m02k11M71k19K0l42K23K41j59J82l72P7N9
2543a25L24k11m8L48N5k14k51L2K02J08j16q9r3j1j95L91m3R0n5j30K41o1j84
$$ y = [288, 62, -85, 69, -3, -150, -4, -53, 27, -17, 146, 140, -94, 34, -216, -136, -132, -42, 184, -32, 102, 104, 164, -33, 221, -32, -24, -3, -76, -37, 103, -57, 48, 181, -300, -171, 199, -12, -267, -40, 151, 54, -53, 264, 123, -28, -177, -43, 57, -153, 146, -39, 254, 141, -200, -92, 85, 55, -52, 53, -22, 185, -152, -161, 289, -103, 8, -167, -39, -6, 64, -110, -174, -122, 171, -173, 177, -88, 367, 56, 65, -270, 14, 132, 57, -23, 146, 21, 81, -315, 57, -20, 82, 111, -336, -377, -359, -250, 87, 207, -300, -20, -190, -22, -24, -218, 5, -24, 32, -47, -133, 60, 109, 112, 108, -32, 34, -107, 48, -10, -175, 69, 11, -50, 71, 109, 336, -39, 212, 225, -95, -117, -41, 12, -88, -43, -218, -72, 127, 270, -74, 163, -13, -249, -29, -186, 174, 307, -95, -306, 165, -54, -34, -376, -153, 88, -71, 111, -261, -184, -125, 199, -12, -60, 288, 343, 129, -122, -90, 112, 220, 104, 15, -78, -89, -284, 107, 64, 154, 99, -31, 210, 149, -35]
2566c5K06k67J39q8N8j32k13L33K11k37j76J88Q5p1o6J93l08N5J27K12k15j89
2588a90o6O1K14k7M2n8J41k2K71j84l19K29Q3j61J07j03p2pk00K55LP2q7J24o4
2613D2j42P7K52k93J80Rk77Q9K22j46M2o2K9j34j00P6M6J7Pj3K23j07M1m0l2L7
2639D3k82J68K16l18M10k71J37j29k8JJ8J31k05L02k38J21O0j73J03q4Q6k01L53
2662B20k02o4K82m08L59l4j87j99J71J00n1j58J66N3Lp6Q0q4R9k24L53lk81K9
2686e6J88j85p4K42Qk17K00k11J17j18J50K13j83ko5J83k99J37Rj27J30J65k74
2709f9J52K1k16N1K62j65j99K38p8J81k89K42k04J16m6q8j97N49j34j60J96q9
2731G4j20k17J67P7M2o3j28m3K30m4K35j71n6k43K51k15L00L0J36o9j79K03oj86
$$ y = [-35, 171, -96, 43, -45, 13, -119, -332, 1, 212, -25, -201, -13, 72, 1, -65, 128, -180, -125, 2, 214, -1, -190, -256, -195, 19, -8, 34, -24, 117, 95, 366, 182, -137, 92, 175, 14, 121, 18, -54, -61, -261, -6, -3, 69, -18, 106, 42, -100, -23, 229, -64, 116, 125, -152, -63, 159, 13, 55, -7, 22, -112, -212, -136, -90, -73, -66, -79, 144, 37, 78, 38, 6, 43, -239, -71, 145, -173, 237, -34, 103, -26, -54, -53, -35, 96, -109, 193, -45, 76, 136, -37, 66, -18, 68, -133, 220, 18, -46, 236, -172, 187, 153, -34, -233, -62, 38, -13, -171, -5, 48, 51, -25, 55, -29, 70, -154, 199, 196, -85, -56, 132, -53, -127, 115, 123, -94, 106, -105, 12, -106, 44, 257, 74, 72, 7, 190, -109, 28, 37, -90, 40, 205, -69, 83, 104, -112, -61, 201, 36, -163, 75, -3, 178, -111, 131, -73, 43, -3, -91, -288, 261, 127, -33, 163, 74, -46, -263, -96, -19, 23, -40, -168, -211, 19, -25, 210, 39, -17, -260, -9, -224, 76, 106, 242, 173, -6, 197, 191, 5]
2755Ek7o4J28l02K91j14L01k60k74M20J93l17j77PN58k48j78QQ2J24l08J02L02
2778B52j53k29M02m35K05j9Q0k72L17J19j78j04L01m88J20R7o9J09k03J04L00
2799B56j82Q7mk16m1P2j18k96L38M7m1K48l16j63L62Qp0n3P6K00j42k42J91j36
2823a35L77r5j59M4k56L09k10nj57K57J85l78M46m99K37K81l43N6k42K06M49m23
2845e5j05K61p8k6N5J5k08L13m70K56J09l7O3k21r4J08J03K61n95K62j83L46J89
2868B69J58m35J1J77k80L10j99r9K1Q8l8K10j45k12P8R9J61j99l1J39J39k48j31
2891a57K23j32K7K16j29k27K66j32K5j34J65j04J69rP8k84K92j25k22R7K8rm5
2914a23N75j40m76J03o5J82j79L19k65O1q8k5O9J75j32k51L55j40j88J78J9N6
$$ y = [5, -22, -86, 42, -260, 31, -83, 218, -42, -316, 104, 297, -20, -197, -190, 368, 120, -58, -50, 32, 156, -152, -50, 252, 99, -130, 272, -163, 42, 23, 103, -169, 148, 267, 89, -15, 286, -202, -82, 15, -54, 55, -148, -44, 256, 74, 161, 157, -59, -100, -28, -146, -442, -104, -57, -98, 150, -166, -329, 33, 41, -29, -82, -6, 194, 52, -190, 1, -135, 242, 147, -12, 32, -224, 85, -125, -130, -287, -30, 155, -223, 223, -276, -39, 242, -101, -45, -287, -81, 368, -55, -160, 101, 23, -3, 52, 67, -141, 172, -298, -42, 67, 30, 93, -128, -222, -114, -11, 250, -345, -83, -266, 80, 269, 427, -8, 3, 180, -100, 210, 11, -88, -67, 21, -17, 193, 48, -164, -86, 13, 174, -25, -56, 83, 222, -26, -157, 66, -66, -39, 177, 48, -179, 87, -45, -20, -154, 11, -93, 76, 67, 145, -139, 153, 28, -194, -97, -69, -78, -123, 452, 312, -164, -61, -126, 56, -123, 196, -69, -8, -96, -121, -52, 123, -9, -260, 95, -45, -233, -55, -36, 20]
2936B0M1n6J09k80L35q8j95l20M99P7k6k38j8J29q1J65p7j27P7J76k97K17K0j41
2960g9J72j14R0k09J30K4K09m21L43j86N5mK5R7l90L91n7Q5m64M71m7J68m38k46
2984c95L82Q0J66k92o2K41l91J30K42Q1k43J07J9Q2k87J48n8O0J49m04N10l50
3006h5j66K72j00k34L96J72n2k76M4J43k36l0K06k0L10m04R6n8j39j4O9J16J21
3029A31o1pJ46N9j52n2J96l04J9o0N06m15k15K40q2j88L7K71j63K24k07J40l33
3052b70K93J53o3k26l2J43J8J70k26J86n1l90M70j35j33q7K23O2r9K51j39m69
3074c51K17K29q0J30N9J64o07L05J06k19P0o1k92L45k52R5Q5j38K37Q7k26M22
3096C25k37j93j10O9J54L1k5k16L34j77k3rJ19n26M20r0J02l04J90J66J86j84
$$ y = [20, 61, 5, 114, -166, 169, 81, -114, -434, 65, 142, 116, -122, -140, -11, -92, 73, -4, -131, -54, 122, -175, 42, 62, -79, 93, -21, 69, -140, -10, 14, 223, -198, 145, -41, 14, 10, 35, 132, -258, 133, 76, 161, -303, 168, 121, 289, -149, -395, -13, 67, 233, -59, -121, 120, -271, -141, 101, 182, -61, 46, 65, 147, -140, 8, -50, 10, 159, -245, 265, -85, -251, 21, -79, -313, 83, 255, 203, -73, -29, 114, -122, -152, 54, 34, 344, -60, 36, -22, -161, -175, -106, 10, 131, 70, 63, 209, 268, 116, 64, 260, -44, -25, -85, 421, 6, -209, 31, -51, -239, -202, 69, -94, 130, -77, 63, -270, 23, 176, 113, -113, -145, -2, 16, 186, -40, 146, 95, -295, 175, 40, -93, -180, 43, 105, 6, 257, 118, -351, -134, 95, 15, 145, 204, 368, -239, 66, 172, -47, 23, -38, -330, 15, -237, -142, -57, -195, 42, 129, -97, 325, 88, -105, -215, -146, 8, 39, 14, -202, 132, -45, -68, -77, 42, -484, -64, -154, -52, -356, -166, 0, 186, 2]
3118BN9l6L5k9j35K5p6M51k84p2K85k37l9J59k62l8M5K85K65q2n38M25m48K91
3142E1N6k49K83QJ4k80J69l59M81q8j75J97k7m8k56K67J76k69J97j16k0O5J10
3165A87q3Q0j98M1Kn8j03J41K3j2K44j69k13J06r7j00J80k27J38M39k24J9k03
3188h7J99R7r1m5k92L36mK05l43l9r1K30j11l0L3r5J65j07j24K83j17L16o8r9
3212A21j61j10K38r4j08K32l7J00Q5o3k56J75o7K8k09P0j80L77m8l66M05k81r6
3235b45Nq2L84j46N0j75J29J27m42N68k17J29j03J34M2J18l76rj77J89j18J23
3257i2R4Q8j26J17j04oJ28k64J24k1J0J98j60k4j15J70p7J04l5K1K1K94k81r3
3281b9j98K9J9J04R6rJ39k02n9n9J48k65J16j01L93j62K29o5k81l2L7J12L20l09
$$ y = [2, 61, 25, 60, 31, -104, -79, -155, 296, 12, -60, 225, -12, -51, 108, -154, -192, -147, 138, 403, 321, -217, 208, -240, 51, 107, -142, 141, 149, 163, -117, 52, -307, 174, 86, -89, 108, 81, 33, -223, 44, 220, -49, 148, 32, 12, 77, 187, 104, 184, -14, 27, 29, -29, -132, 9, 32, 20, 264, 95, -118, -12, -109, -209, -29, -256, -118, 321, 97, 116, -87, 112, 209, 118, 73, -219, 117, 113, 318, -25, -64, -155, 75, -36, -66, -33, -128, 37, -70, -194, 89, -28, 288, 220, 121, -40, -150, 88, -6, -114, 118, 81, 181, 266, 203, -53, 122, 55, 83, -126, -56, -236, 141, 93, -273, 132, -149, -245, -240, -322, 62, -84, -34, -209, -80, 47, -395, 173, -44, 85, -18, 116, 158, 276, -100, -109, -286, -97, -215, -92, 2, 90, -36, 81, -23, -29, 99, -165, -41, -62, -52, 146, -14, -38, -153, 17, -60, 44, 9, 30, 51, 345, 64, -29, -227, -198, -179, -75, 21, 12, 151, -51, -110, -169, -21, -286, -170, -271, 122, -40, 189, 124, -157, -189, -152, -40, 280, -29]
3305b9k46L30P1k01K7M2Lo7J69Q1k15k21J65K31j04N2L60m76P8j68J28j73J66
3328CJ72p8k4k08Q2J17R8n2P0j49r6K1q9J36k15k26P17n4k76J8J1P4J2Pn8j46
3354a33K67j57r7O5j42K83j60r8J74j34J33P2m2k04J03j28OK03n5J02l62L35M33
3377D64l58r6M2q1j84J04J63Q4k68k0n6L02l9k28J99J43n4j71K71k97J07j07J
3400g9j3%K52j78L9n8J06j29K70k53j7J6J44O1j6l6q7j16k7N6n5J35m8m5K44P2
3426B38j59q6k58J00J94N9n1O9k09K57K4k30J29lj7n8lK05j25J42j54K8j86jL21
3451B26l26J24j62K78k52K26k19L38k20J30K01m17j01L8L45l30M63n16K90K22
3471C38m74K41O3k82K6K9K05j60K9M4j59P9M7j51J59J91j96k44J22J99Pjl12J36
$$ y = [-29, -275, 55, 126, -75, -48, -6, -3, -70, 99, 180, -35, -256, -91, 140, 36, 88, 448, -28, 50, -118, 10, -163, 3, 175, 97, 73, -135, -53, 64, 162, 110, 180, 31, -65, -44, -133, 3, -212, -438, 279, 225, -51, -33, -22, 52, 64, 71, 13, -133, 134, -23, -120, -55, -197, 86, -74, -172, 2, -132, 1, 73, 31, -173, -70, -198, -192, 11, -44, 58, -304, 31, 464, 106, 10, 52, -29, -213, -109, 54, 138, -130, -150, -206, 96, 57, -171, 28, 171, 117, -54, 217, -80, 27, -80, -79, -92, -92, 160, -18, 21, -37, 69, -60, 210, -43, -60, -44, 100, 161, 145, 109, 22, -94, -121, -65, -120, 15, -33, -78, 166, 238, 79, -7, -265, -165, 29, 88, 37, 106, -103, 154, 178, -52, 77, 74, 57, -1, -4, 201, 76, 218, 64, 92, -94, -95, 226, -100, 24, -138, 140, -112, 114, -105, 233, 13, 143, 344, -73, -174, -136, 209, -121, 342, -174, 116, 338, -136, 105, 168, -114, -88, -59, 146, -14, 15, 59, -100, -21, 26, -125, 34, 225, 29, -215, -93, 106, 113, 112, -200, -64]
3495f4J60j54m2L43j22J0j03J09k11J10L1r8k9jK28j35K97l91P7L52m24M2j13
3518a28J24k5q7L08k53j76J96j07J63n8L45m02K77j21j02mK14m05O02l74j8M7
3540A6R4j61J41J28k66J82p4j02J58J41j34k22P3l11J07K16J1R8k7pn1m22M51
3563C9K28k65K04l51J96j53O5J53j16n6M3J47J2k02O6kj9K71r9l15N1J3J52K4
3587H6j01J41l90L73P4j76J4j08j7O0Kj29M03l68m1L97j53j23j44K6J15K39k18
3610c8p6L81l73J14P1m7n5l11M57r7j85K18k90J55j11M34m07O9J98j10J38k64
3632a29N3K36l63K82K6j87L3N2k9j34K76k17j6K07Nl19K29j01J97k1k99J47L15
3655B43j5j85l50M94j88J98j81J09k35L93K5n16K45M3k43K69N8k90K11k84K22
$$ y = [-64, 96, -58, -100, 243, 121, 131, 28, 137, -74, 36, 67, -31, -60, -61, 167, 32, 329, -62, 15, 367, -57, -15, -128, -4, -29, -116, 192, -61, -237, -41, -148, 15, -43, 302, -100, 177, 56, -46, -50, 164, -241, 361, -13, -31, 16, 110, -51, 90, 218, -48, 134, 60, -42, 116, 257, 123, -99, -26, -337, -230, -14, -3, 95, 68, 61, 10, -412, 39, 267, 2, 206, -145, 51, -102, -37, 116, 0, -56, -13, 134, 146, -56, 10, 8, -11, 260, 161, -154, -103, -90, 62, 86, -15, 126, -264, 109, 183, 7, 21, -87, -104, -44, -42, -171, 232, -136, -177, 220, 67, -56, -200, -174, -59, 180, -38, -114, 267, -106, 8, 79, 32, -23, -334, 123, 26, -159, 59, -231, -76, -187, 247, -160, -91, 107, -3, 135, -129, -76, 160, -203, 79, 105, -82, -49, 3, -26, -160, 116, -101, -117, 90, 95, -224, 5, -96, 101, 80, -219, -72, 243, 228, 43, -307, 187, -1, 197, 16, 125, -110, 283, 308, -208, 37, 80, -163, 106, 164, -126, 85, -199, 23]
3676B3n2l46N50k31j60K99r4p8K21k75J72k9o9kK52k14R7j45J10j31J51K48n62
3699b65j2L44q1J4n9j4l47M01M4j82K92k14J00r7L65l49K9j37N9j21M89j22l45
3722b08lK82rnk3q8K47j16k69J38k28L89K55m75J60Q1p0p1L07k30o1l7K60j49
3746G7k81L4J7R6J95k24P0n0J22k37K99j47j86L58j29J38j74jJ30j31J27o0J37
3769A80j83q6j8J13n7J44k51N04k34j53m1J7p9J61m4J41k21J2O5p8q0K72k7j33
3793g6J72L2k09q2j47J77o0l3J55L8K05l18L27L8k10j90K35j06M9j9j80K78j92
3816a16q3k7J69K68k98J10M8p3j12J63J40m44K38l0J08k6m8j07J12L31n46K06
3838a7K39l05J0K00j70J26j37K14j08j68L64j04l27J54l44M87k31K25j82J12J97
$$ y = [23, -29, -375, 175, -56, -216, 83, -11, -89, 132, -143, 29, 0, -69, -71, 181, -33, 64, -81, 29, -102, 49, 297, -265, -277, 67, -14, 0, -59, -73, -420, -19, 25, -157, 135, -79, 21, -76, 289, -60, -31, -168, -109, -230, 259, 137, -208, -211, 71, 62, 57, 34, -54, 193, 77, -192, -54, -282, 107, 362, -113, 47, 128, 58, -13, 294, 64, 3, -34, 226, 77, -204, -170, -153, -57, 138, -86, -16, -66, 56, -181, 118, -29, -215, 143, 14, 152, -22, -23, 107, -24, 103, 43, 180, -3, -89, -107, 6, -51, 93, -158, 346, 112, -41, -82, -65, -144, 17, -27, 114, -107, -95, -30, -108, -188, 84, 57, -76, 96, 128, -81, -163, -310, -133, -193, -226, -71, -33, 172, -146, 181, 219, 9, -181, 54, -52, -3, -22, -202, 76, -116, -199, -226, -57, 211, -87, 23, 71, -2, -114, 49, 189, -255, -17, -47, 61, 35, -13, -120, -8, 323, -223, -17, 222, -83, -73, 127, -43, 83, -54, 160, 52, -116, 248, 144, -183, -29, -373, 114, -117, 108, -74, 38, 235]
3859B35j49k93K27%O4j26J34j59J26L4j5j60K48k09K01j74l5O9R6k9j83P3l0o0
3883a15J54J9Q9k5k66J10j89P5L39n04M46N4m73L03j75j02K89l8P2j03n2J92k08
3906a08r8M12j82j20J91k72K21j15m1m9M21k56J56n1r6O9J5L8m79N44q9k04k10
3929c03M00n9j80j10mL33ml45K1K51k71M18qJ44j64K8k22J08pj5k28K64J8q9J18
3954I4l3j92L1J50J15k57o5J89J97r8k44L57k57q8K87k11J92J7K9r0l08J33J86
3977A34n5O0L99n67J67o4P8L4k02K2Jj55K04J01j99J10K30k10k68M66l57J98l45
4000b18L38q6J17k8J0l49P1j11K00K44j74j79j43N31k54K96m09L89j63l93K69
4021d2K81m08J27l0j28K10j32P0J61K85n50K05k21l2J56l6J49j69J33j7j50l1
$$ y = [235, 86, -207, 20, 20, 84, -42, 92, -67, 59, 93, 78, -82, 166, -43, 158, -16, -51, 18, 114, 85, -98, -25, -55, -115, 39, 58, 147, 122, -144, -34, -223, -148, 191, -313, 133, 187, -286, 17, -158, -260, 29, -9, 63, -40, -92, 100, -108, -206, 206, 24, -96, 95, -177, 44, -71, -112, -161, 260, 4, 160, 109, 13, 82, 97, 135, -344, 200, 111, -93, -303, 97, 38, -142, -252, -256, 77, 73, -272, -251, 0, -271, 147, 139, 283, 119, 147, -75, 33, 26, 11, -217, 47, 65, -24, 94, 61, -131, -100, 50, 165, -92, -157, 32, 229, 131, -113, 244, -13, -101, 186, -25, 167, 184, 213, 123, -185, -52, 134, 79, 139, 538, -29, 138, 74, 152, 186, -16, 6, 7, -148, 56, 157, -42, 68, 298, 88, -180, 286, -71, 127, -218, 120, 34, 151, 123, 133, -216, -145, -256, -56, 188, 14, -165, -308, 223, -31, 265, -144, 245, 82, -311, -42, 239, -169, -42, -72, -200, 10, -122, -52, 109, 394, -156, 49, -172, -204, -48, -84, 65, -104, 29, 12, -138, -169]
4043a69n0K48o3j47K97l40L16j58J78K63m06K06j34n9j2OJ39j78K93m41K28J3
4065C0q1O2j16Qn4J92m8J53j65j39L03l59L49k3o3J82j67J02j15K11k70n0J09
4088E1o4k21K66Q3j09N4J7Oj69K10P8l1k1j91K85k69J69N4o5l01P8P6K09j70L5
4113F0n4k04L15J60m13r2J74P9R0j28k96L97l3j64M8J43M5j46J65j73L7J85q0
4136A15j63r0K32mk50M25J3l76K98l13k5nM51l03J09j3p8j65O7J82K03k54p4K12
4160A94l04N6R0N6q7O6J42j23n1j34Q6lk37J53J36j56J75j13k79L70J34j58k9
4183a6L20m19n8n6J37L2L04m10O3K83l33K09J5p6J68j76j52L74Kl93L00k28L32
4206B22k70L38m31M77m42J08j23JJ90j38j1J51j39K09K19l10J21j81K32j54j93
$$ y = [-169, -219, 29, -34, -181, 116, -224, 92, -66, 112, 375, -31, 175, 41, -18, -30, -24, 115, -63, 230, -211, 17, 30, -51, 11, -105, -97, -151, 41, -7, 146, -19, -158, 145, -214, 135, 112, 49, 231, 64, 166, 51, 262, -8, -58, 51, -13, -234, 32, 115, 6, 60, 77, 83, -86, 124, 202, 171, 150, -41, 244, -25, 144, 198, 133, -168, -90, -14, 195, 25, 60, 6, -198, 117, 277, -136, -228, -54, 25, 115, -13, -309, 88, 55, -109, -61, 82, 127, -19, 146, -27, 10, 195, 115, -48, -138, 94, 90, -160, 265, 278, -98, 200, -113, -138, -143, 308, 5, 114, 101, 23, -142, -75, 107, 310, 56, -18, 194, -110, -54, 36, 92, 5, 71, 213, 90, 39, -95, -9, -12, -249, -96, 40, -116, 59, -54, -333, 37, 171, 13, -16, 304, -115, -173, -229, -92, -60, 244, -166, -103, 180, -153, 56, 71, -5, 163, -13, -165, 209, 211, -182, 118, -110, 222, -48, 290, -141, 336, -106, 2, -121, -120, 70, -68, -79, 72, -67, 142, 361, 51, 172, -9, 223, 69, -124]
4227a24j23L18p1k8k77j4N39l51jN8%Jk5p0J32j46J66J45k49K54o0J14J3l27n0
4252a76L53m24L76j14j02M4L04l90K15P7M9q0l12M3J03K53J14m24J29J55l11l
4274a21K21l51K33qr2P5R1J70o5j21j58O4R3N8J98k45J00k6k85R0K34M5l40K12
4298G2K52l40J02j32nk34K20mJ05K39j35k40J49j10J60j07k6K4kJ14n15M73O7
4321A27j60j69K72k07J62Q4k03J55l5R4O6N3j37k34L31m09K47K8QrJ25k72L11
4344B28l52r1L33j62r7J03QK5N0j27PP1Q6j81O2J75j21J90l11j9R2NK30l43L45
4369B06r6k25O6J03j3l81L02R8k57L92r8N6l19RK50k38M23m21j41L75l7m0Q5j11
$$ y = [-124, -247, 71, 0, -28, -305, -319, 220, -131, -132, -74, -74, -73, -98, -168, -36, -182, -16, 129, -120, 134, 74, 188, 201, -126, -176, 177, -247, 129, 15, -87, -43, 261, -129, 86, 163, 212, 132, -180, -137, -34, 219, 333, -91, 38, 193, -118, -121, 100, -251, -18, -26, -118, -43, 48, 218, 153, 32, -126, -62, 31, 89, 287, 42, 142, 116, -169, -79, 155, 200, -140, 72, 324, -16, 86, -46, -51, -285, -65, -69, 36, 275, 140, -100, 49, -61, 99, -8, -34, -10, -12, 102, -413, 60, 127, -33, -202, 70, -137, 25, 109, -94, 61, 26, 120, 186, 239, 102, -132, 199, -210, 37, 65, 73, 64, 189, -83, 228, -124, -215, 118, -44, -141, -38, -30, -5, 45, -82, -75, -4, 82, -99, -37, 138, 17, 207, -104, -123, -31, -26, 204, -139, 206, 110, -115, -49, 54, 41, -340, -38, 60, -197, 195, 97, 153, -166, -157, 93, -145, 278, -143, -284, 91, 54, 14, 99, -12]
$$ [...]
8191A82
##END NTUPLES=NMR FID
##END=
